##TITLE=1H_AN-AD-63
 CDCl3, 8 sc, 
 13.05.2021
##JCAMPDX= 6.0         $$ Bruker NMR JCAMP-DX V2.0
##DATA TYPE= NMR FID
##DATA CLASS= NTUPLES
##ORIGIN= UXNMR, Bruker Analytische Messtechnik GmbH
##OWNER= root
$$ XWIN-NMR		Version 3.5
$$ Thu May 13 13:23:58 2021 Russian Standard Time (UT+4h)  she@DPX200
##.OBSERVE FREQUENCY= 200.131506
##.OBSERVE NUCLEUS= ^1H
##.DELAY= (6, 6)
##.ACQUISITION MODE= SIMULTANEOUS
##.ACQUISITION SCHEME= undefined
##.AVERAGES= 8
##.DIGITISER RES= 18
##SPECTROMETER/DATA SYSTEM= spect
##.PULSE SEQUENCE= zg30
##.SOLVENT NAME= CDCl3
##.SHIFT REFERENCE= (INTERNAL, CDCl3, 0, 15.7039)
##AUDIT TRAIL= $$ (NUMBER, WHEN, WHO, WHERE, WHAT)
$$ ##TITLE= Audit trail, XWIN-NMR		Version 3.5
$$ ##JCAMPDX= 5.01
$$ ##ORIGIN= Bruker BioSpin GmbH
$$ ##OWNER= she
$$ F:/spectra/data/she/nmr/H-F/1/audita.txt
$$ ##AUDIT TRAIL=  $$ (NUMBER, WHEN, WHO, WHERE, WHAT)
(   1,<2021-05-13 13:22:36.54 +0400>,<she>,<DPX200>,
      <created by zg, POWCHK disabled, PULCHK disabled
       configuration hash MD5:
       00 E9 B6 7A A2 85 ED C7 34 08 36 98 17 FE 4E 26
       data hash MD5: 16K
       B6 1A DB 20 C5 22 64 B1 10 17 44 73 DC C2 C7 FF>)
$$ ##END=
$$ 
$$ hash MD5
$$ 74 49 D6 11 87 3B 8B 48 A3 08 AD 3B 72 DC D6 9D
##$RELAX= 
##$RELAX= 
##$RELAX= 
##$RELAX= 
##$RELAX= 
##$RELAX= 
$$ Bruker specific parameters
$$ --------------------------
##$DU= <F:/spectra>
##$EXPNO= 1
##$NAME= <H-F>
##$PROCNO= 1
##$TYPE= <nmr>
##$USER= <she>
##$AMP= (0..31)
100 100 100 100 100 100 100 100 100 100 100 100 100 100 100 100 100 100 
100 100 100 100 100 100 100 100 100 100 100 100 100 100 
##$AQSEQ= 0
##$AQ_mod= 1
##$AUNM= <au_zg>
##$AUTOPOS= <>
##$BF1= 200.13
##$BF2= 200.13
##$BF3= 200.13
##$BF4= 200.13
##$BF5= 200.13
##$BF6= 200.13
##$BF7= 200.13
##$BF8= 200.13
##$BYTORDA= 1
##$CFDGTYP= 0
##$CFRGTYP= 5
##$CHEMSTR= <none>
##$CNST= (0..31)
1 1 145 1 1 1 1 1 1 1 1 1 1 1 1 1 1 1 1 1 1 1 1 1 1 1 1 1 1 1 1 1 
##$CPDPRG= <>
##$CPDPRG1= <>
##$CPDPRG2= <>
##$CPDPRG3= <>
##$CPDPRG4= <mlev>
##$CPDPRG5= <mlev>
##$CPDPRG6= <mlev>
##$CPDPRG7= <mlev>
##$CPDPRG8= <mlev>
##$CPDPRGB= <>
##$CPDPRGT= <>
##$D= (0..31)
0 1.2 0 0 0 0 0 0 0 0.06 0 0.03 0 0 0 0 0.0002 0 0 0 0 0 0 0 0 0 0 0 0 
0 0 0 
##$DATE= 1620897755
##$DBL= (0..7)
120 120 120 120 120 120 120 120 
##$DBP= (0..7)
150 150 150 150 150 150 150 150 
##$DBP07= 0
##$DBPNAM0= <>
##$DBPNAM1= <>
##$DBPNAM2= <>
##$DBPNAM3= <>
##$DBPNAM4= <>
##$DBPNAM5= <>
##$DBPNAM6= <>
##$DBPNAM7= <>
##$DBPOAL= (0..7)
0.5 0.5 0.5 0.5 0.5 0.5 0.5 0.5 
##$DBPOFFS= (0..7)
0 0 0 0 0 0 0 0 
##$DE= 6
##$DECBNUC= <off>
##$DECIM= 32
##$DECNUC= <off>
##$DECSTAT= 4
##$DIGMOD= 1
##$DIGTYP= 9
##$DL= (0..7)
0 120 120 120 120 120 120 120 
##$DP= (0..7)
150 150 150 150 150 150 150 150 
##$DP07= 0
##$DPNAME0= <>
##$DPNAME1= <>
##$DPNAME2= <>
##$DPNAME3= <>
##$DPNAME4= <>
##$DPNAME5= <>
##$DPNAME6= <>
##$DPNAME7= <>
##$DPOAL= (0..7)
0.5 0.5 0.5 0.5 0.5 0.5 0.5 0.5 
##$DPOFFS= (0..7)
0 0 0 0 0 0 0 0 
##$DQDMODE= 0
##$DR= 18
##$DS= 0
##$DSLIST= <SSSSSSSSSSSSSSS>
$$ [...]
##$SUBNAM2= <"">
##$SUBNAM3= <"">
##$SUBNAM4= <"">
##$SUBNAM5= <"">
##$SUBNAM6= <"">
##$SUBNAM7= <"">
##$SUBNAM8= <"">
##$SUBNAM9= <"">
##$SW= 16.9725357007746
##$SWIBOX= (0..15)
0 0 2 0 0 0 0 0 0 0 0 0 0 0 0 0 
##$SW_h= 3396.73913043478
##$TD= 16384
##$TD0= 1
##$TE= 0
##$TE2= 300
##$TE3= 300
##$TEG= 300
##$TL= (0..7)
0 120 120 120 120 120 120 120 
##$TP= (0..7)
150 150 150 150 150 150 150 150 
##$TP07= 0
##$TPNAME0= <>
##$TPNAME1= <>
##$TPNAME2= <>
##$TPNAME3= <>
##$TPNAME4= <>
##$TPNAME5= <>
##$TPNAME6= <>
##$TPNAME7= <>
##$TPOAL= (0..7)
0.5 0.5 0.5 0.5 0.5 0.5 0.5 0.5 
##$TPOFFS= (0..7)
0 0 0 0 0 0 0 0 
##$TUNHIN= 0
##$TUNHOUT= 0
##$TUNXOUT= 0
##$USERA1= <user>
##$USERA2= <user>
##$USERA3= <user>
##$USERA4= <user>
##$USERA5= <user>
##$V9= 5
##$VALIST= <valist>
##$VCLIST= <CCCCCCCCCCCCCCC>
##$VD= 0
##$VDLIST= <DDDDDDDDDDDDDDD>
##$VPLIST= <PPPPPPPPPPPPPPP>
##$VTLIST= <TTTTTTTTTTTTTTT>
##$WBST= 1024
##$WBSW= 4
##$XGAIN= (0..3)
0 0 0 0 
##$XL= 0
##$YL= 0
##$YMAX_a= 400374
##$YMIN_a= -136389
##$ZGOPTNS= <>
##$ZL1= 120
##$ZL2= 120
##$ZL3= 120
##$ZL4= 120
##$ABSF1= 10
##$ABSF2= 0
##$ABSG= 5
##$ABSL= 3
##$ALPHA= 0
##$AQORDER= 0
##$ASSFAC= 0
##$ASSFACI= 0
##$ASSFACX= 0
##$ASSWID= 0
##$AUNMP= <proc_1d>
##$AZFE= 0.1
##$AZFW= 0.1
##$BCFW= 1
##$BC_mod= 2
##$BYTORDP= 1
##$COROFFS= 0
##$CY= 11.3945322036743
##$DATMOD= 1
##$DC= 2
##$DFILT= <>
##$DTYPP= 0
##$F1P= 15.9154993809931
##$F2P= -4.1035820241983
##$FCOR= 0.5
##$FTSIZE= 0
##$FT_mod= 4
##$GAMMA= 1
##$GB= 0.15
##$INTBC= 1
##$INTSCL= 1
##$ISEN= 128
##$LB= 0.24
##$LEV0= 0
##$LPBIN= 0
##$MAXI= 10000
##$MC2= 0
##$MEAN= 0
##$ME_mod= 0
##$MI= 1.114404
##$NCOEF= 0
##$NC_proc= 0
##$NLEV= 6
##$NOISF1= 3.799351
##$NOISF2= 2.8
##$NSP= 1
##$NTH_PI= 0
##$NZP= 0
##$OFFSET= 15.70392
##$PC= 1
##$PHC0= -11119.46
##$PHC1= 9.401
##$PH_mod= 1
##$PKNL= yes
##$PPARMOD= 0
##$PSCAL= 0
##$PSIGN= 0
##$REVERSE= no
##$SF= 200.130013532006
##$SI= 16384
##$SIGF1= 3
##$SIGF2= 2
##$SINO= 400
##$SIOLD= 16384
##$SREGLST= <1H.CDCl3>
##$SSB= 0
##$STSI= 0
##$STSR= 0
##$SW_p= 3612.71676300578
##$SYMM= 0
##$S_DEV= 0
##$TDeff= 0
##$TDoff= 0
##$TI= <>
##$TILT= no
##$TM1= 0
##$TM2= 0
##$TOPLEV= 0
##$USERP1= <user>
##$USERP2= <user>
##$USERP3= <user>
##$USERP4= <user>
##$USERP5= <user>
##$WDW= 1
##$XDIM= 8192
##$YMAX_p= 0
##$YMIN_p= 0
$$ End of Bruker specific parameters
$$ ---------------------------------
##NTUPLES= NMR FID
##VAR_NAME=  TIME,          FID/REAL,        FID/IMAG
##SYMBOL=    X,             R,               I
##VAR_TYPE=  INDEPENDENT,   DEPENDENT,       DEPENDENT
##VAR_FORM=  AFFN,          ASDF,            ASDF
##VAR_DIM=   8192,          8192,            8192
##UNITS=     SECONDS,       ARBITRARY UNITS, ARBITRARY UNITS
##FACTOR=    0.0002944,     1,               1
##FIRST=     0,             0,               0
##LAST=      2.4114304,     0,               0
##MIN=       0,             -136389,         0
##MAX=       2.4114304,     400374,          0
$$ Real data points
##PAGE= N=1
##DATA TABLE= (X++(R..R)), XYDATA
$$ [...]
2050c5J355p89M09K1m99P55j163J542j910J792j137j99O07o86O27j185J603j562
$$ -35 1320 531 940 961 462 1217 54 1596 -314 1478 341 142 749 63 690 -495 1108 -454
2068d54J715j636L83O83j548K003k001J608j117J208r48O75r5r63K048k219K027
$$ -454 1261 -375 8 691 -857 1146 -855 753 -364 844 -104 571 476 -487 1561 -658 1369
2085A369j150K12Q6j21M1m13J305j992K029j686P89L60j340J426q88N77j337J730
$$ 1369 219 431 517 396 437 24 1329 -663 1366 -320 469 829 -511 915 27 604 -733 997
2103I97j868J614k27j077K073k198J802p64M23o51J383q51P2J471k320K708k123
$$ 997 -871 743 516 -561 1512 -686 1116 352 775 124 1507 656 728 2199 -121 2587 464
2120D64J284l30l63K37l0K69j037J901k521J982r80n83J285j511R30p31N79j280
$$ 464 1748 1418 1055 1292 1262 1531 494 2395 -126 1856 876 293 1578 67 997 266 845 -435
2138d35J942j721k1J430k160J855j316O19o45N10o59J076j9j659K634k299J540
$$ -435 1507 -214 -235 1195 -965 890 -426 193 -452 58 -601 475 456 -1203 1431 -868 672
2155F72k75m05K85k32M57p14J201k147K402j604K7J097j574J163j054J027j171
$$ 672 397 -8 277 45 502 -212 989 -1158 1244 -360 -333 764 -810 353 -701 326 -845
2172h45Q08r09Q03j37j204K327j978J125m33N09o37O71J49o71J606j839J994j366
$$ -845 -37 -946 -143 -280 -1484 843 -1135 -10 -443 66 -571 100 249 -422 1184 -655 1339 -27
2190b7N89M72p62O46l79Q59j366J713j440J013m56m31R77j416J280r46R06j143
$$ -27 562 1034 272 918 539 1398 32 1745 305 1318 862 431 1408 -8 1272 326 1232 89
2208H9Q79k74m20R84j810J787j371Q29m81L13m7m51R38j627J924j438Q71m25q8
$$ 89 968 694 274 1258 -552 1235 -136 693 212 525 478 27 965 -662 1262 -176 695 270 182
2227A82N59p97R35j104J351j786J450o75j73O67j211J442j661J530j476P52k83
$$ 182 741 -56 879 -225 1126 -660 790 115 -58 609 -602 840 -821 709 -767 -15 -298
2244b98M5O07j153J269j413J383j090R46m45m36Q92j251J419j287J489j242M76
$$ -298 -253 354 -799 470 -943 440 -650 296 -149 -585 307 -944 475 -812 677 -565 -89
2261h9O4l18J145j601J546j209P37m60M11j14k92Q37j431J707j710J360n51j54
$$ -89 -25 -343 802 -799 747 -462 275 -185 226 112 -180 657 -774 933 -777 583 32 -122
2279a22O18o96J027j095J315j687J368o34k31J045j472J610j333R56q91J011j088
$$ -122 496 -200 827 -268 1047 -640 728 94 -137 908 -564 1046 -287 669 -222 789 -299
2296b99M56J93j108J584j896J572q33L82k32p7M06q12J431k035J525j095Q50J79
$$ -299 157 350 -758 826 -1070 502 -331 51 -181 -258 148 -664 767 -1268 257 -838 12 191
2314A91p47Q04r25J058j348J273j264J064R5r09J594j337R92q18K83o23P62j82
$$ 191 -556 248 -677 381 -967 306 -958 106 201 -708 886 -451 541 -277 6 -617 145 -37
2332c7p73J838k249J748j067L55O6k81K12j73O17j422J798j587J110k74o81J234
$$ -37 -810 1028 -1221 527 -540 -185 -119 -400 -188 -361 256 -1166 632 -955 155 -119 -800 434
2350D34o54L42l61R11j322Q77r1m28J089j536J362q68K89l91O82p03L78M83j557
$$ 434 -220 122 -239 672 -650 227 136 -292 797 -739 623 -245 44 -347 335 -368 10 493 -1064
2369a064K036j874R71m20N4K15l18K77p49J570j824J367p01n4N54p34J069j213
$$ -1064 972 -902 69 -351 -297 -82 -400 -123 -872 698 -1126 241 -460 -514 40 -694 375 -838
2387h38J016q99J136j105L76Q37j473J533j227J014p14M39m63J36K32n77J106
$$ -838 178 -721 415 -690 -314 523 -950 583 -644 370 -344 95 -368 -232 0 -577 529
2404E29j716J445n13J9J30j73L92p32Q73q79J017j041O40K84o85R55q76J020r29
$$ 529 -1187 258 -255 -236 -106 -279 113 -619 254 -625 392 -649 -9 275 -410 545 -331 689 -240
2423b40R63p29N06J43o41Q99j249J093n31M19m59K68L10p30O16r68R31j229J055
$$ -240 723 -6 500 643 2 901 -348 745 214 633 174 442 752 22 638 -330 601 -628 427
2442D27n40j89N94p42P96j208J123q15O40q7k16M90r72J553j488J231r94P77k57
$$ 427 -113 -302 292 -450 346 -862 261 -554 86 -1 -217 273 -699 854 -634 597 -397 380 123
2461A23m19P77r55R24j048J123q09L01Q2m54O10r48O84r60P00m25K80J6k98P22
$$ 123 -296 481 -474 450 -598 525 -284 17 99 -355 255 -693 -9 -969 -269 -694 -414 -398 -696 26
2481B6j369J263p66M37l82L80K60k88O17j052J349j003P06K6l11M29k53P54r32
$$ 26 -1343 -80 -846 -409 -791 -411 -151 -439 178 -874 475 -528 178 204 -107 322 69 823 -109
2500a09P51r76R54m87lQ41j278R09q15N13j82K18m70j03M56j034J501j414O63
$$ -109 642 -334 620 133 130 971 -307 602 -213 300 118 336 -134 -237 219 -815 686 -728 -65
2519f5k16J96O8L0J82j067J511j435J154l78M5L29o22Q67n33L51p36J011j012
$$ -65 -281 -85 -17 13 195 -872 639 -796 358 -20 25 354 -268 599 66 417 -319 692 -320
2538c20M17J38p08J026r75N60p14N87m88J99K3p28J162j067O36m77K58J5K7K8
$$ -320 97 235 -473 553 -422 138 -576 11 -477 -278 -255 -983 179 -888 -252 -729 -471 -456 -429 -401
2558d01j05N38j263J325q99O55m0l18N02p19Q76q51J001p90N99k5o77R53j140
$$ -401 -506 32 -1231 94 -805 -150 -190 -508 -6 -725 151 -700 301 -489 110 85 -592 361 -779
2577g79J018o14L57m65M30j04l11N70j084J428j126N04q5N9L35l17R4n83R35j006
$$ -779 239 -375 -18 -483 -53 -157 -468 102 -982 446 -680 -176 -261 -202 133 -184 -90 -673 262 -744
2597g44J060n21k14P86q67P80o73P88r33Q11m85r2L48n73Q24r29N11l64M39m32
$$ -744 316 -205 -419 367 -500 280 -393 395 -538 273 -212 -304 44 -529 295 -634 -123 -487 -48 -480
2617d80J34L19n13P76j125J208o58K17O4r9J97o51R96r72R90p38M37q6n77R48
$$ -480 -346 -27 -540 236 -889 319 -339 -122 -58 -157 40 -611 385 -587 403 -335 102 16 -561 387
2637C87p58Q08q54P01m00QL04o35Q53r90J275q25L61n47J75L74o15Q36r29J040
$$ 387 -371 437 -417 284 -116 -108 196 -439 414 -576 699 -126 235 -312 -137 237 -378 458 -471 569
2657E69p51L92n0J94j89j46Q78r05M79m11N39k08J24J68r49R58p94O73n05K43
$$ 569 -182 210 160 354 165 19 897 -8 471 60 599 391 515 683 -266 692 -102 571 66 309
2677C09K00m27M01n81M95o92O57n74L83Q1m74O53p31Q04q59P08n30kK78n54R63
$$ 309 509 82 483 -98 397 -295 362 -212 171 252 -222 431 -300 504 -355 353 -177 -179 99 -455 508
2698E08p24P54m86L25j38Kq0l71R65r97Q33j116Q63j68k12K46n62O71r07R71r45
$$ 508 -216 538 52 377 239 241 161 -210 755 -242 591 -525 338 170 -42 204 -358 313 -594 377 -568
2719e68O17j87m1M29q25R47r86Q71n65M82k83%L03q37J080o26M48k28K06j73p0
$$ -568 49 -138 -179 250 -575 372 -614 257 -308 174 -109 -109 194 -643 437 -189 259 31 237 64 -6
2740fK37m67P27q64P25k51k51N91o53L09j84L39q69Q70n34lP40r53P01n09M91
$$ -6 231 -236 491 -373 352 101 -150 441 -212 97 -87 252 -617 253 -281 -284 456 -497 204 -305 186
2761A86o36N42l93K05L15q73J143q84Q25l79N1j35Q0J58l51Q02j236J111n53k6
$$ 186 -450 92 -301 -96 219 -654 489 -395 430 51 102 -33 47 205 -146 656 -580 531 -22 -48
2781d8K23k35M73q35O91o30P61r08P49k22l32Q45j032N48l24P42q47M98p9k3N30
$$ -48 175 -60 413 -422 269 -361 400 -508 241 19 -313 532 -500 48 -276 466 -381 117 38 15 545
2802E45j080J293p68N9O4k3J63o30Q04p90R13r61N73j79l80O48o97O22o29P48
$$ 545 -535 758 -10 49 113 90 253 -377 427 -363 550 -411 162 -17 -397 251 -446 176 -453 295
2822B95o54L09k7j15K60p54Q66o42O11n74L85l1k32N99j058J099j010R61j37r3
$$ 295 -359 -50 -77 -192 68 -686 180 -462 149 -425 -40 -71 -303 296 -762 337 -673 288 151 58
2842E8ll26L81q16J007q68J014n77l18M00l14P56q51R19q44P76j082L74O78o72
$$ 58 55 -271 110 -706 301 -567 447 -130 -448 -48 -362 394 -457 462 -382 394 -688 -314 364 -308
2862c08K02m01J040r89O38j18j70ql58Q04q19R50q52N57j74j81P56q93R74j037
$$ -308 -106 -507 533 -456 182 64 -106 -114 -472 332 -487 463 -389 168 -6 -187 569 -324 650 -387
2882c87P33n30K05O7L8L45p98R48r21O74m71K06K3k40M21l80N31p77O37m29K05
$$ -387 346 -184 21 88 126 471 -327 621 -300 374 -97 109 132 -108 313 -67 464 -313 324 -105 100
2903A00R5m87O38n53N75n93O95m85M6K93o39R47r78P13m95L79l56J39j5k72Q27
$$ 100 195 -292 346 -207 368 -225 470 -15 31 324 -315 632 -346 367 -128 251 -105 34 19 -253 574
2924E74p46R73j030K97k8n6L95n64O51p49P76n31K79k3k46N88o69O41m15L53n04
$$ 574 -172 801 -229 68 40 -16 379 -185 466 -283 493 -38 241 218 -28 560 -109 532 117 470 -34
2945c4L79l56j21P91r52J099r59J23J40n9n0k4N21q09R44r14Q05j55n12N41n69
$$ -34 345 -11 -132 659 -293 806 -153 -30 110 51 1 -23 498 -311 633 -281 524 369 -143 398 -171
2966a71O34o69Q58n63K72l39j42L77m80O06o71O97q11O38k97l7L94n03O26p74
$$ -171 463 -206 652 89 361 22 -120 257 -223 383 -288 409 -402 236 -61 -98 296 -207 419 -355
2986c55M50k46K22j22p9M01p09Q63r84P36k90N8M6m93M88j03M12o27P38o19M25
$$ -355 95 -151 71 -51 -130 271 -438 425 -559 177 -113 -55 -9 -502 -14 -117 295 -332 406 -213 212
3007B12o9l69P76p83L55m87O05n48K17K07m61Q36j059J031q26M54j85j65J16l29
$$ 212 143 -226 550 -233 122 -365 240 -308 -91 116 -345 491 -568 463 -363 91 -94 -259 -143 -472
3027d72O87q32P21m05L58j49k79O41o92O42o41O12n79M49j4l89O43p76Q41q81
$$ -472 215 -617 104 -301 57 -92 -371 270 -422 220 -421 191 -388 61 47 -342 301 -475 366 -515
3047e15Q58l67L6j0k74M29r01J151o58L26k42j3K45m88M85m30O30n69M73m65K1
$$ -515 343 -24 12 2 -272 157 -744 407 -251 75 -167 -180 65 -423 62 -368 262 -307 166 -299 -278
3068b78L91l94M94p72J000q38M04j09j7k4rr5L5M74o45K92N37m39L40o32J97J48
$$ -278 113 -281 213 -559 441 -397 7 -102 -119 -143 -152 -247 -212 262 -383 -91 446 7 347 -285 -88 60
3090F0L89r72O98%k32K99n78P54n79O18o18L99k30L3N32q57O92q00O95k24nK19
$$ 60 449 -523 175 175 -57 242 -336 418 -161 457 -161 238 8 41 573 -284 408 -392 303 79 74 293
3112B93m41O05q37J038r73N56j68O1J47l60O24r21P66m30N92m72K03P1p79R07
$$ 293 -148 457 -380 658 -315 241 73 134 281 -79 545 -376 390 -40 552 80 283 354 -425 482
3132D82q12M98l57N23k72l9L20q25Q97q23Q86q13M56J15k38R1j80K64m66P68n40
$$ 482 -330 168 -189 334 62 23 343 -482 415 -408 478 -335 121 236 -2 89 -91 173 -293 475 -65
3153f5l0L12l84K15j24O49p28O54k89K1j5m95Q01q99O78m16R1LK24J42k21M11
$$ -65 -95 217 -167 48 -76 573 -155 499 210 231 216 -279 522 -377 301 -115 -24 -21 203 345 124 535
3175E35j002Q00o73Q40k05k26Q0l48N11m34N89j005P18O9l59O15q00P36n42M43
$$ 535 -467 333 -340 500 295 69 149 -199 312 -122 467 -538 180 249 -110 505 -295 441 -101 342
3195C42o04O32l83K6K24p69J187r18O73n57L49K29o90Q09p21O01o76K82J52l75
$$ 342 -262 370 -13 13 237 -532 655 -263 410 -147 202 431 -259 550 -171 430 -246 36 188 -187
3215a87J35k22O33m20J85k02K65m13K10O5m27P63n41O82q47P13o22R9M23o09P58
$$ -187 -52 -274 359 -61 124 -78 187 -226 -16 49 -378 385 -156 526 -321 392 -230 -131 292 -317 441
3236D41o35O57q60P22l78l6J74l94P39q49O76l74K80j46r8L95n11O17n30K69k33
$$ 441 -194 463 -397 325 -53 -89 85 -309 430 -419 257 -117 163 17 -81 314 -197 420 -110 159 -74
3257g4o3L56m25N89n47L21j35K31m58M60j35j35L41p82P71n13N46l19J2K95k38
$$ -74 -137 219 -206 383 -164 157 22 253 -205 255 120 -15 326 -456 315 -198 348 29 41 336 98
3278I8K75m58M42n48L61l77K83p7k18N15p13Q86q09L66k06J51M19o91O27p00N71
$$ 98 373 -85 357 -191 170 -207 76 -1 -219 296 -417 469 -340 26 -180 -29 390 -301 326 -374 197
3299A97l89J97J43j82J31n14P56m78K90l45M73j04k61M31p81Q49p69O34l88J41
$$ 197 -192 5 148 -34 97 -417 339 -139 151 -194 279 175 -86 345 -436 413 -356 278 -110 31
3319C1K43o04M69l54P40q20M41n7l0pj31N00p73P42o89O77l47k07K69l16N70k62
$$ 31 274 -330 139 -215 525 -295 146 89 59 52 -79 421 -352 390 -299 378 31 -176 93 -223 347 85
3341H5M23n79J56j42J99J27n22N82l77N38p97M03k7K3K02o88P38m40L54m28M40
$$ 85 508 -71 85 -57 142 269 -253 329 -48 490 -307 96 69 92 294 -394 344 -96 258 -170 270
3362B70Qn29K81j44M87p19M99j95J53M5l85L61n73O79o26M10J97l57N76l68K17
$$ 270 278 -251 30 -114 373 -346 153 -42 111 156 -229 132 -441 238 -388 22 219 -138 438 70 287
3383B87m65M02m50K89j01J54J6k63M57o05M27k39K88j75p3K79m30M82o13N69l05
$$ 287 -178 224 -226 63 -38 116 132 -131 326 -279 148 -91 197 22 -51 228 -202 280 -333 236 -69
3404f9K62j44QL91r54Q46r31Q97o26J77K6m4K37n71P77n58M49k60J8J45l08L54
$$ -69 193 49 57 448 -506 340 -591 306 -320 -143 -117 -161 76 -495 282 -276 173 -87 -69 76 -232 122
3426A22k45M24n49K42mk19K88k17J40l13M64n85K57R7j53M60o95N51m88M95n93
$$ 122 -123 301 -248 -6 -10 -229 59 -158 -18 -331 133 -452 -195 -98 -251 209 -486 65 -423 72 -521
3447e21N42j60k6Q8k70L71n99O60n06M71j88n2J55j16K23k76N58m28J1o6N4L12
$$ -521 21 -139 -165 -77 -347 24 -575 85 -421 50 -138 -190 -35 -151 72 -204 354 -74 -63 -129 -75 237
3469B37n85N25k75N02l42j76J83k12R00q41K29j76K3j34J29J41k54N8k39N53o02
$$ 237 -348 177 -98 404 62 -114 69 -143 757 -84 145 -31 -8 -142 -13 128 -126 -68 -307 246 -356
3490c56K23j6J02J41l84N27o64O01l15L08k53l9L82n64O56n98L60l43L26k54l8
$$ -356 -133 -149 -47 94 -290 237 -427 174 -141 167 -86 -125 257 -307 349 -249 111 -232 94 -160 -198
3511a98N62o87M56m61L99m03K33L1k82L18l96O74o31K51Jo5p0k37O81p13N11k28
$$ -198 364 -323 133 -328 71 -332 -99 -68 -350 -32 -428 246 -385 -134 -133 -198 -268 -505 176 -537 -26 -254
3533b54J56j24L25k71j08J31m79O97l89L58j98k8K47l23K76l34N29k75K15j52
$$ -254 -98 -222 103 -168 -276 -145 -624 73 -316 42 -156 -184 63 -260 16 -318 211 -64 151 -1
3553aj17J27m2Ql21O13n20K96K5l88N54o24N90o66Q91j85n52P7J95J40l62L63
$$ -1 -118 9 -33 -25 -346 267 -253 43 68 -320 234 -390 200 -466 425 240 -312 -235 -40 100 -262 101
3575A01m89M60j73K22l07P1K80m82O41o73N49j55r7Ok05M39k65M57o70K84k68
$$ 101 -388 72 -101 121 -186 -115 165 -317 324 -349 200 45 -52 -46 -251 188 -77 380 -290 -6 -274
3596b74q7L54l09M34l07M11l50J98l9j35J92l98O20n87M24m46J80J99k10L58n60
$$ -274 -361 -7 -316 118 -189 222 -128 70 31 -104 88 -310 310 -277 147 -299 -119 80 -130 228 -332
3617c32L31j89N96p22J84J71k49M76l72M39o24N20l31K6M2j32O04m85J04n77O00
$$ -332 -1 -190 406 -316 -132 39 -210 266 -106 333 -291 229 -102 -76 -34 -166 438 -47 57 -520 80
3638H0k44J41k9j5J27m30L14K09J38m18L6J46q2P0l18M83l42J12K35n16K50k12
$$ 80 -164 -23 -52 -67 60 -370 -56 153 291 -127 -91 55 -27 43 -275 208 -134 -22 213 -303 -53 -265
3660b65N81m55J2j92N17j71j18N6j37M88n86K20k71M42p7k75L84k72L36n47M98
$$ -265 316 -139 -127 -319 198 27 -91 -35 -172 316 -270 -50 -321 121 44 -231 153 -119 217 -330 168
3681A68k38N2K91l00K29m09N82m70L04n0j31j87J14M27k69n0n43N91k67P7L46
$$ 168 -70 -18 273 -27 202 -207 375 -95 209 159 28 -159 -45 382 113 63 -480 111 -156 -79 267
3702B67n17L83m38M51j20N7j64l5J68m33O66m32M18n24L76Lo8Q3k93N43n51L56
$$ 267 -250 133 -305 146 26 83 -81 -116 52 -381 285 -147 271 -253 123 126 58 141 -152 391 -160 196
3724A96l86J89J63l55M07n22O51m28L70m84J9J08l31N02m55L99k98M30l20o0R6
$$ 196 -190 -1 162 -193 214 -308 343 -85 285 -199 -180 -72 -403 99 -356 43 -255 175 -145 -205 -109
3745a09l50M78l10K68k82K75j02j13J13l05M10n64Q08n58K32j01r4L16l14M16
$$ -109 -459 19 -291 -23 -305 -30 -132 -245 -132 -437 -27 -591 217 -341 -109 -210 -304 12 -302 114
3765A14k42J02l94O78l82J71j6l34M87k28J35k30J34q4k6J74l37K27l9J99l02
$$ 114 -128 -26 -420 258 -124 47 31 -303 184 -44 91 -139 -5 -89 -115 59 -278 -51 -90 109 -193
3786a93J64j68M7N2k20M38n68M82j98R2M0j94J98PL09m51K28p7j28O1k63O30p44
$$ -193 -29 -197 -150 -98 -318 120 -448 34 -164 -72 -32 -226 -28 -21 288 -163 65 -12 -140 -79 -342 288 -456
3809d56N71m01L01j52j56L35m68P34n69K74k02Q4j36J48K32m79N19m89J73k51
$$ -456 115 -286 15 -137 -293 42 -426 308 -261 13 -189 -105 -241 -93 139 -340 179 -310 -137 -388
3829c88K05K03k71L21n29M98l79L86j12J18j52K4M07o32L41o4J51Lj06P7l63K44
$$ -388 -183 20 -251 70 -459 39 -340 46 -66 52 -100 -76 331 -301 40 -24 127 130 24 101 -262 -18
3851a8q8K72l11K79j55K4J04l97N48m62K55k11M54n49K01K46k48Q6l3K36l46J35
$$ -18 -106 166 -145 134 -21 3 107 -290 258 -204 51 -160 294 -255 -54 192 -56 30 -3 233 -113 22
3873B2m1j15L49p60O46k95N03m14o4K62l74N26m95N07n00M56m24J42j2r6M60n62
$$ 22 -19 -134 215 -545 101 -194 309 -105 -169 93 -281 245 -250 257 -243 213 -211 -69 -81 -177 283 -279
3895b79M17m18K23k57L49Rj88J78j53J94k40K15k03J52n5Q6N9o20O34j82J85L3
$$ -279 138 -280 -57 -314 35 44 -144 34 -119 75 -165 50 -153 -1 -56 30 89 -531 103 -79 106 139
3917A39l44L69n93N15j50J15k75K89k03K9M12n34L65n45N38j32J69j1k61P3l59
$$ 139 -205 164 -429 86 -64 51 -224 65 -138 -109 303 -231 134 -411 127 -5 164 153 -108 -35 -394
3938c94N29j43J99k9j22R3j51Q0l61O25l91L11j22k67K70n69O10l15M50m19K54
$$ -394 135 -8 191 162 40 133 -18 62 -299 326 -65 246 124 -143 127 -442 168 -147 303 -116 138
3959A38l63J94K21l70M55o60O89m78J70o5J15K94m30L1l52O63n93L93l0P8K81
$$ 138 -225 -31 190 -180 275 -385 304 -174 -4 -69 46 340 -90 -59 -411 252 -341 52 22 100 381
3980C81n42L29k34L16l94K27pj05K7p3J98l49J69j78P1K55l63K31m65N07j90J65
$$ 381 -161 168 -66 250 -144 83 76 -29 -2 -75 123 -226 -57 -235 -164 91 -272 -41 -506 1 -189 -24
4002b4M7m55N25j82Q2l08N43n39M20l23M0K97j26J7k20L76n35N24l54Q9L3k57
$$ -24 23 -432 93 -89 -7 -315 228 -311 109 -214 -174 123 -3 14 -206 170 -365 159 -195 -106 -73 -330
4024c30O03n51L01l06J33J27p9J25l25L76l37L32j5j29L9kL18q62O18m77O87o12
$$ -330 273 -278 23 -283 -150 -23 -102 23 -302 74 -263 69 54 -75 -36 -38 280 -582 36 -441 246 -366
4046c66L87J00l68L36k3K11n65P57n23mK45m46P30p96O28k88K10k54o0K53l12
$$ -366 21 121 -247 89 66 277 -288 469 -54 -58 187 -259 471 -325 303 15 225 -29 -89 164 -148
4067a48M38k42J00l98M37k79M0Q3k99M14k19k5n3L85k00k01K98k18M00k48K01
$$ -148 290 48 148 -250 187 -92 -52 31 -268 146 -73 -98 -151 234 34 -167 131 -87 313 65 266
4088B66k74J44K36m52K03n19N08l82M18k25pK99m73M50m48N12m58Q9k2lL59l86
$$ 266 -8 136 372 -80 123 -396 112 -270 148 -77 -84 215 -258 192 -256 256 -202 -113 -135 -138 221 -165
4110a65M57m99M75n69M28j88j33L85k41J70k12O05p49M82N8m19J37p5K49m40N92
$$ -165 292 -207 268 -301 127 -61 -194 191 -50 120 -92 513 -236 246 304 -115 22 -53 196 -244 348
4131C48m15O1j20o8J00l87N60m44L94k29J38J01j27M86l86J52j5J3j54N4q7J0
$$ 348 -67 -6 -126 -194 -94 -481 79 -365 29 -200 -62 39 -88 398 12 164 149 162 8 62 -25 -15
4153a5K17o62O79l44L56k35k4K42l57M64n23L14k92K78k30K36k69R0K33l71L69
$$ -15 202 -460 219 -125 231 -4 -28 214 -143 321 -202 112 -180 98 -132 104 -165 -75 158 -213 156
4174A56l86J41J82k30M05n90O88m04J96r1J28n1l14K66l87M64j79P7l14L17J20
$$ 156 -230 -89 93 -137 268 -322 366 -38 158 67 195 144 -170 96 -291 173 -6 71 -243 74 194
4195A94j78J36k61K69j09q5m9J16J40j93J95l22K86k55J55k12K53L00m83M87n19
$$ 194 16 152 -109 160 51 -34 -83 33 173 -20 175 -147 139 -116 39 -173 80 380 -103 384 -135
4216a35J70Q3n1J61l31K11j39L40m99L39l45J42l0j36L44m02N40m58M84k03k34
$$ -135 35 118 67 228 -103 108 -31 309 -190 149 -196 -54 -84 -220 124 -278 262 -196 288 85 -149
4237a49O3P4L88p31O55m49K71j52r9M1N4J91n32M19l27N53k61j56K89j98J96j48
$$ -149 -86 -12 376 -355 300 -149 122 -30 -129 -88 -34 157 -375 44 -283 270 9 -147 142 -56 140 -8
4259hQ1l60L90k52P8J02j41J60j03L59k05Q8j42n2L04m14M85n69L10k79J80R5
$$ -8 73 -287 103 -149 -71 31 -110 50 -53 306 101 189 47 -5 299 -115 370 -199 111 -168 12 107
4281A07k2J70n31N07j29O5R7r6o0n2J06k45N41o74L35j68P5L1j19J12k78N54o03
$$ 107 85 255 -276 231 102 167 264 168 108 56 162 -83 458 -216 119 -49 26 57 -62 50 -228 326 -277
4304b77L53J05J78j85n8l7l36N34m40m7J91K39j03j28m8k94O31l93J0J79j29J30
$$ -277 76 181 359 174 116 79 -257 277 -163 -210 -19 220 117 -11 -59 -353 278 -115 -105 74 -55 75
4326G5j54K08l39L77n57K04j6lL98n60N10l13J80j79L17o8j93j44q0K95k84N22
$$ 75 -79 129 -210 167 -390 -186 -202 -205 193 -367 143 -170 10 -169 148 80 -113 -257 -337 -42 -326 196
4348A96k47J40j47J20L3n8J55l41M21j92Q4j22k71L76j10K5l50M60q4j58J64k00
$$ 196 -51 89 -58 62 95 37 192 -149 272 80 164 42 -229 147 37 62 -288 172 88 -70 94 -106
4370a06K83l42O00o81N27r2m8O5k85K83k54K02j36K2J42j22L11m06M77n05K66
$$ -106 177 -165 435 -246 281 189 141 206 -79 204 -50 152 16 38 180 58 369 -37 440 -65 201
4391B01o6K02Q6o67M33n6J18k04K24m10K50q4q2K54l55J93l85M31p6J42j28k25
$$ 201 135 337 423 -244 189 133 251 47 271 -139 111 27 -55 199 -156 37 -348 83 7 149 21 -204
4413b04K79j94J45l70P65m83j31L84k04J72k50J77l72K43J39k17K59l45L95m19
$$ -204 75 -119 26 -344 421 -62 -193 191 -13 159 -91 86 -286 -43 96 -121 138 -207 188 -231
4433b31K78k63M17m28R4J41j97L49n91M57r0k3P0k9mp3M32m50K5j78L11K4oJ88
$$ -231 47 -216 201 -227 -133 8 -189 160 -431 26 -64 -87 -17 -46 -50 -123 309 -141 -116 -294 17 41 35 223
4457B23k00L94m77K76l37J07R3k86L30j67J97k65J28k10K46P5k66K24j7J31m23
$$ 223 23 417 -60 216 -121 -14 79 -207 123 -44 153 -112 16 -194 52 127 -139 85 68 199 -224
4478b24L03l67K29p3L94J46o90L93k92L87j06o5J47j55L8j15K42l95K20K38k60
$$ -224 79 -288 -59 -132 262 408 -282 111 -181 206 100 35 182 27 65 -50 192 -203 17 255 -5
4499eL41l67M12n36K22k63J46m3P8J56j32K30m99O35n31M9j7k23M88J50j30k48
$$ -5 336 -31 381 -155 67 -196 -50 -93 -15 141 9 239 -260 375 -156 -107 -124 -347 141 291 161 -87
4521h7L20l26R1K30j66K45j89K17n28K70J56k69K66j36K28k23J13k16oL3j84L07
$$ -87 233 -93 -2 228 62 307 118 335 -193 77 233 -36 230 94 322 99 212 -4 -10 23 -161 146
4543A46l91L59m55M38j93q3P4P5L0j95K06k63M23n94L47J33m36L86k17L00j78
$$ 146 -245 114 -341 97 -96 -179 -105 -30 0 -195 11 -252 171 -423 -76 57 -379 7 -210 90 -88
4564h8J67j0M2k07j30J90j54N03m63J74k99K50J51n55M55j85K47l41L86Q4m90
$$ -88 79 69 111 -96 -226 -36 -190 313 -150 24 -275 -25 126 -429 26 -159 88 -253 133 217 -273
4585b73K01k28M16j66J61j54P9j81K1K8Q9J73j83J06j92J34J37k37K78j34J03
$$ -273 -72 -300 116 -50 111 -43 36 -145 -124 -96 -7 166 -17 89 -103 31 168 -69 209 75 178
4606A78n6L7N0rr3o1J4j50M14m49K06o6J47p4k88M49l24L92j73j51J03q7J63k82
$$ 178 122 159 209 200 107 46 60 -90 324 -125 81 15 162 88 -200 249 -75 317 144 -7 96 9 172 -110
4630a10L89j67J60n23K54O1k21P4k78P71m93K89l10J8J37l15K28r6J99k76K86
$$ -110 279 112 272 -251 3 64 -157 -83 -361 410 -83 206 -104 -86 51 -264 -36 -132 67 -209 77
4651G7o7K8l5j36J68k07K86j62Q6j23K92k13j64K83j12J39l13K65p7j83J30mK09
$$ 77 10 38 3 -133 35 -172 114 -48 38 -85 207 -6 -170 113 1 140 -173 92 15 -168 -38 -42 167
4674A67m33N67l35L27l40R7j83j69M89m03M05n5l11J62Oj33J28k6Q5J63l34K6
$$ 167 -266 301 -34 293 -47 50 -133 -302 187 -216 189 134 -177 -15 -9 -142 -14 -40 45 208 -126 -100
4696a00L21l44L33l48K62K9r9P6K0j01n6L0j15K10m5j03j9n8K54o7K74m72L80
$$ -100 221 -123 210 -138 124 153 54 130 150 49 -7 23 -92 118 73 -30 -49 -107 147 80 354 -118 262
4719B62n04K27O4j43R4J7Q7p7J18l25J78k59L21n3P2J98m44P4Qk66L97p7K42k30
$$ 262 -242 -15 49 -94 0 17 104 27 145 -180 -2 -261 60 7 79 277 -167 -93 -85 -351 46 -31 211 -19
4743a9j8j90M36k89R4j51K07Ok49M03n80M54k55J01K25k47M08m43J51j25N60o96
$$ -19 -37 -227 209 -80 14 -137 70 76 -173 230 -350 104 -151 -50 175 -72 336 -107 44 -81 479 -217
4765b17L28M2k25M95n36L81l71K57r8qn4J26j60Q3j88k05N51k65n3L96k74M6j74
$$ -217 111 153 -72 423 -113 268 -103 154 56 48 -6 120 -40 43 -145 -350 201 -64 -117 279 5 51 -123
4788a23K14m18O47l96j6L5r4K19k19l2K37k13K22k83J44j09K73j25J78Pj29p1
$$ -123 91 -327 320 -76 -92 -57 -151 68 -151 -183 54 -159 63 -220 -76 -185 88 -37 141 148 19 -52
4810e2j91K46j26K40j94Jj8L5J24o1L52n22J68K4L33n92L43j71K3J71n07N18l58
$$ -52 -243 3 -123 117 -77 -76 -94 -59 65 4 356 -166 2 26 359 -233 110 -61 -38 133 -374 144 -214
4833b14J3M07j13Lj45J69m97O52n38J56K44j38L02m25L77k88J95l98L03J31l88
$$ -214 -201 206 93 96 -49 120 -377 275 -263 -107 137 -1 301 -124 253 -35 160 -238 65 196 -192
4854a92M10k87M09n46K48j84Q5p6J52K28m88L32j43J90n9M7nj4K5j14L10m70J85
$$ -192 218 -69 340 -206 42 -142 -57 -133 19 247 -241 91 -52 138 79 126 121 107 132 18 328 -142 43
4877D3j89M8K59k57K73l77K13k43K27n6J03j0j49M59m80J93n7K24k15J46j08r4
$$ 43 -146 -98 161 -96 177 -200 13 -230 -3 -59 44 34 -115 344 -136 57 0 224 9 155 47 -47
4899d7J81Rjl34J45J01j32J21j57K60R1m7q5j57K4p2L30l79L24k93J53j39q4L65
$$ -47 134 143 142 -192 -47 54 -78 43 -114 146 237 190 105 -52 -28 -100 230 -149 175 -118 35 -104 -188 177
4923A77l73J77l45O51k72l0L5k0%k82M78l32M02l54o9J36P1Mk50K15k31L55l95
$$ 177 -196 -19 -364 287 15 -15 20 0 0 -282 196 -136 266 -88 -157 -21 50 54 -196 19 -212 143 -252
4946b52J62j5k97L99j28L41l20J21j09O9L4R8l5m25N67k61K76l83L49p8j86P5
$$ -252 -90 -105 -402 -3 -131 210 -110 11 -98 -29 5 103 68 -357 210 -51 225 -158 191 113 -73 2
4968Bm14N55l32K17j23PP0l10N28l62J61l01N66m26J26nmK39m00M21k35J13k33
$$ 2 -412 143 -189 28 -95 -88 -18 -328 200 -162 -1 -302 264 -162 -36 -41 -45 194 -206 215 -20 93 -140
4991a40O9L09j88j71L9j82K01N9j03K8L89l36O8l70N09q4k59o7K92J0k05J41k39
$$ -140 -71 238 50 -121 -82 -264 -63 -4 -107 -79 310 -26 42 -328 181 97 -162 -229 63 73 -132 9 -230
5014b30J55Q8k14K91k09K21k04K41l24L57k82P0r1L11n6l76M08k41QM7L0r2n8
$$ -230 -75 13 -201 90 -119 102 -102 139 -185 172 -110 -40 -131 180 124 -252 156 -85 -77 -30 0 -92 -150
5037a50M33l66K48j67R5j16N2j15j9K68l95M62l33J52Pj05K56l83K80k42L89j64
$$ -150 283 -83 165 -2 93 -23 29 -86 -105 163 -232 230 -103 49 56 -49 207 -176 104 -138 251 87
5059H7r0J73k72L09k11K98k11J12j15rRm9J8j83M25l58K14j67O5O9R2Nl39K85
$$ 87 -3 170 -102 207 -4 294 83 195 80 71 80 31 49 -134 291 -67 147 -20 45 114 206 211 -128 157
5083A57j86J29j81K8K12j77J83k11J56k16M7j0pK23o14Q52m46Pk06K18M5k77L41
$$ 157 -29 100 -81 -53 159 -18 165 -46 110 -106 -59 -69 -76 147 -467 385 -61 -54 -260 -42 3 -274 67
5106F7k25j3J70j2k08J91q2k78L99j08M75m58L10j83n2K5j92J83j21J50j43J20
$$ 67 -158 -171 -1 -13 -221 -30 -112 -390 9 -99 376 -82 228 45 -7 18 -174 9 -112 38 -105 15
5128A5k66K40J46l18J64n9J39Pk4j78K76m0j26J57l60K48k03L07m3k7RJ20j5j77
$$ 15 -251 -11 135 -183 -19 -78 61 68 44 -134 142 102 -24 133 -227 21 -182 125 82 55 64 184 169 -8
5152hK96l65L2J47k3K00m13L35J22k70r1OK7k5K25l60M37l68J53Q3nk14k12M33
$$ -8 288 -77 -45 102 79 279 -134 201 323 53 -38 -32 -5 -30 195 -165 272 -96 57 140 135 -79 -291 142
5176A42n18M88n3j6K6n2L32o95L18l52O52k78P2j84Oj07m1K69l61N17n70K90J17
$$ 142 -376 112 59 43 69 17 349 -346 -28 -380 272 -6 66 -118 -112 -219 -260 9 -352 165 -405 -115 2
5199Bk45N08k88L32n07J42J3ON8k57K48p0J61nK42l47n5L72n25L28j43Q6j95L05
$$ 2 -243 265 -23 309 -198 -56 -43 -37 21 -236 12 -58 103 98 340 -7 -62 310 -215 113 -30 56 -139 166
5223A66k04J39m5p8M2J10Kj78K45l56j88L30j47O06p31M17k75J9RJ07k64R5O8
$$ 166 -38 101 56 -22 20 130 132 -46 199 -157 -345 -15 -162 444 -287 130 -145 -126 -117 -10 -274 -179 -111
5246a11o3K03j61K29k35k3J76k64R4j30N56m86J37R9J8o6l39M96k21K18k34R8
$$ -111 -174 29 -132 97 -138 -161 15 -249 -155 -285 271 -215 -78 21 39 -27 -366 130 -91 127 -107 -9
5268iR2k08L13m07J02J71K0j30K05j70k39L67k82J94j52M07l30J45M1j11J19l38
$$ -9 83 -125 188 -219 -117 54 74 -56 149 -21 -260 107 -175 19 -133 274 -56 89 130 19 138 -200
5290b00K20j5K11l24ML57j67j55J30M2O1k09K31k50K52k25N56p08K41k3M4l1k44
$$ -200 20 5 216 -108 -104 253 86 -69 61 103 164 -45 186 -64 188 -37 519 -189 52 29 73 42 -202
5313b02L93k29K57m85L92k74K89j93L01P3o16M30j70jk32L35k20jL43k59J37m85
$$ -202 191 -38 219 -266 126 -148 141 -52 249 322 -294 136 -34 -35 -267 68 -152 -153 190 -69 68 -417
5335d17M48L5J78j42j6M4j10KL4L3Qj17P2n47M68k48K42j61L69j43R1J72k48Q4
$$ -417 31 66 244 102 86 130 20 22 56 89 97 -20 52 -495 -27 -275 -33 -194 175 32 123 295 47 131
5359A31l74M22l20J10L7J79r3l69O70q3k61J1P5K4k52N27n84K03k78M27j18l12
$$ 131 -243 179 -141 -31 6 185 92 -277 393 310 49 60 135 159 -93 434 -150 53 -225 202 84 -228
5381b28J54m4M0o5L45j88om6j99L74k75L66l79K97l0k20q1NM32l06L51m71J36
$$ -228 -74 -118 -78 -143 202 14 8 -38 -237 137 -138 228 -151 146 116 -104 -185 -180 252 -54 297 -174 -38
5404c8r3K30L4j60N1l82N64k24K51m77K60r6j55L7J78R1K4l5l42K85q0J09Lj45
$$ -38 -131 99 133 -27 24 -358 206 -18 233 -244 16 -80 -235 -198 -20 71 95 60 -282 3 -77 32 35 -110
5428a10K88j33J84k56r2L39j77j21l14N36l49M27k22J8J35k78M87m46M06n21L06
$$ -110 178 45 229 -27 -119 220 43 -78 -392 144 -205 222 0 18 153 -125 362 -84 322 -199 107
5449A07j7j37K20q9P7k56M03k63J23k93J3ml42N72l00L08l71K14%r2K93q6N6k65
$$ 107 90 -47 173 84 161 -95 308 45 168 -125 -112 -116 -458 114 -186 122 -249 -35 -35 -127 166 80 136 -129
5473a29K80r2k16K14K8j25k19L43k54K2J40k32L07q9K2k01K13j81J84j07P3K43
$$ -129 151 59 -157 57 85 -40 -259 84 -170 -148 -8 -240 67 -22 0 -201 12 -169 15 -92 -19 224
5495B24m77L11k53K28j42L41k52q0L3q4L17k77M06l35K1M0RJ58m45L03K2L96n29
$$ 224 -253 58 -195 33 -109 232 -20 -100 -67 -151 166 -111 295 -40 -19 21 30 188 -257 46 68 464 -65
5518f5j01O6j68M97m69J81Q3PJ10Q8l14O8J6j4J04j62R1q6P3p9J75O6J23j44r0
$$ -65 -166 -100 -268 229 -240 -59 24 31 141 229 -85 -17 -1 -15 89 -73 18 -68 5 -74 101 167 290 146 56
5543E6Q1n5k15m0L05J34n88M89k61J92k53j09M40m19L14l99O93k68K4m6j99K82
$$ 56 137 82 -133 -173 132 266 -322 167 -94 98 -155 -264 176 -243 71 -328 365 97 121 75 -124 158
5565A58l16M03l27J60j39q4J99k40M33j78K10n08J25p9J64L38k95k4p7R4j38L74
$$ 158 -158 245 -82 78 -61 -145 54 -186 247 69 279 -229 -104 -183 -19 319 24 0 -77 17 -121 253
5587B53k37o6l3J21J46n67M15j58j56K83r1J54j19K17k26MJ68k0p0n6K3j42K99
$$ 253 16 -50 -83 38 184 -383 32 -126 -282 1 -90 64 -55 162 -64 -60 108 88 18 -38 -15 -157 142
5610A42R6j10j34M9P3j96J74l01K78r4J1j24K25J28l0n3j42J31j35L1j48N0J99
$$ 142 238 128 -6 43 116 -80 94 -207 71 -23 -12 -136 89 217 187 134 -8 123 -12 19 -129 -79 120
5633A20j23M9j77J92l9m3q6L6j86M4J69j99L95l41J72j8L1J56k59J07m8O8N2o
$$ 120 -3 46 -131 61 22 -21 -107 -71 -257 -213 -44 -243 152 -189 -17 -35 -4 152 -107 0 -48 20 72 66
5657F6K0k19K16k14K19k94K15O4j3n7j54L82m29K14rJ8k84K65P5o0J38m2p8K9
$$ 66 86 -133 83 -131 88 -206 9 73 60 3 -151 231 -198 16 7 25 -259 6 81 21 159 117 39 68
5681F8j84K44Lr1J5j20l21M35r2NK02k97K30k54R9K14j26K5J4L9l97L70R0j33
$$ 68 -116 128 131 40 55 -65 -386 49 -43 -38 164 -133 97 -157 -58 156 30 55 69 108 -289 81 171 38
5705C8j84R1l3q1J50j20L93l67J81J51j64l05K65j7k2M3l67P39o48M74k96N5K18
$$ 38 -146 -55 -88 -169 -19 -139 254 -113 68 219 55 -250 15 -2 -24 19 -348 391 -257 217 -79 -24 194
5728A94j51l5N3J66l22K46j20j8k5k33K47r8L04j31J2j27j10L36k03L31k28K19
$$ 194 43 8 61 227 -95 151 31 13 -12 -245 2 -96 208 77 89 -38 -148 188 -15 316 88 307
5750C07l85J40K95k27j29j29M01j71K20k44J19k10j54L50j79M8L8j49R9L4j42
$$ 307 -78 62 357 130 1 -128 273 102 322 78 197 -13 -167 183 4 52 90 -59 40 74 -68
5771f8oj38QK50j39o6J58R7m8j31M09m00k29J36K69j13M7r4N9L48m00J44l67J11
$$ -68 -74 -212 -204 46 -93 -159 -1 96 48 -83 326 -74 -303 -167 102 -11 36 -58 1 349 -51 93 -274 -163
5795a63K25k48K20l8j1r5nK14k39J2j49L49l82K60m6O3j27K13K4P6j55j77L45
$$ -163 62 -186 34 -4 -15 -110 -115 99 -140 -128 -277 72 -310 -50 -96 -33 -160 53 77 153 -2 -179 166
5818A66l76N08m04P3l1P1K04k67J77j74L18j64j19nj25L37k53J44j42J08k11K11
$$ 166 -210 298 -106 -33 -64 7 211 -56 121 -53 265 101 -18 -23 -148 189 -64 80 -62 46 -165 46
5840D6J9j66J46k12L79j52k6k81L20p3J33J03l34K44p0J58j94j22L9q7J14j70
$$ 46 65 -101 45 -167 212 60 34 -247 73 0 133 236 -98 146 76 234 40 -82 -43 -130 -16 -186
5862a86J82j68K92p6j32J79j69J45o2k1O4l7J33L7j81M1N7k68K88k53K84k09O3
$$ -186 -4 -172 120 44 -88 91 -78 67 5 -16 48 11 144 181 0 41 98 -170 118 -135 149 -60 3
5885CK13mj67l92M08k62K31j31lJ54J62K3k14J90k73Q0j73J41L95m48m9J94J39
$$ 3 216 212 45 -347 61 -201 30 -101 -104 50 212 235 21 211 -62 18 -155 -14 381 -67 -116 78 217
5908B17j71j06j16K63j88J48J18l22K06j45P9J53l62J54J1L90l97J30j70J13j77
$$ 217 46 -60 -176 87 -101 47 165 -157 49 -96 -17 136 -226 -72 -61 329 -68 62 -108 5 -172
5929a72K08O2k14K61l79K85l30L64j87N3K78k66M3lL0k25K53K5n31O99m02L85
$$ -172 36 98 -116 145 -234 51 -279 85 -102 -49 229 -37 6 3 33 -192 61 86 -445 254 -148 237
5951B37m4k73J09O4j98J35j75N2j0j4M4M5Qj27R4M3m2l7K52k22Q3k51K09P2J79
$$ 237 193 -80 29 93 -105 30 -145 -93 -103 -117 -73 -28 -20 -147 -53 -10 -52 -89 163 -59 24 -227 -18 54 233
5976B33k54K6j1j02J4j43L41k67J71j15j16R5l9L09k91L47j81J26k38K13l34K29
$$ 233 -21 5 -6 -108 -94 -237 104 -163 8 -107 -223 -128 -167 142 -149 198 17 143 -95 118 -216 13
5998A3j38j5J38j46K05k43J37j3m8r6m7J07j25J6N7M3J77j82J38j10J16P2j53
$$ 13 -125 -140 -2 -148 57 -186 -49 -62 -110 -206 -253 -146 -271 -255 -198 -155 22 -160 -22 -132 -16 56 -97
6021i7Q2K7M3K09j03l22J36j1k1QL6R9r7j52L4L39m97K98ql1J4j85K16j23oJ22
$$ -97 -15 12 55 264 161 -161 -25 -36 -57 -49 -13 86 -11 -163 -129 210 -287 11 3 -28 -14 -199 17 -106 -112 10
6047A0r6J11o9j2l9N4k57N18j30o1j59M4K15r4J33m09M12j85p6K5n9J91l5J73
$$ 10 -86 25 -44 -56 -95 -41 -298 220 90 29 -130 -86 129 35 168 -241 171 -14 -90 -65 -124 67 32 205
6071B05k59P1j14O0j57J92Q9j89L15k64Q4K47k75j3r1J63j08J15pj83q6N3K20
$$ 205 -54 17 -97 -37 -194 -2 87 -102 213 -51 33 280 5 -8 -99 64 -44 71 64 -119 -205 -152 68
6094F8j28R5K7j6j72k16L14l9L10n17L60k30J68J42j67P8j12j1k19M61l81J66
$$ 68 -60 35 62 46 -126 -342 -28 -67 243 -274 86 -144 24 166 -1 77 -35 -46 -265 196 -185 -19
6116a9n2O3J59J4j89P7J53m2l72L08k35NJ19m9o8J10J73N2l02N9O3j44L70l96
$$ -19 -71 -8 151 165 -24 53 206 164 -208 100 -135 -130 -11 -60 -128 -18 155 207 -95 -36 27 -117 253 -143
6140a43L29l65L00j39k6J46k34k9M7K35j72nN2N6L2k35J46j11L23k62p6k3r3L29
$$ -143 186 -179 121 -18 -44 102 -132 -161 -114 121 -51 -56 -4 52 84 -151 -5 -116 207 -55 -131 -154 -247 82
6164H2k88J20KJ93R7l02K55k93J95j69M89k12n1j0j06j9j38M75k47m6QJ47j57
$$ 82 -206 -86 -84 109 206 -96 159 -134 61 -108 381 169 118 108 2 -17 -155 320 73 27 35 182 25
6187B5j42L61l93j43K86K60l79J40Mk1L32n20K38l1J24j94K9J47l28J94J96m1
$$ 25 -117 244 -149 -292 -6 254 -125 15 19 -2 330 -190 48 17 141 -53 -24 123 -205 -11 185 144
6209A44j89j42K17L38m43n1N8j59R9L6L39j69K3%l49K79r3L6j1k4J64k41J56O
$$ 144 -45 -187 30 368 -75 -126 -68 -227 -128 -92 247 78 101 101 -248 31 -62 -26 -37 -61 103 -138 18 24
6233B4J65k28J94k62P9lj08K81j8o2k84K68j35r9L26k92K07p4P6j25L73j5k81
$$ 24 189 -39 155 -107 -28 -31 -139 142 124 62 -222 46 -89 -188 138 -154 53 -21 55 -70 303 288 7
6256GL20l73R4j77L08j72J4Q5k49K95l59M83l69J41l1Q8k49K52J44k25J96k71
$$ 7 327 -46 48 -129 179 7 21 106 -143 152 -207 276 -93 48 17 105 -144 108 252 27 223 -48
6278d8J79l50J54m7P6n2j31M71k75R3k69K04p9K5L02m82P74n78J42L5k84J21j25
$$ -48 131 -219 -65 -112 -36 -88 -219 252 -23 70 -199 5 -74 -49 253 -229 545 -33 109 144 -140 -19 -144
6301a44L27l32J33j16J65J4j06J38j52K24n04N83k96m0R0l0p5K46P5n5k02j31
$$ -144 183 -149 -16 -132 33 47 -59 79 -73 151 -353 230 -66 -106 -16 -46 -121 125 200 145 -57 -188
6323a88K72p0l1O8j19J98k68J26J24k53J46R2Nj24K79j28k39L1J84L02n18L57
$$ -188 84 14 -17 51 -68 130 -138 -12 112 -141 5 97 102 -22 257 129 -110 -79 105 407 -111 246
6345B46j92km9L33l98J4mJ42k27MK33N9k16j56Q3K96k80L80l56J59k77l3K87J01
$$ 246 54 52 3 336 -62 -48 -52 90 -137 -133 100 159 -57 -213 -130 166 -114 266 -90 69 -208 -241 46 147
6369A47R6j82l0lN4k68K83p4J83j13k37K47j62J37r7J38%k13M5j71M91k74M44
$$ 147 243 61 31 28 82 -186 97 23 206 93 -144 103 -59 78 -19 119 119 -94 -49 -220 271 -3 441
6392D41p79M32K3k5j68m61O71k20K17n90M78O3n08L96j87L30k14qR7j73J98J15
$$ 441 -338 94 117 92 -76 -537 134 -86 131 -459 19 82 -426 -30 -217 113 -101 -109 -12 -185 13 128
6414A28j54K71k27p7J81K0m5M6j53J53j58K0q0J7J00j72K96l92M67l76Q8M5k50
$$ 128 -26 245 18 -59 122 142 97 143 -10 143 -15 5 -75 -58 42 -130 166 -226 241 -135 -47 -2 -252
6437b52M55J49j83m32M91k94J90q1k64K20J8J47j88n0J53n8l9j48N3l3K96p4J07
$$ -252 203 352 169 -263 228 -66 124 43 -221 -1 17 164 -24 -74 79 21 -18 -166 -113 -146 150 76 183
6460A83l97K04p5N1J51k66K58Mo3k05J54j77J60K01l37K08j19K96m23J11J0N3
$$ 183 -214 -10 -85 -34 117 -149 109 113 50 -155 -1 -178 -18 183 -154 54 -65 231 -192 -81 -71 -18
6482a8J63m60L05j67L07k43JK84l08J91k87M76k86J82k83K38q4k04M33l60J41
$$ -18 145 -315 -10 -177 130 -113 -112 172 -136 55 -232 244 -42 140 -143 95 11 -193 240 -120 21
6503B1j68L41m02J68p9l4K03j03J49j07L0l9J54J96l39m7j00L01j4o0O3p6K7j89
$$ 21 -147 194 -208 -40 -119 -153 50 -53 96 -11 19 -20 134 330 -9 -56 -156 145 131 71 134 58 85 -104
6527a04J29J8R2j39m0k2N2O3l5r0J36J29m72K83n0m8L80l21R3K6K29k07o7m9K4
$$ -104 25 43 135 -4 -44 -66 -14 49 14 -76 60 189 -283 0 -50 -98 282 -39 54 80 309 102 35 -14 10
6552A0j35J21K52m39K42j16J84j56q7J51R0j36j29L24n7k54L14J9k4m40J92p6
$$ 10 -125 -4 248 -191 51 -65 119 -37 -124 27 117 -19 -148 176 119 -135 179 198 174 -266 -74 -150
6574a50J50R5k27K86k13J72k16K12k34p4K85J53j56k21K59j51j78K66j92J54m5
$$ -150 0 95 -132 154 -59 113 -103 109 -125 -199 86 239 83 -138 121 -30 -208 58 -134 20 -25
6595b5j6j91L07l96L20J26l7K78l24J47j81J71m04R5K22j93j29M5P0r2L42k84
$$ -25 -41 -232 75 -321 -1 125 88 366 42 189 8 179 -225 -130 92 -101 -230 -185 -115 -207 135 -149
6617a49J08j99J11J97j25nj58K91j28J4P6P5j59rJ48n8R1j63P3j65J73J76k13
$$ -149 -41 -240 -129 68 -57 -62 -220 71 -57 -43 33 108 -51 -60 88 30 121 -42 31 -134 39 215 2
6640BJ2p4j01J28K66n04K35j22J08J74l41K61K18l80J91k31m7p1M54m16L50r5
$$ 2 14 -60 -161 -33 233 -271 -36 -158 -50 124 -217 44 262 -118 73 -158 -205 -276 178 -238 112 17
6662A7R6m2n1J76m60L43l3J15j70j82K66k60M52k22J6J34j33j71J53M4q8J75m65
$$ 17 113 71 20 196 -264 79 46 161 -9 -191 75 -185 267 45 61 195 62 -109 44 88 0 175 -290
6685b90N88m59Q3J23j42N9l6R1l3K71m86M24m77J07J34j41L64k12L04k02k58J13
$$ -290 298 -161 -78 45 -97 -38 -74 17 -16 255 -231 193 -284 -177 -43 -184 180 -32 272 70 -188 -75
6707g5q3K49j30J06r6M9j22K8J48p4j71N2J41k09K35o2j69K74j80J52K3kM0k40
$$ -75 -158 91 -39 67 -29 20 -102 -74 74 0 -171 -119 22 -187 48 -14 -183 91 -89 63 86 84 124 -116
6731a16L10k38J20j06j34L01k18k6J3J12m1J65j42l3Q5j98K28J3j15k5j57K82
$$ -116 194 -44 76 -30 -164 137 -81 -107 -94 18 -23 142 0 -33 52 -146 82 95 -20 -45 -202 80
6753H0J58r1o7j90J7O3j26K38k17K40J71j49m18N07k00k0R5j4M0pQ0j69m6J44
$$ 80 238 147 80 -110 -93 -30 -156 82 -135 105 276 127 -291 216 16 -4 91 77 117 110 190 21 -25 119
6777A19p9p2J05j67R0K44n2m59J20J04Q4j85P9M1J33j03O3P3l3J26l33J57L6k07
$$ 119 40 -32 73 -94 -4 240 188 -271 -151 -47 37 -148 -69 -28 105 2 65 138 105 231 -102 55 91 -116
6801a16O1R3J23mj16J32k57K13r2J34k87K67j98k38L61J44l58P5J15j85J65k81
$$ -116 -55 38 161 157 41 173 -84 129 37 171 -116 151 -47 -285 76 220 -138 -63 52 -133 32 -249
6823b49K95j41k8K73l78J74k94L87Q9k3k70M4K46l90L10j12K78k25J49q3j34J43
$$ -249 46 -95 -123 150 -228 -54 -348 39 128 105 -165 -121 125 -265 45 -67 211 -14 135 52 -82 61
6845F1L0l63k2K32N6j96K57j66M9j94R6J14j00OJ10R1n4j73L18J2l08J51K34j15
$$ 61 91 -272 -294 -62 -6 -202 55 -111 -62 -256 -160 -46 -146 -140 -30 61 7 -166 152 164 -144 7 241 126
6869A26l7l54L43j16M9n5J13n8k5Q1M3L1k38K30l41K78q1N7j99j13M11L1k78O4
$$ 126 89 -265 78 -38 11 -44 69 11 -14 67 110 141 -97 133 -208 70 -11 46 -153 -266 145 176 -102 -38
6893c8J92N9K9k13N5k9j67J87P3Om71K38L00m95L72k55M59k03l6j42j62K57m2
$$ -38 154 213 242 29 84 55 -112 75 148 154 -317 -79 221 -274 98 -157 302 99 63 -79 -241 16 -26
6916b6K39p7Ql06K31j48J87k65J00K39k75J13N3k73Q9p6L00n4j8j62K00j1n3N3
$$ -26 213 136 144 -162 69 -79 108 -157 -57 182 -93 20 73 -200 -111 -187 113 59 41 -121 79 68 15 68
6940F8k5R0l24M26k97p1K27o3Pj69K08k09P3O2j68K21l14L01j55K11j74K43l05
$$ 68 43 133 -191 235 -62 -133 94 31 38 -131 77 -132 -59 3 -165 56 -258 43 -112 99 -75 168 -137
6963a37P8r5Q8R2m77L41n1J77p5J05n6k42J92Q5k07J49J14j56J16L0j63k4j2J78
$$ -137 -59 -154 -66 26 -451 -110 -161 16 -59 46 -10 -252 -60 25 -182 -33 81 -75 41 71 -92 -116 -128 50
6987E0j07R0j76K25k16L58q4l94J91j17J24o7O5L8l85N57k65q5P6L41k84pJ23
$$ 50 -57 33 -143 82 -134 224 140 -254 -63 -180 -56 -123 -58 -20 -405 152 -113 -198 -122 219 -65 -72 51
7010E1j67j03J43j43L21j80J40p7j39K39k48K26p5p1J43jk79L77j11m6O8q6k6
$$ 51 -116 -219 -76 -219 102 -78 62 -15 -154 85 -163 63 -12 -83 60 59 -220 157 46 0 68 -18 -44
7033d4l3N5%J52J06j56j25R8k04L13j55k88M44j91N2r2n7K00nJ41j81j0k5J05
$$ -44 -77 -22 -22 130 236 80 -45 53 -151 162 7 -281 163 -28 24 -68 -125 75 70 211 30 20 -5 100
7057A00l90L89r3K82r6k94J51k69L07M0j71L3k39L17p1P2l78J95k6q8K05k10K57
$$ 100 -290 99 6 288 192 -102 49 -220 87 127 -44 -11 -250 67 -4 68 -310 -115 -141 -229 -24 -234 23
7080B3j03J70k10L09k97J25kj50J38k42K74j24L91j52k68N0p5L16j51J08k89K53
$$ 23 -80 90 -120 189 -108 17 15 -135 3 -239 35 -89 302 150 -118 -68 -143 173 22 130 -159 94
7102I4k31J41J37k06J02k54L55j21n4r7J21J78k44j97J98K47j42m3K58l96J99
$$ 94 -137 4 141 -65 37 -217 138 17 -37 -134 -13 165 -79 -276 -78 169 27 -16 242 -154 45
7123D5k20M65m98J49r8K72K1j82L18l41M52n22M30k17P0k14M8mj79K06j07K30
$$ 45 -175 290 -208 -59 -157 115 136 -46 272 -69 383 -139 291 74 144 -70 -22 -26 -205 1 -106 124
7145A24j75J94k07l12O53q8k71j97J64J55L2J9n1j9J27j10k02L70m09J22j8J44
$$ 124 -51 143 -64 -376 277 189 -82 -279 -115 40 72 91 40 21 148 38 -164 206 -203 -81 -99 45
7167D5J79p7j42j86K14k64K42N8j14K47k35P1k6M8k69Q3L35l06K40j81l8j2Q7
$$ 45 224 147 5 -181 33 -231 11 69 -45 202 -33 38 12 60 -209 -126 209 -97 143 -38 -76 -88 -1
7190aJ16o1j63Q7P0mj92L0K7J2m9J93j37O8P6J04k49K8K27n5k21N7j5J39r5l14
$$ -1 115 54 -109 -22 48 44 -148 -118 -91 -79 -128 65 -72 -4 72 176 -73 -45 182 127 -94 -37 -52 87 -8 -322
7216c22L08q8J91m0P8j30P4j23QL7Oj61K40k26J17k10M72k10K0R3j86J10n06M90
$$ -322 -14 -102 89 49 127 -3 71 -52 -44 -7 -1 -162 78 -148 -31 -241 231 21 41 134 -52 58 -448 42
7240D2Q6j89J4L5M32l97j1MK15j02k07J31k12L19j6j3k09L35k23N8mj89J21j62
$$ 42 128 -61 -47 -12 420 23 12 16 231 129 -78 53 -159 160 144 131 -78 257 34 92 88 -101 20 -142
7264a42R3j57J03K30N6j70O4J63m15K00r2L58k77k0L0j26J47j19j04l8L99j05
$$ -142 -49 -206 -103 127 183 13 77 240 -175 25 -67 291 14 -6 24 -102 45 -74 -178 -216 183 78
7286G8j39K28m27J68n6N8J14j8L9j6J64q4q9k38L12j35K07r8j35K47k19K83k08
$$ 78 -61 167 -260 -92 -148 -90 24 6 45 29 193 109 20 -218 94 -41 166 68 -67 180 -39 244 36
7309C6P3l06N1K86j16M7l63L36l54K88M8O0J74m61L79l12K18m0k9J97j54j49J08
$$ 36 109 -197 -146 140 24 71 -292 44 -310 -22 26 86 260 -201 178 -134 84 44 15 212 58 -91 17
7332A7L67o98M24K2j61J07k53K08j99M3J54P8l45L14j7M4j33L0L08p1j03J63l79
$$ 17 384 -314 110 132 -29 78 -175 33 -166 -123 31 109 -236 78 61 105 -28 2 310 239 136 299 -80
7355h0q2K39pk57K05j88K71j99J39J29l45Q3O7m8k75L06R4j54K47l30L93k49j59
$$ -80 -162 77 70 -187 18 -170 101 -98 41 170 -175 -92 -25 -73 -348 -42 52 -102 145 -185 208 -41 -200
7378b00R1P6N9j02R1M6J6r6m6qR5j71J41k5q1J10Rm9J7J57k37J04J52k49M58l39
$$ -200 -109 -33 26 -76 15 61 77 -19 -65 -73 22 -149 -8 -33 -114 -4 5 -44 -27 130 -107 -3 149 -100 358 19
7404A9n1J2L5j9J01j25P9J07l87L48j97J97k27m4L12m44M05n13L12n7l8J32j41
$$ 19 -32 -20 15 -4 97 -28 51 158 -229 119 -78 119 -108 -152 160 -284 121 -392 -80 -137 -175 -43 -184
7427a84K61p1Q6j94J50j85p0J15k7J77j37Q0q6K7R6K28k93k00L82l01J85P8j40
$$ -184 77 6 92 -102 48 -137 -207 -92 -119 58 -79 1 -85 -58 38 266 -27 -227 155 -146 39 117 -23
7450b3j2J4J66r2j38R4q1m5J76k7J42k23L5j29K31j4J02p5j88N6Q0k32K25K0J0
$$ -23 -35 -21 145 53 -85 9 -72 -117 59 32 174 -49 -14 -143 88 74 176 101 -87 -31 49 -183 42 62 72
7475G2K0k39L9O6J03P2j29j56M7J48n2J58j11M5q6P2j73K1J70j56j9J8J81k04
$$ 72 92 -147 -108 -42 61 133 4 -152 -105 43 -9 149 38 83 -3 69 -104 -83 87 -69 -88 -70 111 -93
7499i3K07j74L9o0j50L84l23J74P7q2j10O4O3k39L53l21J73k7K25j24j01J94q0
$$ -93 114 -60 -21 -81 -231 153 -170 4 81 -1 -111 -47 16 -223 130 -191 -18 -45 180 56 -45 149 69
7522F9p9J70K7p0j55k05k9L6J36K16L0K2j12l27L01L1Lk23L67l98J99o2O9nj69
$$ 69 -10 160 187 117 -38 -243 -272 -236 -100 116 146 168 56 -271 30 61 64 -159 208 -190 9 -53 16 11 -158
7547a58K31j34K62k12M8m6l9M7K07j05k95R5K45j8k23p3K11l21L35l31L44l51
$$ -158 73 -61 201 -11 37 -9 -48 -1 206 101 -194 -99 146 128 -95 -168 43 -278 57 -274 70 -281
7569b81M53l91K48J52l64L44j57qq9J69l04J22J36J90L9m06M94m40O7K0m7k33
$$ -281 172 -219 29 181 -183 161 4 -4 -93 76 -228 -106 30 220 259 -147 347 -93 -26 -6 -53 -286
7591b86Q3J86j15j2N0j49P4N8L73m24K67q8R3k20J74P4k61Q2K05j79j74K29l1
$$ -286 -203 -17 -132 -144 -94 -243 -169 -111 262 -162 105 17 110 -110 64 138 -123 -41 164 -15 -189 40 9
7614IL3l9QL2j5k0r3K03j53q7L04k3k61J41m5M7j80K55j12k85R3J38J01Q4l85
$$ 9 42 3 11 43 28 8 -85 118 -35 -122 182 159 -102 39 -6 41 -139 116 4 -281 -188 -50 51 135 -250
7639b50K74n7n1j53K96j47j92M66m66L37j21J9O6m2J4k10J45J09k50L02q5j80
$$ -250 24 -33 -84 -237 59 -88 -280 186 -280 57 -64 -45 21 -21 -7 -217 -72 37 -213 89 4 -176
7661a76R5L27l98J48n4J18J01J43k32j72L15k95J62L3k12K02k71L39k11l2j1J03
$$ -176 -81 246 -152 -4 -58 60 161 304 72 -100 215 -80 82 115 -97 105 -166 173 -38 -70 -81 22
7683B2R5j65J02j55K85k93K14K7j95j77K13oJ2R4j61K31k45J92P7k34J75j35P3
$$ 22 117 -48 54 -101 184 -109 105 132 -63 -240 -27 -33 -21 73 -88 143 -102 90 167 -67 108 -27 46
7706D6j04P4O6Q5j23j28K32k82J41j65L61l8m85N34k77K81k53m9LL41l6l76K37
$$ 46 -58 16 82 167 44 -84 148 -134 7 -158 203 165 -320 214 -63 218 -35 -84 -81 260 224 -152 85
7729H5rK6k03K31k51OL90k48J71n89N16j83P4j8m8K10N1q9k91J12k11K50K29k14
$$ 85 76 102 -101 130 -121 -115 275 27 198 -391 125 -58 16 -2 -50 160 211 122 -169 -57 -268 -18 211 -3
7753cP6j31M7JM2j15q3L78j59p9K7j39K20k9j55K70j74J28r9r6L08k23j01m0J33
$$ -3 73 -58 -11 -10 32 -83 -166 212 53 -26 1 -138 82 53 -102 168 -6 122 23 -73 235 12 -89 -129 4
7778Dj16J81j19J60m8j51M23l04J89l11K09j38M6l9L6j78j37J98m9J65J44k53
$$ 4 -112 69 -50 110 62 -89 334 30 219 -92 117 -21 25 -14 22 -156 -293 -95 -144 21 165 -88
7800h8J69k59N9L43m45L75m84M36q9p1P5K2J04j53k01K73m2j97M34m68J32P9O1
$$ -88 81 -178 -119 224 -221 154 -330 106 17 -54 21 43 147 -6 -207 66 24 -173 261 -207 -75 4 65
7823F5j27rP2k35K04m5N8q9O5K78j69j27o3J44j6n7p5q9O5K16j8j12k5j62P2R8
$$ 65 -62 -71 1 -234 -30 -75 -17 -106 -41 237 68 -59 -122 22 6 -51 -126 -215 -150 66 48 -64 -89 -251 -179 -81
7849h1oJ90m14M93k31q4o4K13J03k17K93k46J06j82R3J9L8J24k32J71j35K09l38
$$ -81 -87 103 -311 182 -49 -133 -197 16 119 -98 195 -51 55 -127 -34 -15 23 147 -85 86 -49 160 -178
7872a78J63R2m03L27j68J69ML0j95J38J56r5J46k97o3J10O6j05N6o0j22M80k88
$$ -178 -15 77 -326 1 -167 2 6 36 -159 -21 135 40 186 -111 -174 -64 2 -103 -47 -107 -229 251 -37
7895c7P9j26K05j06m1l6lJ78r1j50k6M06k37K9M10o11M91n93M51j37M9j05L2j50
$$ -37 42 -84 121 15 -26 -62 -65 113 22 -128 -154 252 15 44 454 -157 334 -259 192 55 104 -1 31 -119
7919a19j25M56k22J36j30m4P1kJ23p9rk51K02j61n5M20k03m0J1r0J92j24r8J66
$$ -119 -244 212 -10 126 -4 -48 23 21 144 65 56 -195 7 -154 -209 211 8 -32 -21 -111 81 -43 -141 25
7943B5M0P6p3K7lk00M41n61K34J82k21J80j24j24J10lk15J41J72p1O6k13M6q4
$$ 25 65 141 68 95 92 -108 333 -228 6 188 -33 147 23 -101 9 6 -209 -68 104 33 99 -114 -68 -152
7967a52K28L0j71J30j88Q7O1j8Q9j53k23j02O21l90K63o8j21q8K79O9l43O1j0
$$ -152 76 106 -65 65 -123 -36 25 7 96 -57 -280 -382 239 -151 112 44 -77 -165 114 183 -160 -99 -109
7990a09R4j40L06j99k4N3N7j03o4K32kM0L3k98j18K50L2Kkk2j09m4k02M72j30
$$ -109 -15 -155 151 -48 -72 -19 38 -65 -129 103 101 141 174 -124 -242 8 40 42 40 18 -91 -135 -337 135 5
8015Em4j04K73k15J00p0l1K76Pr0k77M82j13j49Q9j30J26k69L16j48J19k25J85
$$ 5 -39 -143 130 -85 15 -55 -86 190 197 107 -170 312 199 50 139 9 135 -134 182 34 153 -72 113
8038A13j47j92J26j24R8J36l2k34M0O7J20p0j78J38j20K08J06%p7j6J18j03K37
$$ 113 -34 -226 -100 -224 -126 10 -22 -256 -216 -149 -29 -99 -277 -139 -259 -51 55 55 -22 -38 80 -23 214
8061B14m65M08l07Q5L2k94L69k3Kj85KJ88o9k08M5kK14J00j31m2k1k4K69j33j05
$$ 214 -251 157 -150 -65 -33 -327 42 19 21 -164 -162 26 -43 -251 -206 -208 6 106 -25 -67 -88 -112 157 24 -81
8086h1k15L50j7k58L52k22M65k20k22mL31k16m0k7K10k32O3J60q1k8r3O6o5j25
$$ -81 -296 54 37 -221 131 -91 374 154 -68 -72 259 43 3 -24 186 -46 17 177 96 68 -25 41 -24 -149
8110a49K52r1J4JJ83k43l5K71l06P8n6M0J70j67L2j38N1j03K04k35J11J60j44
$$ -149 103 12 26 27 210 -33 -68 203 -103 -25 -81 -41 129 -38 -6 -144 -93 -196 8 -227 -116 44 -100
8133a00R9R3k46J04K38k52J28j02J86l64O8L00m52L76k86P0J71q9J40o8r9J96
$$ -100 -1 92 -154 -50 188 -64 64 -38 148 -216 -148 152 -300 76 -210 -140 31 -58 82 14 -85 111
8155A11M6KM2k75mo8N4J93l00K37n8L7J7k43P6L02k53J91n8q4J18k56J08J03K5
$$ 111 157 159 201 -74 -78 -146 -92 101 -199 38 -20 17 34 -209 -133 169 -84 107 49 -35 83 -173 -65 38 63
8180F3P5l4j56j03JJ20j16L77k32j63R5
$$ 63 138 104 -52 -155 -154 -34 -150 227 -5 -168 -73
8191g3
$$ Imaginary data points
##PAGE= N=2
##DATA TABLE= (X++(I..I)), XYDATA
0@%%%%%%%%%%qJ6j6J6k4L2m0M8n6P2q8J04j26J50j76K06k39K79l24L73m30M94
$$ 0 0 0 0 0 0 0 0 0 0 0 -8 8 -8 8 -16 16 -24 24 -32 40 -48 56 -70 80 -96 110 -129 150 -174 199 -231 263
32B63n59O32p18Q12r14J027j151J288j436J596j776J972k184K415k666K945l248
$$ 263 -296 336 -382 430 -484 543 -608 680 -756 840 -936 1036 -1148 1267 -1399 1546 -1702
49a702L576l939M340m782N272n816O425p113P894q790R831j1058J2530j4337J6621
$$ -1702 1874 -2065 2275 -2507 2765 -3051 3374 -3739 4155 -4635 5196 -5862 6668 -7669 8952
64H952j9615K3750k9906M0275o2684K08741J6570J37525P6766k02329J62339n0996
$$ 8952 -10663 13087 -16819 23456 -39228 169513 186083 323608 400374 198045 360384 309388
76C09388n7276R4533j16818k3242J80887l01768J37587Q2505k51036J19734L1463
$$ 309388 252112 346645 229827 206585 387472 85704 223291 305796 54760 174494 205957
87B05957j51281P7805j0201r8833J44360j61976K2221J58510k43321J16395Q6583
$$ 205957 54676 132481 122280 23447 167807 5831 28052 186562 -56759 59636 146219
98A46219j59791O0670Q8311j33976R7954j3298o9903J58923j67286N1941J09871
$$ 146219 -13572 47098 135409 1433 99387 86089 16186 175109 7823 59764 169635
109A69635j64103M0835R9765j38549J7172Q0153j40661R8701p1010l4684R8959
$$ 169635 5532 46367 146132 7583 24755 104908 -35753 62948 -8062 -42746 56213
120E6213j38802J9351P8788j08891k2448J17904j31626L3120M2582q2580Q7141
$$ 56213 -82589 -63238 15550 -93341 -115789 2115 -129511 -96391 -53809 -136389 -49248
131d9248o6575J3010O0707n5520j2061J02003p0431j3553J07636q9603N3510J826
$$ -49248 -115823 -102813 -42106 -97626 -109687 -7684 -78115 -91668 15968 -73635 -20125 -18299
143a8299r537L7812k7275K442M1970k2130m1889R4234p2301L435L7372l8678J7882
$$ -18299 -27836 9976 -17299 -14857 27113 4983 -36906 57328 -14973 -11538 25834 -12844 5038
156E038k1052J5096j0426K049k8003M3654k9109k2239N2488m2046J7991j1240
$$ 5038 -16014 -918 -11344 -9295 -37298 6356 -22753 -44992 7496 -34550 -16559 -27799
168b7799K5886j8858M406J6099o804J2626j7807L9378k7022K0293q129J7109l17
$$ -27799 -1913 -20771 -16365 -266 -7070 5556 -12251 27127 105 20398 12269 29378 29061
181B9061k3700N0202l9269J4370L676J857j4936J7079j0405q948K9063n4705N3950
$$ 29061 5361 55563 16294 30664 34340 36197 21261 38340 27935 18987 48050 -6655 47295
194D7295k9436j6623L5450k5191q478K1718q423k7875N7004o1637L2741J7272
$$ 47295 17859 1236 36686 11495 3017 24735 16312 -11563 45441 -16196 16545 33817
206C3817n5804O0167k2698j8261L3690k759m0714O6907m3789j0023O7750q3497
$$ 33817 -21987 38180 15482 -2779 30911 28152 -12562 54345 10556 533 68283 -15214
218a5214N2561P038m6712M0911N329n0397N5867j1080n5195R5949p9475J3620
$$ -15214 37347 44385 -2327 38584 43913 -6484 49383 38303 -16892 79057 -418 13202
230A3202N3281p4290L7520K3491n6764L4754K7489q3423R0478l8115m0380R2073
$$ 13202 66483 -7807 29713 53204 -3560 31194 58683 -24740 65738 27623 -12757 79316
242G9316p8895J4875M8106n8571J0002N5252q5171N3418J9432q7385J00828n3096
$$ 79316 421 15296 63402 4831 14833 70085 -15086 38332 57764 -29621 71207 18111
254A8111k4820P1172n4949j1825O7568o7203N584O9312j05448P5936j905o7593
$$ 18111 -6709 64463 9514 -2311 65257 -1946 3638 72950 -32498 43438 41533 -26060
266b6060Q3577l7471l2492O8967l9087l3290R2489q9351K5882N4808r6299P3907
$$ -26060 57517 20046 -12446 56521 17434 -15856 76633 -12718 13164 67972 -28327 45580
278D5580o359n4002O1336j1055n6890Q4860m8340l0104R1132r5217L9284L1755
$$ 45580 39221 -14781 46555 35500 -21390 63470 15130 -14974 76158 -19059 20225 51980
290E1980o9514M5887J3049o1430N5138j18o6659R3164o2716o355O3663p2017K7640
$$ 51980 -17534 28353 41402 -20028 35110 34992 -31667 61497 -1219 -7574 56089 -15928 11712
303A1712K9265n3788K3563L4779p5263O5314j2467m8350P6283n6959M814L9528
$$ 11712 40977 -12811 10752 45531 -29732 35582 23115 -25235 51048 -5911 -1097 38431
315C8431m3430K484M6296o0227K4312L2209o9913O4432k6001j9776M4073l2614
$$ 38431 -4999 -2515 43781 -16446 7866 40075 -29838 34594 8593 -11183 32890 276
327B76o320L9193l4335r311N5553o5772L3089J2357m0383L8995j8854q048K1491
$$ 276 -6044 33149 -1186 -10497 45056 -20716 12373 24730 -15653 23342 4488 -3560 17931
340A7931j1306k2290M8179m1368q62L9459m8607K7007l567q213O913N28j3696
$$ 17931 6625 -15665 32514 -8854 -9716 29743 -18864 8143 4576 -3637 3276 3804 -9892
353i892K2196j0453j9920M6824m0491J1878J3453j1569K832K514M873n805J0238
$$ -9892 12304 1851 -18069 28755 -11736 142 13595 2026 4858 7372 12245 6440 16678
366A6678j7776L0288k2275q06K2227j9375N575l507J4556k1157J0185q48n91n884
$$ 16678 -1098 29190 6915 6109 28336 8961 14536 11029 25585 4428 14613 13765 13174 7290
380G290n612J8563k5023J1043p503J0684j5417k699K0037k2976M474L594P622
$$ 7290 1678 20241 -4782 6261 -1242 9442 -5975 -8674 11363 -11613 -7139 -3545 4077
393D077k3025K0298m920m043R133j6886L0320k3608J402J8408n987j7323K4575
$$ 4077 -18948 1350 -3570 -7613 1520 -15366 14954 -8654 -7252 11156 5169 -12154 12421
406A2421r40k4611L2728k6224J7564o563j5070K5518j5415j5981K2417N49m0556
$$ 12421 11481 -13130 19598 -6626 10938 4375 -10695 14823 -592 -16573 5844 6393 -34163
419c4163M4944k3726j0807K4344l0266K2050p366j6724K0171N907m1003M4679
$$ -34163 10781 -12945 -23752 592 -29674 -7624 -14990 -31714 -11543 -5636 -46639 -1960
431a960n062l7936N3595l0493M793J7549j9327J4767J3248l2258L0042J6081n5995
$$ -1960 -7022 -44958 8637 -21856 -17063 486 -18841 -4074 9174 -23084 6958 23039 -32956
444c2956O1263j7722k5133M0989k3466j385J9528k3079M290K9576n7113M2285
$$ -32956 28307 10585 -14548 26441 2975 1590 21118 -1961 2329 31905 -25208 17077
456A7077N204n2752N3653j9528k0354K8934j2880j5611L6751l8687J2297L3345
$$ 17077 22281 -30471 23182 3654 -16700 12234 -646 -16257 20494 -18193 -5896 27449
468B7449o1841N0231p78l6479L9037k603k6980L6496j2153j8818N0742n1922K5347
$$ 27449 -34392 15839 15061 -21418 17619 15016 -11964 24532 12379 -6439 44303 -7619 17728
481A7728K3300m9668L7894M713l4871K8414O484m0876M8973k9842j0923M3406
$$ 17728 41028 -8640 29254 33967 -904 27510 33994 -6882 42091 12249 1326 44732
493D4732n2140K2928J5185l7244J8068J7979m4478L3585Q76l8240N1799l5904
$$ 44732 -7408 15520 30705 -6539 11529 29508 -14970 18615 19491 -18749 33050 -2854
505b854J271K9170l2051Q838K3488l1959J2473K5431m7480M3270j0682k2375L8793
$$ -2854 -1583 27587 -4464 4374 27862 -4097 8376 33807 -13673 29597 18915 -3460 35333
518C5333k5402j740K2426j7732o976L2449l8749J8584J3106l8421L7388j6137
$$ 35333 9931 8191 30617 12885 5909 38358 -391 18193 31299 -7122 30266 14129
530A4129j2497K0835q819j6007K6480j9017o619K8917l8455K5713k080j9590K1037
$$ 14129 1632 22467 13648 -2359 24121 5104 -1515 27402 -11053 14660 12580 -7010 14027
543A4027m633j4669J6019J053k2261L0616k3125O081J1093k1660J8890n114q905
$$ 14027 9394 -5275 10744 11797 -10464 20152 -2973 3108 14201 -7459 11431 6317 -2588
556b588P020Q995k3546J9473k914j3714J8739j7783J2032n717k867L371M050j1901
$$ -2588 4432 13427 -10119 9354 6440 -7274 11465 -6318 5714 -3 -2870 501 4551 -7350
570g350N066J0828k2401J8196q334K463k407o98O137p961M181m497J1103j6668
$$ -7350 -2284 8544 -13857 4339 -3995 -1532 -3939 -4637 1500 -6461 -2280 -6777 4326 -12342
584a2342J1175L67o159K967k993J0499j7227J3330l467j166j554J475M930q989
$$ -12342 -1167 -800 -6959 -3992 -6985 3514 -13713 -383 -3850 -5016 -6570 -5095 -165 -9154
598i154P368n440J1446j7229J1626O398j7264J3705j987Q3m843R932q446Q855
$$ -9154 -1786 -7226 4220 -13009 -1383 5015 -12249 1456 -531 -448 -5291 4641 -3805 5050
612E050p341l33J7320k6863J8271K084j1843L651R240j2191L943O151j5651K2628
$$ 5050 -2291 -2624 14696 -12167 6104 8188 -3655 -4 9236 -2955 988 7139 -8512 14116
626A4116k3407Q343J2822k2945J0331Q890j4423k09J8350k5603J9973o753r694
$$ 14116 -9291 -948 11874 -11071 -740 8150 -6273 -6482 11868 -13735 6238 -515 -10209
639a0209K4318k5511R517J2467j6379j519K3975k6777R374J4731k8138K8223j6416
$$ -10209 14109 -11402 -1885 10582 -5797 -7316 16659 -10118 -744 13987 -14151 14072 -2344
652b344k823J8220j6900l343K2667k1010n217L0387l6719J9495K835k0018K1913
$$ -2344 -5167 13053 -3847 -7190 15477 -5533 -10750 19637 -17082 2413 5248 -14770 7143
665G143j1890p562J8300j0416j5098L4982l0730L324K3900l2185K0584o51j3547
$$ 7143 -4747 -12309 5991 -4425 -19523 15459 -15271 -11947 11953 -20232 352 -299 -13846
678a3846J4786j22j9781K8824j3921j5213L7584l3920J0444J3680k1170J1168
$$ -13846 940 818 -18963 9861 -4060 -19273 18311 -15609 -5165 8515 -12655 -1487
690a487O863j9098J5785L687k7729L7251k3066o029K6836k5752O509J2289j6612
$$ -1487 5376 -13722 2063 5750 -21979 15272 -7794 -13823 13013 -12739 -6230 6059 -10553
703a0553L600J6418k9655K5068k947k2238L3104k1612r19J6706j2846l912K0060
$$ -10553 -6953 9465 -20190 4878 1931 -20307 12797 -8815 -9734 6972 -5874 -9786 10274
716A0274k1295P062J6019l0783K8646r768j0948J9368j0152o418J6024r514q254
$$ 10274 -11021 -3959 12060 -18723 9923 155 -10793 8575 -1577 -7995 8029 -1485 -9739
729i739K4824k7930J4770N870k0159J9425o381o909R922j21j4194K1904j5501
$$ -9739 15085 -12845 1925 7795 -12364 7061 680 -6229 3693 3572 -10622 11282 -4219
742d219j369J8298k3469J5646j062q002O272L692j2111J1332n89j3497K2169j9454
$$ -4219 -5588 12710 -10759 4887 3825 -4177 2095 5787 -6324 5008 4419 -9078 13091 -6363
756f363O917N593j0467N315K390n027l86Q674j5767J5882q658k804J0789j1774
$$ -6363 554 6147 -4320 995 3385 -1642 -2028 6646 -9121 6761 -1897 -4701 6088 -5686
770e686O146n51N21m966R563r362M453L376r312J2192j0173N968j920J299k479
$$ -5686 460 -91 430 -4536 5027 -4335 118 3494 -5818 6374 -3799 2169 249 1548 -931
785i31K612P20n535Q664r233Q257o687L748o06k870M818o823P873q361O379m140
$$ -931 1681 2401 -3134 5530 -3703 4554 -2133 1615 1009 -1861 2957 -3866 4007 -4354 2025 -2115
801b115J953j246k9L269p996J1346j1200P973j978k543M407k863J641j934O851
$$ -2115 -162 -1408 -1437 1832 -6164 5182 -6018 1955 -23 -2566 1841 -1022 619 -1315 5536
816E536j1513J2976p934l42R005j1431Q399k614o57j331P197j0763P994R11j1465
$$ 5536 -5977 6999 -935 -1277 7728 -3703 4696 2082 1425 94 7291 -3472 4522 5433 -6032
831f032J6803j4439N165L458o314Q89O356q664J201J1203j9078J7359p521m419
$$ -6032 10771 -3668 1497 4955 -1359 -470 5886 -2778 -1577 9626 -9452 7907 386 -4033
845d033J1842j0332J802O854o285m277J7236j9721J0376N394j6268J7683r334
$$ -4033 7809 -2523 -721 6133 -152 -4429 12807 -6914 3462 8856 -7412 10271 937
858I37j446P691m090p384J7059j4433j250J8363k3886J5133p43r107Q888j712
$$ 937 -509 7182 3092 -4292 12767 -1666 -2916 15447 -8439 6694 5951 -3156 5732 4020
872D020p960J2002m670j1502K4580k2960O376J1594j7473J0155J118p464N233
$$ 4020 -3940 8062 3392 -8110 16470 -6490 -114 11480 -5993 4162 5280 -2184 3049
885C049M307j5805K1501j2844o456K2181k1764O958P680r275M6J0012j4422J0578
$$ 3049 7356 -8449 13052 208 -6248 15933 -5831 1127 8807 -468 -422 9590 -4832 5746
899E746O94j6097K5235j8343o46J4743j2390j689J1725r776j256J2672j9587J8378
$$ 5746 6440 -9657 15578 -2765 -3411 11332 -1058 -2747 8978 -798 -2054 10618 -8969 9409
913I409p926q826J9389j4221j802J1778n648r534J8467j5264M760O344j5408J8244
$$ 9409 1483 -7343 12046 -2175 -3977 7801 2153 -7381 11086 -4178 582 6926 -8482 9762
927I762j0919l296J1036m114j0601J6191o531q547J6916j6056J0518k958n861
$$ 9762 -1157 -4453 6583 2469 -8132 8059 1528 -7019 9897 -6159 4359 1401 -4460
940d460J0308m770o359J0003Q47j5975K0206j1082j026P273q557Q217m814j334
$$ -4460 5848 1078 -5281 4722 5569 -10406 9800 -1282 -2308 4965 -3592 4625 -189 -1523
954a523L612L698j4433J5559l519j0850J4873r506L811j537O27K25J562n555N299
$$ -1523 2089 5787 -8646 6913 3394 -7456 7417 -2089 1722 185 812 1037 2599 -2956 2343
969B343L547j4371J6081p190j922L159l20J8k957L717l218N617j0960J0825k398
$$ 2343 5890 -8481 7600 410 -1512 1647 1327 1345 -1612 2105 -1113 4504 -6456 4369 1971
984A971o816P998l604J181m595P583n919K147j841K184J343q157J0462o184J788
$$ 1971 -4845 3153 -451 730 -3865 3718 -2201 -54 -1895 289 1632 -6525 3937 -2247 -459
999d59k872N265k696l669O836m479K649m974Q152o136R41J967j866L560p975R713
$$ -459 -3331 1934 -762 -4431 2405 -2074 575 -4399 3753 -2383 -1442 525 -1341 2219 -5756 3957
1015C957n418n43Q37L038m101q40O660q792P917o897M978j99n022N639j008k067
$$ 3957 -1461 -2004 -1167 1871 -2230 -3070 3590 -5202 2715 -4182 796 597 -4425 1214 206 -1861
1031a861j761R239j1927Q107o52l813O857p406O060j002j212j397Q491j0109L774
$$ -1861 -3622 5617 -6310 1797 1145 -2668 4189 -3217 2843 1841 629 -768 7723 -2386 1388
1046A388P095j2628J1426o043R66K386k385q74N240n222k564J2637j5968R582
$$ 1388 8483 -4145 7281 1238 2204 4590 2205 1331 6571 1349 -1215 11422 -4546 5036
1060E036K11p004P276l285j649L020J36p214J3737j2529K530R192j3848J0112
$$ 5036 5247 -1757 5519 2234 585 3605 3741 -3473 10264 -2265 265 9457 -4391 5721
1074E721j424l686L191K956q559J0358m308o479J5603j5497O970L640p830L570
$$ 5721 4297 611 3802 6758 -1801 8557 4249 -2230 13373 -2124 4846 8486 656 4226
1088D226L664p556L810M524j3224J5542j0166j126R654j0741L293L597n605q32
$$ 4226 7890 334 4144 8668 -4556 10986 820 -306 9348 -1393 1900 5497 -108 -940
1102i40R308j4091J0642p92r882J4177j0030J295M959l715k635R345r598K246
$$ -940 8368 -5723 4919 4127 -5755 8422 -1608 -313 4646 931 -1704 7641 -1957 289
1116B89Q593j4962J3831n364l714P352l890l141O733l483n383J2954j4354P696
$$ 289 8882 -6080 7751 2387 -1327 6025 2135 -1006 5727 2244 -3139 9815 -4539 3157
1130C157K093r757Q941l613k755L170J325q784J1539q175r49R312j2536Q489j361
$$ 3157 5250 -4507 4434 821 -1934 1236 2561 -6223 5316 -2859 -3808 5504 -7032 1457 96
1145I6l358K060L105p214O306J45q051J2391j0582M538K562n088K905J293k739
$$ 96 -3262 -1202 1903 -5311 995 1140 -6911 5480 -5102 -564 1998 -3090 -185 1108 -1631
1160a631l82O087j0282J0049n189j632O300p112L817p38l7l067O240o962L673
$$ -1631 -2013 4074 -6208 3841 -1348 -2980 3320 -3792 25 -713 -750 -3817 2423 -4539 -866
1175h66J627o921Q660o436K818o67L50j865K862r17k524O184q005P365l901M03
$$ -866 761 -6160 2500 -3936 -1118 -1785 -1435 -3300 -438 -1355 -3879 2305 -5700 1665 -2236 -1833
1191a833J549j372J595j417L233n876O513n037K582K74k693L955l863L660m239
$$ -1833 -284 -1656 -61 -1478 1755 -4121 2392 -2645 -63 211 -2482 1473 -2390 1270 -2969
1206b969M350l451J636K43j875L104m400N219n308M285k750P71J356l364M429
$$ -2969 1381 -2070 -434 -191 -2066 1038 -3362 1857 -3451 834 -1916 -1145 211 -3153 1276
1221A276l961L014k941L993m260K423J604m668N783n458M161k269N28o7J299j745
$$ 1276 -2685 329 -2612 1381 -2879 -456 1148 -3520 2263 -3195 966 -1303 -775 -842 457 -1288
1237a288n65N151q508P714l736k8K366l024K066o17N36k971P131q430M680K065
$$ -1288 -1853 3298 -5210 2504 -1232 -1260 1106 -1918 148 -469 67 -2904 4227 -4203 477 2542
1253B542o525O529l460R79k71J505l253N445n020Q2P335j0871P991j331k793J828
$$ 2542 -3983 2546 -914 65 -206 1299 -1954 3491 -1529 -1447 5888 -4983 3008 1677 -1116 712
1269G12J286k949K263L38n124R972j0551M675L133p129M094P26k568J46M221p783
$$ 712 1998 -951 1312 1650 -3474 6498 -4053 622 3755 -3374 720 1446 -1122 -976 3245 -4538
1285d538Q127m948j517Q238j0052N110J848l659l60N720p087L821K152p757J0448
$$ -4538 3589 -1359 -2876 5362 -4690 420 2268 -1391 -1751 3969 -3118 703 2855 -4902 5546
1300E546q023K206M230n364L48N286m767j728P946j0184P754k633l095O727o233
$$ 5546 -2477 -271 3959 -1405 -1057 4229 -538 -2266 5680 -4504 3250 617 -2478 4249 -1984
1315a984J071L398k234m412R864q730K053M648p823P662m581j11L165r93l760
$$ -1984 -913 2485 251 -4161 5703 -3027 -974 3674 -4149 3513 -1068 -1179 1986 993 -2767
1330b767P666m105l225R859r297M998o64j483L275j522p03K553Q79p211J0560
$$ -2767 4899 794 -2431 7428 -1869 3129 2465 982 4257 2735 2032 4585 5464 -1747 8813
1345H813p529L04N980o471L769j454r88n2K289n970O686l459l189P758p034K202
$$ 8813 1284 1588 7568 1097 4866 3412 2424 2372 4661 -1309 5377 1918 -1271 6487 -547 1655
1361A655O55o44j281K772k971J381K491o432Q315n683O64L074j980m13J363O20
$$ 1655 2310 1666 385 3157 186 1567 4058 -2374 5941 258 922 3996 2016 1603 2966 3586
1377C586k985N247o019M799j577k727M416l549J014o13J563l833L774l164K5K294
$$ 3586 601 5848 -171 4628 3051 324 4740 1191 2205 1592 3155 -678 3096 -68 -43 2251
1393B251m856M924m231J781j133J052j555P08J313l375M572m420L753k038Q77
$$ 2251 -2605 2319 -1912 -131 -1264 -212 -1767 -1059 254 -3121 1451 -2969 784 -1254 -377
1408c77P08j004K260k553L540l668L682k042P84M33j492K839l394L545l546K099
$$ -377 331 -673 1587 -966 2574 -1094 2588 546 1330 1763 271 3110 -284 3261 -285 1814
1424A814q78n41P16j745K132l471L742m381L087j623q42K527l477K423j686J742
$$ 1814 936 395 1111 -634 1498 -1973 1769 -2612 475 -1148 -1990 537 -2940 -517 -2203 -461
1440d61k704L336k509Q21K207m530N707m387K033K42k76q59J870l22l012N772
$$ -461 -3165 171 -2338 -1517 690 -3840 1867 -2520 -487 -245 -521 -1380 490 168 -2844 2928
1456B928o247M214j703j313K641k254P0M7J415n184O190m502J69K901m519L941
$$ 2928 -3319 895 -808 -2121 520 -1734 -1664 -1617 -202 -5386 804 -3698 -3529 -628 -5147 -1206
1472a206k450J7K60J614l901M293j049l776P136o142L425J10j040J009Q37k138
$$ -1206 -3656 -3639 -3379 -1765 -5666 -1373 -2422 -6198 938 -5204 -1779 -1669 -2709 -1700 -863 -3001
1488c001J853K362o485Q198m756o5L393l295J462K95l88r47M180o345N425r02
$$ -3001 -1148 1214 -5271 2927 -1829 -1894 1499 -1796 -334 -39 -427 -1374 2806 -3539 1886 984
1504I84m572O773m363P30J214mk156M030l977J452L454p080P340l329r96L058
$$ 984 -3588 3185 -1178 -448 766 762 -1394 2636 -1341 111 3565 -3515 3825 496 -500 2558
1520B558q54j789K659k12l265O271o632M519K47m245M746j868r34R94J738n025
$$ 2558 1704 -85 2574 2362 -903 5368 -1264 3255 3502 -743 4003 2135 1201 2195 3933 -1092
1536a092N552l345m06L957o147N195j699j243J023J795m230L167L07m508O347
$$ -1092 4460 1115 709 4666 -1481 3714 2015 772 1795 3590 -640 2527 2834 -1674 4673
1551D673n637K998L03k144J364P59k000J85L401n896N531k951p08L192l788K199
$$ 4673 -964 2034 2337 193 1557 2316 316 501 3902 -1994 3537 586 -122 3070 -718 1481
1567A481m49m4j535L721m751K334J359m302M876l371J466m57L64j265J873j281
$$ 1481 1032 988 -547 3174 -1577 757 2116 -2186 2690 -681 785 328 692 -573 1300 19
1583A9j021M046n466M263k033J1P80o01K69n06J226k872M205m025K010L62k224
$$ 19 -1002 3044 -2422 1841 -192 -181 599 -2 267 -239 987 -1885 2320 -1705 305 667 -1557
1600a557K291k203J847j907K454k836K076r51j070K854l541K853k085J894j412
$$ -1557 734 -1469 378 -1529 925 -1911 165 -786 -1856 998 -2543 310 -1775 119 -1293
1615a293O84j27r81J966k600K808k842K440j278K88P10j889K868k779K684k303
$$ -1293 -609 -736 -1717 249 -2351 457 -2385 55 -1223 -935 -225 -2114 754 -2025 659 -1644
1631a644J934j298O62J19j085K433l421L289k386R23L10n79O37q96J478k549L383
$$ -1644 290 -1008 -346 -227 -1312 1121 -2300 989 -1397 -474 -164 -743 -106 -1002 476 -2073 1310
1648A310l487J940k4j932K662k384J582j177J537k580K403j389m53K620l979L895
$$ 1310 -2177 -237 -261 -2193 469 -1915 -333 -1510 27 -2553 -150 -1539 -1992 628 -3351 544
1664E44k251M10L39O12j536R29R71k879M402m227K472K49j913J700n78k64o03
$$ 544 -1707 -1297 -958 -346 -1882 -953 18 -2861 1541 -2686 -214 35 -1878 -178 -756 -1020 -1623
1681a623K518m079L541k018q94K843l789K403j063j32p00J986l316K087O26l687
$$ -1623 895 -3184 357 -1661 -2555 288 -3501 -1098 -2161 -2293 -2993 -1007 -4323 -2236 -1610 -5297
1697e297M693l441J258O40j010J54J412j111p14L765m908M435j525j192L111k181
$$ -5297 -604 -4045 -2787 -2147 -3157 -3003 -1591 -2702 -3416 349 -4559 -124 -1649 -2841 270 -1911
1713a911Q68M62J82k254M273m399K135J301l753M199k853M45K38L58k387K712
$$ -1911 -1043 -581 -399 -2653 1620 -2779 -644 657 -3096 1103 -1750 -1305 -1067 -709 -3096 -384
1729c84j716j416M000m861L353j053j041J515jj370J137J239l342M926l716J527
$$ -384 -2100 -3516 484 -4377 -1024 -2077 -3118 -1603 -1604 -2974 -1837 -598 -3940 986 -2730 -1203
1745a203J412k473K437n25J53m97K392l804L795j421j757L657l482J785p04k16
$$ -1203 209 -2264 173 -352 -199 -696 1696 -2108 1687 266 -1491 2166 -1316 469 -235 -451
1761d51p25J694k535Q19J404m198M260l022O40N00p86J42K98l54j093L419l993
$$ -451 -1176 518 -2017 -1198 206 -3992 268 -2754 -2114 -1614 -2400 -2258 -1960 -2314 -3407 12 -3981
1778c981L213n04j018K122j020O82p57J836j705K807k150R42J508k912L084j901
$$ -3981 -768 -1272 -2290 -168 -1188 -506 -1263 573 -1132 1675 -475 467 1975 -937 2147 246
1794B46Q27p78J151j242M36R2j704K835l866K837j206l40K04J84J85j521K405
$$ 246 1073 295 1446 204 640 732 -972 1863 -2003 834 -372 -712 -508 -324 -139 -1660 745
1811G45k226K363k018J336N74j963K319r27J327j838K545j565O74M61q53J770
$$ 745 -1481 882 -1136 200 774 -1189 1130 203 1530 -308 2237 672 1346 1807 954 2724
1827B724k549K594k090J178q23M71J86j689K331k456J450k175J904j213p70J379
$$ 2724 175 2769 679 1857 1034 1505 1691 2 2333 -123 1327 -848 1056 -157 -927 452
1843D52j900K171k519J910j297L00k73O03k15j440K943k847K061j397O49L77q42
$$ 452 -1448 723 -1796 114 -1183 -883 -1156 -553 -768 -2208 735 -2112 -51 -1448 -799 -422 -1264
1860a264J152j204J440k285K977k434M51J279j877J545j437J210j199R46j631
$$ -1264 -112 -1316 124 -2161 816 -1618 -1167 112 -1765 -220 -1657 -447 -1646 -700 -2331
1875b331K148j279j215L079l457J912p38R99j053O24k19m33J179k431L812k919
$$ -2331 -183 -1462 -2677 402 -3055 -1143 -1881 -882 -1935 -1311 -1530 -1963 -784 -3215 597 -2322
1891b322J007J070j415O73j81R80j692K204k452K578r77j194K657k658J007K48
$$ -2322 -1315 -245 -1660 -987 -1168 -188 -1880 324 -2128 450 -527 -1721 936 -1722 -715 -467
1907d67N35j923K551j737J89J535k739L293k676R68N26n75n56J080K21j970L209
$$ -467 68 -1855 696 -1041 -852 683 -2056 1237 -1439 -471 55 -520 -1076 4 225 -1745 1464
1924A464l401K466p71j029J805j361K55j40J373k715L075k380K85J782k988K462
$$ 1464 -1937 529 -242 -1271 534 -827 -572 -712 661 -2054 1021 -1359 -1074 708 -2280 182
1940A82j459M48n75J276k107J944J65k461L360k993J952o24l81M72K52l82k0J932
$$ 182 -1277 -829 -1404 -128 -2235 -291 -126 -2587 773 -2220 -268 -892 -1273 -801 -549 -931 -951 981
1958I81l540L288j756%J101j310Q09m26P59j514K219k768J739J06j919K606k223
$$ 981 -2559 729 -1027 -1027 74 -1236 -427 -853 -94 -1608 611 -2157 -418 -312 -2231 375 -1848
1975a848J252o01N02j037J482o98o82K104k903K755j619N66J43j42L09l20J287
$$ -1848 -596 -1197 -695 -1732 -250 -948 -1630 474 -2429 326 -1293 -727 -584 -726 -417 -737 550
1992E50k176K639k242J602j98j192J803j426J035j040J571k068J507o42l55J552
$$ 550 -1626 1013 -1229 373 175 -1017 786 -640 395 -645 926 -1142 365 -277 -632 920
2008I20k391K138j522J168q57O59k16k79R84j779K082j699J425p45O4M38o96J135
$$ 920 -1471 667 -855 313 -544 115 -101 -380 604 -1175 907 -792 633 -112 -48 390 -306 829
2026H29j591J999j979J860j065L13K79q18J231j698J864j941J525j242N21N23
$$ 829 -762 1237 -742 1118 53 366 645 -173 1058 -640 1224 -717 808 -434 87 610
2042F10j239J551j800J995j660J287m57o93J227j207J380j428J471j358J464q20
$$ 610 -629 922 -878 1117 -543 744 287 -406 821 -386 994 -434 1037 -321 1143 323
2058C23k21J114j618J833j558J264r06Q49r02p5P49j428K056k240J355n28k02
$$ 323 102 1216 -402 1431 -127 1137 231 1080 178 103 852 -576 1480 -760 595 67 -135
2075a35N34o70P22j095J593k099K142j225R0R01j415J222p30J067j560J799j310
$$ -135 399 -271 451 -644 949 -1150 992 -233 -143 758 -657 565 -165 902 -658 1141 -169
2092a69Q02L96j471K451k542J491m45L60o75O27n08n24J723k586K146j505J27
$$ -169 633 1029 -442 2009 -533 958 513 873 198 825 317 -207 1516 -1070 1076 -429 -302
2109c02R95r29L18l19P93j387K012k084J319k1j051J767j715J347p99J141j397
$$ -302 693 -236 82 -237 556 -831 1181 -903 416 395 -656 1111 -604 743 -56 1085 -312
2126c12J678o64o98K062k189J738j193O19l10K3q0J50K47j838K562k428R97%j020
$$ -312 1366 702 4 2066 -123 1615 422 1041 731 754 674 824 1071 -767 1795 -633 364 364 -656
2145f56J152q80O56p06J093j951K009q61q87J826j691J506r96P37p52J149j047
$$ -656 496 -384 272 -434 659 -1292 717 -144 -1031 795 -896 610 -386 351 -401 748 -299
2162b99L40R53k069K684j958P60l7o4k22J50L95j353J636k469K351j510m18J358
$$ -299 41 994 -1075 1609 -349 411 374 310 88 238 633 -720 916 -1553 798 -712 -1130 228
2180B28j263P41j042J234j698J710j136N17K48j164J790j525Q41n10J017j077
$$ 228 -1035 -294 -1336 -102 -1800 -90 -1226 -709 -461 -1625 165 -1360 -519 -1029 -12 -1089
2196a089O76L84j171J857j986K095j097M09K55j31m8o99J435j844J838j425R83
$$ -1089 -413 -29 -1200 657 -1329 766 -331 78 333 202 154 -545 890 -954 884 -541 442
2213D42n50l69J005j023J053j270J396j190Q54k60n63J183j270J525j478J109
$$ 442 -108 -477 528 -495 558 -712 684 -506 348 88 -475 708 -562 963 -515 594
2229E94l58K45j7k71J160j723J633j415J228q73K05L62o39J020j373J632j551
$$ 594 236 481 464 193 1353 -370 1263 -152 1076 203 408 770 131 1151 -222 1410 -141
2246a41J039n71J62M8o23R63j587J642j248O94m8r7N57j361J435j267J126j411
$$ -141 898 327 489 537 -86 877 -710 932 -316 378 330 233 790 -571 864 -403 723 -688
2264f88Q03K90q46J134j234J306j281J151j172P90n23j58R25j480J583j347Q64
$$ -688 115 405 -441 693 -541 765 -516 635 -537 253 -270 -428 497 -983 600 -747 117
2281A17o50L32k16k60J053j286J511j466Q99n1l2J26o59J067j272J716j757J233
$$ 117 -533 -201 -417 -677 376 -910 601 -865 34 -17 -49 77 -582 485 -787 929 -828 405
2299D05n86l01J112j092R37q03Q87j267J285q96K19P05j659J715j402R77l47J42
$$ 405 -181 -482 630 -462 475 -328 559 -708 577 -319 -100 605 -1054 661 -741 236 -111 31
2317C1m68M82K23j094J863j723J322m65k34O39o35O21o67J077j315J694j292J21
$$ 31 -437 45 268 -826 1037 -686 636 171 -63 576 -59 562 -105 972 -343 1351 59 180
2335A80O41j351J452q59N72n74O07q32R17k52r91J669j983J356l47p1l9J64j90
$$ 180 821 -530 922 63 635 61 668 -164 753 501 -490 1179 -804 552 205 134 95 259 69
2354F9m21R92j531J765j144N03M88q53O47o29R08r66J597j554Q86j0o34R83j078
$$ 69 -352 640 -891 874 -270 233 721 -132 515 -114 794 -172 1425 -129 757 747 113 1096 18
2373A8R08q13R56j128P55o17j53J008j469J248o97K21j41J06j31m8M18r44J613
$$ 18 926 113 1069 -59 696 79 -74 934 -535 713 16 237 96 202 71 23 441 -503 1110
2392A110j561J279m01j94L77p01P65p14R43j164J352o80j52P09j194J041q65O74
$$ 1110 -451 828 427 233 610 -91 674 -40 903 -261 1091 411 259 968 -226 815 -50 624
2410F24q34R10q47M90r9p53J330j447R74p34M13j22r0L77q07J135j081J143n95
$$ 624 -210 700 -147 343 244 -509 821 -626 348 -386 27 -95 -185 192 -615 520 -561 582 -13
2429a3K05K90n82P32p53J116j193R99r34M48J17n56J267j315R06r87R23q09K52
$$ -13 192 482 -100 632 -121 995 -198 801 -133 315 432 -124 1143 -172 734 -253 670 -139 113
2448A13q0m20R75j027J045r08M78l23j7M20l51O88j178J286p52L66k36j57N48
$$ 113 33 -387 588 -439 606 -302 176 -147 -164 256 -95 593 -585 701 -51 315 79 -78 470
2467D70p20J279j048P44n18J70m6j61P07j064J156j424J019p19j0K96n03Q10q28
$$ 470 -250 1029 -19 725 207 377 331 170 877 -187 969 -455 564 -155 -165 131 -372 438 -390
2486c90N42p52Q63r32L70J85p38J177j096Q74p50M02j74M31J00m77Q31j288J152
$$ -390 152 -600 263 -669 -299 -114 -852 325 -771 103 -647 -245 -419 12 112 -365 466 -822 330
2505C30o39M08q9j03J41l55Q24j034J024j250J109k63n89O66p05N53o99J003j101
$$ 330 -309 99 10 -93 48 -307 517 -517 507 -743 366 103 -486 180 -525 28 -671 332 -769
2524g69P67n65J08P15j133J229q73M86j93N08k96J08L82q11J441j386J025n1m12
$$ -769 -2 -567 -459 256 -877 352 -521 -35 -228 280 -16 92 474 -337 1104 -282 743 692 280
2543B80L87l42K08n59R12j272J319n16j81M50r81P35l15N14q24O36n23K97J05
$$ 280 667 325 533 -26 886 -386 933 417 236 686 -295 440 125 639 -185 451 -72 225 330
2562C30o60J227j324R26r05O01l83M65k47k06P69j138J074o49M29k21m4J46k77
$$ 330 -330 897 -427 499 -406 195 -188 277 30 -176 593 -545 529 -120 309 88 44 190 -87
2581h7O39j093R89r78Q23l12l51R40j231Q74n92N64r79Q46j34m99R41j212J227
$$ -87 552 -541 448 -530 293 -19 -370 570 -661 213 -379 185 -794 52 -82 -581 360 -852 375
2600C75q26O82k61j22R3j15M60p44J228j249M66k6m1M3k88P12j063J177q73P64
$$ 375 -451 231 -30 -152 -59 -174 286 -458 770 -479 -13 -39 -80 -37 -325 387 -676 501 -372 392
2620C92n55p2N10o24P11q66Q38o61M41o7j48L67q35J127j019O71l95M15p0m29
$$ 392 -163 -235 275 -349 362 -504 334 -327 114 47 -101 266 -569 558 -461 210 -185 230 160 -269
2640b69Q02o93R15j352R85o25M18j29m38O58q26R08j089J128n99Q4J16n48O31
$$ -269 533 -160 755 -597 388 -237 181 52 -386 272 -554 354 -735 393 -206 -122 -6 -554 77
2659G7p98P58o03P38l03j94N07o38Q02r78J068p42M64k23k8L24m91N34n39P14
$$ 77 -721 37 -566 172 -131 -325 182 -456 346 -632 436 -306 158 -65 -93 231 -260 274 -265 449
2679D49o40L44j08O7K96r63R50q00N28k87J84K6l76N71n51P08r04Q04o23L11J66
$$ 449 -191 153 45 112 408 -555 395 -405 123 -164 20 46 -330 241 -310 398 -506 298 -325 -14 152
2700A52l10L88l73N56n21M08n89M05J85n39R74j146R13n49K41k29K9K24m32O79
$$ 152 -158 230 -143 413 -108 300 -289 116 301 -238 736 -410 503 -46 195 -34 -5 219 -213 466
2720D66j202J228r79R8J72k56M11m99P00j156J011p15M69j79m7L12o06R52r49
$$ 466 -736 492 -487 -389 -217 -473 -62 -561 139 -1017 -6 -721 -252 -431 -478 -166 -772 180 -769
2739g69R07r24J96O3k86J002j092J067o33L18j64L05k69J3J16o03J092j114P26
$$ -769 138 -786 -590 -527 -813 189 -903 164 -469 -151 -315 -10 -279 -266 -150 -753 339 -775 -49
2758d9o72L48K71k82N30o44Q55j023Q96p01J67M28o04O87p07Q64p48P45q17M60
$$ -49 -721 -373 -102 -384 146 -498 357 -666 230 -471 -304 124 -480 207 -500 364 -384 361 -456 4
2778DL52p60Q50q54O71l12L45l33J9L64n07P28j058J052n51n9Rj70N96o64O00
$$ 4 356 -404 446 -408 263 -49 296 -37 -18 346 -161 567 -491 561 10 -49 -40 -210 386 -278 322
2799C22p65P91p23L62J63n96P07o81P31o48O96q66O89j22k48P24j181J100p10
$$ 322 -443 348 -375 -13 150 -446 261 -420 311 -337 359 -507 182 60 -188 536 -645 455 -255
2818b55M44m88l6J3J36N39q86Q21p70O23l77%M27o71P11r46O72o29P11j74j49
$$ -255 189 -299 -335 -322 -186 353 -533 288 -482 141 -236 -236 191 -480 231 -715 -43 -672 39 -135 -284
2839b84L38m48Q50r07N26m60N92j69jK98m71R11p48L46l50qJ37l68J114O32r36
$$ -284 54 -394 456 -451 75 -385 207 38 37 335 -136 775 27 373 23 15 152 -216 898 1530 594
2860E94n94K70j106N61R29r51Q47j014O96o39O53l47L96j56j41K73n15Q08q48
$$ 594 0 270 -836 -275 654 -297 550 -464 232 -407 246 -101 295 139 -2 271 -244 564 -284
2879b84L65j32n4M30o46P87o54P43n87K77k42l22P52p52P52o53N61n55O04k78
$$ -284 81 -51 -105 325 -321 466 -188 555 -32 245 3 -319 433 -319 433 -220 341 -214 390 112
2899A12j10K82p36J280j081O69n86J00M5l5M97q06O55n54O96m16j08K53l26K43
$$ 112 2 284 -452 828 -253 416 -170 -70 -25 -60 437 -369 286 -268 428 12 -96 157 -169 74
2919G4m41R13o11M49n93p0K85l93P36o44M65m41N72n23K84J44o20P64q88P96m70
$$ 74 -367 546 -65 384 -209 -279 6 -387 349 -295 170 -271 301 -222 62 206 -414 350 -538 258 -212
2940b12L19j64n4J49n61P19p56P54n17L16k9k96R5k21L02l98Q00r23P33k21m46
$$ -212 107 -57 -111 38 -523 196 -560 194 -323 -7 -36 -332 -237 -458 -156 -554 246 -677 56 -165 -611
2961f11N96q51Q12m19M33j92J71j44k84O74r98R89p61M22j02R1K89m03N93r35
$$ -611 -15 -866 -54 -473 -40 -232 -61 -205 -489 185 -813 176 -585 -163 -265 -174 115 -288 305 -630
2981f30J052j076O98k64j7K84n71P70o62O68q72O76j71l84P96q11R38j140J024
$$ -630 422 -654 44 -220 -237 47 -524 246 -416 252 -620 56 -115 -499 297 -514 424 -716 308
3000C08n41L92j75k43M87q03Q67n75P12m98K07j34J20K22m83L12m24O28l56J14
$$ 308 -233 159 -16 -259 228 -575 292 -283 429 -69 138 4 124 346 -137 175 -249 379 23 137
3020A37R9l90N91j006Q01n34M45q7j92L21q47O20n66Q94o83M95m86L62N9n32O09
$$ 137 236 -154 437 -569 232 -302 143 56 -136 185 -662 -42 -608 286 -397 98 -388 -26 33 -499 110
3041A10n76O58o94M56Rk84L21k69M20l77M61o09L76J73k47J02m62P39p72Q98o80
$$ 110 -466 192 -502 -46 -37 -321 0 -269 151 -226 235 -374 2 175 -72 30 -432 307 -465 433 -247
3062b47K77M9m10O98p13P36r15L85k0K83J0n30O36n31R31j353Q25k09J63k44J25
$$ -247 30 79 -331 367 -346 390 -525 -140 -160 123 133 -397 239 -292 639 -714 111 -98 65 -179 -54
3083e4J095j650Q85o25P39n12P09M01j117P08q13O87p45O60j59j54L45m63N78
$$ -54 1041 -609 276 -349 390 -122 587 988 -129 579 -234 453 -292 368 209 55 400 -63 515
3102E15r23R80q21K06O1j16M59o69N30j68M20o97L15j19M0K56m37N10r02P98j56
$$ 515 -408 572 -249 -43 18 -98 361 -308 222 54 474 -223 92 -27 13 269 -168 342 -560 238 82
3123H2k1K22k89L27o45R03o81N15l72J53K13l98J60m21P02o11N12l70o8L04n07
$$ 82 61 283 -6 321 -324 579 -102 413 41 194 407 9 169 -252 450 -161 351 -19 -87 217 -290
3144b90P27o71L66l81O26l94j38L53o16J079j034P23n22K35j80PL83q53Q12m80
$$ -290 437 -234 132 -249 377 -17 -155 198 -418 661 -373 350 -172 63 -117 -110 273 -580 232 -248
3164b48M68m86J14L26l61L21m97R01p54N03n47L59J04p49Q93o56N98o48N37k37
$$ -248 220 -266 -152 174 -187 134 -363 538 -216 287 -260 99 203 -546 347 -309 289 -359 178 -59
3184e9L1K9n02Q24r22R32p99M70k58J32M7k80O70j020J060p50M41k02n8M09m37
$$ -59 -28 1 -501 323 -599 333 -466 4 -254 -122 -75 -355 315 -705 355 -395 46 -156 -214 195 -242
3205b42K50k50O65n17J75k08n6K29m43R34q61O84l91K02j89j03K96m07P16o29
$$ -242 8 -242 423 -94 81 -127 -183 46 -397 537 -324 360 -31 171 -18 -121 175 -232 484 -145
3225a45L37m18M19o6l57N79m61N24o03M41m10J85K11o73Q27q08P70p08Q60o16
$$ -145 192 -226 193 127 -230 349 -112 412 -191 250 -160 25 236 -437 390 -418 352 -356 504 -112
3245a12J53K61n78O08r10R10m13M17l72n9K39l08N82j007P75m02O02l21j46M38
$$ -112 41 302 -276 332 -578 332 -81 336 -36 -95 144 -164 418 -589 186 -216 386 65 -81 357
3265C57p17N91n17O83o55L04k79J34J54m56O68n26N14m75J67J79l17K88l15Q35
$$ 357 -360 231 -286 397 -258 46 -233 -99 55 -401 267 -259 255 -220 -53 126 -191 97 -218 617
3285F17p45M76l28K45K89o11M96o42O77o29K56j88k25M03j88N73n14O24o34K59
$$ 617 -128 348 20 265 554 -57 439 -203 474 -155 101 -87 -312 91 -97 476 -38 586 -48 211
3305B11M7k79L97m79O09q16Q27n68M27m19k3N13m66O32m98L32m07J44J39m40N38
$$ 211 258 -21 376 -103 506 -310 517 -51 376 -43 -66 447 -19 613 115 447 40 184 323 -117 421
3326D21m10M59m85M40l19J35P7m74O60r69Q26m59K07Nk58J03k10N11p05P95n21
$$ 421 11 470 -15 425 106 241 318 -156 504 -465 361 -98 109 114 -144 -41 -251 260 -445 350 -171
3347a71J97r8J02O1m23M86k66K41m30J25Q3N9L05m43M93o54N96m53L56l66J66
$$ -171 26 -72 30 91 -332 154 -112 129 -301 -176 -93 -34 271 -172 321 -333 263 -190 166 -200 -34
3368c4K86n99R07p90J84r9K31o3O3J73m07N54o20M47m49J28M06l68J46l21N98
$$ -34 252 -347 560 -230 -46 -145 86 23 86 259 -148 406 -214 233 -216 -88 318 -50 96 -225 373
3389C73n62L45k91K62n9k68N26o93N28k85R5K45L0j9l53K86n01N52k63K58l4j95
$$ 373 -189 156 -135 127 68 -200 326 -367 161 -124 -29 216 246 227 -126 160 -341 211 -52 206 172 -23
3411b3J97k53J77l05K71m42M53J13j31J43n96Q90p08N25j69n1j14p7O32n43L47
$$ -23 174 -79 98 -207 64 -378 75 188 57 200 -396 494 -214 311 142 91 -23 -100 532 -11 336
3432C36o74P36k68J29j21l52O32m66N17m16K86j63J15N7k73L53m24N36n26K19
$$ 336 -338 398 130 259 138 -214 418 -48 469 53 339 176 291 348 75 428 4 540 14 233
3452B33k72k3M18k99K40l58L80n72M54j45N1L53m76L87l76M17n76K50J94j38J43
$$ 233 -39 -62 356 57 297 -61 319 -253 201 56 107 460 -16 371 -5 412 -164 86 280 142 285
3473B85n70P83n55L79j01l2j5k34N35m61M15m22J98r9M7J30k29P1l56N49n04L61
$$ 285 -285 498 -57 322 221 189 174 -60 475 14 429 7 205 106 153 283 54 125 -231 318 -186 175
3495A75j18O6K02o56O78n31M62l34L77l25L0P4o2J96m99O23l78J95K2k01L30l62
$$ 175 57 123 325 -331 347 -184 278 -56 321 -4 26 100 38 234 -265 358 -20 175 197 -4 326 -36
3517c6K18k31K06k36K79Q1k17J49k79L29k68L49l10K91k23j59M30n62M98n36M39
$$ -36 182 -49 157 -79 200 281 64 213 -66 263 -5 344 34 325 102 -57 373 -189 309 -227 212
3538B12j93M7K4j08M53n28N27m49K32j54K8J21j12L24o19P29o41L21p2L1j35J60
$$ 212 19 66 90 -18 435 -93 434 -15 217 63 91 212 100 424 -195 534 -107 214 142 173 38 198
3560A98R3n87O30k96J4J63r2J21l97P95j012M75o4J66j68J37L49p83Q12m87L27
$$ 198 291 -296 334 38 52 215 123 244 -153 642 -370 105 41 207 39 176 525 -258 554 67 394
3581C94m71K74Q4j50L02p98Q70o21K48%j52P0M6M58n24M52n45M76k46k59M48l74
$$ 394 -77 197 281 131 433 -365 505 -116 132 132 -20 50 96 554 30 482 -63 413 167 -92 356 -18
3603a8M26m48O15o32M63j55j99M48l96K63n04N44m95K62k8j9K42l20L53m90M81
$$ -18 408 -40 575 -57 406 251 52 500 104 367 -137 407 -88 174 146 127 369 49 402 -88 393
3624C93m99K93k5k32K89k61K73m11M77m59L72J7m72M82l95M83m98L82k21M18k83
$$ 393 -106 187 162 -70 219 -42 231 -180 297 -162 210 227 -245 237 -158 325 -173 209 -12 406 123
3645A23m28P65o52O05o20K77j28k8L00l59L02m35L98m84N28n4j21J73l69N41p43
$$ 123 -305 460 -192 413 -207 70 -58 -86 214 -145 157 -278 120 -364 164 110 -11 162 -207 334 -409
3666d09O90n76M29j2k99N44n99N09m55L66l66L18k51J7L7j68L43l82M35m80N19
$$ -409 281 -295 134 122 -177 367 -232 277 -178 188 -178 140 -111 -94 -57 -225 118 -264 171 -309 210
3687B10j86j78K25k52M74l30J40k09Q3K01k14K11n23P37n34K86k7j27K04m44L61
$$ 210 24 -154 71 -181 293 -37 103 -106 -23 178 -36 175 -348 389 -145 141 114 -13 191 -253 108
3708A08k55M30n44L22k09q4L15l81J89j74L68j52J23k08j7J92m87O44o87N12k56
$$ 108 -147 283 -261 61 -148 -232 83 -298 -109 -283 85 -67 56 -152 -169 23 -464 180 -507 5 -251
3729b51K40J58l65K04m89O72k46K96l79J82q7k99N34m98N11m22L61j64j9J90m75
$$ -251 -11 147 -218 -14 -503 169 -77 219 -160 22 -65 -364 170 -328 183 -239 122 -42 -61 129 -346
3750c46M60k00K65m51L73k21J4J56j98L86m51M01k92R7j11j62M58l40L54m74P51
$$ -346 114 -86 179 -272 101 -120 -106 50 -148 238 -213 188 -104 -7 -118 -280 178 -162 192 -282 469
3771D69n49MJ20n5L84n55P07o49K50j20J97k14j05K99m11L80j81J71l15K62Kk79
$$ 469 -80 -76 44 -11 373 -182 525 -124 126 6 203 -11 -116 183 -228 152 -29 142 -173 89 91 -188
3793a88K69l06N09o65N83k50p4L55m74L29j87M17n46K37J1R2p6j68K50k85M45
$$ -188 81 -225 284 -381 202 -48 -122 233 -241 88 -99 318 -228 9 20 112 36 -132 118 -167 278
3814B78m22M00j30l68K89n5L27n84K76J13p6J53j04K11m61M56l78L32m00K07j4
$$ 278 -144 256 126 -242 47 -8 319 -265 11 124 48 201 97 308 -153 303 -75 257 -143 64 50
3835E0r0J21j51K39l12M98n33K37K0k00L01l77L78n27O34j78j26K20m07N12n33
$$ 50 -40 81 -70 169 -143 355 -178 59 79 -121 180 -197 181 -346 288 110 -16 204 -203 309 -224
3856b24N68n76N33k92L42l06j44L55l29M98m47J45k34k0J20j06L05n76N57l99
$$ -224 344 -232 301 9 351 45 -99 256 -73 425 -22 123 -111 -131 -11 -117 188 -388 169 -230
3876b30J95J45j24k9n9L33k73k3j95O45j68r2l1k27K76n97O11j56J31Qj58L95
$$ -230 -35 110 -14 -43 -102 231 -42 -65 -260 385 217 125 94 -133 143 -454 157 1 132 140 -18 377
3898C77k23K65p03M84l4J01K5j76K96m39M92o32L80j11J28J83n58L96n02O04p44
$$ 377 154 419 -284 200 166 267 292 116 412 -27 465 -167 213 102 230 413 -145 251 -251 353 -391
3919c91N03P8j05J4j70J95m41L79j56K0J73j52L31l52L97n35L63l21L1L19k78
$$ -391 112 190 85 99 -71 124 -317 62 -94 -74 99 -53 278 -74 323 -212 151 -170 -139 180 -98
3940i8K39l64N01o13J33k08M43j18L6r5k20N98l95J63j70L3Mk83L02l39N03k55
$$ -98 141 -223 278 -335 -202 -410 33 -85 -49 -144 -364 234 -161 2 -168 -135 -131 -414 -112 -451 52 -203
3962b03P1j13M2P9k10P07m30M23n67K71k84J21N1k26L49k53K39MR5m5r4j6LK79
$$ -203 -132 -245 -203 -124 -334 373 -57 366 -201 70 -214 -93 -42 -268 81 -172 67 71 166 121 27 11 14 293
3986B93l28K89k50N3j28j19M45l81M16n26N27l66P7j5j2J41j89L83o57M72k50
$$ 293 -35 254 4 57 -71 -190 255 -126 290 -236 291 -75 2 -13 -25 116 -73 310 -347 125 -125
4007a25K34J1k91L87k98K77l35L75l68M4K35l24K76k7J47n13L92j09j21J71l06
$$ -125 109 120 -171 216 -82 195 -140 235 -133 -89 146 -178 98 71 218 -295 97 -12 -133 38 -268
4028b68M53o89P81m40M22m35Q0K90n31N70n32M82j59O8r5k02J21k34N68n26M82
$$ -268 185 -504 277 -163 259 -176 -96 194 -337 233 -299 183 24 92 -3 -205 -84 -318 250 -276 206
4049B06m22L03q7l4L77k71K06l78K88Kj41J94k49M83p44L23l56M02O8m1pj31J12
$$ 206 -216 87 0 -34 343 72 278 -100 188 190 49 243 -6 477 -267 56 -300 102 170 129 122 -9 103
4072A03r2K70l21N4l9Q6r6l35O21n64N33n02O10k92r0N9j00L04k45L08n87N26
$$ 103 11 281 -40 14 -25 61 -35 -370 251 -313 220 -282 328 36 -54 5 -95 209 -36 272 -315 211
4094B11l08l06N81j84K65l78K93k84Q6o4j27K25j76N73p94N14k81k78M11N6R8
$$ 211 -97 -403 178 -6 259 -119 174 -110 -24 -88 -215 10 -166 407 -387 127 -154 -432 -21 35 133
4115A33r6K55l98K18j93K50j28j54L02m60N88l81K49k86R3p3Q9M33o47M45m32
$$ 133 37 292 -106 112 -81 169 41 -113 189 -271 317 -64 185 -101 -8 -81 8 441 -206 239 -193
4136a93L27n5l27L06k70L83l53L52q7kj17J72j0k54K54j47J40j13q9j0j14L54
$$ -193 134 79 -248 58 -212 171 -182 170 83 81 -36 136 126 -128 126 -21 119 6 -83 -93 -207 147
4158A47l78M97n33O04l47n1J83l38L90n11M39m97L36K16k94q3J65J56l26J60j54
$$ 147 -231 266 -267 337 -10 -61 122 -216 174 -337 102 -395 -59 157 -137 -220 -55 101 -225 -65 -219
4179b19M04k05j81L32l04J77k29L33l89O5Q6M24j15k78K60m77N24m02J61r2J6
$$ -219 185 -20 -201 131 -173 4 -225 108 -281 -216 -130 294 179 -99 161 -316 208 -194 -33 -125 -109
4200a09K13j54K52n59N99l89L06j59j60N51n67K22k49K56L2J13j12j10L72n93
$$ -109 104 -50 202 -357 242 -147 159 0 -160 391 -176 46 -203 53 85 198 86 -24 348 -245
4220b45N83m18K67k76j50K29k38N14k90K87m40M87l34K0K97m31O20m99L07j93
$$ -245 338 -80 187 -89 -239 -10 -248 266 -24 263 -177 310 -24 -4 293 -138 482 -17 290 97
4240I7jM9oJ15k99J38j38J67l12Q0O1p6J99m28N85o58O22m86L12J38l97L42j12
$$ 97 96 145 139 254 -45 93 -45 122 -190 -110 -49 -125 74 -354 231 -427 195 -291 21 159 -238 104 -8
4263hK09l36K31k83L10j76k28N25l54K45k49J23J95j31J75l83J84k61M70n58L82
$$ -8 201 -135 96 -187 123 -53 -281 244 -110 135 -114 9 204 73 248 -135 49 -212 258 -300 82
4284H2q3LJ36j43L50j96N9j79j2LK23j46k30K97l14K63j62L04j81k04K57l27N82
$$ 82 -1 2 138 -5 345 149 208 29 17 20 243 97 -133 164 -150 113 -49 255 74 -130 127 -200 382
4307C82m71L22k83L7Q2l99K57j45O67o89K60J18j24J40l93N34l10J59k13K50k64
$$ 382 -89 233 -50 -13 69 -330 -73 -218 449 -240 20 138 14 154 -239 295 -15 144 -69 181 -83
4328h3L11l3r4K14n95N99m29N22m43n4L19m08J39q9l8r0J93J54k35L71k16Nl41
$$ -83 228 195 101 315 -280 319 -110 412 -31 -85 234 -174 -35 -124 -162 -252 -59 95 -140 231 15 20 -321
4351c21M78p9J8o0OL2j19L93n22N64l96J47j56K37J91p18M98l62J79l3Q7o5k1
$$ -321 157 78 96 36 42 74 -45 348 -174 390 -6 141 -15 222 413 -305 193 -169 10 -23 64 -1 -22
4374b2L56o09M50l98M40k28K88l37k05K79m03L50j53L73j97J46O5l01N11p62P13
$$ -22 334 -275 175 -223 217 -11 277 -60 -265 14 -389 -39 -192 181 -16 130 195 -106 405 -357 356
4395C56n39M54k0k39J34k13R1j81L55j00RM3k99J75k63L26l13L49n19K97N3o2
$$ 356 -183 271 251 12 146 -67 24 -157 198 98 107 150 -149 26 -237 89 -224 125 -394 -97 -44 -106
4417a06L02l93J84q4j11L42j86K00l26L35k80R9k54M43k82K53L1l41J02K8K82
$$ -106 196 -197 -13 -97 -208 134 -52 148 -178 157 -123 -24 -278 165 -117 136 167 -174 -72 -44 238
4438B38k44K19k51L07j75m13N62n87L47lJ38k84J22K67l67J94j96M06n45N02l24
$$ 238 -6 213 -38 269 94 -319 243 -344 3 0 138 -146 -24 243 -124 70 -126 280 -265 237 -87
4459h7J2J05j80L62j46P8m68M44N1l44N84n85L16l84L54Lj1J09k64K07m11L34
$$ -87 -75 30 -150 212 66 144 -324 120 171 -173 411 -174 142 -242 112 115 104 213 -51 156 -255 79
4481G9n26O44l56j57L70j77J71k97N09o61K44K38j44L86l56L37l78L01k41L06
$$ 79 -447 197 -159 -316 54 -123 48 -249 260 -401 -157 81 -63 323 -33 304 -74 227 -14 292
4501B92k58Q4L9k52L75m65M53m37J89o6n9K66l89K98m31L04J7J67mk21K08l60
$$ 292 34 118 157 -95 280 -185 268 -169 20 -46 -105 161 -228 70 -361 -57 -40 127 123 -98 110 -250
4523b50M83l21J91j58o9J18r7J84j68M51l83J96k71j14N20l31M59m47L30m81L21
$$ -250 233 -88 103 -55 -124 -6 -103 81 -87 364 -19 177 -94 -208 312 -19 440 -7 323 -158 163
4544A63j54m9L99m52K35j13Om92N22N4k95p0K06J8j93M74m60J37J10k47J53L2
$$ 163 9 -40 359 -93 142 29 35 -457 65 119 -176 -246 -40 -22 -215 259 -201 -64 46 -201 -48 -16
4566a6L73m10K01m01K73J9k12K83k81M10l38L15l07L21j96l7l1j34K26k37J83
$$ -16 357 -53 148 -253 20 39 -173 110 -171 239 -99 216 -91 230 34 -3 -34 -168 58 -179 4
4587Dk19M18k27N7J35o44O19k05L13m07M4K70l00J66j86K14j72L76j02j21K5N
$$ 4 -215 203 -24 33 168 -476 143 -62 251 -156 -112 158 -142 24 -162 52 -120 256 154 33 58 63
4609F3j46j58M51k18Q9l4j60L10k24K47k67K59l49J70j6r2M42m14L04k95O0O9
$$ 63 -83 -241 210 -8 81 47 -113 197 -27 220 -47 212 -137 33 17 -75 367 -47 257 -38 22 91
4631I1l94L04O8m8k94J81J02N9j70J44k06J16K05k79K20m5R3k27K73j20j22K83
$$ 91 -303 1 69 21 -273 -92 10 69 -101 43 -163 -47 158 -121 99 54 147 -80 193 73 -49 234
4653B34k89K72j82Q1l9j24K23l47L70k38J62j94K14R9k75J94l68L35j11O9l8n6
$$ 234 -55 217 35 116 77 -47 176 -171 199 -39 123 -71 143 242 -33 161 -207 128 17 86 48 -8
4675hN7j0K05j80j8j63J24r4K0M34n66N29l17l3j78M03l4l90L13K4J2l42K41l3
$$ -8 49 39 244 64 46 -117 7 -87 -67 367 -199 330 13 -20 -198 205 171 -219 94 118 130 -212 29 -4
4699dK15j21j34K30m07M44k58J59m80N51l51K6K64l11M91k75L31j68k43l8j5M05
$$ -4 211 90 -44 186 -221 223 -35 124 -356 195 -156 -130 134 -177 314 39 370 202 -41 -79 -94 311
4721C11m04N57n41K02j63J6K17l87M90l04jO6k4j18K76k27J4M17m06J50l52K79
$$ 311 -93 464 -77 125 -38 -22 195 -192 298 -6 -7 59 35 -83 193 -34 -20 397 -9 141 -211 68
4743F8j04J96O0m21L96l00K97l83J95K8j93K93l47L76n28P20o58K37J24n5J34
$$ 68 -36 160 220 -201 195 -105 192 -191 4 32 -161 132 -215 161 -367 353 -305 -68 56 1 135
4764A35l47N15m19K98j79j66K7R9K7j1J64k50J56j87r3L13k9J49m22K64j01J76
$$ 135 -212 303 -116 182 3 -163 -136 -37 -10 -21 143 -107 49 -138 -231 82 53 202 -220 44 -57 119
4786A19k34P0O7L6j9k62M77l05J31j05j65J27m4K09j36J62l17L69J0l76M90n30
$$ 119 -115 -45 22 58 39 -223 254 -51 80 -25 -190 -63 -107 102 -34 128 -189 180 190 -186 304 -226
4808b26M42l0k6m95K08J56j53J31j17M03m44N78k35k33K6O4K97o18L89q1K44m08
$$ -226 216 186 160 -335 -127 29 -124 7 -110 293 -151 427 192 -41 -15 49 346 -272 117 36 280 -128
4830a28K25j1O2K8l53L63k59K9k19kM18j55J23k66L27j67P9j69r0L71m01K44j04
$$ -128 97 86 148 176 -177 186 -73 -44 -263 -265 153 -2 121 -145 182 15 94 -75 -165 206 -195 49 -55
4853e5L12k35J73l5j95L39l37J54l46N14l46J47N5l65K54k05M27m18J96k99L79
$$ -55 257 22 195 160 -35 304 -33 121 -225 289 -57 90 145 -220 34 -171 256 -162 34 -265 114
4874A14J73m34L86m39K89j69L51l64K6K70l30J66l28L49q6J07r5j68K63j18J26
$$ 114 287 -147 239 -200 89 -80 271 -93 -67 203 -127 39 -289 60 -26 81 -14 -182 81 -37 89
4895H9j43Q0lk4J0N7l0k94L80k24Q4J00p4o5r3R5j07L48l12K65n02K28J51n8k6
$$ 89 -54 26 23 -1 9 66 36 -258 122 -102 -18 82 8 -57 -150 -55 -162 186 -126 139 -363 -135 16 -42 -68
4920f8j58L76k30K55l57N7j02M78j12l34K81k54J59J38Q1k47J39K6l52L98n35
$$ -68 -226 150 -80 175 -182 -125 -227 251 139 -195 86 -168 -9 129 210 -37 102 128 -224 174 -361
4941c61L95j51J73O3l84L29m29O45k94L7J08j73K44l92K58k94J40j45M27k02o8
$$ -361 34 -117 56 119 -265 64 -365 280 -14 23 131 -42 202 -190 68 -226 -86 -231 196 -6 -74
4962g4J16J22q1m18M30j97MJ4R1n2J54M30l83mk74M7K31k26j45O4l9O1O7L1J1
$$ -74 42 164 83 -335 95 -102 -98 -84 7 -45 109 539 156 152 -122 -75 156 -70 -215 -151 -190 -129 -62 -31 -20
4987b0K46k88L84k32J01k37M7q5P6J40l55M15m07N96n92L78l14k3K76k51J08j69
$$ -20 226 -62 322 90 191 -46 1 -84 -8 132 -223 192 -215 381 -211 167 -147 -170 106 -145 -37 -206
5009b06K40k25L18j80q5J65n7N9k68L35n6r0M1j67K84m03M71m08M04l70K41J81
$$ -206 34 -191 127 -53 -138 27 -30 29 -239 96 40 -50 -9 -176 108 -295 176 -232 172 -198 43 224
5031B24k72K83m09L67l02K13q0k46M57L0j27j93J89l67M80q0R4L0j94M31o21L23
$$ 224 -48 235 -174 193 -109 104 24 -222 235 265 138 -55 134 -233 247 167 261 291 97 528 -93 230
5053B30p13N63J78l18K91k46M58m17K2N3Q2k82k3K86j58K93n87M38l47K33k6n3
$$ 230 -483 80 258 -60 231 -15 443 26 48 101 183 -99 -122 164 6 299 -288 150 -197 36 10 -43
5075d3k9LK34j82K48j95j35J91k71K14k61M36l42L14m22L06L2k33K31k26N0M9
$$ -43 -72 -69 165 -17 231 36 -99 92 -179 35 -226 210 -132 182 -240 66 98 -135 96 -130 -80 -31
5097c1N4j66%K7j3J63l97L61k4j23N0j37M69p35P40l16R1j77L3K02j62J78k88
$$ -31 23 -143 -143 -116 -129 34 -363 -2 -26 -149 -99 -236 233 -502 238 -78 13 -164 -131 71 -91 87 -201
5120b01K16l66M54l50J84L3L92m07q7M02k52J01j78j28J71n8K86n76K71kK03j95
$$ -201 15 -351 103 -247 -63 -30 362 -45 -132 270 18 119 -59 -187 -16 -74 212 -364 -93 -95 108 -87
5142h7M9j17K21J50j93j95J03K38l54J84m5j99J76o6J19oKj61N7L42k87q8R2L12
$$ -87 -38 -155 66 216 23 -172 -69 169 -185 -1 -46 -245 -69 -135 -16 -22 -20 -181 -124 218 -69 -157 -65 247
5166B47lj25J01k54K66m77K80m1j28K6K20q8l02M05l82K84N5j08j5l6J60l03K80
$$ 247 244 119 220 -34 232 -245 35 -6 -134 -108 112 24 -278 127 -255 29 84 -24 -39 -75 85 -218 62
5189F2q9J09j63O9Q0ml1k09L14j62J5q8J54m6RJ07PJ67l86J35k86J0N6N3M58n05
$$ 62 -27 82 -81 -12 68 64 33 -176 138 -24 -9 -97 57 11 20 127 134 301 -85 50 -236 -226 -170 -117 341 -164
$$ [...]
8191c5
##END NTUPLES=NMR FID
##END=
