##TITLE=1H_AN-AD-108
 CDCl3, 8 sc, 
 13.05.2021
##JCAMPDX= 6.0         $$ Bruker NMR JCAMP-DX V2.0
##DATA TYPE= NMR FID
##DATA CLASS= NTUPLES
##ORIGIN= UXNMR, Bruker Analytische Messtechnik GmbH
##OWNER= root
$$ XWIN-NMR		Version 3.5
$$ Thu May 13 13:52:11 2021 Russian Standard Time (UT+4h)  she@DPX200
##.OBSERVE FREQUENCY= 200.131506
##.OBSERVE NUCLEUS= ^1H
##.DELAY= (6, 6)
##.ACQUISITION MODE= SIMULTANEOUS
##.ACQUISITION SCHEME= undefined
##.AVERAGES= 8
##.DIGITISER RES= 18
##SPECTROMETER/DATA SYSTEM= spect
##.PULSE SEQUENCE= zg30
##.SOLVENT NAME= CDCl3
##.SHIFT REFERENCE= (INTERNAL, CDCl3, 0, 15.7039)
##AUDIT TRAIL= $$ (NUMBER, WHEN, WHO, WHERE, WHAT)
$$ ##TITLE= Audit trail, XWIN-NMR		Version 3.5
$$ ##JCAMPDX= 5.01
$$ ##ORIGIN= Bruker BioSpin GmbH
$$ ##OWNER= she
$$ F:/spectra/data/she/nmr/H-F/1/audita.txt
$$ ##AUDIT TRAIL=  $$ (NUMBER, WHEN, WHO, WHERE, WHAT)
(   1,<2021-05-13 13:51:05.23 +0400>,<she>,<DPX200>,
      <created by zg, POWCHK disabled, PULCHK disabled
       configuration hash MD5:
       00 E9 B6 7A A2 85 ED C7 34 08 36 98 17 FE 4E 26
       data hash MD5: 16K
       1D B3 13 97 17 63 87 86 6E F4 9D BC B4 3F 69 77>)
$$ ##END=
$$ 
$$ hash MD5
$$ 66 AB 17 1F 6F 22 46 7C 28 EE DB 67 C2 D0 2B D8
##$RELAX= 
##$RELAX= 
##$RELAX= 
##$RELAX= 
##$RELAX= 
##$RELAX= 
$$ Bruker specific parameters
$$ --------------------------
##$DU= <F:/spectra>
##$EXPNO= 1
##$NAME= <H-F>
##$PROCNO= 1
##$TYPE= <nmr>
##$USER= <she>
##$AMP= (0..31)
100 100 100 100 100 100 100 100 100 100 100 100 100 100 100 100 100 100 
100 100 100 100 100 100 100 100 100 100 100 100 100 100 
##$AQSEQ= 0
##$AQ_mod= 1
##$AUNM= <au_zg>
##$AUTOPOS= <>
##$BF1= 200.13
##$BF2= 200.13
##$BF3= 200.13
##$BF4= 200.13
##$BF5= 200.13
##$BF6= 200.13
##$BF7= 200.13
##$BF8= 200.13
##$BYTORDA= 1
##$CFDGTYP= 0
##$CFRGTYP= 5
##$CHEMSTR= <none>
##$CNST= (0..31)
1 1 145 1 1 1 1 1 1 1 1 1 1 1 1 1 1 1 1 1 1 1 1 1 1 1 1 1 1 1 1 1 
##$CPDPRG= <>
##$CPDPRG1= <>
##$CPDPRG2= <>
##$CPDPRG3= <>
##$CPDPRG4= <mlev>
##$CPDPRG5= <mlev>
##$CPDPRG6= <mlev>
##$CPDPRG7= <mlev>
##$CPDPRG8= <mlev>
##$CPDPRGB= <>
##$CPDPRGT= <>
##$D= (0..31)
0 1.2 0 0 0 0 0 0 0 0.06 0 0.03 0 0 0 0 0.0002 0 0 0 0 0 0 0 0 0 0 0 0 
0 0 0 
##$DATE= 1620899464
##$DBL= (0..7)
120 120 120 120 120 120 120 120 
##$DBP= (0..7)
150 150 150 150 150 150 150 150 
##$DBP07= 0
##$DBPNAM0= <>
##$DBPNAM1= <>
##$DBPNAM2= <>
##$DBPNAM3= <>
##$DBPNAM4= <>
##$DBPNAM5= <>
##$DBPNAM6= <>
##$DBPNAM7= <>
##$DBPOAL= (0..7)
0.5 0.5 0.5 0.5 0.5 0.5 0.5 0.5 
##$DBPOFFS= (0..7)
0 0 0 0 0 0 0 0 
##$DE= 6
##$DECBNUC= <off>
##$DECIM= 32
##$DECNUC= <off>
##$DECSTAT= 4
##$DIGMOD= 1
##$DIGTYP= 9
##$DL= (0..7)
0 120 120 120 120 120 120 120 
##$DP= (0..7)
150 150 150 150 150 150 150 150 
##$DP07= 0
##$DPNAME0= <>
##$DPNAME1= <>
##$DPNAME2= <>
##$DPNAME3= <>
##$DPNAME4= <>
##$DPNAME5= <>
##$DPNAME6= <>
##$DPNAME7= <>
##$DPOAL= (0..7)
0.5 0.5 0.5 0.5 0.5 0.5 0.5 0.5 
##$DPOFFS= (0..7)
0 0 0 0 0 0 0 0 
##$DQDMODE= 0
##$DR= 18
##$DS= 0
##$DSLIST= <SSSSSSSSSSSSSSS>
$$ [...]
##$SUBNAM2= <"">
##$SUBNAM3= <"">
##$SUBNAM4= <"">
##$SUBNAM5= <"">
##$SUBNAM6= <"">
##$SUBNAM7= <"">
##$SUBNAM8= <"">
##$SUBNAM9= <"">
##$SW= 16.9725357007746
##$SWIBOX= (0..15)
0 0 2 0 0 0 0 0 0 0 0 0 0 0 0 0 
##$SW_h= 3396.73913043478
##$TD= 16384
##$TD0= 1
##$TE= 0
##$TE2= 300
##$TE3= 300
##$TEG= 300
##$TL= (0..7)
0 120 120 120 120 120 120 120 
##$TP= (0..7)
150 150 150 150 150 150 150 150 
##$TP07= 0
##$TPNAME0= <>
##$TPNAME1= <>
##$TPNAME2= <>
##$TPNAME3= <>
##$TPNAME4= <>
##$TPNAME5= <>
##$TPNAME6= <>
##$TPNAME7= <>
##$TPOAL= (0..7)
0.5 0.5 0.5 0.5 0.5 0.5 0.5 0.5 
##$TPOFFS= (0..7)
0 0 0 0 0 0 0 0 
##$TUNHIN= 0
##$TUNHOUT= 0
##$TUNXOUT= 0
##$USERA1= <user>
##$USERA2= <user>
##$USERA3= <user>
##$USERA4= <user>
##$USERA5= <user>
##$V9= 5
##$VALIST= <valist>
##$VCLIST= <CCCCCCCCCCCCCCC>
##$VD= 0
##$VDLIST= <DDDDDDDDDDDDDDD>
##$VPLIST= <PPPPPPPPPPPPPPP>
##$VTLIST= <TTTTTTTTTTTTTTT>
##$WBST= 1024
##$WBSW= 4
##$XGAIN= (0..3)
0 0 0 0 
##$XL= 0
##$YL= 0
##$YMAX_a= 190645
##$YMIN_a= -123793
##$ZGOPTNS= <>
##$ZL1= 120
##$ZL2= 120
##$ZL3= 120
##$ZL4= 120
##$ABSF1= 10
##$ABSF2= 0
##$ABSG= 5
##$ABSL= 3
##$ALPHA= 0
##$AQORDER= 0
##$ASSFAC= 0
##$ASSFACI= 0
##$ASSFACX= 0
##$ASSWID= 0
##$AUNMP= <proc_1d>
##$AZFE= 0.1
##$AZFW= 0.1
##$BCFW= 1
##$BC_mod= 2
##$BYTORDP= 1
##$COROFFS= 0
##$CY= 11.3945322036743
##$DATMOD= 1
##$DC= 2
##$DFILT= <>
##$DTYPP= 0
##$F1P= 15.9154993809931
##$F2P= -4.1035820241983
##$FCOR= 0.5
##$FTSIZE= 0
##$FT_mod= 4
##$GAMMA= 1
##$GB= 0.15
##$INTBC= 1
##$INTSCL= 1
##$ISEN= 128
##$LB= 0.24
##$LEV0= 0
##$LPBIN= 0
##$MAXI= 10000
##$MC2= 0
##$MEAN= 0
##$ME_mod= 0
##$MI= 1.114404
##$NCOEF= 0
##$NC_proc= 0
##$NLEV= 6
##$NOISF1= 3.799351
##$NOISF2= 2.8
##$NSP= 1
##$NTH_PI= 0
##$NZP= 0
##$OFFSET= 15.70392
##$PC= 1
##$PHC0= -11117.32
##$PHC1= 4.401
##$PH_mod= 1
##$PKNL= yes
##$PPARMOD= 0
##$PSCAL= 0
##$PSIGN= 0
##$REVERSE= no
##$SF= 200.130013532006
##$SI= 16384
##$SIGF1= 3
##$SIGF2= 2
##$SINO= 400
##$SIOLD= 16384
##$SREGLST= <1H.CDCl3>
##$SSB= 0
##$STSI= 0
##$STSR= 0
##$SW_p= 3612.71676300578
##$SYMM= 0
##$S_DEV= 0
##$TDeff= 0
##$TDoff= 0
##$TI= <>
##$TILT= no
##$TM1= 0
##$TM2= 0
##$TOPLEV= 0
##$USERP1= <user>
##$USERP2= <user>
##$USERP3= <user>
##$USERP4= <user>
##$USERP5= <user>
##$WDW= 1
##$XDIM= 8192
##$YMAX_p= 0
##$YMIN_p= 0
$$ End of Bruker specific parameters
$$ ---------------------------------
##NTUPLES= NMR FID
##VAR_NAME=  TIME,          FID/REAL,        FID/IMAG
##SYMBOL=    X,             R,               I
##VAR_TYPE=  INDEPENDENT,   DEPENDENT,       DEPENDENT
##VAR_FORM=  AFFN,          ASDF,            ASDF
##VAR_DIM=   8192,          8192,            8192
##UNITS=     SECONDS,       ARBITRARY UNITS, ARBITRARY UNITS
##FACTOR=    0.0002944,     1,               1
##FIRST=     0,             0,               0
##LAST=      2.4114304,     0,               0
##MIN=       0,             -123793,         0
##MAX=       2.4114304,     190645,          0
$$ Real data points
##PAGE= N=1
##DATA TABLE= (X++(R..R)), XYDATA
$$ [...]
2207a020J703j379Q52m5r16J263j190J175j219J254j012N85j11m81J105j515J775
2224H24j392J084q30M11j8p21J251j318J644j406R02m60q2N56o46O09q96J309
2242H21j282J203o71j42O08j225J537j564J545j163L51l54K93N45j191J408j015
2259b96J560j826J287n66n10J547j306Q36j581J327O4n47O01o58O24k203K976
2276A329j819O68k97o87J383r89J426j660J574j545J187p32J32M5m18R40j331
2293g94J131r47O47n4l91R66j403J758j613R12o21M33J23j73L15q56J229j501
2311h39J247m29k69L96p93J137j123J295j401J149q27K23R11j506J403j317J241
2328D98j025O05k26J30M56j354J862j629J225p64J23K17n07J120j390J262j113
$$ plain form
2207 -1020 683 -696 156 111 -805 458 -732 443 -776 478 -534 51 -60 -541 564 -951 824
2224 824 -568 516 -314 97 79 -642 609 -709 935 -471 431 -29 -111 445 -201 408 -488 821
2242 821 -461 742 71 -71 537 -688 849 -715 830 -333 18 -336 -43 502 -689 719 -296
2259 -296 1264 -562 725 159 -351 1196 -110 726 -855 472 536 -11 590 -68 556 -1647 1329
2276 1329 -490 178 -119 -806 577 -412 1014 -646 928 -617 570 -162 -30 15 -403 537 -794
2293 -794 337 -610 37 -17 -408 558 -845 913 -700 212 -409 24 147 -26 289 -567 662 -839
2311 -839 408 -21 -290 106 -687 450 -673 622 -779 370 -457 -234 677 -829 574 -743 498
2328 498 -527 78 -148 -18 438 -916 946 -683 542 -222 -99 118 -389 731 -659 603 -510
2345e10J211q57K21J06q73J474j443J390j249J066q63O02O7j074J494j653J596
2362G05j300J001m01r0J69p42J379j465J017q42M35R6k06M39r98J330j198J286
2380F15j092M28K45r35J348j436J398j255Q82m72M05R8p53J035j309J537j297
2397e58N44j67k93O61n72J031j311J451j554J082k26n63R63j012J270j258J269
2414G57j127O85p1n86J139j459J402j118Q21m39K85Q8o85J098j132J107j111R74
2432F28n57l3N19q47J123j380J318j195Q87m67j00P68j080R54j141J051p83P30
2450C95m49l05Q28j294J681j565J146j009N09J71o84P69j156J385j386J226q44
2467e82L35J07o71J008j112J328j063P84m61L14K59q84J106j410J565j108O55
$$ plain form
2345 -510 701 -156 65 171 -702 772 -671 719 -530 536 -327 275 342 -732 762 -891 705
2362 705 -595 406 5 -85 84 -658 721 -744 273 -569 -134 -38 -244 195 -803 527 -671 615
2380 615 -477 -49 196 -739 609 -827 571 -684 198 -274 131 229 -524 511 -798 739 -558
2397 -558 -14 -181 -474 187 -385 646 -665 786 -768 314 88 -475 488 -524 746 -512 757
2414 757 -370 315 244 -342 797 -662 740 -378 443 4 289 377 -308 790 -342 765 -346 628
2432 628 71 38 557 -290 833 -547 771 -424 463 -4 -104 664 -416 538 -603 448 -335 395
2450 395 -54 -359 469 -825 856 -709 437 -572 -63 108 -576 193 -963 422 -964 262 -582
2467 -582 -247 -140 -811 197 -915 413 -650 134 -327 -13 246 -638 468 -942 623 -485 170
2484A70j55j56Q74j367J387j335J424j065P39l53l59R93j133J268j399J192o91
2501C4K32J81o45Q38q94J031j242J027o65J74L46q00Q03p98Q83j200J196m33k90
2520b22N30r62J054j088R45n46M17l65l86J054j276J424j868J496j133P71Mk78
2538d29N04m92R15j530J353n93n6N62p37M99o24J105o20J86j11M1N04q80P10j188
2558h81J681j250J098j109%J007p15L36n73J491j841N15N5N64k96j66R34j304
2576d54Q92o57L38O7p29J101j657J956j652J313j7k06q64N03M37m31K47j421J309
2595G5l86J58K45m72Q42j065R23j064P59j08m86J182j356J385j608J255p47M12
2613e6n5k60N03m91O32o41J094j239N35J01l56P73j408J711j801J309l64n9K34
$$ plain form
2484 170 15 -141 733 -634 753 -582 842 -223 516 163 -196 797 -336 932 -467 725 34
2501 34 266 447 -198 640 -254 777 -465 562 -103 71 417 -383 420 -378 505 -695 501 68 -222
2520 -222 308 -654 400 -688 257 -289 128 -237 -623 431 -845 579 -1289 207 -926 -155 -151 -429
2538 -429 75 -417 498 -1032 321 -272 -328 234 -503 -4 -628 477 -143 43 -68 -27 477 -403 307 -881
2558 -881 800 -450 648 -461 -461 546 -169 167 -406 1085 -756 -241 -186 378 82 -84 850 -454
2576 -454 438 -219 119 186 -543 558 -1099 857 -795 518 501 295 -569 -66 371 -60 187 -1234 75
2595 75 -311 -153 92 -380 462 -603 320 -744 15 -93 -579 603 -753 632 -976 279 -468 -56
2613 -56 -111 -371 132 -359 273 -368 726 -513 22 123 -233 540 -868 843 -958 351 -13 -72 162
2632A62n40P56r90J126r22P89m72j55O83p76J183o53N83r40N21k50l07P15p57
2651b44P56j019Q15q21M65O60q54Q43j223J122j130Q80m84J74Q5l06Q64j163Q95
2670C15r76Q47j29l01M63p11R88j080J072r72N55m28L3Q25j250J291j306J232
2688D68r74Q55n76j33R88j315J279j110J070q70K02J24k92P40j095J535j474J005
2706D27n25k5N75p19Q65r90J273j187R02p19O6Q35j060O93n47P67r03O56j54j67
2726F3M90j085J331j023P87o97L60j50k72Q42j172J274j293J126r14L09K82o99
2744d41R49r03R79j130P68l09j95N47r11J388j564J368r36K55O6r8L92q37J165
2763E53j176Q45n75M59J1k73Q16j463J486j279J251j109P53k87n72J055j269J594
$$ plain form
2632 162 -378 378 -612 514 -408 381 -91 -246 437 -339 844 191 774 -166 355 105 -202 513 -244
2651 -244 512 -507 308 -513 -48 612 -242 601 -622 500 -630 250 -234 -60 25 -281 583 -580 315
2670 315 -661 186 57 -244 219 -492 496 -584 488 -484 71 -357 -324 501 -749 542 -764 468
2688 468 -506 349 -227 -360 628 -687 592 -518 552 -318 -116 8 -284 456 -639 896 -578 427
2706 427 -98 -123 452 -267 598 -392 881 -306 596 -123 -57 778 -282 411 -136 631 -272 384 230 63
2726 63 553 -532 799 -224 563 -134 226 76 -196 646 -526 748 -545 581 -333 -24 258 -441
2744 -441 508 -395 584 -546 222 -87 -282 265 -646 742 -822 546 -390 -135 -69 -167 225 -612 553
2763 553 -623 222 -353 106 117 -156 660 -803 683 -596 655 -454 299 12 -560 495 -774 820
2781H20j156P22l09L03op90R69j108J352j151P32j74j76K36o82J131j282J442
2799H73j149Q12k73l57P70r56R23r30R50o14L82k28l29R68j359J183j284Q76m44
2818a86J63K31o26R03j354J526j231R17n44J12L03q13J081j246J350j173P13m07
2836b81N9M44q84Q30j048J500j323J169k71Nk40o86J416j654J314p46M54l5l68
2855c45J083j258J364j433R50n79L17Q3m22Q77j100J096j044J040n65m1L24p37
2873c90Q89j133J281j065Q32n71jP14r86Q92r16Q87o88L56k77m07J170j180J178
2892E85j011J167j068L85R8n56Q30j264J240q86N73m28J07K48m40P84j316J383
2910D31j117R28l13j25O14j006J168j311R11p45N42p7k91Q39j192J335j025P65
$$ plain form
2781 820 -336 386 77 380 374 -416 553 -555 797 -354 378 204 28 264 -418 713 -569 873
2799 873 -276 536 263 -94 676 -280 643 -287 663 49 431 203 -126 842 -517 666 -618 258 -186
2818 -186 -23 208 -418 485 -869 657 -574 343 -201 -89 214 -599 482 -764 586 -587 126 -281
2836 -281 -222 222 -662 168 -880 620 -703 466 195 200 -40 -726 690 -964 350 -396 58 23 -345
2855 -345 738 -520 844 -589 361 -218 99 182 -240 637 -463 633 -411 629 64 23 347 -390
2873 -390 499 -634 647 -418 414 -157 -158 556 -430 462 -454 433 -255 101 -176 -583 587 -593 585
2892 585 -426 741 -327 58 156 -400 430 -834 406 -480 93 -335 -228 20 -420 364 -952 431
2910 431 -686 242 -71 -196 418 -588 580 -731 180 -565 -23 -100 -391 448 -744 591 -434 331
2928C31o22L30p2m03Q28j004J129j058Q22m17J59J28n11Q72r62J049r27O21n99
2947c06J99M18p02J192j491J490j027L26m4L9K18q31J077j346J421r42N39n3n67
2966c90O40q76J325r74P20q15K97N4k75O79j038R02q55Q17p38L70K30o28J016
2985D61j440J691j030N65l18k56N82r17J248j219J145r11P11m01j14N15q13Q45
3003C44q14Q31o81M88K8n47P20r04J030q61N63n49N14K55o34N68p13J014j260
3022f08J091l71k56N65n94O85q65J110j001O34m72p4M56o30R21j219J296r04M47
3041B11J4k75L59r49J273j004P95r63O85k5l63N74o96O99q36P48m78K88J41r65
3061g67J110j045J218j107Q33l72L6K60o71J054j116R37n99M69m61K5O32q49J134
$$ plain form
2928 331 -291 39 -33 -436 392 -612 517 -541 281 -136 23 151 -360 512 -450 599 -328 293 -306
2947 -306 -107 311 -391 801 -690 800 -227 99 55 94 312 -519 558 -788 633 -309 230 177 -390
2966 -390 250 -626 699 -275 445 -370 -73 -19 -294 385 -653 249 -606 211 -527 -157 73 -555 461
2985 461 -979 712 -318 247 -71 -327 255 -662 586 -633 512 -399 312 -89 -203 312 -501 344
3003 344 -470 361 -320 168 196 -351 369 -535 495 -366 197 -352 162 417 -217 351 -362 652 -608
3022 -608 483 112 -144 421 -173 512 -353 757 -244 390 -82 -156 300 -330 591 -628 668 -236 211
3041 211 225 -50 309 -640 633 -371 424 -539 146 121 -242 332 -364 335 -501 247 -231 57 198 -767
3061 -767 343 -702 516 -591 242 -130 -94 166 -505 549 -567 370 -229 240 -221 -196 436 -413 721
3080G21j164R99r04L77J61m40P94j084J103j179R82m72J17M9k14J017j329J114
3098F48r83N64l37J60K05m59P41q03P93q78O46j04m30O31p96J040j271J117q01
3117c17N08j28j6M42r84J162j294J163q29N06J1o83Q47j079R54p52P40p00L33
3136a16L60p14P33j057J126r05Q11k87k93O08r00J025j056J184r83M43L9l77P11
3155C52r56J064j276J451p68R1K24r8M39r55P79o79Q18p65M78J54n86P70j145
3174f08J267r28O67m17J65O8o38Q06r20J048q22M16j17j16O36q60Q60r85R81p40
3194b37M35r9k63N21j065J174j183J190p69L56J09n04N86p18J043r28N16o35N7
3213d14O35o42N60r63J251j145Q46m06n7N52p38O82q17J235q70M98l24j6M97r58
$$ plain form
3080 721 -443 556 -348 29 190 -250 544 -540 563 -616 366 -106 11 60 -154 863 -466 648
3098 648 -335 229 -108 52 257 -202 539 -264 529 -349 297 193 -237 394 -402 638 -633 484 -317
3117 -317 191 63 47 489 -495 667 -627 536 -293 213 224 -459 388 -691 263 -489 251 -449 -116
3136 -116 244 -470 263 -794 332 -573 238 -49 -342 266 -634 391 -665 519 -464 -21 18 -359 352
3155 352 -604 460 -816 635 -133 -42 182 84 523 -432 347 -332 486 -279 199 353 -233 537 -608
3174 -608 659 -269 398 -19 146 214 -424 382 -538 510 -312 104 -13 -129 507 -353 507 -478 503 -237
3194 -237 198 99 -164 357 -708 466 -717 473 -296 60 169 -335 251 -467 576 -352 164 -471 -414
3213 -414 221 -421 139 -824 427 -718 128 -278 -335 217 -521 161 -656 579 -291 207 -117 -133 364 -594
3233e94J093r83P80m30L70j29o01Q77p22J070j028O20n60K79l0m67R24p56J047
3252G60j215Q14n50K64J38o55Q52r46J200r11P14o10j45Q33q67P86o92P34o76
3271a72M05r3m44M91p84J128j045O85l42L16J09p75P77j029J154j084R58p00K79
3290a66N06q59J154j117Q40r94Q86m01r9O14j193J175q25R51r80P13j82k92P59
3309D90q09Q24r88J013p35K77L5m62Q05n73R25j065P30m46K19N2n03Q08r06R32
3329F23q57M49k89K23L64r86P92o61P86o72M51k20j20N15n33O59r48J116q97M21
3349B16j48l63O76r29J052r72R45n37K20q2m60O88q71Q12p84Q01n36M1L17n19
3369d33Q74j129J214j069O53k55J58K07n91O61q20P67n48N56l70K03R2n43P36
$$ plain form
3233 -594 499 -484 296 -134 236 107 -494 383 -339 731 -297 323 -237 42 12 -455 469 -287 760
3252 760 -455 359 -191 73 211 -444 408 -538 662 -249 465 -145 -290 543 -324 462 -230 504 -172
3271 -172 233 140 -304 187 -597 531 -514 171 -171 145 254 -521 256 -773 381 -703 255 -445 -166
3290 -166 340 -519 635 -482 358 -636 250 -151 -250 364 -829 346 -479 472 -508 205 23 -269 490
3309 490 -319 505 -483 530 -205 72 107 -355 450 -123 802 -263 467 21 240 292 -211 597 -309 623
3329 623 -234 215 -74 149 513 -473 319 -342 444 -228 223 3 -117 398 -135 524 -424 692 -205 216
3349 216 68 -295 381 -548 504 -468 477 -60 160 78 -382 306 -565 247 -537 264 -272 -231 86 -433
3369 -433 441 -688 526 -543 110 -145 13 220 -371 290 -530 237 -311 245 -125 78 170 -373 363
3388C63o16O61q11M02O6k23O80r28R85r55P93o93L27K92l15n0m63J053j058R45
3408D55n88K12J93m26O80j105J058q26O09n20R8N20p39N38o61O94n57L98M8k88
3428b07L09o34R36r28R67o49J29K44o26R73j088J135j178Q05l55J40J23l75M23
3447A44q99Q91l68J69l43J65L29n53O71p02O40m81L20J13j91M27o56P83q07P84
3467D36o98K47K50m03K52m99Q13n99M39k05O7l9l77P30q74R22p16N12k37OK82
3488C09o73R54j105R12q30N51k1l14M73p78J046q84Q07q76M43q1n8M09p89N95
3508I0o28P60m21J30J5OK46m82O19q41O37l43j4K0k61P31o46J004q48M23m63L92
3530A26J01k24K10o41Q18m53K00k6k83N58o61R21q24N04m58L15K2l49M80o75P42
$$ plain form
3388 363 -253 408 -403 -1 65 -158 522 -406 579 -376 417 -276 51 343 28 -22 -485 568 -490 455
3408 455 -133 79 272 -154 526 -579 479 -347 262 -258 -160 360 -379 159 -502 192 -365 33 81 -207
3428 -207 102 -532 404 -524 443 -206 -77 167 -459 514 -574 561 -617 188 -167 -27 96 -279 144
3447 144 -755 136 -232 -63 -406 -241 88 -465 206 -496 144 -337 -17 96 -95 332 -324 459 -348 436
3467 436 -262 -15 235 -168 84 -415 398 -201 238 33 100 61 -316 414 -460 462 -254 258 21 27 309
3488 309 -364 590 -515 397 -433 118 97 -217 256 -522 524 -360 447 -429 14 -67 -125 284 -505 90
3508 90 -538 222 -199 -69 -54 -48 198 -284 335 -506 131 -212 -226 -206 -467 264 -382 622 -226 197 -266 126
3530 126 227 3 213 -428 390 -63 137 111 -172 386 -275 646 -178 326 -132 183 205 -144 336 -339 403
3551D03q68J010o37J31L37n73N65p79Q32q06O78m35O5L70n26O38p65Q33p95L22
3571@J59n4J26p07P91n03N13n00J55P3j83L21n56P64q81N31m35L00q2k34Q83r16
3593d35P02q42O64j88N5M2k82L99n91O94m05L04l10M20k2k64M08q15O43k99K63
3614A41k53L5K92o37R23q97Q64o52K78m9j93O94q18P71q88P92m97N56k22l10M15
3635C45n88Q12r54M36k28J00L50m16L90o17N14n35P17l09p5K36j67J18m52N13
3655A90n70L52J8j33J77n64R96p39L73k77K55j20J73K45m31J69l12K49m52L95
3675fJ29l13O00p05O97n46L25j38n3J69n18P47n83M93l84L76j29l06N12o17N52
3696C02p17O20k72L35k37j58M63o16O98p44Q60p33K09L8J50%l61L02l92L01J41
$$ plain form
3551 403 -465 545 -92 39 376 -197 368 -411 421 -385 293 -142 -77 293 -233 405 -360 473 -322 0
3571 0 159 105 231 -476 315 -188 325 -175 -20 53 -130 191 -365 399 -482 49 -386 -86 -168 -402 481 -435
3593 -435 267 -575 89 -99 -44 -2 -284 115 -476 218 -187 117 -193 227 205 -59 349 -466 177 -122 141
3614 141 -112 -77 215 -422 501 -396 468 -184 94 45 -148 546 -272 499 -389 403 -94 462 240 -70 345
3635 345 -243 569 -385 51 -177 -77 273 -143 247 -370 144 -391 326 17 -58 178 11 129 -323 190
3655 190 -380 -28 -10 -143 34 -530 466 -273 100 -177 78 -42 131 376 -55 114 -198 51 -401 -6
3675 -6 123 -190 410 -295 402 -144 181 43 -10 159 -359 388 -195 298 -86 290 161 -145 367 -250 302
3696 302 -415 205 -67 268 31 -127 336 -280 418 -326 534 -199 10 48 198 198 -163 139 -253 48 189
3717A89n9J46k80L16n50P42n56L91k09J19j85l48M90n86P04m07m0N2N4J26q57
3738g48R94m92M65o10L33N3k59M64q05O42m41P00n39L21nk08N10p67P31n83L72
3759A28k07J65J63m67N30n80K98r3K99l41j25L23k04M13n24N66n70M53j79J4K14
3780B76p00Q05n47M08m74L95l6k58N53o48L83m25M17l23K28nl59N32q71J022m35
3801f2J67k13L7L95p46P40q26Q68l88K55l38k8J73m81R64p95N98l89J36q0l98
3822d11O44m50N03m43M43l94J70j10k23N84o81P19p46M26J8k1p3l61O04m01N83
3843C80n91K88k12N4J34k13N81q86Q60n38PM2j30M09o11R29q40N61j38N2j13p1
3865d6K70l94M45m78K83k59L91j06l78N88n95P39n80M28l53J82O6l74K3j83O38
$$ plain form
3717 189 130 276 -4 312 -238 504 -52 339 130 249 64 -284 206 -380 324 -83 -123 -71 -17 109 -748
3738 -748 246 -246 219 -391 -58 -5 -264 200 -605 37 -404 296 -243 78 73 -135 375 -392 339 -244 128
3759 128 -79 86 249 -218 312 -268 30 -63 236 -105 -230 93 -111 302 -222 344 -226 227 48 62 276
3780 276 -424 381 -166 242 -232 163 127 -131 422 -226 157 -268 149 -174 54 49 -310 222 -649 373 -62
3801 -62 105 -108 -71 324 -422 318 -508 360 -28 227 -111 -139 34 -447 517 -278 320 -69 67 -13 -411
3822 -411 233 -217 286 -157 286 -108 62 -48 -271 313 -368 351 -395 31 49 28 -45 -406 198 -203 380
3843 380 -211 77 -135 -81 53 -160 421 -465 395 -143 -136 -94 -224 185 -426 503 -337 224 86 138 25 -46
3865 -46 224 -170 275 -203 80 -179 212 106 -272 316 -279 460 -120 308 -45 137 203 -171 -148 -331 307
3886C07m40J35n0j97M78n26M91o85N51m67N86j30j17K39n01N25n69O32n98M01
3906F5j98k37M37j66N29p27N79m10Q3Pm44Q32o83N69m84O41j81j15K81n64N35
3927C49n18L51m01M79k48%l4p2M46p21O19l17P3j09PK02n93N90k36M80m88L51
3949B10J6n88O46m71N22o75L72j60J27J12l94L97k94N46p04N68l44J10J45n84
3969d43P79p41M95m19M26r3k55L15l51N56o17O58o26J76J70l26N62n93M31m79
3989c75P76l49K21m9k09M30n88L99n38L95r6j19M95o71O45n38L93k47K05l1k59
4010a10M78o57P73o97O04n89L43l08r7M19m44O08o03N09k24j45J81j99N78p59
4030c39M00l73N98l93O7n0k21L15l03N64o44L47k51L13M2k34P12r75P53k87K39
$$ plain form
3886 307 -133 2 -48 -245 233 -293 198 -487 64 -403 183 53 -64 175 -326 199 -370 262 -336 65
3906 65 -133 -370 67 -99 430 -297 282 -128 -45 -38 -482 350 -333 236 -248 393 212 97 378 -186 349
3927 349 -169 182 -219 260 12 12 -22 -94 352 -369 250 -67 6 -103 -96 106 -487 103 -133 347 -141 210
3949 210 226 -362 284 -187 335 -340 32 -128 -1 111 -283 114 -180 366 -338 230 -114 -4 141 -443
3969 -443 336 -405 90 -329 97 4 -251 64 -287 269 -348 310 -316 -140 30 -296 266 -327 104 -375
3989 -375 401 52 273 224 15 445 -143 256 -282 113 17 -102 393 -278 367 -171 222 -25 180 149 -110
4010 -110 368 -289 484 -213 391 -198 145 -163 -260 159 -285 323 -280 229 5 -140 41 -158 420 -339
4030 -339 61 -312 286 -107 -40 -90 -311 4 -299 265 -379 -32 -283 30 72 -162 550 -425 328 41 280
4051B80m25K8J94k30L18m73O68m70J80K8j47L56p14M89l69M27j36J17o5l27L74
4072A03m02P20o00L93m18J86K34l84N25n51N39l04J64k25k81N44n43O84m25L13
4092B72p4Q0j46m16M26l46O81o29N43m35jJ91k91L63n16M83l80J97j05K70k22
4113e5k83M49n98O92k15Kp1K04n0k41K39l66N29m46K67p0rJ65m89N95m80M06j92
4136a7j4J94r3L51p37M38l57N32m40q3K94k54N41n16M54o06N84m66K70L4m30P94
4158D73p38N00m78M87k69J9J18k19M76o45M68m26L05n7j48L54m31O53o40L47l11
4179a62L96j18l50L25k15P37j109M47J5K05k30o19J283q56K42k54j89J4L13m10
4199e35R22k01o15Q42j017M61M70m83K91m96K91M0J78j47m61R68k14k37p76J106
$$ plain form
4051 280 -145 -117 77 -153 165 -308 360 -110 70 98 -49 307 -407 82 -287 140 4 121 56 -271 103
4072 103 -299 421 -179 214 -204 -18 216 -168 357 -194 345 41 205 -20 -301 243 -300 384 -41 272
4092 272 198 278 132 -284 142 -204 477 -152 391 -44 -45 146 -145 218 -298 185 -195 2 -103 167 -55
4113 -55 -338 111 -487 205 -10 -8 -79 125 75 -166 73 -293 236 -210 57 -13 -22 143 -346 249 -231 175 -17
4136 -17 -31 163 70 421 -316 122 -235 297 -143 -226 68 -186 355 -161 293 -313 271 -195 75 109 -321 473
4158 473 -265 235 -243 244 -25 -6 112 -107 369 -276 192 -234 71 14 -134 220 -211 442 -198 149 -162
4179 -162 234 116 -234 91 -124 613 -496 -49 -34 171 -59 -678 605 -251 -9 -263 -452 -438 -125 -535
4199 -535 387 186 -429 413 -604 -143 327 -156 135 -361 -70 -30 148 1 -460 508 294 57 -719 387
4219C87j299J324Q1o70k57O36L25j520Q04K36L53p46q5L88o81J656j111P90p53
4238a42J16k27R4K20q62O35l51M76P1k55j6K33J68n95N12o06O89j76O5j41R0L09
4260C07o66O97p02M69k77L6J94l05L69m65M41m09M96l68K83o3m36Q35n43J03m10
4281d14L24OP9K03m79N52p79O34k34O3k01J44K78l78L43m83O40m88K72j60k71
4302c49O98m77N51p12M83j67j83J65l08L98n85O18k97J29lj15L53l86M30n82N88
4323B49n80L87j31r1K51m03N69p29O33j04p7Q9j47N23p45O80n54N20m13k0K48
4344A55l04L87m95N83p68P19n53K74M2l68K82k27N00l52p4J35n5K97l24M55o43
4365c34N72l91J52K02m62M87l75P55p18M75n07L08j27N8K72o54P98p13L31l41
$$ plain form
4219 387 -912 412 493 -177 -434 202 527 -993 -189 47 400 -346 -431 -43 -724 932 -179 611 -142
4238 -142 -26 -253 -159 61 -801 -166 -517 -41 30 -225 -241 -8 160 -435 77 -529 160 -16 49 -92 -2 307
4260 307 -359 338 -364 105 -172 -136 58 -247 122 -343 98 -311 185 -183 100 37 -399 436 -107 -4 -414
4281 -414 -90 -84 -5 198 -281 271 -508 126 -108 -45 -246 -102 176 -202 141 -342 298 -190 82 -78 -349
4302 -349 349 -128 423 -289 194 27 -156 9 -299 99 -486 132 -165 -36 -39 -154 199 -187 243 -339 249
4323 249 -331 56 -75 -166 85 -318 251 -478 155 51 -26 63 -84 439 -306 374 -180 340 -73 -93 155
4344 155 -149 238 -257 326 -442 277 -276 -2 40 -328 -46 -273 227 -125 -199 -64 -119 178 -146 309 -334
4365 -334 238 -153 -1 201 -261 226 -149 606 -112 363 -144 164 37 95 367 -287 511 -202 129 -212
4385b12K29j48J07K22k77N46n95K42k23q7J17j76K43k77O40m18K10j51j55J94
4405C1k27L85p58R83n49O5j4QM12q47N78j96J68m83O03q9k55L80n09O32n13N30
4427C35m87K84J0n31N20n19O20k42K62k91QJ28l14M65m83M40k01K20j94n2L80
4448C58n19M78o02M48q5J57l81l9M37m78O23n14L09k04R3L26n83O33n72J74j94
4469a35M80n04j02K50k09L01m28P79n38K73j7n7j32L9P5l14M18k85N0J46l58M35
4491A67o25N62l10M0m4K76j4n12O78o41O34m10L22l26K62r6j47M31m78N78p60
4512d13M72j56K01J76n23M62l05J92l48M82m59J83L42l63L63m64M66l31J8J39
4532A34l11M97l24M06n40O72p47j3K32k86L14j43M15l49M55l25oQ7n77O36m32
$$ plain form
4385 -212 17 -131 -24 198 -79 467 -128 114 -109 -196 -79 -255 -12 -289 351 -67 143 -8 -163 31
4405 31 -196 189 -569 414 -135 -70 -84 -76 336 -511 67 -129 39 -444 159 70 -185 195 -314 318 -195 335
4427 335 -152 132 142 -389 131 -388 232 -10 252 -39 -31 97 -217 248 -235 205 4 224 30 -22 358
4448 358 -161 317 -285 163 78 235 -146 -185 252 -226 397 -117 192 -12 81 407 -176 457 -115 59 -135
4469 -135 345 -159 -261 -11 -220 81 -347 432 -106 167 150 93 -39 0 75 -239 179 -106 -56 90 -268 167
4491 167 -458 104 -206 -166 -210 66 52 -460 218 -423 211 -199 123 -203 59 -37 -184 247 -231 347 -413
4512 -413 59 -97 104 280 -243 219 -86 106 -242 240 -219 -36 306 -57 306 -158 308 -23 -5 134
4532 134 -177 320 -4 402 -138 534 -213 -226 6 -280 34 -109 306 -43 412 87 81 168 -409 227 -205
4553b05M36l21J68k40M5L10l41M43n61M70k56M2j10j51L88l01N20o13M78m20M04
4574A85K2l61L37n19M59m53K77j74J45K73m24M54n33M11k16M87j69k99L90k86
4594FK70o58Q45o80K32k55R3L14j98M61p97L67j48M93l64J24Ok18L61n44M66k89
4616a13L29k19l16N57k10J16k58L64m23J87k6j33M24n06M39l83K92j46o5O2k26
4637b54N42n41K52k92J46J98J08Ll13K60l03K91l13J92R2j49J92n07K94k11M75
4658A62k27L8nm3K97l92L33m27J87R1l4J21m00O64o22L37j20J07J0l37L84j86
4680f2K80m09N89l97J85q0k21L52m50O01o29M52l61N9L18o00R65p71M66n16K27
4701bn1J64q5j54M12l79M90n38J99l2o2J5k00M57l40K39k91K27j19M3K09m13K61
$$ plain form
4553 -205 231 -90 78 -162 -117 193 -148 295 -266 204 -52 -10 -120 -271 117 -184 336 -277 201 -219 185
4574 185 207 -154 183 -336 123 -330 -53 -227 -82 191 -233 221 -312 99 -117 370 201 -98 292 6
4594 6 276 -382 463 -217 15 -240 -147 167 -31 430 -367 0 -148 345 -19 105 111 -107 254 -290 176 -113
4616 -113 216 -3 -319 238 28 144 -114 250 -173 14 -12 -145 279 -227 212 -171 121 -25 -90 -28 -254
4637 -254 288 -253 -1 -293 -147 51 159 162 -151 109 -194 97 -216 -24 68 -81 111 -396 -102 -313 162
4658 162 -65 -27 -32 -75 222 -170 163 -264 -77 14 -20 101 -299 365 -257 80 -40 67 77 -260 124 -62
4680 -62 218 -191 398 1 186 106 -115 237 -213 388 -241 211 -150 -91 227 -373 592 -179 287 -229 -2
4701 -2 -53 111 26 -128 284 -95 395 -143 56 24 -38 -23 -223 234 -106 133 -158 69 -50 -7 202 -211 50
4724E0k54M10m89K32p8J17K14k29J85j38P1j15mqq2L31l44L26l70L76l04q4J68
4747a9k99N88m64O50m12J37M1m69M65k41K98k16M68m29M3j59o6J23j15K44r4N
4769G9j84K2O1j82L63k12k1K47J9l36J00J50M0q1j91K90j90J47k16L7J85l61M15
4792A81l98L67k02J84M1m7k7l84O69o34K95l12M17l66K7M03k07J64o26O89k99
4813f5L60n9n10L23n77P42l23J49j05K13R7k76M55p22N58l95K78k51J57J56m46
4834b41N05n96L60l3Rk18R6K87k49M29o60M63k85M75j42j23K71o08N85o08O05
4855C22k06j69J76k94K01j92K81m92O23o48K29J83l98N52k27J18l8P7j97N1o1
4876a09j61O57o27N52l86K4j04R1K83m83M78m63K70j20J46l26K33J71k78L16j90
$$ plain form
4724 50 -204 206 -283 -51 -129 -12 202 -27 158 20 91 -24 -28 -36 -118 213 -131 195 -175 201 -103 -187 -19
4747 -19 -318 270 -194 456 44 181 222 -247 218 -23 275 59 527 98 141 -18 -84 39 -76 168 74 79
4769 79 -105 -83 -22 -204 159 -53 -74 173 192 -144 -44 106 146 65 -126 164 -26 121 -95 -58 127 -234 181
4792 181 -217 150 -52 132 173 126 99 -285 384 -250 45 -267 150 -216 -189 214 7 171 -455 234 -65
4813 -65 295 236 -274 49 -528 214 -109 40 -65 148 245 -31 424 -298 260 -135 143 -108 49 205 -241
4834 -241 264 -332 28 -5 4 -214 -118 169 -80 349 -311 152 -133 342 200 77 348 -260 325 -283 322
4855 322 116 -53 123 -171 30 -162 119 -373 250 -398 -169 14 -384 168 -59 59 21 98 -99 -48 -109
4876 -109 -270 387 -240 312 -74 -50 -154 -63 220 -263 215 -248 22 -98 48 -278 -45 126 -152 164 -26
4897b6J27L2l8q0l5K7r4K42k05L07m60J06L58k90M43o59N50m32j2J3J20L37m57
4920a26L10m42M70l15Q5nJ36K04o48N26l61L22J69m52L53n67O19m67M03k13R1
4941I2j39q6M42n61L51k96K58k93J61l2l0K89p36Q69l59L98l99K16Rk6j9l39M97
4964B67j53K16l56K39j24j91N98p25N49m06Q3R2k1J37k43L57l91J03p9m0M11M7
4986C70j31l52M04m40M81m07J1k06K42L16n25N49n79M25l50K27J9L6J24k74J51
5007I1k25O4l5M1J72m56N11m30M76j52J73m06R6o9N3J71m45K48j36L03j46kj6
5030a19J37K33o77N72k72K37qj00K25p76Q13o10L56k25K77l8l05M33m68N55m40
5051b00K37K9oJ09l10J74m48M88l22M82k67J12R8l37M42m75N21m39P1n9J07K43
$$ plain form
4897 -26 101 133 95 15 -20 7 -87 155 -50 257 -203 -97 261 -29 414 -245 305 -127 -139 -126 -6 331 -126
4920 -126 184 -258 212 -103 -18 -23 113 317 -331 195 -166 156 325 -127 226 -341 278 -189 214 1 92
4941 92 -47 -133 309 -252 99 -197 61 -232 -71 -103 -133 156 -580 289 -70 328 -71 145 154 128 109 -230 267
4964 267 114 330 -26 213 89 -102 496 -229 320 -86 -3 89 68 205 -38 319 -72 31 -48 -88 323 370
4986 370 239 -113 291 -149 332 -75 -64 -270 -28 288 -237 312 -267 158 -192 35 54 90 214 -60 91
5007 91 -134 -70 -105 -64 108 -348 163 -267 209 57 230 -176 -80 -149 -96 75 -370 -122 -258 45 -101 -103 -119
5030 -119 18 251 -426 146 -126 111 103 3 228 -548 265 -345 11 -214 63 25 -280 153 -315 240 -200
5051 -200 37 66 60 169 -141 33 -415 73 -249 233 -34 78 176 -161 281 -194 327 -112 -41 -100 7 250
5073B50m64M97j64N0j84K65k82mK95m96O51p03K03l2M8J54j76M79o24M48j58J81
5095B34l28J79J68l97K85m37L41k02K10k29p5M59l37L03k44L58n67N50j3l14M56
5116D00m81J62l20O07l15k6r8k60Q05o64M89j44p7r2L5O0k81M57l89K94l46M30
5138B46l77K00Q0k18K57l33L93l38J73k82J12L78o08M55k05J04l1j29J1J38R8
5159A24l35K86k49L43j25j01K0j30K99k88K35k71M06l76J79J15l51L62l30o8K2
5180b33L36p0n03M87k36N53o43K45k81L58q2j06L97l27M05m59K80j85m5J33k04
5201a80O15p93N00k32n6J01Mrk58M39l98N70m55L40j77q0L05n39L91k22K56k70
5223a48J71k53K83J32k47K42k75L02j72R9j19l01M84p0K08n43M17j67r0Qj06M63
$$ plain form
5073 250 -214 283 119 169 -15 250 -32 -36 259 -237 414 -289 -86 -118 -70 84 -92 387 -237 211 53 234
5095 234 -94 85 253 -144 141 -296 45 -157 53 -176 -251 208 -129 174 -70 288 -279 271 258 -56 400
5116 400 -81 81 -239 368 53 27 -71 -331 474 -190 299 155 78 -14 21 81 -200 257 -132 162 -184 246
5138 246 -131 69 149 -69 188 -145 248 -90 83 -199 -87 291 -317 138 -67 37 6 -123 -112 26 124
5159 124 -211 75 -174 169 44 -57 -37 -167 132 -156 79 -192 214 -162 17 132 -219 143 -187 -255 -233
5180 -233 103 33 -470 17 -219 334 -309 -64 -345 13 -69 -175 222 -105 300 -159 121 -64 -109 24 -180
5201 -180 435 -358 142 -90 -146 -45 -41 -50 -308 131 -267 303 -152 188 11 -69 236 -303 88 -134 122 -148
5223 -148 23 -230 53 185 -62 180 -95 207 35 134 15 -286 198 128 336 -207 210 43 -47 -39 -145 318
5245C18o34P65p16L25n6o3J19l61N20m26N14o18M61k86R4q6j39N14l12R8j47J29
5267A3j13K38J82n05L66k97K79m54M81j73j92K41o9L30m81L83k78kJ8q9J37M5
5289F0J64l34L68j67j08K08l59J75o9J05k17M07j04j27k4k08N15o50N32l25J19
5310c9k91J54K76l55L20l64M44k39J15K18m07J9OJ92l94N65q6k36L82l88L19m34
5332b23M99m69J36K1J32l32n8L33k39L54m51M08O6j51J91l99K62j89L23o8k28
5353h2K82j62K07m77K84l90L91k5J0j88N2L88o46N11l86M51k71J74J32o18Q05
5374D42n15K04l08K04j05J59J17p8Q4n14N48k21K62l29j72N11n12K96j28K05l76
5395b26K38k4J1J67o01P27n05M08k87mo6L6K03m94M22r9K77j0m33N11l80L04m60
$$ plain form
5245 318 -316 449 -267 58 2 -61 58 -303 217 -209 305 -313 148 -138 -44 -130 -269 245 -67 31 -116 13
5267 13 -100 138 320 -185 181 -116 163 -291 190 17 -175 66 -3 327 -154 229 -49 -51 -33 -122 15 60
5289 60 224 -110 258 91 -17 191 -168 7 -62 43 -174 233 129 2 -22 -230 285 -365 167 -158 -39
5310 -39 -330 -176 100 -255 65 -299 145 -94 21 239 -168 -149 -143 49 -345 220 134 -102 280 -108 211 -223
5332 -223 276 -193 -57 -36 96 -236 -294 39 -200 154 -297 111 177 26 217 -182 80 -109 214 146 -82
5353 -82 200 38 245 -232 52 -338 53 28 38 -150 -98 290 -356 155 -231 220 -51 123 255 -363 442
5374 442 -73 131 -177 27 -78 81 198 120 204 -310 238 17 279 -50 -222 289 -223 73 -55 150 -226
5395 -226 12 -12 -1 166 -435 292 -213 195 -92 -96 -162 -126 77 -417 5 -94 183 173 -260 251 -129 175 -285
5418b85L02k54J65J93k40K14m51L86l21N72m97L10n5j31J70k03J96j78Q4N8k2
5439A3N6Oj71p8L68l30N33m83J35J14l09K04m74N59j27Q0k25o8M01l04M92k76
5461A16P0l89R3k41K33K48k49L54n66L95rJ50l42q7O18r41Q03l73M09k15K30m64
5483a57Q9N4K2J15j37J81k12j53L82l66M23m50L54j87k3K30k40K13j69J48n18
5504d01N92k41Nk19L3L64j45K35m06L15j5j03n4K2L07m36n1Q4L69k76q9K28p6
5527D2J72m63O52k92j17M6k65M74n28M43k88J81J0pm76K74J97j92L01l65K95j29
5549c5K2p4J37J14l74K96j98K18r9R2rl64K96k46L44j17M0k91L00J14k03K96l85
5572a26J59j54J90j57k7L61l09J15j71J05k34K41J73k25K9k04J72k9J55p5J82
$$ plain form
5418 -285 17 -237 -72 121 -119 95 -356 30 -291 281 -216 94 39 -92 78 -125 71 -107 -23 35 13
5439 13 69 75 -96 -174 194 -136 397 -86 49 163 -146 58 -416 143 16 96 -129 -197 204 -100 392 116
5461 116 186 -203 -110 -351 -118 130 -119 235 -331 64 55 205 -137 -224 394 -547 256 -117 292 77 307 -157
5483 -157 -68 -14 8 123 -14 167 -45 -198 184 -182 241 -209 145 -42 -65 165 -75 138 -31 117 -401
5504 -401 191 -50 -45 -264 -231 133 -12 223 -183 132 117 14 -40 -18 289 -147 -198 -114 255 -21 -110 118 42
5527 42 214 -249 403 111 -6 40 -225 249 -279 164 -124 57 67 60 -416 -142 55 -137 164 -201 94 -35
5549 -35 -13 -87 50 164 -210 86 -112 106 7 99 90 -274 22 -224 120 3 43 -248 52 166 -37 259 -126
5572 -126 33 -121 69 -88 -115 246 -63 52 -119 -14 -248 -7 166 -59 -30 -234 -62 -91 64 -11 171
5593A71j44Q4L09m99K67m06K70o3K16q3j85l6j90N20k79l6J68k01K21k56M38m09
5615a23K61m73M94j08o8J80k89K43k85L14k22K69j0m25K54j43J29j83M60k35j59
5636a19J59l35N59k91L45n84K34J69l36L03l40M34o27N21m11K47R8j39M15n82
5656b80N62m72M34k18j95L86l75J08l24O70l02o3k74M29Ll07L93j40K25k80J84
5677A64o0j98%o0K59k17L54n72L53J31p8J06k75K90k48K08m07M58j13m19L66j72
5699a30J78l09O29k82N4q4l49J72J56J34l48P4k6J35K94l70J29l17M09l40J12
5720g9J01J17K9l66L30k00K36m58K88l7j6J46o4K66j45n2j36K62k4k05K07k73
5742g3M3j44P15p32J81J92m11M51j63K95l57J00j60J88j52K11j26j23K02k42K01
$$ plain form
5593 171 27 111 420 -79 188 -218 52 -11 205 122 -63 -99 -289 231 -48 -84 84 -117 104 -152 286 -123
5615 -123 138 -335 159 51 -17 163 -126 117 -168 146 -76 193 183 -242 12 -131 -2 -185 275 40 -119
5636 -119 40 -295 264 -27 318 -266 -32 137 -199 104 -236 198 -429 92 -319 -72 26 -113 302 -280
5656 -280 282 -190 244 26 -169 217 -158 -50 -374 296 -6 -69 -343 86 89 -218 175 35 260 -20 164
5677 164 104 -94 -94 -154 105 -112 242 -330 23 154 76 182 -93 197 -51 157 -250 208 95 -324 42 -130
5699 -130 48 -261 368 86 140 56 -293 -121 35 169 -179 -105 -131 4 298 -72 57 -260 149 -191 -79
5720 -79 22 139 168 -198 132 -68 168 -290 -2 -39 -55 91 27 293 148 96 -40 222 198 -7 200 -73
5742 -73 -30 -174 541 -191 -10 182 -229 222 59 354 -3 97 -63 125 -27 184 58 -65 137 -105 96
5763I6m22K23J86k97L19k54K17m7o6p6o0L63m39K44j03J63j96K27K5l46J27K56
5785A40J61n07L59p3j21L75m32K27l23N07m49N1N5j17Q1p7M93m91P4P8J83kl37
5808a45K78j52K40l86L15k78l4M46l71J66m46M21k38R3L1K67j56j13L57o6l7j55
5830C7J93j46JJ2l02K49k26K80j63K84k69q2M67n21L89l28K14r0j61J76j58Q0
5852f4q3J93k41K05l34P7L06j83L21l48J31k79K66RM8M8q9J51l34K90p0N7L8j75
5876f0J43k0Q0l23M46l32j22J06J66J30j48k8j28k5r3N59l12k67J53m9K91j61
5898FN5j97L57k28k9K83m69K83k29O2K71q2k90L84K3m48L01k82L79q7P5k00j03
5921a65M30m72K36j84K18K8m04K91p3K57l37L73k62K72k99k41L91k23L37j29K11
$$ plain form
5763 96 -326 -103 83 -214 105 -149 68 21 -45 -121 -181 182 -257 -13 -116 47 -149 78 103 -243 -116 140
5785 140 301 -206 153 80 -41 334 -98 129 -194 313 -136 -85 -30 -147 -66 -143 350 -141 -67 11 194 192 -145
5808 -145 133 -19 221 -165 150 -128 -162 284 -87 79 -367 54 -184 -91 -60 207 51 -62 295 229 192 37
5830 37 230 84 85 97 -205 44 -182 98 -65 219 -50 -132 335 -186 203 -125 89 -1 -162 14 -144 -64
5852 -64 -147 46 -195 10 -324 -247 59 -124 197 -151 -20 -299 -33 -24 24 72 -17 134 -200 90 20 77 115 -60
5876 -60 83 63 143 -180 266 -66 -188 -82 84 214 66 38 -90 -115 -208 351 39 -228 -75 -124 167 6
5898 6 61 -136 221 -7 -36 247 -222 61 -168 -106 165 83 -207 177 200 -248 53 -229 150 63 138 -62 -165
5921 -165 265 -207 29 -155 63 91 -313 -22 -95 162 -175 198 -64 208 -91 -332 59 -164 173 44 255
5942B55l48j32L75j46J53m42L81j66J20j71N1Q3M8j10j14K30o9K2k46P2K47o8
5964B5J15j82K12k43M0K63l18P4k09L07j48J50p8l3K89l06J13k3M59o72K94j94
5986f5M7On9K13k52L63l03J31k59J11j6P3lj39K83j25P6j90j38L17l38K93mJ87
6010B09l73P8mJ8L68o50N75l03L14j67m6j04k41O62m85P3q6L90l92L02l9q3P5
6033I1j3J5m03N56l76K03Q8l40N90o39K87j91K19R6k44K82o62P44o37L63J25j83
6055b9J30j59J42l31L87l15M33k87M3q8J39m6j3Ol4K12j97j54L79l74K24j08J67
6078A27m17M54k63J86J58m41L31k49J97j22O8k98O5J02J38Q7k13K88k92J53k2
6099C7J18k27k27L58l87K06P0L0K30m75K18j7N68o11l1j58%M51m73M10k9R8j69
$$ plain form
5942 255 -93 -225 150 4 157 -285 96 -70 50 -121 -70 13 61 -49 -163 67 -2 20 -226 -154 93 25
5964 25 140 -42 170 -73 -33 230 -88 -14 -223 84 -64 86 8 -25 264 -42 71 48 507 -165 129 -65
5986 -65 -18 -12 -71 142 -110 253 -50 81 -178 -67 -83 -10 -13 -152 131 6 82 -108 -246 71 -267 26 22 209
6010 209 -164 -86 -90 -72 296 -354 221 -82 232 65 19 -85 -326 336 -149 -76 -162 228 -164 138 99 16 91
6033 91 78 93 -310 246 -130 73 161 -179 411 -228 59 -132 87 183 -61 221 -441 303 -334 29 154 -29
6055 -29 101 -58 84 -247 140 -175 258 -29 14 -74 65 19 6 12 -22 190 -7 -161 218 -156 68 -40 127
6078 127 -290 164 -99 87 245 -196 135 -114 83 -39 29 -269 -204 -102 36 123 -90 198 -94 59 37
6099 37 155 -72 -299 59 -328 -122 -52 -22 208 -267 -49 -66 502 -109 -140 -298 -298 153 -320 90 61 159 -10
6122a0r8J48J46k75J37J72n72P80m70LJ85J22l83L1J82k23K58j82J76j00K00l58
6144a31k53N61m34M65l61M70m95K26j75j12O16r55N98N4l03L84k31K50l52K85
6164A07j75l21K89M86n57j42K39k89N11k55J95J15k20n21J75P79j080M78j56L90
6184D8M80j98l71j83O7k71P82p20O21k72J58j40j30L06k41j91K50M61k96n3j01
6205Fm7k20R4J52J31m93N79l18M44j60j40j13J09J00l04M85n00M00l14R7m3J42
6227H7kj61J91k25J2l34O26n1Q5k85k34M94m07K57k95J60P2j45J84j26J66k4j01
6250e6p8K50k07J58O2l71M87p39K30L00Jo5j21L36l74L09l15L49L3l39K80l23
6272a93K65j32L41l49J88o7m8K29m05M46m95L43l16L38L0m4J6m27L38j47J98j81
$$ plain form
6122 -10 -108 40 186 -89 48 220 -352 428 -42 -39 146 268 -115 -84 98 -125 133 -49 127 27 227 -131
6144 -131 -384 177 -257 208 -153 317 -178 48 -127 -239 377 -578 20 74 -229 155 -76 174 -178 107
6164 107 -68 -389 -100 386 -171 -313 -74 -363 148 -107 88 203 -17 -538 -363 416 -664 -186 -342 48
6184 48 528 330 -41 -224 -157 -428 354 -366 255 -17 141 1 -129 177 -64 -255 -5 456 160 107 6
6205 6 -41 -261 -167 -15 116 -377 202 -116 328 168 28 -85 24 124 -180 305 -195 205 -109 -12 -55 87
6227 87 85 -76 115 -110 -98 -432 194 143 228 -57 -291 203 -204 53 -242 -82 -10 -155 29 -97 69 45 -56
6250 -56 -134 116 -91 67 129 -242 245 -494 -264 36 37 -28 -149 187 -187 122 -193 156 189 -150 130 -193
6272 -193 72 -60 281 -68 120 53 5 234 -171 275 -220 123 -193 145 175 131 147 -280 58 -89 109 -72
6294g2K99l0n38M99k69J12k08L00j96m8K78k15K49p1j11R0k2j70j84L3J66K97
6316A89k98J78k55J84K7l11O46o47L02k59K59r2J88q9j2Pj42J67k35J94J14r9
6338A6Jl4J93k18J03k50K68k1MK49m76L38m51M75m20M57k40L3k21J62j53N35q2
6361B68j68k10J76j09J3q5L59k52R3k00P1J92k13J55l55N28n32J32j1J60J34j23
6383B3K54n53L00k52K66pm9Q0m4J79l46K39j86J51k51J67L31m50K18k23L69k76
6405f0J31L9k50J39K4m5L2J30l82K80k61J35J66k76L07l15L87k96K50J01j97R9
6427A38j96K81l28J4J79L9n4j28J33J24j97n9l8J40l6J74l49M48l41K88l37M7
6449e8j6N5K5n8K19k07K65j55R2j96j38R5O1O5NJ33Q1l35J31M4k98lJ22j6M8l27
$$ plain form
6294 -72 227 197 -341 158 -111 1 -207 93 -103 -151 127 -88 161 90 -21 69 47 -123 -307 -274 -108 189
6316 189 -109 69 -186 -2 25 -286 360 -287 15 -244 15 -77 111 22 10 17 -125 42 -193 1 115 16
6338 16 17 -17 176 -42 61 -189 79 58 62 311 -165 173 -278 197 -223 234 -6 27 -194 -32 -185 350 268
6361 268 100 -110 66 -43 -30 -115 244 -8 85 -115 -44 148 -65 90 -265 263 -269 -137 -148 12 146 23
6383 23 277 -276 24 -228 38 31 -18 62 18 197 -149 90 -96 55 -196 -29 302 -148 70 -153 216 -60
6405 -60 71 110 -140 -1 23 -22 10 140 -242 38 -223 -88 78 -198 109 -206 181 -115 135 236 39 138
6427 138 -58 223 -105 -91 88 127 73 -55 78 202 5 -54 -92 48 12 186 -163 285 -56 232 -105 -58
6449 -58 -74 -19 6 -52 167 -40 225 70 162 -34 -172 -77 -16 49 54 187 268 -67 64 108 -190 -193 -71 -87 -39 -366
6475c66L29J02k16L07l49L95j74J43M2k37P1p2J74k0J3l05M50j15k35P4k02N00
6497C09m08M2J09N0J7l11J95j31O7p0P1J53j73M98n32K77k35K15j61K39k47j21
6519a47L34l52L3l5L01k16o7L52l27K52n40M08k23k2K16j88J70p2l3L5J62k01
6541a60L85l57j30M60j79j49l5N06o08J98m1J68j26MJ78n6J11k64n2J0j7J55j90
6564a89L07j07k6q3J29M10o48K25J06k87J84m5J25o5j3J37k24J79m60M37p4j45
6586a27K09L21n36J07j61K40M6J63j74r3J4k48K86j57K44J02n1l01o4L59j68k1
6608a0j98L62m0l03J71lK39k55M9Pk11R7j55N41r0M7o27k01M48K35K83m44J20
6631F2l84Q8J25j68M33qk40j36j62M37J47m17M81l0j11K22k69J50o2j71m6M21
$$ plain form
6475 -366 -37 65 -151 156 -193 202 28 171 213 -24 47 -25 149 129 142 -163 287 172 -63 11 -191 309
6497 309 -99 -57 52 102 119 -192 3 -128 -61 -131 -60 93 -80 418 -114 163 -72 143 -18 221 -26 -147
6519 -147 187 -165 -132 -167 134 -82 -149 203 -124 128 -412 -4 -227 -249 -33 -221 -51 -123 -156 -121 41 -160
6541 -160 225 -132 -262 198 19 -130 -165 341 -267 -69 -110 58 -68 -64 114 58 169 -95 -147 -137 -154 1 -189
6564 -189 118 11 -15 -98 31 441 -207 18 124 -163 21 -24 101 36 23 160 -64 115 -345 92 18 -127
6586 -127 82 403 -133 -26 -187 53 99 262 88 -5 9 -239 47 -110 134 236 185 -116 -180 179 11 -10
6608 -10 -208 154 114 -189 -18 -21 218 -37 12 19 -192 -95 -250 291 201 248 -379 -580 -132 103 386 -58 62
6631 62 -322 -234 -109 -277 156 148 -92 -228 -390 47 194 -223 258 228 117 339 70 220 158 -13 -59 362
6653C62l74j59L41k16K34o4N4k32K78m06qL51k56m6j30Qk4J90qK36n6l60K54J84
6677A53O8l16o9L65j40J21m97O44j98q5n3K51N9p97O22j74K1J20J75n98R29n79
6699B2M28p87R3K7K83N02k06m01k3k4M04q18O34K83k2q58N39M5k30l60M44k74
6721b99J019n86Q20j750R11o0K46q74N27J33l17K4n0q1r3L65L59J79n71j80m9
6742c27O96l88O2k24J25K37m25J52K14J7q5m32J85J95PK19m65L97o08K99K25j39
6764f3K71n39L15L10o15L97k06j81L95k76J34m1L3j90N48k65P7j56r4J46J66j53
6786A3J64k70L27l88K43j9Q3j04j91K53n13L95j05L30j11j48J75l5K8m0N2N8k49
6809e2L04k59J19j19k5k22M29q9q3J72l79K97m71O53m29J07J27l19L45k60L61
$$ plain form
6653 362 -12 -171 170 -46 188 124 178 -54 224 -182 -190 161 -95 -141 -271 -263 -287 -97 -105 131 75 -285 -31 153
6677 153 221 -95 -164 201 61 182 -315 329 131 46 -7 244 303 -494 128 -46 -25 95 270 -328 601 22
6699 22 450 -337 -244 -217 66 568 362 -39 -62 -86 318 -500 134 417 395 -463 76 121 -109 -469 -25 -299
6721 -299 720 134 954 -796 115 55 301 -573 -46 87 -230 -206 -256 -337 -430 -65 294 473 -98 -278 -327
6742 -327 369 -19 43 -181 -56 181 -244 -92 122 139 54 -378 -193 2 9 228 -237 160 -448 -149 76 -63
6764 -63 208 -331 -16 294 -321 76 -130 -311 84 -192 -58 -99 -66 -256 292 27 104 -52 -146 0 166 13
6786 13 177 -93 234 -154 89 70 153 49 -142 111 -402 -7 -112 218 107 -41 134 99 127 87 139 197 -52
6809 -52 252 -7 112 -7 -32 -254 175 86 3 175 -204 93 -378 275 -154 -47 80 -239 106 -154 207
6830B07l79K06k97K76J2j72L55l83L11l63K33j05qJ52j18J19k8J69o6qo6j35J04
6853A6r9R1n7L33o00L35n0J74j43K9P7kL0l29K98J50n87L96m4J55l74K11j64j85
6877c39M80l37L50k37K45m31K44n1J65j92R1R9n9J02j99J96l27J99k69RJ18N0
6899i3N0J38j51l6Kj0MJ81k02K92p4j55LK57O6n0j31k56KJ15j39L68l83L91j33
6924E6K14o68L55O3j39K78k38J18k4j83k4J48Q6J48k21k9L09l85M8J97l01K37
6946D5q3K39p9l23K9L51n8j74J45k02J60j04m0j80L18l26L75r5k68L27l19N77
6968C15j70m7j01J2l2K39j03k07Q4o4N1l0Q5K3O7K1l63K94k38K37k1k46J42J18
6992F6M6R7j73K0R9j78j67J00j72K05m4J40k7j46J90j6Rk09N2J39N2K9jJ73k22
$$ plain form
6830 207 -172 34 -263 13 25 -147 208 -175 136 -227 6 -99 -107 45 -73 46 18 187 121 113 47 -88 16
6853 16 -83 8 -49 284 -316 19 -31 143 0 29 106 104 134 -195 103 253 -334 62 18 173 -201 10 -154 -339
6877 -339 141 -196 154 -83 162 -269 -25 -76 89 -103 -12 87 28 130 -69 127 -200 -1 -270 -261 -143 -93
6899 -93 -43 95 -56 -92 -90 -100 -96 85 -117 175 101 -54 -51 206 272 222 91 -165 -163 -48 -187 181 -202 189 56
6924 56 270 -398 -43 20 -119 159 -79 39 15 -168 -192 -44 42 190 -31 -60 249 -136 -88 109 -192 45
6946 45 -38 201 122 -201 -172 179 121 -53 92 -110 50 -54 -94 -274 44 -282 93 -2 -270 57 -262 315
6968 315 145 98 -3 9 -23 216 113 -94 -10 -74 -23 -53 32 55 122 143 -220 74 -164 73 52 -194 -52 66
6992 66 112 209 36 56 155 -23 -190 -90 -262 -57 -101 39 12 -134 56 40 49 -160 -108 31 83 112 111 284 62
7017F2M9k10J17p3N3Q3k95K68k53M02k20K25m07L09p4J44l02n0K72j59nL3K5K24
7041B18j15J11j88J19j79J06K7j41P0o6J75k92M57l58K66l80K71j1Kj13l7J75
7063A17J0k20Q1J70m54K26p6L5K65k74K90l91J93Q5m0J61k98k2jJ9J63n1R8k63
7087a77K07r6RK84k43m8k8K18Kj67J27J71l86R4J02q0k8L45l52P6R1q3M4Ok51
7112a63O09m66R1j39K85j79L2K3n4L4j46J05P5o7j96K61k08K0J44j22m4J18k24
7135b11K49%j31j29L76k99J90M1j18J21o4J43K8m5l22K26l06J86K88m17N15o71
7157c50M82j52l9M2J26J32k06J6m8kj86M9q8M52K2k59P4J2j70K57j53O7j77MP5
7182b0K14j86J1K36k95j16M9M3j7K27j86J57Mm56N42l16J28j32K16PL0k0j7j99
$$ plain form
7017 62 111 -99 18 -55 -2 81 -214 54 -199 203 -17 208 -199 110 36 180 -122 -172 100 -59 -64 -31 -6 218
7041 218 103 214 26 145 -34 72 99 -42 28 -38 137 -155 302 -56 210 -170 101 90 92 -21 -58 117
7063 117 127 -93 -12 158 -296 -70 -146 -111 154 -120 170 -221 -28 57 17 178 -120 -142 -143 -124 39 -12 86 -177
7087 -177 30 -66 -57 227 -16 -64 -92 126 128 -39 88 259 -127 -33 69 -11 -39 306 -46 30 121 38 82 88 -163
7112 -163 446 -20 71 -68 217 38 70 93 39 73 -73 32 107 40 -156 105 -103 -83 61 -61 -105 13 -211
7135 -211 38 38 -93 -222 154 -145 45 86 -32 89 25 168 196 151 -171 55 -251 -65 223 -194 321 -350
7157 -350 132 -20 -59 -17 109 241 35 51 3 1 -185 -136 -224 228 250 -9 65 77 -93 164 11 78 -99 -95 -20
7182 -20 194 8 19 255 -40 -156 -107 -64 -81 146 -40 117 121 -335 207 -109 19 -113 103 110 140 120 103 -96
7206i6J73mj58K08p7j86M0j7K31j99K45j60J24l8k43j1K66p8k49M48k72P2j30
7229a11l5O9m0L05m07M38j84J34l43P8lJ34K08m13K62l5J64l29J71m2n1K04k67
7252i3K56j7j61K1o4K75l78J59j13K35j79j08J73n8O3q4J70r7K27l94M44L7m93
7275a79M14m42J0M34J16m34Q0M7l0J77n34M29j40J64p1j8j19m5J33j14K40M5j83
7298b0J58j08J50m48K22K23K6n2l11L3J86P1k36K55m02L17o8K1K80k46L6o5j7
7321EK33m8k29j07J08N5k7k34M13k67K98l44L09j21q7J86j77K27l53M7K6pJ33
7344C9Q4n9l31J83L00j25Q0l13jj69L19j7q2n2J77j54J14L24m76K28p1RL11n35
7368b17L10J4k08p5K12Kk59K56l05J06l6K99l13M7m7L81Ol27K03j42l6Q6J7k1
$$ plain form
7206 -96 77 73 -85 123 46 -140 -100 -117 114 -85 160 0 124 86 -157 -168 98 20 -229 219 -53 19 -111
7229 -111 -146 -77 -117 188 -219 219 35 169 -174 -96 -99 35 243 -170 92 57 221 -108 63 21 -30 174 -93
7252 -93 163 146 -15 6 -58 217 -161 -2 -115 120 -59 -167 6 -52 11 -73 97 0 227 -167 277 314 -179
7275 -179 235 -207 -197 237 353 -81 -1 46 16 193 -341 88 -52 112 41 23 -96 -141 -8 -122 118 163 -20
7298 -20 138 30 180 -268 -46 177 203 151 -160 -127 59 130 -106 149 -253 64 -4 17 297 51 87 22 5
7321 5 238 190 -39 -146 -38 17 -10 -244 169 -98 200 -144 165 44 -43 143 -34 193 -160 -113 -87 -94 39
7344 39 123 64 -267 -84 216 91 171 -142 -143 -312 7 -10 -92 -144 33 -121 -7 317 -159 69 -2 7 318 -217
7368 -217 93 107 -101 -176 36 38 -221 35 -270 -164 -200 99 -214 -167 -214 167 173 -154 49 -93 -129 -43 -26 -47
7392d7J94o8k27K27L3j7p3K10j68k49K22m16N98j39q9q1O1J13p9N4q2J47l95L74
7416A03j48J06J12j83l9j35L24k25L2j41L57L5l13J86l4p9k4l3k9O1j7N6L29m08
7440a07N46n77K99o6j79K30k50L7j73M19l28P0R4j02Q2m07N01j52L9p3n2L61k76
7463f4J64N8j96j83L35o8nP0j21J99j92P2j12J44J80k23K77l30M4p2l0K83j12
7486A18kK2k34J00j22J45L7K73k66J73l77K16r1J55m84N19Q2k96J7k21K75l1J2
7509B0R7R%k07K05k81J72MJ47j83j32L67m16L03Jj71j73L16K3j03R5l7O1m9l0
7534C8Q4N2j51j22J59N1J82k42Qj83L43j26j36J98l16N51j75r8j07k2k4R2L5j41
7558e0K96k77n2K72j61L2k44K44o5J05j21O9K45m19M01l75J7J23o3J88n3p0j26
$$ plain form
7392 -47 147 79 -148 79 112 95 22 232 64 -185 37 -379 219 80 -9 -90 -29 84 5 59 -23 124 -271 103
7416 103 -45 61 173 -10 -49 -184 140 -85 -53 -194 163 198 -115 71 37 -42 -66 -99 -128 -67 -84 -28 301 -107
7440 -107 439 -138 161 95 -84 146 -104 -67 -240 179 -149 -79 15 -87 -5 -412 89 -63 -24 -97 -149 212 -64
7463 -64 100 158 -38 -221 114 46 41 111 -10 189 -3 69 -43 101 281 58 335 5 49 -23 -53 230 118
7486 118 116 138 -96 4 -118 27 64 337 71 244 -133 83 -8 147 -337 182 264 -32 -15 -236 39 8 20
7509 20 117 126 126 -81 124 -157 15 19 166 -17 -149 218 -198 105 106 -65 -238 78 101 -2 93 56 117 68 38
7534 38 122 174 23 -99 60 111 293 51 59 -124 219 93 -43 155 -161 390 215 117 10 -12 -36 56 91 -50
7558 -50 246 -31 -83 189 28 60 -184 60 -5 100 -21 48 293 -126 275 -100 -83 40 -23 165 112 42 -84
7581h4o9j03M38n29J64K74k5K89l49n3k38N63k66j28K31r9K86m71L58l82J22J62
7603I1k68J65P0l9j3j00k82M02k95N49n0m43N05k14J69j24M0k35K29J02j77m01
7625c19K84N2J11l3m02O45l69J22k38N9N58n56K00q4o7KJ2N8l99M15J20k14m1
7648h4L31L2o3n7n87N10m53M29J35M5l31o4L57o49M33J01K4j6l5J60n15M62j34
7671C1m42K95N6j11Q9l8O8K32p17O97l94M17qm24J93j24M89l49j77K54j85L93
7693B45r62O23k74M40R5j23m1Mk20q8N20m03L87m83K67q4J18l63L42J3oK06l59
7716a46J90j69M7j88O00m82L38j63l4k07Q5J64k75N84m81J87P0J96m48K8J42k04
7738a66M36q9k87J58M09p88L04n69L47q61M42O86m08M81q73R17j71P6M44j74q58
$$ plain form
7581 -84 -153 -256 182 -347 -183 91 66 355 6 -47 -285 278 12 -116 115 16 302 -169 189 -193 -71 91
7603 91 -177 -12 58 19 6 -94 -376 26 -269 280 230 -213 292 78 247 123 163 -72 157 259 82 -319
7625 -319 -35 17 128 95 -307 338 -31 91 -147 -88 470 -86 114 30 -37 -35 -23 35 -364 51 171 -43 -84
7648 -84 247 279 216 159 -428 82 -371 58 193 238 -93 -157 200 -449 -16 85 109 93 58 218 -297 165 31
7671 31 -411 -116 -60 -171 -82 -120 -52 180 -537 160 -234 183 175 -249 -56 -180 309 -40 -217 37 -148 245
7693 245 -717 -94 -368 72 167 44 3 7 -213 -301 219 -184 203 -280 -13 -97 21 -342 0 13 7 213 -146
7716 -146 44 -125 -78 -266 334 -148 190 27 -7 -214 -129 35 -240 344 -137 50 120 316 -132 -104 38 -166
7738 -166 270 181 -106 52 461 -327 -23 -592 -245 -1106 -664 22 -386 95 -778 139 -32 44 488 314 -544
7759e44O82o7J82R8n42J61M1o27O34J106j243j09Q35p88N60j057P74K27k81L73
7779D15m50K62j88j69j37J93Q2r0J70k66j3K53ll29M06J96j13n6p3o7M5J13k60
7802g9K03O0l23K36l38K56j64K24j85J47j66j25L39J1k9Jr6n0rL11p3L5k20k3
7826e7pM8j18J36j86J49J25l24J66K2J0J14j82J48j1J14k57O0Q3r7K03j20n3o2
7850i6K35j27p3j8n5N25l17J98k45j05jK18l11L38Q3k38Mj25J01Q9L3j28j3K4
7874dn0R5k04K65J0k91K17j03J50r5K64j01j62M1j13r7K85l3k79K79l1J29l42
7897a70J37K80k52M0k18J42R9k8q0O0r9M3o7K44Q2k08Q4k07o8K3J18R8j9j90R0
7922f6J38L0mj15k09L11oPj27K40l01P4j2R1N9O6j31j60P7j14j7K89n9J56m71
$$ plain form
7759 -544 138 71 253 351 -191 -30 11 -616 18 1124 -119 -228 607 -181 379 -678 96 323 42 415
7779 415 -35 227 39 -130 -267 -74 8 -82 88 -178 -191 62 59 -270 136 332 219 163 90 23 68 181 -79
7802 -79 124 184 -139 97 -241 15 -149 75 -110 37 -129 -254 85 96 67 68 -28 -78 -87 224 151 186 -34 -57
7826 -57 -64 -16 -134 2 -184 -35 90 -234 -68 -46 -36 78 -104 44 33 147 -110 -50 33 -64 139 19 -34 -96
7850 -96 139 12 -61 -79 -134 391 74 272 27 -78 -79 139 -172 166 249 11 15 -110 -9 80 113 -15 -28 -4
7874 -4 -54 41 -163 102 112 -179 38 -65 85 -10 254 153 -9 32 -81 -178 107 74 -205 74 43 172 -170
7897 -170 -33 247 -5 35 -183 -41 58 30 -50 10 -89 -46 -113 131 213 5 89 -118 -186 -163 -45 53 34 -156 -66
7922 -66 72 102 98 -17 -226 85 79 86 -41 199 -102 -28 -40 51 110 176 45 -115 -38 -152 -169 120 61 217 -254
7947b54L28o0j47L11m29L31l78L52j58Ko3J12L2l2J34k21L04k67J11Q9j54L0l32
7970c59M68j04L3J4Jm4j58N65m27q1j33L20m5k1J51q8J33k06N3l15L83l42L3L48
7994A79k17m0j34O06n54J92J62l19J34m3N9l3J8N2j22K34j66l0J30Rj28q7L82
8017B84l74J08k66L37m09K97k21L20mJ44j42j77J99k08J78k43j70M12k98N5M82
8038C04l34J2j27NK09j84O8J56q6k88Q9M63j75l78J46L10n00J41J63j53K11Q3
8060A35oj25n3J45j89J70j45L24k36K43k67oJ26k55L07j06J47l85J89p8Q9J34
8082A58j59K62m81J09Q2J71q6k78K01KK5j24p7P8K94k98J53l2m1L92l02R8k43
8105i6J19j00n0K00k69J93J12q0J17k82O9p5J30n6RJ85k15K49k37o8J8J79J46
$$ plain form
7947 -254 74 14 -133 178 -251 80 -298 54 -104 -102 -165 -53 -21 -53 81 -140 164 -103 8 97 -57 -27 -359
7970 -359 109 5 38 52 53 9 -149 416 -11 -92 -225 95 50 29 180 92 225 19 72 -243 140 -202 -169 179
7994 179 -38 -78 -212 394 -160 32 194 -125 9 -34 25 -8 10 62 -60 174 8 -22 108 117 -11 -98 284
8017 284 -90 18 -248 89 -320 -23 -244 76 72 216 74 -103 96 -112 66 -177 -347 65 -233 -178 304
8038 304 -30 -18 -145 -140 69 -115 -47 109 23 -265 -176 287 112 -266 -120 190 -310 -169 -6 -159 52 135
8060 135 129 4 -49 96 -93 77 -68 256 20 263 -4 -10 116 -139 168 62 209 -176 13 -65 24 158
8082 158 -1 261 -220 -111 -29 142 56 -222 -21 -19 6 -118 -195 -117 177 -121 32 0 -41 351 49 147 -96
8105 -96 23 -77 -127 73 -196 -3 109 29 146 -136 -67 -142 -12 -68 -59 126 -89 160 -77 -145 -127 52 198
8128A98q6j39k19K18k6j67L99j52K5pq1K02J29k44m0J07mj04p4J71j55l2J25j1
8152C3L0r7q0K51n3JJ4j05L27k27j36J55p8k9k5n6J56q6K8p9j05Q4J46p9J34K0
8178A44j72j46J91P4M6j02j24o0P6j35M73k91Q3
$$ plain form
8128 198 112 -27 -246 -28 -54 -221 178 26 51 44 -37 165 294 50 10 117 113 9 -65 106 -49 -81 44 33
8152 33 63 -34 -114 137 84 85 99 -6 321 94 -42 113 35 6 -19 -75 81 -5 23 -56 -161 -77 69 -10 124 144
8178 144 -28 -174 17 91 137 35 -89 -149 -73 -208 265 -26 57
8191E7
$$ Imaginary data points
##PAGE= N=2
##DATA TABLE= (X++(I..I)), XYDATA
0@%%%%%%%%%%%%qJ6j6J6k2L0l2M0m8N6p2Q8j04J20j36J58j86K14k47K83l23L69
34A96m18M71n29N98o71P49q36R31j036J150j275J411j560J720j896K093k307K540
52A331k797L083l400L752m150M602n118N715o413P246q264R539j1190J3434j6710
67i340K2071l3137J02621o4971R8215P5186j34924L9533N0043l8497l9572L5302
79A02530j0469K7809j28077J38849m4706j20968J36769m1621q9016O7213K1309
90E9622j23435R6245l0603n2304N7666o2787M8008n4963J5695K4756m4594j7883
102h4577Q1776o7751n3241J58601j32994K198R0478n1612k9512M5533K6398n9364
114g4067L0366Q199M2959r4596O1232P4952j40425P4670N6025p0614k1941J08289
$$ plain form
0 0 0 0 0 0 0 0 0 0 0 0 0 0 -8 8 -8 8 -14 16 -16 24 -24 32 -40 48 -56 64 -72 86 -100 114 -133 150 -173 196
34 196 -222 249 -280 318 -353 396 -440 491 -545 605 -670 741 -819 901 -995 1098 -1209 1331
52 1331 -1466 1617 -1783 1969 -2181 2421 -2697 3018 -3395 3851 -4413 5126 -6064 7370 -9340
67 -9340 12731 -20406 82215 17244 115459 190645 55721 95254 145297 106800 67228 102530
79 102530 92061 119870 -8207 130642 85936 -35032 101737 60116 -28900 38313 59622
90 59622 -63813 32432 1829 -50475 7191 -55596 -7588 -62551 -46856 -22100 -66694 -84577
102 -84577 -2801 -70552 -123793 34808 -98186 -95988 -5510 -57122 -86634 -41101 -14703 -74067
114 -74067 -43701 -35502 7457 -87139 -25907 49045 -91380 -16710 39315 -31299 -53240 55049
126E5049o8855k2248O5340l0355J0411m1285P3640l7376l6065N8425n186n2056
138c0561K8751N2617j07266P0968N258m7631K1338J1506m853l9859N4639k6640
150a1733r018n050M0055l5943l1220Q7128o7619n720L7014Q224o1718M0052L5339
163A9791p2123L2955J4633J711n6200O1959L213o1577M4651J1335k0407l4726
175e4785P5513m2874k5119M4141k695k9894m126O5234p6510K0792L3241k7717
187b4799j4730K5070J6602n7060M7125n241p229j9692L8887j443n7134P2211j9986
200g419k9008J9290L7988n8607J7803M4883n5060K5095k411K2619l7358J3341
212h844L4752l8437l890L7188j717o5403Q7528l0333m1444N7011j5760j6052M54
$$ plain form
126 55049 -13806 -36054 29286 -1069 9342 -31943 41697 4321 -31744 26681 21495 -30561
138 -30561 -1810 50807 -56459 14509 19767 -27864 -6526 4980 127 -39732 14907 -11733
150 -11733 -20751 -25801 14254 -21689 -52909 34219 -33400 -39120 -2106 6118 -55600 -15548 19791
163 19791 -52332 -19377 -4744 -3033 -59233 2726 5939 -55638 -10987 348 -20059 -54785
175 -54785 20728 -22146 -47265 -3124 -5819 -35713 -39839 25395 -51115 -30323 2918 -24799
187 -24799 -39529 -14459 2143 -54917 -7792 -13033 -20262 -39954 -1067 -2510 -59644 12567 -7419
200 -7419 -36427 -17137 20851 -37756 -19953 24930 -30130 -5035 -7446 15173 -22185 -8844
212 -8844 25908 -12529 -16419 20769 19052 -46351 41177 10844 -30600 26411 10651 -5401 -4947
225d947L1247l2387P366j210K3216l2050j2231P2324q1000J8380M4690m2126j9470
238b8198N6969k8040l3523N7805l7996J5193j9359K1244O642m5899M2817O085
250A3740m1175R693N8576q4407L3583M1492o6463L3418M431l239j6325J7881r36
263B69O85k1249K6591J5827p1569P9426j9659m5925N1936J276m2813K7238K4067
276B6100n0523L8251j6687J4744j2359j4202N0071m7559P01L9223j8290m2499
288c3029P2579l2087l7376O6526l9340K462L041J0872j0848o010R691R452k0440
301d507r518N9059p1409K2457L9351n2347J0562K8248j8737k2034M3097k7975
313c753O725o248J0625R943m4551N0296j0381l0511K3077K6100n2541K1990L5172
$$ plain form
225 -4947 26300 -6087 1279 69 23285 -8765 -20996 51328 -29672 -11292 33398 -8728 -28198
238 -28198 28771 731 -32792 25013 -12983 2210 -17149 4095 10737 -35162 7655 13740
250 13740 -27435 -17742 40834 -43573 -9990 31502 -34961 -1543 2888 -351 -16676 1205 269
263 269 954 -20295 6296 22123 -49446 29980 10321 -35604 16332 17608 -25205 2033 26100
276 26100 -24423 13828 -2859 11885 -474 -14676 35395 -12164 -11463 27760 9470 -33029
288 -33029 39550 7463 -29913 36613 -2727 -265 2776 13648 2800 -3210 6481 15933 -4507
301 -4507 -14025 45034 -26375 -3918 35433 -16914 -6352 21896 3159 -18875 24222 -3753
313 -3753 2972 -3276 7349 17292 -27259 23037 12656 -17855 5222 31322 -21219 771 35943
326C5943n6498L1716k30L55j3777R755J4270k2489L139J4624L313m2008N4276
339C2389j8701l0020M2261j4715j3045N019K2214l4382J5633M636o178n406l015
352c310K8833m5258K2776J2784k2777n979K7789j1687l0908M6596k2871p363L965
365g410J8259j8532j3254L7583k3701n937Q017K1933l8400J4015K6513l3737Q847
378e804R818P979l3450L1086K179k4202J5369O318m284j9158L5553k2770k605
391c971J2232j253o177p800K8955l1400Q937J1367o271j6498K0490N577l7693
404b3505L8596j1688r420J151J5247r785j5508K6298q962o985o965L6222l5181
417a0485l728M1168l3431r94J7770N080k9740K6497q3j0906L557N89J9363l7658
$$ plain form
326 35943 -20555 11161 10931 11286 -2491 7264 21534 -955 2184 16808 20121 -21887 32389
339 32389 13688 -16332 25929 11214 -1831 3188 25402 -8980 6653 11289 5111 -295 -3310
352 -3310 25523 -19735 3041 15825 -6952 -12931 14858 3171 -27737 18859 -4012 -11375 -7410
365 -7410 10849 -7683 -20937 16646 -7055 -12992 -4975 16958 -21442 -7427 19086 -14651 -5804
378 -5804 4014 11993 -21457 9629 11808 -12394 2975 9293 5009 -14149 21404 -1366 -3971
391 -3971 8261 7008 831 -6969 21986 -9414 -477 10890 4619 -11879 8611 14188 -23505
404 -23505 15091 3403 -6017 -4866 10381 596 -14912 11386 2424 -4561 -11526 24696 -10485
417 -10485 -14213 26955 -6476 -7470 10300 15380 -14360 12137 12054 1148 4705 5294 24657 -13001
431a3001K7547P545k6625R666J9923k3336o730L7027l9701J5434M625r093K295
444E576o635J3216j4790M98K950Q951l2849K8780L276m2589M1805j1543j8284
457b1638R894J4100k5104P476R029j0927O742j8462L4790k7411o900L4584k1613
470a5440j3700K8314M36l5503M2964j5728p444J3515o261J2456j8868J5402M977
483E120j0459n631L1100k6257p143M2560m1938J2969J4418j2405n275J3572m086
496F545p516Q938q897J7845l0424K2412O623l3238K6216L086k1668M288K5375
509A9585l6161J5325Q350j5966R519j1105J8629j7043k39J2743l363j8470K1760
522C564M562l5377L9377j3798j0819J2196K692q036k327J3554j0516M709r289
$$ plain form
431 -13001 14546 22091 -4534 5132 25055 1719 -5011 32016 -7685 7749 12374 3281 5576
444 5576 -1059 12157 -2633 -2135 815 9766 -23083 5697 8973 -33616 8189 -3354 -21638
457 -21638 -11744 2356 -22748 -15272 -6243 -17170 -10428 -28890 5900 -21511 -28411 6173 -15440
470 -15440 -29140 -826 -390 -35893 7071 -8657 -16101 -2586 -8847 3609 -15259 143 5120
483 5120 -5339 -10970 20130 -6127 -13270 29290 -12648 321 14739 2334 -2941 10631 6545
496 6545 -971 7967 -930 16915 -13509 8903 15526 -17712 8504 11590 -10078 -5790 19585
509 19585 -16576 -1251 7099 -8867 652 -10453 8176 -8867 -9106 3637 274 -18196 3564
522 3564 8126 -27251 12126 -1672 -12491 -295 2397 -5639 -7966 5588 -4928 -219 -9508
535i508K2392k0117l760K9317k8201L784J3852k909k0397K6307p091j3345J4698
548E022n898P224j8517K0234l952j3497J0392P025j2744n140K7964k9068Q946
561b009Q423p659k348K696R824j8591J3193k152J459j0064J3012N32j9223K3806
575A0899r847l384m8J3648j5672n84J7801j7266L753L00J1661k1430J1497R284
589A0612j7475N991L805M638k1045K1127k828j2125O789O673m601j4984K7645
602A4222j7405k307Q770P83p590o28J4643j7145Q374j244O148j2298N761J1673
616A1757k2028J5555q4m597n511J6944j2956l515J6499j5448P782o508J1743j0522
630h89j639J1427o642n928N502J2493k9313K2659O80j7111J2000N44j981q837
$$ plain form
535 -9508 12884 -7233 -10993 18324 -9877 -6093 7759 4850 -15547 10760 3669 -9676 5022
548 5022 -876 6348 -12169 8065 4113 -9384 1008 8033 -4711 -9851 18113 -10955 -2009
561 -2009 6414 -1245 -3593 -897 8927 -9664 3529 1377 2836 -7228 5784 6316 -12907 10899
575 10899 1052 -2332 -2380 11268 -4404 -4988 12813 -4453 -700 -400 11261 -10169 1328 10612
589 10612 -6863 -872 2933 7571 -13474 7653 4825 -7300 -511 6162 1561 -13423 14222
602 14222 -3183 -5490 3280 4063 -3527 -4155 10488 -6657 1717 473 6621 -5677 84 11757
616 11757 -10271 5284 5200 603 -4908 12036 -920 -4435 12064 -3384 4398 -2110 9633 -889
630 -889 -2528 8899 2257 -3671 1831 14324 -14989 7670 8350 -8761 3239 3783 1802 -7035
644g035J4041p928J525o205J2515l850j7538K9033j7472m443J2304L74j4832J2951
658C440L099j5487J6149j1329J0519r901K670R677j4481N865O690n780j0846K6084
672A6369k1555O02J7406j7983O950n89L825q020N336j698M042q458J721J6185
686A4133k8825K0091K135j5519O776Q905j1886j256J4683j6361J0796p969P297
699C000j053j2238J7793r507m350P764P148k2009J7973J143j7811J8769q702K925
713H45m638O214k163j759r19N752p91j4441K5369j8387j055J4319r732k871O335
728B078L150j3088J3862p872M745m563j91J1289j8128J2142J274n783l145J4595
742A0365j2436k559J6357j6772Q289k982M726n759O14N816n498Q1j23R964j9719
$$ plain form
644 -7035 7006 -922 603 -5602 6913 3063 -14475 14558 -2914 -7357 4947 5321 -9511 3440
658 3440 6539 -8948 7201 -4128 6391 -3510 -840 8837 -5644 221 6911 1131 -9715 16369
672 16369 -5186 -4584 12822 -5161 1789 1200 5025 -2995 2341 643 4685 -3773 -2052 14133
686 14133 -14692 5399 7534 -7985 -1209 7696 -4190 -5446 9237 -7124 3672 -4297 3000
699 3000 1947 -10291 7502 -2005 -6355 1409 8557 -13452 4521 5664 -12147 6622 -2080 845
713 845 -3793 2421 258 -1501 -2420 3332 2541 -11900 13469 -4918 -5973 8346 -1386 -4257 2078
728 2078 5228 -7860 6002 -1870 2875 -1688 -1879 9410 -8718 3424 4698 -1085 -4230 10365
742 10365 -2071 -4630 11727 -5045 3244 262 4988 -771 -157 5659 161 242 119 10083 -9636
757i636J5441n0j2316J0244j188j698o683J3600j1053K386Q46J239j046p905J6200
772H381j4386K761M040R0p874N773N610j4709J2583m602J888n577P053k90q743
787h002J0868m930J700n500J1601r362l20R353q023K894k532R797j3453Q134K648
802D873o956L307P19L903j1932J3765o496j001J363J729K68q785J3811r053K04
817b81J209M676q490J698J0089j5789J0714l498J296m545L857J983p239N971k743
832a092M108j1223J4191o179o611J2267o843n48m0P403j1249P006k14k103J965
847H38n425J2080j4001O523L663m822k451P619k348r588J6359j2981M890n1o74
862c69J738n036O520m271J411m024J0764j3145M651Q676j5432J1017k092j516
$$ plain form
757 -9636 5805 5755 -6561 3683 2495 797 -5886 7714 -3339 -953 -107 1132 86 -7819 8381
772 8381 -6005 -3244 796 886 -6988 -1215 4395 -10314 2269 -2333 -445 -6022 1031 741 -8002
787 -8002 2866 -2064 -364 -5864 5737 -3625 -3945 5408 -2615 279 -2253 7544 -5909 2225 4873
802 4873 -2083 1224 1943 5846 -6086 7679 1183 182 1545 3274 3542 -5243 8568 -485 -281
817 -281 928 5604 -2886 -1188 8901 -6888 3826 328 1624 -2921 936 2919 -4320 1651 -1092
832 -1092 3016 -8207 5984 -195 -6806 5461 -1382 -1930 -1970 5433 -5816 1190 976 -1127 838
847 838 -4587 7493 -6508 15 3678 -1144 -3595 4024 1676 -7912 8447 -4534 356 305 -369
862 -369 1369 -3667 2853 -1418 -7 -4031 6733 -6412 -1761 6915 -8517 2500 408 -1108
876a108k720P840o940J440L277m456P245j2288J3677n801n446R256j510o364L865
891c3Q157j6010J3600m262j814K826m169P550q469M126R07J152q695J1423l270
906C019r855J5865j1683L092O76R21l683K628k79k701N165q528J1306j1160L822
921a395N187r125M960J249k341m986J2491j2014L899L441n783N227o773Q793o427
936c597N29J550K977p539L061Q819j6107J2181k556j623q00L023j60m502N302
951E58l774N342r493J0143l037o337J0102o109J079j150N892q615O481r07l113
966b938N202o324P638p580N748j583j192P43J247N39o118J2015j0497L793J524
981B217j101q18q95O417q922N849k532L598o242L714M007r520P777k922J602n588
$$ plain form
876 -1108 -3828 4012 -2928 -1488 1789 -2667 4578 -7710 5967 166 -5280 3976 2466 -3898 -33
891 -33 8124 -7886 5714 1452 -362 2464 -1705 5845 -2624 1502 2409 3561 -5134 6289 3019
906 3019 -6836 9029 -2654 438 1114 2035 -1648 980 701 -2000 3165 -5363 5943 -5217 -1395
921 -1395 3792 -5333 -373 876 -1465 -6451 6040 -5974 -2075 1366 -4417 810 -5963 2830 -3597
936 -3597 -3068 -1518 1459 -6080 -3019 5800 -10307 1874 -682 -2305 -3105 -82 -242 -4744 558
951 558 -3216 2126 -7367 2776 -261 -6598 3504 -2605 -1526 -2676 3216 -5399 1082 175 -2938
966 -2938 2264 -4060 3578 -4002 1746 163 -1029 -286 961 1500 -4618 7397 -3100 693 2217
981 2217 1116 298 -597 5820 -3102 2747 215 3813 -2429 1285 5292 -4228 3549 627 2229 -3359
997c359P400l255m025O107m037K618n889Q609p139J277K742k923K123m204P162
1012C207q158N237j427k26l77j38L622p765R451o180J543Q97M30o58j958O283
1028C783p108N659m192N177m478K56O657q777N249r11K133o456P902l191l067
1043a364O038n342N128o644O496k812j523K112M00j064l729R748j1260O068K17
1058B469l281K656k109K851m569M686m688M968n021K694K827q961R917n215K53
1073e23M00K855n371L293K292o885P847o782N934m067K36L672m073J004Q26K621
1089C279q475J0787o547j076N770n508L427k931L694l861L468l367L873k199l376
1104c042R370j0633N996J36j936q18L305j706k963O577p604O949n484L001J267
$$ plain form
997 -3359 4041 786 -3239 2868 -1169 1449 -4440 4169 -2970 -1693 1049 -1874 249 -3955 3207
1012 3207 -4951 286 -1141 -1367 -1744 -1882 1740 -6025 3426 -2754 -1211 -314 116 -542 -2500 3783
1028 3783 -3325 2334 -1858 3319 -1159 -903 5754 -3023 2226 1315 3448 -3008 4894 1703 -1364
1043 -1364 4674 -668 4460 -2184 4312 1500 -23 2089 2489 1425 -2304 7444 -3816 2252 2469
1058 2469 -812 1844 -265 2586 -1983 2703 -1985 2983 -2038 656 3483 -5478 4439 -776 -523
1073 -523 -123 2732 -2639 654 2946 -3939 3908 -2874 3060 -1007 -771 2901 -1172 -168 658 3279
1089 3279 -5196 5591 -956 -2032 3738 -1770 1657 -1274 2420 -1441 2027 -1340 2533 334 -3042
1104 -3042 6328 -4305 1691 1827 -109 -927 2378 672 -2291 4286 -3318 3631 -1853 1148 2415
1119B415n332N372k119J42k343O677r074N530J458o528O674m739L685l350K537
1134A005j746J284j917N30L942q821R887n793k63K739j317q60k12L500o182O403
1150B179n251L977j753j811N446o425M076j217J703m737O133k865k542O069o629
1165c647N508m301M070k488M10J267o95J193m474P483q263M676L45k188J600j107
1181f11K814m791N548m318J875j313Q71J363n089O148m742K607j747L230l488
1196a643M89L385n867N119l626L601l885K382O24l047L808l618L878n067N400
1211A933l095O1J830k442K899m366N812n328K872R4j423J244j597L413n408N575
1227B074l897K197j024N0K003m608N562m130K199k087L394k589q43M691n963M532
$$ plain form
1119 2415 -2917 2455 336 478 -1865 4812 -4262 1268 2726 -3802 2872 -1867 1818 -1532 1005
1134 1005 -741 543 -1374 -844 3098 -5723 4164 -1629 -1892 847 -470 -1330 -1542 1958 -4224 2179
1150 2179 -3072 905 -848 -2659 2787 -3638 438 -779 924 -3813 2320 -545 -3087 2982 -3647
1165 -3647 1861 -2440 1630 -858 -448 819 124 1317 -3157 4326 -3937 739 1084 -1104 496 -611
1181 -611 2203 -2588 2960 -1358 517 -796 75 1438 -3651 2497 -2245 362 -1385 1845 -1643
1196 -1643 -1154 2231 -3636 1483 -2143 1458 -2427 -45 579 -2468 1340 -2278 1600 -3467 1933
1211 1933 -1162 -1101 729 -1713 1186 -3180 2632 -2696 176 270 -1153 91 -1506 1907 -3501 2074
1227 2074 -1823 374 -650 -600 1403 -3205 2357 -1773 426 -1661 1733 -856 -1699 2992 -2971 1561
1243A561k970K882k718J098J425k436K120k330M670o377N263j209k216L243k369
1258c63J760k344L739m654L881k036M7K461m884N553m702K634q52L13j594J800
1274G59M64m626P112o280L467j169l16R23j889K169k382K728m360N980n159Q02
1290a777L549n559M048j763J601k760L274k353R18K67k475N421o529M650j163
1305f51r69P54Q98j127j108M238o142N961l460O04J792l078L055k290J915k277
1321a885L661m777L970n42l577O217n322K719j016J533k199K138k37j544L227
1336B366m785O022m697J598J863k353Q01K96J472m103N586m256K159l0j748L397
1352C588m021L283k040J632k280K837k030q71L779n179M414k891J000p30M89k72
$$ plain form
1243 1561 -1409 1473 -1245 -147 1278 -1158 962 -1368 3302 -3075 2188 979 -1237 2006 -363
1258 -363 1397 -947 2792 -1862 2019 -17 30 2491 -2393 3160 -1542 1092 240 553 -1041 759
1274 759 1223 -3403 3709 -2571 896 -273 -589 334 -1555 614 -1768 960 -3400 2580 -2579 -1777
1290 -1777 1772 -3787 261 -1502 99 -2661 613 -1740 -822 -555 -3030 2391 -4138 512 -651
1305 -651 -1620 -866 32 -1095 -2203 2035 -4107 1854 -1606 -1002 790 -2288 767 -1523 392 -1885
1321 -1885 1776 -3001 969 427 -3150 3067 -2255 464 -552 981 -1218 920 683 -861 2366
1336 2366 -2419 3603 -1094 504 2367 14 815 1111 2583 -1520 4066 -190 1969 1939 191 3588
1352 3588 -433 2850 810 2442 162 2999 969 98 3877 -1302 3112 221 1221 491 980 708
1368G08r81J884l259L977m358K969r91j517K809k766J717k198L349l888K906j155
1384g94n20K071l027L777l490K610j573Q70p01P60J485l668M915l864K422r92
1400B81O02J63j373K824l150K878k475K780j621j99K052l263L076k594K685k809
1416a43K368j150r71J700k258K620l069L073k889J735m83l10O08k292L354l269
1432a376K169j951J477l42j009K476m042L599k868K308j013N24m34r20K729l776
1448b449M031m164K761o72j304K771k843K177j332J822k128J721o75j84J520k593
1464a541L002l841L074j153M90q02J79Q33k145M059m510L107r16k76J018j451
1480h73J663k106K593k971L159k281L29J752l426L298k088J629j702J934j869
$$ plain form
1368 708 -273 1611 -1648 2329 -2029 940 -51 -1568 1241 -1525 192 -2006 1343 -2545 361 -794
1384 -794 -1314 757 -2270 1507 -1983 627 -946 -76 -777 -17 1468 -2200 2715 -1149 1273 281
1400 281 883 1046 -327 2497 -653 2225 -250 2530 909 710 2762 -501 2575 -19 2666 -143
1416 -143 2225 1075 104 1804 -454 2166 -903 2170 -719 1016 533 223 831 -1461 1893 -1376
1432 -1376 793 -1158 319 -23 -1032 1444 -2598 1001 -1867 441 -572 -48 -482 -1402 1327 -2449
1448 -2449 1582 -2582 179 -493 -1797 974 -1869 308 -1024 798 -1330 391 -284 -468 1052 -1541
1464 -1541 1461 -2380 694 -459 31 -771 -592 241 -1904 2155 -2355 752 -164 -440 578 -873
1480 -873 790 -1316 1277 -1694 1465 -816 -487 1265 -2161 1137 -951 678 -1024 910 -959
1495i59R10Q07k970M079l812K975j508%O74n67j6m92K096m169M424k560m8J760
1513F24j958J689j848J806k146K685k912K159m10k146M034m214K419q98O73j143
1529a586J463k45j228K466l698M023l027P89J015j328J066q53J244k363L566l701
1545b397K480j73j972K871k460J986j678J817j605J297n82q39K834l784L842k578
1561i41Q54r3J69j12m53J890k946L217k953K671r24j288K013j781J450j617K379
1578A535k727K305r13p05J858k365K620k420J754j104O44m69k36J196k170K986
1594A789l147K024n53l24K89m77J148k171K739k429K103j461L23P50j708K379
1610A274k460K284k008J547q13k0R25j882K601k702K300j533Q76k49p44J532j844
$$ plain form
1495 -959 -49 758 -2212 1867 -1945 1030 -478 -478 196 -371 -387 -879 1217 -2952 1472 -1088 -1136 624
1513 624 -1334 355 -1493 313 -1833 852 -2060 99 -311 -2457 1577 -2637 -218 -1116 -443 -1586
1529 -1586 -123 -368 -1596 870 -2828 1195 -1832 -1043 -28 -1356 -290 -1143 101 -2262 1304 -2397
1545 -2397 83 -90 -2062 809 -1651 335 -1343 474 -1131 166 -416 -1255 1579 -2205 1637 -941
1561 -941 -87 -180 -11 -123 -576 1314 -1632 1585 -1368 1303 379 -909 1104 -677 773 -844 1535
1578 1535 -1192 1113 200 -505 1353 -1012 1608 -812 942 -162 482 13 -223 973 -1197 1789
1594 1789 -1358 666 113 -211 78 -399 749 -1422 1317 -1112 991 -470 -147 603 -1105 1274
1610 1274 -1186 1098 -910 637 -176 -196 729 -1153 1448 -1254 1046 -487 389 140 -604 928 -916
1627i16K424k687K489j665O48j42n68J470k360K597k128J586r71M07K23j067J681
1644A021k223K523k515J972j127j09J564j902J995k013J944j893J806j007q8J337
1660A285k054K360k198J708j080O70k26k60J261k245K869k969K269j083k18R56
1676A045r64P83j414K235k603K402j688M17P84k182K577k249J423j001J138j108
1692d05K19N84j920K650k646K367j501M80R7o5O01j278K029k750K860j903O70
1709H9R99j609J682j331J170j333K132k357J634j1j390K531k698K246j434N68
1725H88n60Q30l54p91J903k793K808k241J010K2r31Q30j108J182j843K356k506
1742a298J571k81j284K133k477J741j294J494j634J468p15l86J534k545K699k491
$$ plain form
1627 -916 1508 -1179 1310 -355 293 151 -417 1053 -1307 1290 -838 748 -223 184 407 -660 1021
1644 1021 -1202 1321 -1194 778 -349 -458 1106 -796 1199 -814 1130 -763 1043 36 -52 1285
1660 1285 -769 1591 -607 1101 21 691 465 205 1466 -779 2090 -879 1390 307 89 1045
1676 1045 81 864 -550 1685 -918 1484 -204 213 997 -1185 1392 -857 566 -435 703 -405
1692 -405 -186 398 -1522 1128 -1518 849 -652 -172 -75 -140 461 -817 1212 -1538 1322 -581 89
1709 89 1088 -521 1161 -170 1000 -333 1799 -558 1076 1065 -325 2206 -492 1754 320 888
1725 888 328 1158 804 13 1916 -877 1931 -310 700 722 -209 621 -487 695 -1148 1208 -1298
1742 -1298 273 -8 -1292 841 -1636 105 -1189 305 -1329 139 -576 -962 572 -1973 726 -1765
1758a765J477k32j97n6K74J276k456K681k385J429l28p54O84j64O65j112J487
1775E24j593J582p32l64J422k317K617k282J811j082N09n45Q0P63j947K470k193
1792a277J744j052K0N68r33J056j469J803k062J853q61J28R90j713J854j999J848
1809D98j133P53k73L7P72j671K096k005J932j448R68m05j78Q15j073J698k313
1826i30K181j583O66R4o55J056j926K312k116J717j083K13K94j044J677k076J915
1843G12j934J603q85j63P53j315J539j486J292j222J081o63n8O93j418K040j995
1860a426J467j221J137l47m80J372j542K146k643K138j297L98O08q51J281j579
1876h39J641j534J571j160K42Q57j456J635j779J763j301J001q66L73N97j537
$$ plain form
1758 -1765 -288 -520 -717 -773 -499 777 -1679 1002 -1383 46 -282 -1036 -352 -516 149 -963 524
1775 524 -1069 513 -219 -583 839 -1478 1139 -1143 668 -414 95 -450 -370 393 -1554 916 -1277
1792 -1277 467 -585 -565 3 -930 126 -1343 460 -1602 251 -610 -482 508 -1205 649 -1350 498
1809 498 -635 118 -155 -118 654 -1017 1079 -926 1006 -442 526 121 -57 758 -315 1383 -930
1826 -930 1251 -332 334 428 -227 829 -1097 1215 -901 816 -267 -54 240 -804 873 -1203 712
1843 712 -1222 381 -504 -667 86 -1229 310 -1176 116 -1106 -25 -688 -746 -53 -1471 569 -1426
1860 -1426 41 -1180 -43 -390 -870 502 -1040 1106 -1537 601 -696 -298 310 -541 740 -839
1876 -839 802 -732 839 -321 -79 778 -678 957 -822 941 -360 641 -225 148 745 -792
1892g92K036k394K339j737R09j22k21M91j086K004k565K247j814P99M40j074J139
1909E99j162J492j636J584j339O98k3j047J866k245K123j233Q34q78N51K9o01
1926c88J564k406K297j748R76k42o17J047q72J142j691J724j811J664m06p22J420
1943I31j874J464j164J346j255R90l90k66J246k016K202j865J088k67J3Q8m50
1960a79R48j659K122j973J609q24j17O53j013J116j292J392j449J345q57k09J224
1977H37j680J934j931J502q38K90J60n67O30j175J959k139J673r24J38N88j226
1994g69J416j392J325j380J415j267L43P82j253J477j454J525j436J007r54O85
2010G0N01j322J737j873J774j446J056l41l77Q16j086J497j792J614j274Q39J43
$$ plain form
1892 -792 1244 -1150 1189 -548 361 239 18 509 -577 1427 -1138 1109 -705 94 534 -540 599
1909 599 -563 929 -707 877 -462 236 213 -834 1032 -1213 910 -323 511 -367 184 213 -388
1926 -388 1176 -1230 1067 -681 295 53 -564 483 -389 753 -938 786 -1025 639 233 -489 931
1943 931 -943 521 -643 703 -552 438 48 -218 1028 -988 1214 -651 437 170 183 271 -179
1960 -179 769 -890 1232 -741 868 44 -73 580 -433 683 -609 783 -666 679 -178 -387 837
1977 837 -843 1091 -840 662 -176 114 274 -293 337 -838 1121 -1018 655 -269 -131 457 -769
1994 -769 647 -745 580 -800 615 -652 -309 473 -780 697 -757 768 -668 339 -615 70
2010 70 571 -751 986 -887 887 -559 497 156 -221 595 -491 1006 -786 828 -446 393 536
2027E36o50J139j530J667j723J406r47L17L30q33J505j835J770j312R55p14J34
2044B15L09p86J271j589J547j853J329m09k77N77j238J757k013J582j084N03k13
2061c72o3Q44j573J828k022J802j200O92k43o06R47j349J599j290J355q59M13
2078i7L47p22J294j847J767j542J458q06M39J54r95J688j795J880j487Q21m57
2095A00%Q25j266J247j714J968j374O79P9r02R46j276J464j380J495j514R18m16
2113a21p26J415j736J845j405Q04o54L23j13l64J332j915K104j930J208m31l09
2130f73Q47p92R42j125J232j529J445l89p40J159j383J536j306J216j151J027
2146C16m18k68R13j300J779j789J071m21J99R2n62R93j322J584j726J348p45K8
$$ plain form
2027 536 -114 1025 -505 1162 -561 845 -102 215 545 -288 1217 -618 1152 -160 795 81 215
2044 215 524 -262 1009 -580 967 -886 443 34 -243 334 -904 853 -1160 422 -662 -159 -372
2061 -372 -435 409 -1164 664 -1358 444 -756 -64 -307 -913 34 -1315 284 -1006 349 -510 -97
2078 -97 250 -472 822 -1025 742 -800 658 -148 291 445 -550 1138 -657 1223 -264 557 100
2095 100 100 925 -341 906 -808 1160 -214 465 544 -358 588 -688 776 -604 891 -623 295 -121
2113 -121 -847 568 -1168 677 -728 76 -578 -255 -368 -732 600 -1315 789 -1141 67 -364 -673
2130 -673 174 -618 324 -801 431 -1098 347 -42 -782 377 -1006 530 -776 440 -711 316
2146 316 -102 -370 543 -757 1022 -767 304 -117 82 174 -388 605 -717 867 -859 489 -256 -228
2164b28N04q55J352j560J612j531J280j030L50P21j272J574j798J430o66N66m83
2181c4J79M92j400K035j888J421j092N73P3o21P10q71J400j737J681j067M87n3
2199B88p70J298j451J217j290J232j209M23L89r91J330j697J717j433R25n09Q8
2216d43N00j105J361j389J620j583R16k33l43R61j109J294j290J199q24L01K31
2233F4m13J084j785J813j206P46n61O70%n81J130j445J453j482J331p05J85J80
2251D78o24J528j973J694j533J053n30k63O41n89J671j913J127q49M10m48j17
2268b37Q03j357K086k357J573j456R20O61j268J950j538R87j472J224j176N14
2284a43L41r27J575j946J691j429J056o46P3J5m00J219j538J789j424R82l02l26
$$ plain form
2164 -228 276 -579 773 -787 825 -706 574 -456 -106 615 -657 917 -881 549 -117 449 -34
2181 -34 145 637 -763 1272 -616 805 -287 286 359 -262 448 -423 977 -760 921 -146 341 288
2199 288 -482 816 -635 582 -708 524 -685 -262 127 -864 466 -1231 486 -947 -22 -531 -443
2216 -443 57 -1048 313 -1076 544 -1039 -123 -356 -699 262 -847 447 -843 356 -468 -167 64
2233 64 -349 735 -1050 763 -443 303 -258 412 412 -169 961 -484 969 -513 818 113 298 478
2251 478 -146 1382 -591 1103 -430 623 93 -170 471 -118 1553 -360 767 -82 328 -120 -237
2268 -237 566 -791 1295 -1062 511 -945 -25 636 -632 1318 -220 767 -705 519 -657 -143
2284 -143 198 -729 846 -1100 591 -838 218 -428 -355 -340 -740 479 -1059 730 -694 288 -14 -340
2302c40Q30j231J350j316J232j203R50k30n03J240j374J188j201Q08o20O34j55
2319E9k72J058j767J731j469R84m15K20K27p90R94j080J432j378R40o25L5N59
2337D43j036J245j454J184p82Q34n18j35R15j615J566j361J260q84K9M78m70R33
2355F32j479J471j324J256r52L54L90q06P24p64J123j330R27n43K93L25j004J312
2373F05j455J633j217O00k00M3J18n27J163j661J601r45Q2M29m73P65q44J212
2391I29j565J215q78N74J55q54J240j441J538j541J209o61O15m4p11J096j568
2408f92J374j066O71k30k79N80p49J117j517J696j478O72l6l97P40j089J383j427
2426g27J315j081M63J00o79Q89j312J440j023R49p00qM04o30J054j132J395j391
$$ plain form
2302 -340 490 -741 609 -707 525 -678 272 42 -461 779 -595 593 -608 200 -420 214 59
2319 59 -213 845 -922 809 -660 324 -91 129 356 -434 560 -520 912 -466 474 -151 -116 443
2337 443 -593 652 -802 382 -400 434 -84 -219 696 -919 647 -714 546 -338 -309 169 -301 632
2355 632 -847 624 -700 556 -396 -42 348 -458 266 -498 625 -705 222 -321 -28 297 -707 605
2373 605 -850 783 -434 166 -34 9 127 -400 763 -898 703 -242 -160 269 -204 561 -283 929
2391 929 -636 579 -299 275 430 -424 816 -625 913 -628 581 -80 535 491 -220 876 -692
2408 -692 682 -384 287 57 -222 358 -391 726 -791 905 -573 99 63 -334 406 -683 700 -727
2426 -727 588 -493 -30 70 -609 280 -1032 408 -615 334 -366 -374 30 -600 454 -678 717 -674
2444f74J108p47J81N82j063J162j208J546j353O10j57M2L80q72J032j087J182
2461F64j211Q49Lp55P72p43J073j407J293o90J32L15p84J099j318J417j448J198
2479D59p15K91K34p47J241j368J220j220N84k33l1M83q01J084j212J414j294Q96
2497B85m91m48J152j113J266j336J313j208N85K10o50J067j361J490j277R11p82
2514c87M24j65j36Q84j340J552j280N57l69J98M37r25R79p72J009j392R36l6k44
2533g0K55o72J198j699J820j367J415j043q7N98j326K211j546J184o72K50M11
2550H60j621J555j669J779j324R59n31r6P35r34P16r90Q89p37R54o80m30N89p69
2569g45J266p50J384k120J585q12M36J28j068J276k174J683r32K028q00j092J302
$$ plain form
2444 -674 434 -313 -132 450 -613 549 -659 887 -466 144 -13 29 409 -463 569 -518 664
2461 664 -547 302 305 -450 322 -421 652 -755 538 -152 -20 295 -489 610 -708 709 -739 459
2479 459 -256 35 269 -478 763 -605 615 -605 -21 -254 -285 198 -603 481 -731 683 -611 285
2497 285 -206 -654 498 -615 651 -685 628 -580 5 215 -435 632 -729 761 -516 395 -387
2514 -387 37 -128 -264 620 -720 832 -448 109 -260 -62 375 -550 429 -343 666 -726 210 174 -70
2533 -70 185 -487 711 -988 832 -535 880 -163 -250 348 -978 1233 -313 871 199 449 860
2550 860 -761 794 -875 904 -420 539 8 -88 647 -287 429 -561 328 -409 545 -135 -565 24 -745
2569 -745 521 -229 1155 -965 620 -192 244 372 -696 580 -1594 89 -843 1185 385 -707 595
2586E95j381O94p31J524l88P38j287Q7J39q03R80j067Q82l10n4O89j366J349q77
2605e87P79m52J124j344K00M89r32J440j543J763j210Q44l91o2J51p87J296j394
2623f16R77p73O07J13l48Q90j397J370j328J161m92J9Q8m00Q77j225J095j031
2641d13Q05j62j61K58m83O71p39P18q62Q53m60k25M21q87J342j320J184r36M55
2660E9k0k28Q69j186J168j189R75q27M82j6j66N87j126J218j245J010q36L51L19
2679A99p03J254j501J228p08N30k79o4K00o41J181j391J452q67L19j21m95P07
2697C00p91J065j004P98p39N34J20o67Q86j140J361j263J311r37J10L49n45J040
2715G88j491J522j292J155r18l2N50p93R72j130J202r42P55l24j4M79r97R23r19
$$ plain form
2586 595 -786 -92 -823 701 313 1051 -236 -149 -10 -813 167 -900 -18 -328 -382 307 -1059 290 -587
2605 -587 192 -260 864 -480 -280 209 -723 717 -826 937 -273 571 180 118 269 -518 778 -616
2623 -616 361 -412 195 308 -40 850 -547 823 -505 656 164 183 271 -129 748 -477 618 -413
2641 -413 392 230 69 327 -156 515 -224 494 -368 485 25 -200 221 -666 676 -644 540 -396 59
2660 59 39 -189 680 -506 662 -527 448 -379 103 87 -79 508 -618 600 -645 365 -471 -120 199
2679 199 -504 750 -751 477 -231 299 20 -44 156 -485 696 -695 757 -110 209 88 -407 300
2697 300 -491 574 -430 368 -371 163 283 -384 502 -638 723 -540 771 -166 -56 293 -252 788
2715 788 -703 819 -473 682 -236 -268 282 -511 461 -669 533 -409 346 22 8 487 -510 413 -506
2734e06R68p21N40l38l47Q67r22J347j584R21m55J26K15o15R82j190J110r36Q43
2753C05n28J08M64n92R36j544J631j189J012q26K19K79j001J432j385R72k85K04
2771B12o7j76M37o34J017j409J256j116N84k7l04P56r60J027r38J059p97J99p8
2790D1n02R20j061J137j062P98n30qL77n53J154j412J206j020P37n74k28P37q57
2809g00J117j387J362r88N68p3k10P92j224J264j156J021q41J57L74n30R36r72
2827d90J093j121P76q79P07n4m77Q18j068J256j033Q44l10j54L22l95R10j293
2845e48J365q62L29o08o4P26q17J009j348J103o31M23Q8l57O78r81R38r31Q19
2864C31o26M50O7o26Q87j211J332j422J093o53L78K22p90J124j402J289p43N42
$$ plain form
2734 -506 462 -259 281 -57 -404 463 -459 888 -696 225 -230 -104 111 -504 478 -712 398 -538 305
2753 305 -223 -115 349 -243 693 -851 780 -409 603 -223 -4 275 -726 706 -679 293 8 212
2771 212 145 -31 406 -228 789 -620 636 -480 104 77 -227 529 -431 596 -342 717 -80 119 41
2790 41 -461 459 -602 535 -527 271 -259 -267 110 -443 711 -701 505 -515 222 -352 -580 157 -700
2809 -700 417 -970 392 -596 -28 -101 -311 481 -743 521 -635 386 -455 -298 76 -454 482 -490
2827 -490 603 -518 258 -621 86 32 -445 373 -695 561 -472 372 62 -92 230 -165 745 -548
2845 -548 817 -45 284 -324 -388 338 -479 530 -818 285 -346 77 165 -192 486 -495 443 -488 331
2864 331 -295 155 222 -404 483 -728 604 -818 275 -378 0 222 -568 556 -846 443 -300 242
2882B42m23M7M22j007Q42o34P71q30O21j38k62O08q11R58j171J176q21L05Pl36
2902d34R99j215J324j651J351n51J42O1k59P85j181J220r91P96o84K73K26o05
2920c94Q16q96Q71p32P86m35J3O03r39Q25q83R06q98N21rl38O19r89J351j364
2940e66J098q88M97j51l55Q99j118J259j063P59o91J92K38n06R77j369J452j227
2958e63Q19m90K96Q4j138J603j358J176j029N81J5l70P70j010J194j614J511n60
2976h3L0J44n84J116j123J208j314J086q43M57J67n90J057j335J177q29N36j99
2994G8K18J92q75J187j242J065r80Q10m90K55M96j043J275j470J347j032M37j31
3012I7k43P51j118J208j228Q49l85J23J16o90J250j283J051q40Q38o75L25J33
$$ plain form
2882 242 -181 -134 288 -719 123 -511 260 -570 51 -87 -349 259 -552 406 -765 411 -410 -105 -98 -434
2902 -434 565 -650 674 -977 374 -177 -35 26 -233 552 -629 591 -400 396 -288 -15 211 -394
2920 -394 422 -474 397 -335 451 16 29 632 -307 518 -365 541 -357 164 155 -183 436 -553 798 -566
2940 -566 532 -356 141 -10 -365 534 -584 675 -388 371 -320 -128 110 -396 581 -788 664 -563
2958 -563 256 -234 62 146 -992 611 -747 429 -600 -19 -4 -374 396 -614 580 -1034 477 -83
2976 -83 -53 91 -493 623 -500 708 -606 480 -363 94 261 -329 728 -607 570 -259 277 78
2994 78 296 488 -387 800 -442 623 -357 453 -37 218 714 -329 946 -524 823 -209 228 97
3012 97 -146 605 -513 695 -533 316 -69 54 170 -520 730 -553 498 -342 496 -179 146 279
3030B79o43R71j159J077q33O65j91n81O42o78P35r79J075q27M36q6k23O35q80
3049e65R83j028Q23p86O33p1l07P40j140J352j160R86o16K04N6n28J003r75O83
3068B87o95Q33l36J04Pn93R97r59J163j191O75j33l43M21o49Q89r97J038p73M50
3088A95j5l92R11q24P32q83P06o83L99o0m25Q26r06J014j208P88m65L86n4n00
3108d58P55j134J422r70K90k9k0K73q10J262j415J309j384J086k41l99P16p60
3126e07R26j076J015q79O92k03l01N08p65J084r83Q50m39j31L68n19P59j082J029
3145C46p80R70o08K78J39q74J209j112R94p82L63k89k03P22p22R26q61J039j289
3164e34N51O4l76N90q91J365j075R95j147O15K2m61N61n89P62p98N83m53K08L83
$$ plain form
3030 279 -364 607 -552 525 -308 357 166 -415 227 -451 284 -695 380 -447 -11 -97 -320 315 -565
3049 -565 418 -610 213 -573 60 -11 -318 422 -718 634 -526 460 -156 48 104 -424 579 -396 287
3068 287 -408 425 89 193 200 -393 604 -355 808 -383 292 159 -184 237 -412 477 -520 518 -255 195
3088 195 180 -212 699 -125 607 -276 430 -253 146 86 -339 487 -419 595 -613 175 -290 96 42 -458
3108 -458 297 -837 585 -385 -95 -124 -144 129 -681 581 -834 475 -909 177 -64 -463 253 -507
3126 -507 419 -657 358 -521 171 -32 -333 175 -590 494 -489 361 -78 -209 159 -360 399 -683 346
3145 346 -434 536 -72 206 345 -529 680 -432 562 -220 143 -146 -349 373 -349 577 -284 755 -534
3164 -534 17 81 -295 295 -596 769 -306 689 -458 157 179 -282 279 -310 452 -346 237 -216 -8 375
3184C75n78N08j026J117n90L78l63J7L74p61J165j310R38m56K25l3j49M75q07
3203e01Q87r26J027q43O52j60o27N50o73J143j022R13o01L73n5n00M82p31J077
3222D65p81O20o22K75J96k24P40j143J164p71M74k05m38O06o01Q67r86P57p52
3241c59O72k20k97L91o66J078r47J070r89N33k22j64M75q31J009j065Q07l87j7
3260a29L47o69J069j112J070j043O75k24j58L94p91R89j108J069o26N46n94j83
3278d78P69p12Q79j147R05o39O32n9l40M44o00Q56p22N09o99N18l3l17O98q31
3298c67R24p41M90k91K7J67k27N66j146J132q72P66m29j38N92q59Q76j065R46
3317C51n69O84k90l62M40p90Q30o63O36o39O15l33m7N11p75P32m24M68p53L94
$$ plain form
3184 375 -203 305 -721 396 -194 184 -179 -162 212 -549 616 -694 244 -212 13 -20 -169 306 -501
3203 -501 386 -540 487 -356 296 136 -491 59 -614 529 -493 420 -181 192 137 -363 119 -612 465
3222 465 -316 304 -318 -43 153 -71 669 -474 690 -81 393 188 -250 356 -245 622 -364 393 -359
3241 -359 313 93 -204 187 -479 599 -348 722 -267 266 44 -120 355 -476 533 -532 275 -112 -129
3260 -129 218 -451 618 -494 576 -467 208 -16 -174 220 -571 418 -690 379 -247 299 -295 -478
3278 -478 291 -421 458 -689 216 -423 209 150 -190 254 -346 510 -212 297 -402 116 83 -234 464 -367
3298 -367 557 -184 306 15 42 209 -18 548 -598 534 -338 428 -1 -139 453 -406 470 -595 351
3317 351 -218 466 176 -186 254 -536 294 -369 267 -372 243 -90 -137 374 -401 331 -93 375 -378 16
3337A6K4m65J053j068Q18r26O65m51K37K40o07Q14j060J039q70O33k60P2L94q49
3357e51J165q17N03n57K00L8l24O66q07J038q13O07o86M54O8n44P89q39Q18q38
3377d30Q49o33J67J72l31N50p92J059j035Q07l54k81P12q00P98r61Q11n13K63
3396E8j30o1M58o52O38p86P64m17N4K71p35R20o69P01j081J030p47K04J63l04
3416c21M71o51J112j045O82m90J14j03j99Q96j033R85m45J45j16k22N21n28O90
3435D63r71O61m81M61k12k80Q11r26R11o35N26m62K52J18n96Q93r34J047q73P25
3455D98o96R9L91m98N45o34P52p51O88n51L0L70n17P22q89P13l49J92j1l04O95
3476D95n97M00p27P32m67J61P2l93O18m56N15q36P35n13J28J11n18J029r37Q38
$$ plain form
3337 16 40 -425 628 -440 378 -548 117 -334 -97 143 -464 350 -710 329 -541 92 -168 -96 298 -551
3357 -551 614 -203 300 -257 -57 -19 -343 323 -484 554 -259 348 -338 116 184 -360 429 -410 408 -430
3377 -430 419 -214 -47 125 -206 344 -448 611 -424 383 29 -252 460 -340 458 -503 308 -205 58
3396 58 -72 -133 325 -327 311 -475 289 -128 -74 197 -538 382 -287 414 -667 363 -384 -180 -17 -321
3416 -321 150 -501 611 -434 248 -242 -128 -231 -430 466 -567 418 -27 118 2 -220 301 -227 463
3435 463 -508 153 -328 133 -79 -359 452 -474 437 -198 328 -134 118 236 -360 533 -401 646 -227 498
3455 498 -198 -99 292 -206 339 -295 457 -294 394 -157 -127 243 -274 448 -441 272 -77 115 104 -200 495
3476 495 -102 298 -429 303 -164 -3 69 -324 294 -162 353 -483 252 -261 -133 -22 -540 489 -448 390
3496C90q94P34k67r2L06l27M55j038J094q00M34k15o9M99p57J153q37N91m39K07
3516A28k61J49L37p80J116j259P65m46L39O7m15M60n50Q84r21P16l77L14j66k49
3536a49N20j014J227q49M63k22q6N13n66O27p42M41k37J94k30J82P8m68R67j100
3556d51P13n88M87j85j35L51p15P82o59Q44l99k6O6j49K08m08M66q45N78R9k72
3577b38O45p40O87q06O62m16K36j85K01K4l54Q77r84P98p35N54J50m96N37n50
3597a33N49n88M81n97M84j96k30N84q08Q85o39M24j87K01J40m01K37m21O84p53
3617b84N15o7n1P7l86N56p25P02q93P07k84JM44q75Q31o46M73m06K67K82l32J83
3639H9m72P47o69O47n80M55n25J21M85j071J015n35N19o42L97L9k41M48p92R75
$$ plain form
3496 390 -504 230 -37 -129 177 -150 305 -733 361 -439 -5 -220 -289 210 -547 606 -231 360 -79 128
3516 128 -133 16 353 -427 689 -570 195 -251 88 155 -260 200 -350 534 -387 329 -48 266 100 -149
3536 -149 371 -643 584 -265 198 -24 -110 403 -163 464 -278 163 -74 120 -110 72 150 -318 649 -451
3556 -451 262 -326 161 -24 -159 192 -523 259 -400 444 45 19 85 -64 144 -264 202 -643 -65 34 -238
3577 -238 407 -333 354 -452 210 -206 30 -155 46 70 -284 593 -391 407 -328 226 376 -120 417 -133
3597 -133 416 -172 309 -288 196 0 -230 354 -454 431 -208 216 29 230 370 -31 206 -215 469 -284
3617 -284 231 164 113 190 -196 360 -365 337 -556 151 -133 -132 312 -563 268 -378 95 -311 -44 238 -94 89
3639 89 -383 364 -305 342 -238 217 -308 -187 298 -773 242 -293 226 -416 -19 20 -221 227 -565 410
3659D10r21P32j46j16K39l87Q18q38M68m07K53l0j90N96p53P17m74J79ll1M8k02
3681c8M33p30P13l96K19k86L94K30q36L29l31P46n53K50l58M8M59q65Q59o39P14
3702C62n43M96n42j01N35n71Q32p95M27m28M18k22J4J65n93Q54o49N23l72M2m1
3723a89j60N37p58P01m86N57m02P0K54p39J016q04Q71q02L96K5j68J94m36O30
3743C07o20Q94r09M16J02m43N38n66P02p54Q95m99JJ66l35K75l16Q12j078O36
3763B24k87K87o8m31N47p27P28m62L37l87J34nj15P08r48R23q80M31K5j47Q3l86
3785d16Q67p28M24m17K57Pk89P48o86N39p82N29m21J39O1j13N82p22Q45p21L65
3806F8l52J91K01l32N27m58L09n35N51k21O6K31l10K50m53M39n07M27l6k77L91
$$ plain form
3659 410 -511 221 75 -41 198 -189 629 -209 259 -148 105 75 -115 481 -272 445 -29 150 147 116 164 -38
3681 -38 395 -335 378 -18 201 -85 309 539 -297 32 -299 447 -106 144 -214 -166 293 -572 287 -352 362
3702 362 -181 315 -227 -328 207 -364 468 -327 100 -328 90 -132 -118 47 -546 308 -341 182 -190 -148 -189
3723 -189 -349 188 -570 131 -355 202 -200 -130 124 -615 401 -403 468 -334 62 87 -81 113 -323 307
3743 307 -313 581 -328 88 190 -253 285 -281 421 -333 562 63 64 230 -105 170 -146 666 -412 224
3763 224 -63 224 156 -275 272 -455 273 -189 148 -239 -105 -110 -225 483 -465 458 -422 9 34 -113 -30 -416
3785 -416 451 -277 147 -270 -13 -6 -295 453 -233 306 -476 53 -368 -229 -168 -281 301 -421 424 -297 68
3806 68 -284 -93 108 -224 303 -155 154 -381 170 -51 15 246 -64 186 -267 172 -335 92 56 -221 170
3827A70k54N11o72L73m00J88O4R0L13o01M32o70M69J26k08K10l50M60n83Q03p28
3848b57L73k09j25L79o50Q69r43R87p59N66m39J85J86l94N01o00M04m42M49j02
3868b1q3N21q54O21m70L98k86L24k98j89N89o03O71p72P30n0l71K41m06N47m33
3889a94L95l74N43l90q2L81m99N07m85P57o29J84j97j77J76q3M66m85O76m90P3
3910G3k32MN83m87L07o03N75l61M03q6l93N97o66O27k33L79m10K4J94m39M06o29
3932c67O58k75j19p6J87M02p67N19m15N05n05M77k38j15K51k06L97o75O36l81
3952a07K55j69j80L99n15M41m63L73l64M34k32m14R12o50M72l68M59k46j35L40
3972B42m42L29o55P78m19M3j1j12L74n11N89m72O38n67N23j15m15L43k68M19n51
$$ plain form
3827 170 -84 427 -245 128 -272 -84 -20 70 383 -218 214 -456 13 139 -69 141 -209 251 -332 471 -257
3848 -257 116 -93 -218 161 -489 380 -563 424 -335 231 -208 -23 163 -231 270 -330 74 -368 81 -21
3868 -21 -104 417 -437 184 -286 112 -174 150 -148 -337 252 -351 320 -452 278 228 -143 98 -308 239 -194
3889 -194 201 -173 370 -20 -102 279 -220 287 -198 559 -70 114 -83 -260 -84 -167 299 -186 490 0 73
3910 73 -159 -155 428 -59 248 -355 220 -141 262 176 -217 380 -286 341 108 487 77 101 295 -144 262 -367
3932 -367 291 16 -103 -179 8 410 -357 162 -253 252 -253 224 -14 -129 122 -84 313 -362 274 -107
3952 -107 148 -21 -201 198 -317 124 -339 34 -330 104 -128 -542 370 -280 192 -176 283 37 -98 242
3972 242 -200 129 -526 252 -167 -124 -135 -247 127 -384 205 -267 371 -196 327 212 -203 140 -128 291 -260
3993b60O78n88L81m9l47N61p45N88l48L14k50r9J04m0M76p67P41o28N98l96M2
4014c4M37n75O24q29O68m14J49l0m5K42m74N47n12N90o05M05j78k49L79o60Q44
4035B80n22L34k34L14l61k06L23k29P04o99N53l73J23K34l85M01o16P01n74L86
4055A54l26J70K58m37M87n35N33m79M02k05p9L14k45K43n48M06k73K69ml15M11
4076B01n71N13m57N30k42m5R1l25N59p37O46l85K25j18J09M3l63M00o12Q75n18
4097a81L21k35j07L10m79O41n09L14n12M51P7k56K91m92M19l96Q41o02R9J1k60
4118b54M29n32P27m69K83k07j38K46k21O88q91Q47p16N92l47k22N19o00P02p52
4138c16O08m31K85k21J3L70n73M37n66Q25l44J01k80OM33o26N27o96P27m69M50
$$ plain form
3993 -260 418 -170 211 162 -185 376 -369 219 -129 185 -65 -164 -60 -100 376 -391 350 -278 320 -76 -34
4014 -34 403 -172 452 -377 291 -123 26 -4 -49 193 -281 266 -246 344 -261 144 -34 -283 96 -564 280
4035 280 -242 92 -142 172 -189 -395 -72 -301 403 -296 257 -116 7 241 -144 257 -359 342 -232 154
4055 154 -172 -2 256 -181 306 -229 304 -175 227 22 -57 257 12 255 -293 113 -160 109 105 -210 201
4076 201 -370 143 -314 216 -26 -71 20 -305 254 -483 163 -222 3 -115 -6 37 -326 74 -538 337 -181
4097 -181 140 -95 -202 108 -371 270 -239 75 -437 14 91 -165 126 -366 53 -343 498 -104 -5 6 -254
4118 -254 175 -357 370 -99 184 -23 -161 85 -136 552 -339 508 -208 384 37 -185 334 -266 436 -316
4138 -316 292 -139 146 -75 -62 308 -265 172 -394 431 87 188 -92 -86 347 -279 248 -448 279 -190 260
4159B60r7k45N52n48K67n79N86m48K45j68J13M21q26O44l20K49j12k50M36o53
4179d73P44p84J172j126O44r9n84M98k78N54o71J058p63j54J486n05J82j556O93
4198C8L3M11l17n71L32k38K39j253K093j378N22M94m49J069j258K54r4J168j565
4217d70L62M79j332K264j699M49j4m80K92r3K1k62J162q04N57l91p1L3m1O4j08
4238h2J00l99K49l65N44k36o6M94l63L24n70R12n11k70m7k01P72o67P46o01L09
4259G2k15J59n0nL41m26N08o35N12m4j98J06k28L14l88L33l85M86l41K87p4k04
4281g5J85k72N02o28O33m13J3L44o37N87m44N28m22L73m36R3M94p19O01o23K76
4302d0K4N2o2j79K30lL14q40O70k14J33l73K12L48n96N18m65O57m56Q8K88n36
$$ plain form
4159 260 163 -82 470 -78 189 -390 196 -252 -7 -175 -62 359 -467 177 -143 106 -6 -256 180 -473
4179 -473 271 -513 659 -467 177 78 -506 -8 -286 268 -403 655 -108 -262 1224 719 901 -655 38
4198 38 71 482 165 -406 -74 -312 -73 -1326 767 -611 -89 405 -44 1025 -233 21 -73 1095 -470
4217 -470 -108 371 -961 1303 -396 53 39 -441 -149 -242 -221 -483 679 -125 432 41 -30 3 -38 26 -82
4238 -82 18 -381 -132 -497 47 -189 -255 239 -124 200 -370 542 31 -239 -286 -487 285 -382 364 -237 72
4259 72 -143 16 -34 -39 302 -124 384 -251 261 217 19 125 -103 211 -177 156 -229 257 -84 203 129 -75
4281 -75 110 -162 340 -288 345 -68 -55 289 -348 239 -205 323 -99 274 -162 -69 425 -294 307 -316 -40
4302 -40 -16 36 -26 -205 25 22 336 -504 166 -48 85 -288 -76 272 -324 194 -271 386 -70 18 306 -230
4324b30L46o13O63k21K82p9r2r3l90M20m03O14k77J35k26L9K08k50M77m89L65
4345A86k00J44l6j92L59o09O52o29P50l71q6O8k59O67p89O62l92K53k60J96R1
4366B05j07L56p06N40l04K29N6m45L93l19K72m94N61k16p9ml08M69n13Q19o85
4387b80O79m24o8J45k19K76p18R63o23J19J12P4j37q3J39n10Q18o01M97m18J33
4408a26L25l64M70o82N77m87M15j26K00P2o37P27n44N50n62J58p6K96K28p20M67
4429A61k66K88k95J90J00j88M23o21L24k2l6j05J04J66m93O04n44K68m08L79J12
4450A41j04P8k47L15m22N26k54J60k17J56K8m24L67n99O98m45j4L28q4J67l97
4471b43M30o04N21p7qJ33l20L23m33P36p46R2J32j92K70j60K13m95P03n30K14
$$ plain form
4324 -230 116 -497 166 -55 227 148 56 -37 -427 -7 -410 204 -73 62 -164 -125 83 -167 310 -179 186
4345 186 -14 130 94 -98 261 -348 304 -325 425 54 -32 36 -223 444 -345 317 -75 178 -82 114 205
4366 205 98 454 -252 288 -16 213 269 -176 217 -102 170 -324 237 21 -58 -62 -370 99 -414 405 -280
4387 -280 399 -25 -93 52 -167 109 -609 354 -269 -150 -38 36 -101 -184 -45 -555 263 -338 159 -259 -126
4408 -126 199 -165 305 -377 200 -287 128 2 202 274 -363 364 -180 370 -192 -34 -110 186 414 -306 161
4429 161 -105 183 -112 78 178 -10 413 -208 116 94 58 -47 57 223 -270 334 -210 58 -350 29 141
4450 141 37 115 -132 183 -239 287 33 193 -24 132 160 -264 103 -496 202 -243 -257 71 -13 154 -243
4471 -243 187 -417 104 27 19 152 -168 155 -278 458 -288 -196 -64 -256 14 -146 67 -428 275 -255 -41
4492d1J18j64K82l15L37m67N58k31k14j63M5N42m94O26p69M07o6Lp6l4L45n14
4514b85L56k47L37l72K54q0k60M20l81N00n24K63J4J95k77k21L79l99N05k74J45
4535D8m7P3o1j64L57p20N25j04J29j75j0M74q61R03n26J98l42L06j1l23N69n10
4557b72N79k17j66k5Q1q0qK10l83L63n6j4R1j30N0l93M82k06K06m91N30k72R2
4580b9J65m26N86n35M89n56K61Nj20L23k18K55k37K69k12N7J69k65K66n18K45
4601b6k13M63k70K19k0l57M27l99M44l63K10p7n6J42l69L51l77N16k72J35m4p3
4623iK76l62K63l24K53k50J74k6p0K85n06M23k80J41l82L88K34l40L19l53M91
4644C45l77j08M4k3K60m20O73m14J53m79M98j49k3L14o42M68l42M18o8k3m1j05
$$ plain form
4492 -41 77 -87 195 -120 217 -250 308 77 -137 -300 -255 287 -207 419 -350 57 -9 -6 -82 -116 229 -285
4514 -285 71 -176 161 -211 43 -37 -297 123 -258 242 -282 -19 -5 190 -87 -308 71 -328 177 -97 48
4535 48 1 74 13 -151 206 -514 11 -93 36 -139 -149 325 -536 367 -159 39 -303 3 -8 -331 238 -272
4557 -272 307 90 -76 -101 -20 -100 -108 102 -281 82 26 12 103 -27 23 -370 112 -94 112 -379 151 -121 -29
4580 -29 136 -290 296 -239 250 -306 -45 -40 -160 163 -55 200 -37 232 20 77 246 -19 247 -271 -26
4601 -26 -239 224 -46 173 153 -204 223 -176 268 -95 115 38 -18 124 -245 106 -271 245 -27 108 64 -9
4623 -9 267 -95 168 -156 97 -153 21 -5 -75 210 -296 127 -153 -12 -394 -6 228 -112 207 -146 345
4644 345 -32 -140 -96 -119 141 -279 394 -20 133 -346 152 3 -20 294 -348 120 -222 196 128 105 64 -41
4666d1J73m14M69m84N80n14K97J13k03K64m76N33l33L92n27J61J74m42N97p63
4686d44O30m15J26N1j6M16l95K40m94O23m48QK45j97L05n71O62o25M05k94K27
4707C9k8pK78o62N64k99J63lP7l3l22N88n62L80m89M53k16K16mq7J08k10M19n15
4731a52J28j9l67M57o0K83m55K63k77L35p2k05L28m92M02k51N93o18J21J84J9
4752A45K08o47M97n65M61l25R4J72m47O28k82M14n98K89r5m6J41j72M85o72M83
4773A68n10K79J24k65K83k24M71n63L16m1m8N7n8K09l56K19l16M45m36K78j88
4794a56J44K08m35J71k39L48j88J65J05l84M37j09J7j97J83K44n22N20l53K30
4814A89m35N70m72L99k48j04L36l65K68l19M42j71J56j84n8Q5o53R38m61R9l07
$$ plain form
4666 -41 132 -282 187 -297 283 -231 66 179 -24 240 -236 297 -36 356 -171 -10 164 -278 319 -444
4686 -444 186 -229 -103 -52 -68 348 -47 193 -301 322 -126 -118 127 -70 235 -336 326 -299 106 -188 39
4707 39 11 4 282 -380 184 -115 48 45 122 89 -233 355 -207 173 -316 137 -79 137 133 46 154 -56 363 -152
4731 -152 -24 -43 -410 47 -13 270 -185 78 -199 136 64 -141 187 -305 97 -154 439 -179 -58 126 145
4752 145 353 -294 203 -362 99 -226 -132 40 -407 221 -61 353 -245 44 -51 -97 44 -128 357 -315 168
4773 168 -342 -63 61 -204 79 -145 326 -237 79 38 -10 47 -11 198 -158 61 -255 190 -246 32 -156
4794 -156 -12 196 -239 -68 -307 41 -147 18 123 -261 176 67 84 -113 70 314 -208 312 -41 189
4814 189 -246 324 -148 251 3 -101 235 -130 138 -181 261 90 246 62 4 89 -564 374 -87 12 -295
4835b95K25j48m9L83l44M12k94L74l13n9K02k86J57j07K10j95K18k23R7J43m06
4856b98O38o89O71n31K27r0r3J80l50N52j45R8l05K17m9j11J77k3J78l28L51l41
4878f4J41K25n04O51o52M59m67L02M5j22N2k91M94l95L59k64K29j10j13J80n08
4899c53M73j03l2j58l0N81m63K30m18N30m68L65k91n1K95k82N86o39M59n47L15
4920aL7J7K27o92O31o78O48l23L37k63J13J48m02L24m52K86l2J46N3j89J11j91
4942a45J55j49M0j2k77M02r0K60o34O60k73J5J18l6J48r1J20j99J73k26l8O1k89
4965c07L83l00M24n32N26j86j37M47l38J93PJ14o37P06o83K62N3l24N51n83N66
4986B05n19M36k68j19L09l38M94o22O24m81M75l14r4L94l03J88j89K20r4Jq9L90
$$ plain form
4835 -295 -70 -218 -267 116 -228 184 -110 264 -49 -108 94 -192 -35 -142 68 -127 91 -132 -35 108 -298
4856 -298 340 -349 322 -209 18 -72 -165 15 -335 217 72 170 -135 82 33 -78 99 76 254 -74 277 -64
4878 -64 77 302 -202 449 -203 256 -211 91 136 14 66 -225 269 -126 233 -31 198 88 -25 155 -353
4899 -353 120 17 -15 -173 -203 378 -85 145 -273 257 -211 154 -137 -188 107 -175 411 -228 231 -316 -1
4920 -1 36 53 280 -412 219 -459 189 -134 203 -60 53 201 -201 123 -329 -43 -75 71 124 -65 46 -145
4942 -145 10 -139 -99 -111 -388 14 -76 184 -450 210 -63 -48 70 34 182 91 211 12 185 -41 -79 -18 -307
4965 -307 76 -224 200 -332 194 8 -129 318 -20 173 180 294 -343 363 -320 -58 -5 -329 222 -361 205
4986 205 -314 122 -146 -265 44 -294 200 -422 202 -279 196 -118 -212 182 -121 67 -122 98 4 5 -84 306
5008C06m9p09N82m81M81k35k7J77l78O87q60O78m77M17r3j27L40l05M11o20N90
5029C08l31K33j29n3L43n35O99o08M31n34L10l0l37N85p68M08j87L95m32M21l05
5050a16l3K03o8P1k43N07m44J5L02j91L88l65K73o50M04k41J29J11j37L51n31
5071b65M58k92K4j08K95K6k92K53k89J12j37J67L86n73M57m24J4j6L86o7qq5j98
5094a76L06n48N69n38O04k65o3J11j71L80l03M71m77O6l9L3J12k88M96n59N08
5115B29l60M42k95J39j29n05P51o87M70k24M19J19m09M54n83M93j53R9l76J95
5135H9L71q20P61o04L96k62m4P3J59K04k84j30ML11m84J91M0r5J95l62L85l09
5157b15M69m96K18j40m8J37M9nl77O44n25K01K83m33M24m42M41l64K49k65m4M39
$$ plain form
5008 306 257 -452 130 -351 130 -105 -132 45 -333 354 -506 172 -305 112 19 -108 232 -73 338 -282 308
5029 308 -23 210 81 28 371 -164 535 -73 358 -176 134 104 -233 352 -416 -8 -195 200 -232 189 -116
5050 -116 -149 54 -14 57 -186 321 -123 -108 194 3 391 26 299 -351 53 -188 -59 52 -85 266 -265
5071 -265 193 -99 -75 -183 112 138 -154 99 -190 -78 -215 -48 338 -235 222 -202 -188 -204 182 115 107 22 -176
5094 -176 130 -418 151 -387 217 -48 -111 0 -171 209 -94 377 -100 -34 -73 -40 72 -216 280 -279 229
5115 229 -131 311 16 155 26 -479 272 -415 55 -169 250 369 -40 414 -169 324 171 270 -106 89
5135 89 460 -360 401 -203 193 -69 -113 -40 119 323 39 -91 -87 224 -260 -69 -29 -124 71 -291 94 -215
5157 -215 254 -242 -24 -164 -212 -75 -26 -31 -408 236 -289 -88 195 -238 186 -256 185 -179 70 -195 -239 200
5179B00k06Pn0M56m21J38j43qP9k57L98k87K29q9L18l00J17J92q16M34j8K05n6
$$ plain form
5179 200 -6 1 -49 407 -14 124 -19 -27 52 -205 193 -94 135 46 364 64 181 373 -443 -9 -27 178 122
$$ [...]
8191b61
##END NTUPLES=NMR FID
##END=
