##TITLE=1H_AN-AD-106
 CDCl3, 8 sc, 
 13.05.2021
##JCAMPDX= 6.0         $$ Bruker NMR JCAMP-DX V2.0
##DATA TYPE= NMR FID
##DATA CLASS= NTUPLES
##ORIGIN= UXNMR, Bruker Analytische Messtechnik GmbH
##OWNER= root
$$ XWIN-NMR		Version 3.5
$$ Thu May 13 13:34:19 2021 Russian Standard Time (UT+4h)  she@DPX200
##.OBSERVE FREQUENCY= 200.131506
##.OBSERVE NUCLEUS= ^1H
##.DELAY= (6, 6)
##.ACQUISITION MODE= SIMULTANEOUS
##.ACQUISITION SCHEME= undefined
##.AVERAGES= 8
##.DIGITISER RES= 18
##SPECTROMETER/DATA SYSTEM= spect
##.PULSE SEQUENCE= zg30
##.SOLVENT NAME= CDCl3
##.SHIFT REFERENCE= (INTERNAL, CDCl3, 0, 15.7039)
##AUDIT TRAIL= $$ (NUMBER, WHEN, WHO, WHERE, WHAT)
$$ ##TITLE= Audit trail, XWIN-NMR		Version 3.5
$$ ##JCAMPDX= 5.01
$$ ##ORIGIN= Bruker BioSpin GmbH
$$ ##OWNER= she
$$ F:/spectra/data/she/nmr/H-F/1/audita.txt
$$ ##AUDIT TRAIL=  $$ (NUMBER, WHEN, WHO, WHERE, WHAT)
(   1,<2021-05-13 13:33:27.21 +0400>,<she>,<DPX200>,
      <created by zg, POWCHK disabled, PULCHK disabled
       configuration hash MD5:
       00 E9 B6 7A A2 85 ED C7 34 08 36 98 17 FE 4E 26
       data hash MD5: 16K
       47 75 2F AE 6F 36 5B 48 0F 5A EA 91 DE 7A 60 78>)
$$ ##END=
$$ 
$$ hash MD5
$$ 66 A6 A8 24 79 56 A6 F6 35 A1 F2 75 B7 F9 1A 60
##$RELAX= 
##$RELAX= 
##$RELAX= 
##$RELAX= 
##$RELAX= 
##$RELAX= 
$$ Bruker specific parameters
$$ --------------------------
##$DU= <F:/spectra>
##$EXPNO= 1
##$NAME= <H-F>
##$PROCNO= 1
##$TYPE= <nmr>
##$USER= <she>
##$AMP= (0..31)
100 100 100 100 100 100 100 100 100 100 100 100 100 100 100 100 100 100 
100 100 100 100 100 100 100 100 100 100 100 100 100 100 
##$AQSEQ= 0
##$AQ_mod= 1
##$AUNM= <au_zg>
##$AUTOPOS= <>
##$BF1= 200.13
##$BF2= 200.13
##$BF3= 200.13
##$BF4= 200.13
##$BF5= 200.13
##$BF6= 200.13
##$BF7= 200.13
##$BF8= 200.13
##$BYTORDA= 1
##$CFDGTYP= 0
##$CFRGTYP= 5
##$CHEMSTR= <none>
##$CNST= (0..31)
1 1 145 1 1 1 1 1 1 1 1 1 1 1 1 1 1 1 1 1 1 1 1 1 1 1 1 1 1 1 1 1 
##$CPDPRG= <>
##$CPDPRG1= <>
##$CPDPRG2= <>
##$CPDPRG3= <>
##$CPDPRG4= <mlev>
##$CPDPRG5= <mlev>
##$CPDPRG6= <mlev>
##$CPDPRG7= <mlev>
##$CPDPRG8= <mlev>
##$CPDPRGB= <>
##$CPDPRGT= <>
##$D= (0..31)
0 1.2 0 0 0 0 0 0 0 0.06 0 0.03 0 0 0 0 0.0002 0 0 0 0 0 0 0 0 0 0 0 0 
0 0 0 
##$DATE= 1620898406
##$DBL= (0..7)
120 120 120 120 120 120 120 120 
##$DBP= (0..7)
150 150 150 150 150 150 150 150 
##$DBP07= 0
##$DBPNAM0= <>
##$DBPNAM1= <>
##$DBPNAM2= <>
##$DBPNAM3= <>
##$DBPNAM4= <>
##$DBPNAM5= <>
##$DBPNAM6= <>
##$DBPNAM7= <>
##$DBPOAL= (0..7)
0.5 0.5 0.5 0.5 0.5 0.5 0.5 0.5 
##$DBPOFFS= (0..7)
0 0 0 0 0 0 0 0 
##$DE= 6
##$DECBNUC= <off>
##$DECIM= 32
##$DECNUC= <off>
##$DECSTAT= 4
##$DIGMOD= 1
##$DIGTYP= 9
##$DL= (0..7)
0 120 120 120 120 120 120 120 
##$DP= (0..7)
150 150 150 150 150 150 150 150 
##$DP07= 0
##$DPNAME0= <>
##$DPNAME1= <>
##$DPNAME2= <>
##$DPNAME3= <>
##$DPNAME4= <>
##$DPNAME5= <>
##$DPNAME6= <>
##$DPNAME7= <>
##$DPOAL= (0..7)
0.5 0.5 0.5 0.5 0.5 0.5 0.5 0.5 
##$DPOFFS= (0..7)
0 0 0 0 0 0 0 0 
##$DQDMODE= 0
##$DR= 18
##$DS= 0
##$DSLIST= <SSSSSSSSSSSSSSS>
$$ [...]
##$SUBNAM2= <"">
##$SUBNAM3= <"">
##$SUBNAM4= <"">
##$SUBNAM5= <"">
##$SUBNAM6= <"">
##$SUBNAM7= <"">
##$SUBNAM8= <"">
##$SUBNAM9= <"">
##$SW= 16.9725357007746
##$SWIBOX= (0..15)
0 0 2 0 0 0 0 0 0 0 0 0 0 0 0 0 
##$SW_h= 3396.73913043478
##$TD= 16384
##$TD0= 1
##$TE= 0
##$TE2= 300
##$TE3= 300
##$TEG= 300
##$TL= (0..7)
0 120 120 120 120 120 120 120 
##$TP= (0..7)
150 150 150 150 150 150 150 150 
##$TP07= 0
##$TPNAME0= <>
##$TPNAME1= <>
##$TPNAME2= <>
##$TPNAME3= <>
##$TPNAME4= <>
##$TPNAME5= <>
##$TPNAME6= <>
##$TPNAME7= <>
##$TPOAL= (0..7)
0.5 0.5 0.5 0.5 0.5 0.5 0.5 0.5 
##$TPOFFS= (0..7)
0 0 0 0 0 0 0 0 
##$TUNHIN= 0
##$TUNHOUT= 0
##$TUNXOUT= 0
##$USERA1= <user>
##$USERA2= <user>
##$USERA3= <user>
##$USERA4= <user>
##$USERA5= <user>
##$V9= 5
##$VALIST= <valist>
##$VCLIST= <CCCCCCCCCCCCCCC>
##$VD= 0
##$VDLIST= <DDDDDDDDDDDDDDD>
##$VPLIST= <PPPPPPPPPPPPPPP>
##$VTLIST= <TTTTTTTTTTTTTTT>
##$WBST= 1024
##$WBSW= 4
##$XGAIN= (0..3)
0 0 0 0 
##$XL= 0
##$YL= 0
##$YMAX_a= 79393
##$YMIN_a= -68288
##$ZGOPTNS= <>
##$ZL1= 120
##$ZL2= 120
##$ZL3= 120
##$ZL4= 120
##$ABSF1= 10
##$ABSF2= 0
##$ABSG= 5
##$ABSL= 3
##$ALPHA= 0
##$AQORDER= 0
##$ASSFAC= 0
##$ASSFACI= 0
##$ASSFACX= 0
##$ASSWID= 0
##$AUNMP= <proc_1d>
##$AZFE= 0.1
##$AZFW= 0.1
##$BCFW= 1
##$BC_mod= 2
##$BYTORDP= 1
##$COROFFS= 0
##$CY= 11.3945322036743
##$DATMOD= 1
##$DC= 2
##$DFILT= <>
##$DTYPP= 0
##$F1P= 15.9154993809931
##$F2P= -4.1035820241983
##$FCOR= 0.5
##$FTSIZE= 0
##$FT_mod= 4
##$GAMMA= 1
##$GB= 0.15
##$INTBC= 1
##$INTSCL= 1
##$ISEN= 128
##$LB= 0.24
##$LEV0= 0
##$LPBIN= 0
##$MAXI= 10000
##$MC2= 0
##$MEAN= 0
##$ME_mod= 0
##$MI= 1.114404
##$NCOEF= 0
##$NC_proc= 0
##$NLEV= 6
##$NOISF1= 3.799351
##$NOISF2= 2.8
##$NSP= 1
##$NTH_PI= 0
##$NZP= 0
##$OFFSET= 15.70392
##$PC= 1
##$PHC0= -11121.95
##$PHC1= 12.801
##$PH_mod= 1
##$PKNL= yes
##$PPARMOD= 0
##$PSCAL= 0
##$PSIGN= 0
##$REVERSE= no
##$SF= 200.130013532006
##$SI= 16384
##$SIGF1= 3
##$SIGF2= 2
##$SINO= 400
##$SIOLD= 16384
##$SREGLST= <1H.CDCl3>
##$SSB= 0
##$STSI= 0
##$STSR= 0
##$SW_p= 3612.71676300578
##$SYMM= 0
##$S_DEV= 0
##$TDeff= 0
##$TDoff= 0
##$TI= <>
##$TILT= no
##$TM1= 0
##$TM2= 0
##$TOPLEV= 0
##$USERP1= <user>
##$USERP2= <user>
##$USERP3= <user>
##$USERP4= <user>
##$USERP5= <user>
##$WDW= 1
##$XDIM= 8192
##$YMAX_p= 0
##$YMIN_p= 0
$$ End of Bruker specific parameters
$$ ---------------------------------
##NTUPLES= NMR FID
##VAR_NAME=  TIME,          FID/REAL,        FID/IMAG
##SYMBOL=    X,             R,               I
##VAR_TYPE=  INDEPENDENT,   DEPENDENT,       DEPENDENT
##VAR_FORM=  AFFN,          ASDF,            ASDF
##VAR_DIM=   8192,          8192,            8192
##UNITS=     SECONDS,       ARBITRARY UNITS, ARBITRARY UNITS
##FACTOR=    0.0002944,     1,               1
##FIRST=     0,             0,               0
##LAST=      2.4114304,     0,               0
##MIN=       0,             -68288,          0
##MAX=       2.4114304,     79393,           0
$$ Real data points
##PAGE= N=1
##DATA TABLE= (X++(R..R)), XYDATA
$$ [...]
$$ plain form
2289 825 -680 991 -451 222 344 -726 933 -1199 693 -855 462 -209 -77 526 -1301 1010
2305 1010 -1292 733 -825 168 -305 -416 242 -1108 1067 -1390 823 -885 43 181 -790 646 -1090
2322 -1090 1164 -1135 579 -570 203 14 -750 724 -1111 1035 -829 563 -371 -179 244 -686 1080
2339 1080 -1038 1123 -377 712 -124 -233 649 -867 1133 -948 1387 -688 327 324 -197 1030 -768
2356 -768 982 -689 892 -416 279 229 -466 992 -1248 1315 -874 483 -293 23 368 -629 1025
2373 1025 -1107 968 -692 235 30 -453 695 -882 823 -1047 701 -744 209 -41 -651 572
2389 572 -1193 722 -1132 559 -527 123 -7 -602 963 -963 726 -1099 538 -348 -575 307 -842
2406 -842 583 -914 1040 -698 380 -90 -162 505 -962 974 -859 904 -430 446 68 -43 900
$$ packed form
2289H25j505J671j442O73J22j070J659k132J892j548J317o71J32O03j827K311
2305A010k302K025j558R93m73j11O58j350K175k457K213j708R28J38r71J436j736
2322a090K254k299J714j149P73j89p64J474j835K146j864J392r34J92M23r30J766
2339A080k118K161j500J089q36j09Q82j516K000k081K335k075J015ln21J227j798
2356g68J750j671J581j308O95n0o95J458k240K563k189J357p76L16L45r97J654
2373A025k132K075j660R27k05m83J148j577J705j870J748j445R53k50o10J223
2389E72j765J915j854J691j086O50j30n95J565j926J689j825J637q86k27Q82j149
2406h42J425j497J954j738J078m70p2O67j467J936j833J763j334Q76l78j11R43
$$ plain form
2423 900 -792 1151 -762 1035 -210 285 623 -402 993 -554 1227 -842 708 -193 221 697
2439 697 -653 693 -792 1008 -890 601 -5 -173 281 -641 890 -1027 592 -960 219 -195
2455 -195 -356 563 -958 660 -996 698 -541 -46 -262 -465 670 -1175 897 -984 495 -485 -121
2472 -121 31 -883 696 -856 712 -793 392 -386 -215 138 -788 655 -900 509 -826 297 36
2489 36 -198 755 -668 616 -715 801 -421 276 236 -101 1040 -1096 1019 -807 694 -105 16
2506 16 368 -385 877 -656 961 -343 498 -64 12 541 -563 947 -777 826 -626 743 97
2523 97 -466 795 -763 678 -790 710 -379 -185 57 -629 468 -754 705 -1029 483 -340 -79
2540 -79 303 -626 602 -1041 505 -1166 224 -515 -149 200 -909 623 -967 374 -710 216 -205
$$ packed form
2423I00j692J943j913J797j245M95L38j025J395j547J781k069J550r01M14M76
2439F97j350J346j485J800j898J491o06j68M54r22J531j917J619j552J179m14
2455a95j61R19j521J618j656J694j239M95k16k03J135j845K072j881J479r80L64
2472a21J52r14J579j552J568j505J185p78J71L53r26J443j555J409j335J123k61
2489C6k34R53j423J284j331J516j222O97m0l37J141k136K115j826J501p99J21
2506A6L52p53J262j533J617j304Q41n62P6N29j104J510j724J603j452J369o46
2523I7n63J261j558J441j468J500j089J94K42o86J097j222J459j734J512q23K61
2540g9L82r29J228j643J546j671J390p39L66L49j109J532j590J341j084R26m21
$$ plain form
2557 -205 -207 426 -678 817 -859 500 -498 266 79 -521 595 -783 738 -892 615 -521 206
2574 206 562 -526 880 -867 919 -570 691 -358 -85 506 -291 934 -678 854 -647 347
2590 347 94 22 431 -586 768 -667 483 -442 37 -146 -326 584 -1106 559 -779 565 -391 162
2608 162 200 -534 493 -773 658 -1070 370 -169 -236 267 -707 638 -975 472 -553 106 -251 -269
2626 -269 272 -751 503 -861 539 -572 379 7 -440 342 -767 731 -608 449 -255 71 59
2643 59 -394 856 -639 863 -536 469 -137 107 491 -437 626 -756 648 -452 370 27 -24 556
2661 556 -426 657 -594 675 -380 442 290 -253 547 -472 819 -817 361 -266 136 203 -240 735
2679 735 -787 615 -706 372 -417 -217 296 -390 391 -905 410 -770 49 -288 -192 -55 -807 879
$$ packed form
2557b05kO33j104J495j676J359r98P64j87o00J116j378J521j630J507j136P27
2574B06L56j088J406j747J786j489J261j049K73N91p97J225j612J532j501R94
2590C47k53p2M09j017J354j435J150r25M79j83j80R10j690J665j338J344r56N53
2608A62L8p34J027j266J431j728J440n39o7N03r74J345j613J447j025O59l57j8
2626b69N41j023J254j364J400j111R51l72m47P82j109J498j339J057p04L26j2
2643E9m53J250j495J502j399J005o06K44L84r28J063j382J404j100Q22l43n1N80
2661E56r82J083j251J269j055Q22j52n43Q00j019J291j636J178o27M02O7m43R75
2679G35j522J402j321J078p89K00N13o86P81j296J315j180Q19l37R6J37p52J686
$$ plain form
2697 879 -901 721 -514 108 -53 -428 408 -734 868 -602 730 -527 88 160 -298 751 -538
2714 -538 584 -564 481 -101 121 391 -535 719 -695 807 -573 248 74 -86 420 -543 1046
2731 1046 -650 820 -305 557 230 -324 750 -655 799 -419 814 -54 224 -10 -244 684 -778
2748 -778 545 -633 296 124 60 325 -409 231 -502 665 -644 127 -150 -277 278 -650 520 -742
2766 -742 740 -695 188 -244 -307 440 -1009 765 -760 658 -504 -99 -67 -465 446 -848 910 -664
2784 -664 373 -262 242 313 -456 620 -507 792 -345 405 -26 -157 388 -443 986 -811 772 -333
2802 -333 638 202 -232 586 -381 805 -232 694 -224 247 -61 5 566 -398 542 -319 626 -10 168 444
2822 444 -350 637 -675 551 -391 430 -148 -113 432 -374 675 -666 711 -763 372 161 -324 275
$$ packed form
2697H79j780J622j235O22j61l75Q36j142J602j470J332j257O15P2m58J049j289
2714e38J122j148J045n82K22K70r26J254j414J502j380Q21j74j60N06r63J589
2731A046j696J470j125Q62l27n54J074j405J454j218J233q68K78k34k34R28j462
2748g78J323j178R29j72o4K65p34O40p33J167j309P71k77j27N55r28J170j262
2766g42J482j435Q83m32o3P47j449J774j525J418j162M05L2l98R11j294J758j574
2784f64J037o35N04P1p69J076j127J299j137P50m31j31N45q31J429j797J583j105
2802c33R71m36m34Q18r67J186j037R26r18M71l08O6N61r64R40q61R45o36J78K76
2822D44p94R87j312J226r42Q21n78L5N45q06J049j341J377j474J135k11m85N99
$$ plain form
2840 275 -626 527 -814 415 -393 229 44 -145 395 -738 461 -779 239 -497 -135 41 -517 379
2858 379 -901 584 -612 435 -196 113 499 -337 635 -616 683 -459 469 69 -519 689 -328
2875 -328 690 -611 586 -102 311 158 -30 833 -511 792 -474 705 -283 304 183 -306 748
2892 748 -564 665 -689 627 -196 -187 410 -512 547 -691 684 -509 370 -49 -266 557 -429 655
2910 655 -762 356 -405 -73 -82 -208 390 -691 660 -772 351 -386 -84 127 -579 263 -650 511
2928 511 -959 332 -82 -294 176 -470 663 -886 622 -510 99 -252 -151 572 -728 713 -661
2945 -661 386 -568 254 -56 -381 666 -706 319 -437 636 -316 312 280 -270 587 -450 589 -435
2963 -435 531 -198 39 436 -350 612 -544 520 -491 637 -122 -109 314 -585 560 -594 425 -489
$$ packed form
2840B75r01J153j341J229q08O22j85j89N40j133J199j240J018p36L62J76n58Q96
2858C79j280J485j196J047o31L09L86q36R72j251J299j142R28m00n88J208j017
2875c28J018j301J197o88M13j53j88Q63j344J303j266J179r88N87j21m89J054
2892G48j312J229j354J316q23RN97r22J059j238J375j193Q79m19k17Q23r86J084
2910F55j417J118p61L32rj26N98j081J351j432J123p37L02K11p06Q42r13J161
2928E11j470J291m14k12M70o46J133j549J508j132O09l51J01P23j300J441j374
2945f61J047r54Q22l10l25J047j372J025p56J073r52O28l2n50Q57j037J039j024
2963d35R66p29K37L97p86R62j156J064j011J128p59J3M23q99J145j154J019r14
$$ plain form
2981 -489 200 -11 -589 402 -485 323 -671 351 -344 77 27 -343 634 -458 613 -654 255 -41 -78
3000 -78 193 -486 524 -732 445 -816 41 -112 8 112 -507 324 -835 351 -519 186 111 -105 453
3019 453 -575 671 -611 458 -426 122 122 -382 818 -563 673 -374 486 -174 47 298 -336 625
3037 625 -467 788 -466 484 -94 -52 329 -478 569 -494 669 -137 415 112 -148 595 -632 417
3055 417 -541 251 -358 -35 -75 -394 353 -342 472 -575 300 -317 16 -2 -391 410 -652 695 -391
3074 -391 184 -303 -327 114 -702 467 -474 605 -442 360 -300 -116 425 -662 558 -662 624 -303
3092 -303 33 60 -410 527 -429 572 -773 659 -369 60 293 -53 463 -314 804 -423 412 -198
3110 -198 140 393 -415 483 -534 680 -452 494 19 32 667 -542 700 -224 357 -297 161 130 -325
$$ packed form
2981d89O89k11n78R91q87Q08r94J022o95M21n0l70R77j092J071j267R09k96l7
3000g8K71o79J010j256J177j261Q57j53J20J04o19Q31j159J186q70P05p5k16N58
3019D53j028J246j282J069q84N48%n04J200j381J236j047Q60o60K21K51o34R61
3037F25j092J255j254R50n78M2L81q07J047j063J163q06N52l03k60P43j227J049
3055D17r58P92o09L23m0l19P47o95Q14j047Q75o17L33j8l89Q01j062J347j086
3074c91N75m87k4M41q16J169r41J079j047Q02o60J84N41j087J220j220J286r27
3092c03L36K7m70R37r56J001j345J432j028M29K33l46N16p77J118j227Q35o10
3110a98L38K53q08Q98j017J214j132R46m75J3O35j209J242r24N81o54M58l1m55
$$ plain form
3129 -325 367 -390 582 -483 390 -143 21 114 -270 566 -673 178 -377 131 -183 -101 133 -373 590 -668
3149 -668 358 -540 282 -65 -250 358 -533 469 -686 512 -310 244 54 -407 243 -374 428 -441 472
3168 472 -160 165 68 -273 661 -414 592 -428 393 -154 -254 416 -308 659 -486 451 -486 471 -115
3187 -115 74 331 -342 562 -661 635 -391 318 287 -198 515 -474 605 -355 774 -341 35 13 -234
3206 -234 442 -619 598 -565 468 -401 -138 176 -238 523 -560 437 -268 80 -84 -52 279 -440 266
3225 266 -678 313 -522 140 -159 -365 296 -715 535 -515 253 -178 163 65 -286 598 -521 436 -402
3244 -402 285 -245 147 257 -221 522 -628 658 -158 349 27 -23 289 -207 493 -478 323 -375 257 244
3264 244 -106 474 -600 865 -611 564 -198 262 230 -347 440 -426 622 -473 338 -110 97 94 -456
$$ packed form
3129c25O92p57R72j065Q73n33J64R3l84Q36j239Q51n55N08l14Q2K34n06R63j258
3149f68J026q98Q22l47j85O08q91J002j155J198q22N54j90m61O50o17Q02q69R13
3168D72o32L25r7l41R34j075J006j020Q21n47j00O70p24R67j145R37r37R57n86
3187a15J89K57o73R04j223J296j026P09l1m85P13r89J079r60J129j115L76k2k47
3206b34O76j061J217j163J033q69K63L14m14P61j083R97p05L48j64L2L31p19P06
3225B66r44R91q35O62k99k06O61j011J250j050P68m31L41r8l51Q84j119R57q38
3244d02O87n30L92J10m78P43j150J286q16N07l22n0L12m96P00r71Q01o98O32j3
3264B44l50N80j074J465j476J175p62M60l2n77P87q66J048j095Q11m48K07ln50
$$ plain form
3283 -456 439 -490 471 -445 238 33 -249 28 -645 374 -604 575 -438 278 -112 -194 41 -486 173
3302 173 -787 438 -106 31 -51 -254 199 -681 482 -434 249 -23 -91 122 -187 347 -577 120 -404 220
3322 220 -205 82 299 64 491 -578 438 -453 294 -41 -64 310 -262 724 -424 474 -181 357 23
3341 23 -32 396 -244 725 -325 600 -150 176 339 -112 439 -616 401 -150 295 -228 -94 274 -376 545
3361 545 -715 368 -227 201 -130 -243 482 -370 433 -319 491 -239 67 -12 -255 263 -536 240 -521 467
3381 467 -370 -10 137 -311 321 -536 432 -490 417 -209 9 170 -236 503 -495 451 -372 179 90 -122
3401 -122 409 -315 234 -611 354 -189 294 45 36 256 -473 470 -479 515 -275 159 328 -181 349 -308 548
3422 548 -108 174 -196 9 170 -295 437 -527 258 -259 166 49 -318 245 -259 395 -535 145 -158 33
$$ packed form
3283d56Q95r29R61r16O83k05k82K77o73J019r78J179j013P16l90q2K35n27O59
3302A73r60J225n44J37q2k03M53q80J163r16O83k72o8K13l09N34r24O97n24O24
3322B20m25K87K17k35M27j069J016q91P47l35k3L74n72R86j148Q98o55N38l34
3341B3n5M28o40R69j050R25p50L26J63m51N51j055J017n51M45n23J34L68o50R21
3361E45j260J083n95M28l31j13P25q52Q03p52Q10p30L06p9k43N18p99P76p61R88
3381D67q37L60J47m48O32q57R68r22R07o26K18J61m06P39r98R46q23N51q9k12
3401a22N31p24N49q45R65n43M83k49rK20p29R43r49R94p90M34J69n09N30o57Q56
3422E48o56K82l70K05J61m65P32r64P85n17M25j17l67N63n04O54r30O80l03J91
$$ plain form
3442 33 155 -180 236 -599 497 -406 240 -163 -121 -213 -112 185 -352 400 -438 416 -108 -10 -105 -334 244
3463 244 -544 276 -238 -39 -58 32 147 -210 546 -536 494 -230 129 126 -109 212 -487 695 -487 388
3483 388 -431 18 258 -90 588 -471 448 -322 488 -85 90 142 -45 325 -211 677 -358 274 -75 208
3503 208 565 -299 478 -444 511 -224 161 -48 -217 331 -310 433 -387 395 -194 130 24 -347 57 -484
3523 -484 621 -362 126 -338 112 117 -122 437 -524 457 -347 293 -242 -287 27 -284 506 -342 307 -376 72
3544 72 -194 -319 185 -195 310 -338 284 -153 320 265 -297 515 -211 286 -187 343 -95 155 249 -146 460
3565 460 -384 582 -181 279 -149 60 296 -187 638 -549 409 -461 248 -164 -67 477 -374 591 -606 555
3585 555 -383 148 38 -136 18 -249 187 -148 303 -333 52 -95 -337 5 -425 399 -376 294 24 -101
$$ packed form
3442C3J22l35M16q35J096r03O46m03M2r2J01K97n37P52q38Q54n24R8r5k29N78
3463B44p88Q20n14J99j9R0J15l57P56j082J030p24L59lk35L21o99J182j182Q75
3483C88q19M49K40l48O78j059R19p70Q10n73J75N2j87L70n36Q88j035O32l49K83
3503B08L57q64P77r22R55p35L85k09j69N48o41P43q20P82n89L24j06l71M04n41
3523d84J105r83M88m64M50Nk39N59r61R81q04O40n35m5L14l11P90q48O49o83M48
3544G2k66j25N04l80N05o48O22m37M73n5n62Q12p26M97m73N30m38K50R4l95O06
3565D60q44R66p63M60m28K09K36m83Q25j187R58q70P09m12R7N44q51R65j197J161
3585E55r38N31j10j74J54k67M36l35M51o36L85j47k42L42m30Q24p75O70k70j25
$$ plain form
3605 -101 -49 -327 202 -401 272 -237 12 -116 -302 149 -231 406 -518 391 54 222 -55 -234 249 -348
3625 -348 633 -606 277 -235 103 66 -279 435 -450 490 -369 281 -109 52 137 -232 257 -369 398 -58
3645 -58 359 105 -52 93 -429 136 -361 287 -248 176 -79 -120 259 -525 338 -532 245 -161 -34 87 -423
3666 -423 261 -323 226 -223 214 -322 -73 -10 -280 60 -360 214 -292 138 -48 51 150 -373 370 -436 294
3687 294 -353 158 -119 -220 190 -411 473 -335 351 -100 -115 6 -210 334 -194 385 -396 141 9 -76 214
3708 214 -273 458 -467 235 -158 237 -126 -13 218 -297 161 -192 491 -321 216 86 -393 527 -403 520
3728 520 -72 243 -16 126 71 -185 143 -237 184 -296 307 -143 -127 -91 -338 449 -165 470 -260 254 -114
3749 -114 -113 -234 -236 93 -334 318 -153 178 -35 -97 167 -141 633 -356 241 -12 77 65 -206 330 -349 252
$$ packed form
3605a01N2k78N29o03O73n09K49j28j86M51l80O37r24R09l37J68k77j79M83n97
3625c48R81j239Q83n12L38l7l45P14q85R40q59O50l90J61Q5l69M89o26P67m56
3645e8M17k54j57J45n22N65m97O48n35M24k55m1L79p84Q63q70P77m06J27J21n10
3666d23O84n84N49m49M37n36K49O3k70L40m20N74n06M30j86R9R9n23P43q06P30
3687B94o47N11k77j01M10o01Q84q08O86m51j5J21k16N44n28N79p81N37j32q5K90
3708B14m87P31r25P02l93L95l63J13K31n15M58l53O83q12N37j30m79R20r30R23
3728E20n92L15k59J42n5k56L28l80M21m80O03m50J6L6k47P87o14O35p30N14l68
3749a14Jj21kL29m27O52m71L31k13o2K64l08P74r89N97k53Q9j2k71N36o79O01
$$ plain form
3771 252 -367 257 -297 302 -19 0 294 -437 295 -142 -34 -48 80 216 -302 336 -415 417 -191 187 9
3792 9 -138 52 -208 354 -237 181 -338 147 -9 -157 293 -344 266 -371 398 -187 -25 60 -313 235 -414
3813 -414 143 -467 332 -246 -142 88 -395 225 -567 -39 -202 75 -119 -245 241 -607 427 -165 115 -195
3833 -195 29 -190 -42 -38 -564 518 -460 286 -173 -197 58 -327 270 -241 365 -231 78 9 -23 31 -255 370
3855 370 -416 415 -343 200 -7 14 265 -101 424 -240 82 -160 35 7 -269 172 -212 354 -267 452 -8
3876 -8 155 -20 -27 185 -650 493 -358 -61 -221 -248 -34 -248 136 -280 281 -231 187 8 -394 -28 -243
3897 -243 322 -453 -55 -317 -27 -263 -40 185 -200 205 -295 36 -214 230 136 -254 155 -367 192 -409
3917 -409 213 53 145 53 -28 441 -295 336 -283 374 69 -46 214 -182 305 -156 61 -128 254 193 -272
$$ packed form
3771B52o19O24n54N99l21J9K94p31P32m37J08j4J28J36n18O38p51Q32o08L78j78
3792Ij47J90k60N62n91M18n19M85j56j48M50o37O10o37P69n85J62Q5l73N48o49
3813d14N57o10P99n78J04K30m83O20p92N28j63K77j94j26M86q48J034n92K80l10
3833a95K24k19J48Mn26J082r78P46m59k4K55l85N97n11O06n96L09o9l2N4k86O25
3855C70p86Q31p58N43k07K1K51l66N25o64L22k42J95k8k76M41l84N66o21P19m60
3876hJ63j75pK12q35J143q51K97j60k7K14k14L84m16N61n12M18j79m02L66k15
3897b43N65p75L98k62K90k36K23K25l85M05n00L31k50M44r4l90M09n22N59o01
3917d09O22j60R2r2q1M69p36O31o19O57l05j15K60l96M87m61K17j89L82o1m65
$$ plain form
3938 -272 130 -333 303 -269 187 39 -67 9 -71 331 -308 513 -331 230 -409 171 106 -335 -67 -378 183
3959 183 -288 139 -79 -26 419 -182 250 -301 389 -241 145 -79 25 257 -422 301 -366 142 -211 66
3979 66 -88 -302 176 -207 191 -431 50 -115 138 80 -201 362 -518 153 -465 286 86 111 96 -313 315
4000 315 -365 438 -279 155 173 -69 194 -353 594 -275 447 -224 187 229 -71 412 17 291 -375 302 -73
4021 -73 -18 138 -83 165 -497 364 -286 170 -139 -133 23 -238 330 -369 396 -233 273 46 -116 64 -280
4042 -280 349 -496 375 -88 75 127 -288 166 -348 442 -350 67 -163 -22 59 6 253 -604 389 -302 537
4063 537 -136 31 19 -147 140 -291 192 -251 195 242 -24 227 -59 497 -289 358 -227 234 165 336 436
4084 436 -203 430 -277 458 79 154 -75 61 541 -298 217 -417 64 -179 -129 187 -269 272 -497 299 -223
$$ packed form
3938b72M02m63O36n72M56j48j06P6q0M02o39Q21q44N61o39N80o5m41K68l11N61
3959A83m71M27k18N3M45o01M32n51O90o30L86k24J04K32o79P23o67N08l53K77
3979F6j54k14M78l83L98o22M81j65K53n8k81N63q80O71o18P51k00K5j5m09O28
4000C15o80Q03p17M34J8k42K63n47R47q69P22o71M11M2l00M83l95K74o66O77l75
4021g3N5J56k21K48o62Q61o50M56l09OJ56k61N68o99P65o29N06k27j62J80l44
4042b80O29q45Q71m63J63N2m15M54n14P90p92M17k30J41Q1n3K47q57R93o91Q39
4063E37o73J67j2j66K87m31M83m43M46M7k66K51k86N56p86O47n85M61o9J71J00
4084D36o39O33p07P35l79P5k29J36M80q39N15o34M81k43N0L16m56N41p69P96n22
$$ plain form
4105 -223 402 -141 -91 445 -224 154 -292 296 -284 -107 -83 -213 11 -505 389 -364 -29 -210 34 -140 -532
4126 -532 118 -189 219 -141 279 -48 -63 -91 -205 330 -245 324 -447 21 -9 -276 89 186 328 -176 165
4147 165 -264 182 -64 -291 342 -130 191 -205 373 104 152 359 -145 457 -435 461 -300 253 -238 193
4167 193 78 -400 81 84 539 -260 122 -128 -74 314 -386 288 -512 357 -81 184 16 -37 240 -377 326
4188 326 -437 218 -352 218 65 -149 178 -392 186 -229 166 -168 -118 7 -265 250 -187 184 -461 137
4208 137 72 -9 107 -76 388 -371 238 -117 104 -288 -179 -25 -385 115 -434 299 -80 93 19 -123 -53
4229 -53 -275 286 -270 294 -278 -31 100 -232 120 -190 167 -350 261 -58 178 531 42 200 -149 465
4249 465 146 263 -7 -307 133 -178 267 -208 363 100 419 93 24 278 -287 466 -260 243 14 -29 108
$$ packed form
4105b23O25n43N0N36o69L78m46N88n80J77K4j30K24n16Q94p53L35j81K44j74l92
4126e32O50l07M08l60M20l27j5k8j14N35n75N69p71M68l0k67L65R7J42n04L41
4147A65m29M46k46k27O33m72L21l96N78k69M8K07n04O02q92Q96p61N53m91M31
4167A93j15m78M81LM55p99L82k50N4L88p00O74q00Q69m38K65j68n3K77o17P03
4188C26p63O55n70N70j53k14L27n70N78m15L95l34N0J25k72N15m37L71o45N98
4208A37o5q1J16j83M64p59O09l55K21l92J09J54l60N00n49P33l79J73p4j42P0
4229e3k22N61n56N64n72K47J31l32L52l10L57n17O11l19K36L53m89J58l49O14
4249D65l19J17k70l00M40l11M45m75N71k63L19l26o9K54n65P53p26N03k29m3J37
$$ plain form
4270 108 -269 356 -235 382 -184 -34 -170 -158 203 -312 319 -365 186 -141 56 76 139 74 -169 226 -282
4291 -282 358 -192 193 88 -99 229 -325 270 -289 127 -284 -96 181 -148 274 -408 178 -148 209 -78
4311 -78 -30 205 -210 91 -370 516 -259 50 -66 -186 165 -4 342 -151 350 -115 39 -285 -29 205 -101
4332 -101 383 -432 -52 -178 81 277 285 265 -346 699 -438 139 47 369 -85 -222 613 -133 264 -98 -126
4353 -126 -329 169 327 -296 422 -384 470 -140 -64 16 -74 156 -540 148 -142 460 -176 -12 132 -293 812
4374 812 -227 170 -446 302 50 129 -334 -10 300 -248 -145 -433 147 -463 48 514 -500 266 42 188
4394 188 -301 173 37 -176 211 -153 182 91 85 -261 193 284 363 100 4 144 9 373 -317 -100 242 6
4416 6 273 -483 312 -385 -38 22 66 18 -305 116 -200 270 -551 -109 -63 -149 195 -661 563 -139 32 -151
$$ packed form
4270A08l77O25n91O17n66J50j36J2L61n15O31o84N51l27J97K0O3o5k43L95n08
4291b82O40n50L85j05j87L28n54N95n59M16m11J88K77l29M22o82N86l26L57k87
4311g8M8K35m15L01m61Q86p75L09j16j20L51j69L46m93N01m65J54l24K56K34l06
4332a01M84q15L80j26K59J96Qk0o11J045j137N77r2L22m54j37Q35p46L97l62k8
4353a26k03M98J58o23P18q06Q54o10P6Q0r0K30o96O88k90O02o36J64J44m25J105
4374H12j039L97o16P48k52P9m63L24L10n48J03k88N80o10N11M66j014P66k24J46
4394A88m89M74j36k13L87l64L35r1ol46M54R1P9k63r6J40j35L64o90K17L42k36
4416FK67p56P95o97L47O0M4m8l23M21l16M70q21M42M6q6L44q56J224p02J71j83
$$ plain form
4438 -151 -167 13 62 288 -816 344 -82 -64 734 229 183 85 126 -183 199 -260 -197 -520 338 -29 -272 -147
4460 -147 -611 326 -1024 -522 257 -199 522 -367 152 39 -198 165 -169 214 246 615 -641 1165 -402
4479 -402 -112 -65 891 -430 -247 -316 -763 156 -233 -255 -831 106 197 -233 904 235 589 112 302 261 -346
4500 -346 646 -268 759 -388 284 -334 -35 -172 -343 694 -486 157 -593 486 -192 -35 158 -225
4518 -225 432 -116 650 -480 157 -315 -385 215 -1 383 -103 -401 -481 106 -219 112 28 -179 60 -237 360
4539 360 179 200 -46 -83 302 -203 754 -302 451 101 -163 518 131 55 -68 441 -396 -83 148 57 12
4560 12 -75 153 -116 346 -160 238 94 -31 238 -18 540 -116 313 -262 98 48 -280 206 32 -30 104
4581 104 358 -305 123 -58 -68 364 -216 -43 50 306 -3 -344 127 -80 56 -284 435 -234 202 62 -44
$$ packed form
4438a51j6J80M9K26j104J160m26J8P98n05m6r8M1l09L82m59O3l23Q58l67k43J25
4460a47m64R37j350N02P79m56P21q89N19j13k37L63l34L83L2L69j256J806j567
4479d02K90M7R56j321J83o9m47R19l89k2n76R37R1m30J137o69L54m77J90m1o07
4500c46R92r14J027j147O72o18K99j37j71J037j180O43p50J079o78J57J93l83
4518b25O57n48P66j130O37m72p0O00k16L84m86k98q0N87l25L31q4k07K39k97N97
4539C60j81K1k46l7L85n05R57j056P53l50k64O81l87p6j23N09q37L13K31r1m5
4560A2q7K28k69M62n06L98j44j25K69k56N58o56M29n75L60n0l28M86j74o2J34
4581A04K54o63M28j81j0M32n80J73R3K56l09l41M71k07J36l40P19o69M36j40j06
$$ plain form
4602 -44 279 -312 48 -56 298 -158 172 5 -244 132 -185 232 -384 77 -470 181 -3 19 378 59 169
4623 169 -210 199 23 253 141 -303 332 -317 120 -119 54 -70 25 -70 -157 303 -519 151 -196 -52 57
4644 57 -256 155 -340 422 -215 61 -73 37 -110 -23 128 -231 410 -331 83 -59 -230 111 -102 143 -344
4665 -344 243 -159 260 3 -84 -3 10 170 -103 -59 -201 427 -65 123 204 61 635 -316 217 69 -127 513
4687 513 -306 208 -271 -234 101 624 15 -174 -439 150 611 95 710 -431 444 -6 511 -147 96 702
4707 702 554 -108 -762 631 21 -90 674 -140 46 -395 168 -35 518 -252 50 197 -224 367 -149 8
4727 8 -59 74 -41 -122 138 -393 84 -239 71 -43 -52 88 -303 114 -416 0 -305 292 245 -78 90 -74
4749 -74 45 142 199 -129 -51 177 -84 119 -284 250 -152 172 -113 206 288 -324 215 -181 196 -38 155 -191
$$ packed form
4602d4L23n91L60j04L54m56L30j67k49L76l17M17o16M61n47O51j84K2L59l19J10
4623A69l79M09j76K30j12m44O35o49M37k39J73j24R5r5q7M60q22O70l47J44J09
4644E7l13M11m95P62o37K76j34J10j47Q7J51l59O41p41M14j42j71L41k13K45m87
4665c44N87m02M19k57q7Q1J3J60k73M4j42O28m92J88Q1j43N74r51N33j48j96O40
4687E13q19N14m79L7L35N23o09j89k65N89M61n16O15j141Q75m50N17o58K43O06
4707G02j48o62o54J393o10j11P64q14J86m41N63k03N53p70L02J47m21N91n16J57
4727Ho7J33j15q1K60n31M77l23L10j14rJ40l91M17n30M16l05N97m7l23J68j64
4749g4J19R7N7l28P8K28k61K03m03N34m02L24k85L19Q2o12N39l96L77k34J93l46
$$ plain form
4771 -191 11 144 -196 263 -358 333 -215 143 -131 -145 46 -194 293 -188 131 -373 -86 179 -145 119
4791 119 -101 40 -140 210 -179 106 223 -390 358 -381 313 -45 227 -302 -18 -26 -111 -55 -397 75 -162
4812 -162 -48 -399 61 -179 23 517 172 20 -244 155 747 -66 -282 -595 159 368 -258 -313 214 234 562
4833 562 -380 187 191 -814 -526 84 379 122 -117 68 -43 180 -446 -12 25 1129 140 732 407 -12
4853 -12 113 -211 -140 -152 425 -57 -170 249 19 393 -179 -326 -261 322 -932 -412 104 261 48 -287 141
4874 141 -32 -237 210 -128 -30 -78 88 171 -277 97 -294 332 -177 112 -56 168 -118 -184 258 -275 299
4895 299 -192 262 71 92 173 -363 156 -262 115 -92 109 -65 -170 27 151 396 -188 123 -139 251 2
4916 2 -14 289 -292 327 -168 235 -317 -108 7 -78 37 -154 110 -175 244 -227 88 95 -154 263 -185 -8
$$ packed form
4771a91K02J33l40M59o21O91n48L58k74j4J91k40M87m81L19n04K87K65l24K64
4791A19k20J41j80L50l89K85J17o13P48p39O94l58K72n29K84qq5N6l42M72k37
4812a62J14l51M60k40K02M94l45j52k64L99N92q13k16l13P54K09o26n5N27K0L28
4833E62r42N67Mj005K88O10K95k57k39J85j11K23o26M34L7J104r89N92l25m19
4853a2J25l24P1j2N77m82j13M19k30L74n72j47O5N83j254N20N16J57k13l35M28
4874A41j73k05M47l38R8m8J66Q3m48L74l91O26n09K89j68K24k86o6M42n33N74
4895B99m91M54j91K1Q1n36N19m18L77k07K01j74j05J97J24K45n84L11k62L90k49
4916Bj6L03n81O19m95M03n52K09J15q5J15j91K64k85M19m71L15Pk49M17m48J77
$$ plain form
4938 -8 -258 137 -253 61 332 -402 -72 -220 291 -138 125 -113 9 68 -216 251 -249 234 -196 -104 112
4959 112 -103 109 -329 225 -173 -7 173 88 -123 -242 240 -140 224 -67 34 144 -199 -99 -170 262 -130
4980 -130 243 79 220 148 -289 233 -521 271 -177 176 -171 323 7 -182 115 -366 33 -310 195 -45
5000 -45 121 -33 -122 86 -96 179 -463 266 85 47 103 -260 48 41 296 -68 -36 -277 215 96 -53 387
5022 387 -368 250 -231 6 -158 49 135 -159 237 -382 -27 -130 -119 325 -192 289 -105 106 -167 175 -356
5043 -356 100 157 -351 131 -378 142 -210 5 -99 -238 173 -194 89 -93 346 -118 120 -83 126 -67
5063 -67 -260 118 -286 270 -185 140 -94 -38 95 -416 9 -168 -65 7 -114 144 -73 236 -211 135 -219
5084 -219 252 -32 120 -10 -136 261 -141 9 26 -70 117 -91 30 -287 76 -222 250 -308 57 29 -64
$$ packed form
4938hk50L95l90L14K71p34L30j48N11m29K63k38J22N9k84M67n00M83m30R2K16
4959A12k15K12m38N54l98J66J80q5k11j19M82l80L64k91J01J10l43J00p1M32l92
4980a30L73j64J41p2m37N22p54P92m48L53l47M94l16j89K97m81L99l43N05k40
5000d5J66j54q9K08j82K75o42P29j81l8N6l63L08pK55l64L2k41M92j19j49M40
5022C87p55O18m81K37j64K07Q6k94L96o19L55j03J1M44n17M81l94K11k73L42n31
5043c56M56N7n08M82n09N20l52K15j04j39M11l67K83j82M39m64K38k03K09j93
5063f7j93L78m04N56m55L25k34N6J33n11M25j77J03P2j21K58k17L09m47L46l54
5084b19M71k84J52j30j26L97m02J50J7r6J87k08J21l17L63k98M72n58L65k8r3
$$ plain form
5105 -64 45 -321 159 -389 205 -340 56 98 -247 126 -220 180 -373 224 -42 -113 149 35 443 -305 134
5126 134 -193 205 -35 -43 -178 -117 145 -306 488 75 105 -199 27 169 -124 386 -146 215 -102 191 340
5147 340 -163 167 67 375 -110 150 -151 241 344 -170 286 32 93 -71 -68 -154 47 213 -115 127 -134
5168 -134 261 -18 -95 209 74 9 -4 334 -282 217 -19 28 50 -154 108 -78 214 -128 200 12 -110 -33
5190 -33 -58 122 -211 111 -17 186 -124 152 282 -306 427 -320 175 -313 106 287 -192 152 -355 169 -396
5211 -396 277 -277 -156 54 -123 350 -138 150 5 154 68 128 63 -31 166 -40 270 11 514 126 45 253
5233 253 39 197 -151 455 -331 130 206 -145 315 -291 271 -85 33 -368 -173 -233 -18 163 -45 21 -351
5254 -351 276 -624 181 -38 -124 389 -554 404 -205 210 135 -136 182 -458 137 -77 227 -63 111 178 -129
$$ packed form
5105f4J09l66M80n48N94n45L96M2l45L73l46M00n53N97k66p1K62j14M08p48M39
5126A34l27L98k40qj35O1K62m51P94m13L0l04K26J42k93N10n32L61l17K93J49
5147C40n03L30j00L08m85K60l01L92J03n14M56k54O1j64Lq6K01J66l28K42k61
5168a34L95k79p7L04j35o5j3L38o16M99k36M7K2k04K62j86K92l42L28j88j22P7
5190c3k5J80l33L22j28K03l10K76J30n88P33p47M95m88M19J81m79L44n07N24n65
5211c96O73n54J21K10j77M73m88K88j45J49q6O0o5r4J97k06L10k59N03l88q1K08
5233B53k14J58l48O06p86M61P6l51M60o06N62l56J18m01J95o0K15J81k08O6l72
5254c51O27r00Q05k19q6N13r43R58o09M15p5k71L18o40N95k14L04k90J74O7l07
$$ plain form
5275 -129 48 -451 301 -102 150 -169 171 -116 -235 -55 -431 241 -18 290 -214 45 -163 -229 122 71 141
5296 141 -157 86 -117 -38 191 -167 282 7 202 -107 28 25 99 89 -168 224 -207 296 -203 -55 -186 64
5318 64 92 -190 227 -292 202 -180 195 265 -41 131 -319 204 -173 243 -135 -93 193 -104 153 -117 -8
5339 -8 -233 48 -216 -10 -29 -158 102 -261 76 -335 -41 -13 2 115 -321 197 -188 416 27 -49 35 -196
5361 -196 46 -123 289 -128 285 -97 -193 39 -196 250 43 363 -184 214 -274 37 215 -480 383 -143
5381 -143 12 -195 22 100 101 200 -27 -41 -353 63 -181 170 97 28 98 -205 246 -23 -12 34 32 113 -177 350
5405 350 -169 221 -140 3 -40 -53 108 -234 -47 -170 -150 -203 43 65 -124 151 -420 190 -38 286 -400 -172
5427 -172 -59 34 37 -81 -56 -118 84 -119 -74 85 -95 -21 -89 348 -149 64 66 -38 263 -257 90 44 151 -42
$$ packed form
5275a29J77m99P52m03K52l19L40k87j19J80l76O72k59L08n04K59k08o6L51n1P0
5296A41k98K43k03P9K29l58M49k75J95l09J35lP4j0k57L92m31N03m99J48j31K50
5318F4K8k82M17n19M94l82L75P0l06J72m50N23l77M16l78M2K86k97K57k70J09
5339hk25K81k64K06j9j29K60l63L37m11K94K8J5J13m36N18l85O04l89p6Q4k31
5361a96K42j69M12m17M13l82r6K32k35M46k07L20n47L98m88L11J78o95Q63n26
5381a43J55k07K17P8JR9k27j4l12M16k44L51p3o9P0l03M51k69J1M6kQ1k90N27
5405C50n19L90l61J43m3j3J61l42J87j23K0n3K46K2j89K75n71O10k28L24o86K28
5427a72J13R3Lj18K5o2K02k03M5J59j80P4o8M37m97K13Kj04L01n20L47m6J07j93
$$ plain form
5451 -42 -42 109 -337 -53 -115 155 -221 117 -64 -185 79 -235 449 -416 77 -453 86 198 69 163 -396 34
5473 34 -255 -20 -74 560 -119 -218 50 -118 39 -290 167 -39 -66 225 0 218 -453 380 -227 -166 -356 104
5495 104 -35 -195 318 -530 -47 -11 462 -135 520 204 -211 295 245 204 -373 129 163 238 158 -225 -94 -218
5517 -218 446 316 610 -229 -241 384 -57 693 40 120 -792 101 151 -154 -54 132 391 202 -23 396 -98
5538 -98 359 47 257 -58 151 -546 611 -485 534 166 414 477 -120 -331 226 246 168 -826 42 -167
5558 -167 220 70 -171 -316 -6 125 159 -133 -205 214 -248 293 -108 70 -14 -112 294 -160 72 -52 -5 -146
5580 -146 -147 110 -188 139 101 110 -44 94 -61 -96 74 -82 10 -189 27 -100 55 159 -185 299 -134 238
5602 238 -137 -16 -143 -47 19 -5 114 -197 -29 91 298 -4 -170 22 -56 132 6 173 66 1 75 -218
$$ packed form
5451d2%J51m46K84o2K70l76L38j81j21K64l14O84q65M93n30N39J12j29R4n59M30
5473C4k89K35n4O34o79r9K68j68J57l29M57k06k7K91k25K18o71Q33o07O1j90M60
5495A04j39j60N13q48M83L6M73n97O55l16m15N06n0m1n77N02L4P5q0l83J31j24
5517b18O64j30K94q39j2O25m41P50o53Q0r12Q93N0l05J00J86K59j89k25M19m94
5538i8M57l12K10l15K09o97J157j096J019l68K48O3n97k11N57K0p8r94Q68k09
5558a67L87j50k41j45L10J31L4k92p2M19m62N41m01J78q4r8M06m54K32j24M7j41
5580a46jK57k98L27l8Rj54J38j55l5J70j56R2j99K16j27J55J04l44M84m33L72
5602B38l75J21j27R6O6k4J19l11J68J20K07l02j66J92p8J88j26J67j07o5P4k93
$$ plain form
5624 -218 171 -200 117 -234 33 -57 114 82 -6 223 231 123 -158 237 -109 -72 177 -68 -75 -282 -5 -223 82
5647 82 -112 -8 178 -446 98 -196 323 -128 -115 73 -52 378 -403 -79 -156 85 -128 -118 -124 66 84 -206
5669 -206 103 -428 77 -288 109 199 -112 153 -97 76 139 145 294 -151 131 -115 350 87 -8 -24 89 151
5691 151 -172 388 23 311 -164 -12 -82 -162 118 74 69 -151 -153 -224 135 -28 -28 -122 -228 301 -204 134 -170 67
5715 67 -183 -52 253 -30 175 -78 283 56 56 -34 -104 41 -261 190 -297 73 -71 17 -184 97 -60 -208
5737 -208 200 -88 56 -124 -58 -126 -149 -10 68 -38 -103 -8 -143 164 168 71 -27 -131 508 -163 -132 -58 -153 125
5761 125 -194 85 -52 -238 -38 256 175 7 92 -234 194 -93 98 -78 120 -149 0 106 -212 335 -193
5782 -193 75 -14 167 252 -113 79 -341 -60 -278 -82 22 -353 216 -188 57 -214 73 -29 136 -125 -167
$$ packed form
5624b18L89l71L17l51K67r0J71l2q8K29Qj08k81L95l46L7K49k45pk07K77k18L05
5647H2j94J04J86o24N44k94N19m51J3J88j25M30p81L24p7K41k13J0oJ90J8k90
5669b06L09n31N05l65L97R0l11K65k50J73O3OJ49m45K82k46M65k63r5j6J13O2
5691A51l23N60l65K88m75J52p0q0K80m4nk20kp1L59j63%r4j06N29n05L38l04K37
5715F7k50J31L05k83K05k53L61k27%r0p0J45l02M51m87L70j44Q8k01K81j57j48
5737b08M08k88J44j80O6o8k3J39P8j06o5R5j35L07Mr7r8j04O39o71L1P4r5K78
5761A25l19K79j37j86K00K94q1j68Q5l26M28k87J91j76J98k69J49J06l18N47n28
5782a93K68q9J81Q5l65J92m20K81k18J96J04l75N69m04K45k71K87j02J65k61m2
$$ plain form
5803 -167 201 90 223 -91 96 0 37 119 -199 95 -227 115 -113 -10 -144 58 63 -137 65 -113 100 -175
5825 -175 -33 -64 -19 169 157 168 -61 104 5 77 73 -21 164 -266 200 -98 -22 -187 -11 -46 -200 177 -147 419
5849 419 -149 -32 241 4 163 7 175 -298 282 -433 94 -14 -5 -6 -358 62 -200 73 -273 -116 39
5870 39 10 200 -31 7 -343 128 15 -16 -26 -349 -1 -170 8 -237 68 86 -131 86 -326 43 85 189
5892 189 6 306 5 95 239 -235 381 -232 135 -159 31 151 168 251 -138 99 -67 292 76 233 398
5913 398 205 300 -247 273 -144 267 94 62 -153 -36 83 -256 184 -174 169 35 103 260 -279 475 -275
5934 -275 -45 -41 -2 -76 -120 217 -380 148 -168 54 -83 -316 -111 -81 228 -172 74 -65 -100 51 9 1 192
5957 192 48 -333 302 38 15 343 121 24 -277 173 -210 221 -78 135 -59 139 144 -241 232 -361 -94
$$ packed form
5803a67L68j11J33l14J87r6L7Q2l18K94l22L42k28J03j34K02Nk00K02j78K13k75
5825a75J42l1M5J88j2J1k29J65r9P2mr4J85m30M66k98P6j65J76l5j54L77l24N66
5849D19n68J17K73k37J59j56J68m73N80p15N27j08Rjl52M20k62K73l46J57J55
5870C9k9J90k31L8l50M71j13l1j0l23L48j69J78k45L05J8k17K17m12L69M2J04
5892A89j83L00l01R0J44m74O16o13L67k94J90J20J7Q3l89K37j66L59k16J57J65
5913C98j93R5n47N20m17M11j73l2k15J17J19l39M40l58L43j34O8J57n39P54p50
5934b75K30ML9p4m4L37n97N28l16K22j37k33K05L0L09m00K46j39l5J51m2qJ91
5957A92j44l81O35k64k3L28k22r7l01M50l83M31k99K13j94J98Nl85M73n93K67
$$ plain form
5978 -94 38 29 71 126 145 56 244 -184 95 -158 -57 -140 -224 48 -118 189 261 148 -68 -88 150 -110 173 -207
6002 -207 395 24 -20 106 -50 92 -178 205 -149 311 -31 89 -23 71 25 -206 214 -116 65 4 -28 100
6024 100 -220 190 -270 291 54 -72 146 182 173 34 189 48 -16 104 61 -64 -122 252 36 257 -99 442
6046 442 -202 58 -84 -112 283 -247 221 -381 -59 -52 84 -88 -112 32 -259 93 -3 200 42 -178 -30 -117
6068 -117 -20 -229 70 -24 119 -28 -125 158 -262 168 -66 69 -255 90 131 -213 190 -86 -64 -120 -60 -345
6090 -345 1 -138 -274 54 -316 262 -160 210 -61 -208 -58 -244 -129 -217 83 -294 21 35 -31 15 -92
6111 -92 278 -102 264 -24 -107 9 -20 46 -203 254 -256 -99 -101 173 -89 -243 117 -157 242 -287 70 399
6133 399 -43 -74 82 -49 -197 12 -55 -199 -188 -37 101 -89 150 -334 335 -51 207 97 -55 -14 -280
$$ packed form
5978i4J32rM2N5J9q9J88m28K79k53J01q3q4K72j66L07P2j13k16k0K38k60K83l80
6002b07O02l71m4J26j56J42k70L83l54M60l42J20j12R4m6k31M20l30J81o1l2J28
6024A00l20M10m60N61k37j26K18L6rj39J55j41o4J20m3j25n8L74k16K21l56N41
6046D42o44K60j42k8L95n30M68o02L22PJ36j72k4J44k91L52r6K03j58k20J48q7
6068a17R7k09K99r4J43j47r7K83m20M30k34J35l24L45M1l44M03k76K2n6O0k85
6090c45L46j39j36L28l70N78m22L70k71j47J50j86J15q8L00l77L15J4o6M6j07
6111i2L70l80L66k88q3J16k9O6k49M57n10J57kK74k62j54L60k74L99n29L57L29
6133C99m42l1J56j31j48K09o7j44J1J51J38j90K39m84O69l86K58j10j52M1k66
$$ plain form
6154 -280 223 232 -15 -235 -110 114 -65 -66 -119 143 -152 116 7 -51 -82 -303 88 -105 -91 -133 159 -62 119
6177 119 -19 -153 54 -381 62 40 157 -156 -97 1 -331 118 -116 -8 -135 -87 24 -276 96 -234 163
6198 163 -26 143 186 -206 167 -60 342 -168 207 -34 24 -196 -74 285 -17 112 -103 110 158 -48 209
6219 209 -294 398 -56 45 -48 44 60 230 69 -83 99 -263 198 -151 -28 -31 154 49 -146 223 -89 93
6241 93 -51 54 -82 -47 -65 87 423 136 61 -293 -33 122 15 -54 -33 -23 -279 240 -317 -176 -166 -174 134
6264 134 -20 -151 -178 47 103 -128 83 -91 71 -362 226 -142 0 70 -14 33 -95 244 -300 136 -176 -90
6286 -90 -71 -147 250 -212 70 -69 86 23 -4 -73 -41 57 55 175 42 232 -172 73 -231 -135 22 -134 205 -357
6310 -357 260 -1 26 144 73 -26 -268 81 -194 195 -24 -83 123 -337 433 112 168 -135 79 63 -46 224
$$ packed form
6154b80N03Rk47k20J25K24j79jn3K62k95K68j09n8l1k21L91j93J4m2K92k21J81
6177A19j38j34K07m35M43k2J17l13N9R8l32M49k34J08j27M8J11l00L72l30L97
6198A63j89J69M3l92L73k27M02n10L75k41N8k20J22L59l02J29k15K13M8k06K57
6219B09n03O92m54J01r3R2J6J70j61j52J82l62M61l49J23lJ85j05j95L69l12J82
6241I3j44J05j36L5j8J52L36k87p5l54K60J55j07o9K1J0k56N19n57J41J0qL08
6264A34j54j31k7K25N6k31K11j74J62m33N88l68J42P0q4M7j28L39n44M36l12Q6
6286i0J9p6L97m62K82j39J55o3k7o9L2R8kJ20j33J90m04K45l04R6J57j56L39n62
6310c57O17k61K7J18p1r9k42L49k75L89k19n9K06m60P70l21N6l03K14j6j09K70
$$ plain form
6332 224 -148 -67 -349 126 -214 18 150 6 61 -256 158 -124 88 5 -123 -221 -123 221 -212 -159 -167 221 -99
6355 -99 -49 102 -46 70 -51 120 -69 57 -10 62 138 -187 95 -243 300 -34 32 125 -46 78 -24 229
6377 229 -2 168 221 -20 260 -257 -4 -203 31 -243 -33 -170 20 -88 -30 532 -298 -1 -221 -234 29
6398 29 -17 132 -59 46 -251 106 -80 -132 131 -172 394 69 113 18 199 233 -95 274 -20 188 -310 179
6420 179 -188 -15 -163 -164 187 -251 70 -209 19 -33 -89 -74 -74 138 -178 151 -171 -71 79 -177 140 -174
6442 -174 140 -182 195 -8 45 -121 83 -63 -155 94 -136 79 -146 93 -78 -26 -113 -153 115 -67 372 -58
6464 -58 101 91 28 -30 -163 404 -368 96 -76 -30 87 -33 -143 -153 143 -47 -84 -38 -29 77 -283 -4 -167
6487 -167 -312 -40 64 -12 100 183 14 27 -73 390 -27 43 -50 -33 151 -126 -149 -113 52 -134 -66 80 -265
$$ packed form
6332B24l72Q1k82M75l40K32J32j44N5l17M14k82K12q3j28r8R8L44m33N3qL88l20
6355i9N0J51j48J16j21J71j89J26o7P2P6l25K82l38N43l34O6R3j71J24j02K53
6377B29k31J70N3k41K80n17K53j99K34k74K10j37J90j08N8N62q30K97k20j3K63
6398B9m6J49j91J05k97L57j86n2K63l03N66l25M4r5J81L4l28L69k94K08m98M89
6420A79l67J73j48jL51m38L21k79K28n2n6J5%K12l16L29l22J00J50k56L17l14
6442a74L14l22L77k03N3j66K04j46r2K49k30K15k25K39j71N2q7m0K68j82M39m30
6464e8J59j0o3n8j33N67p72M64j72M6J17j20j10j0K96j90l7M6RJ06l60K79j63
6487a67j45K72J04p6J12Q3j69J3j00M63m17P0r3J7J84k77k3L6J65j86O8J46l45
$$ plain form
6510 -265 119 29 -15 -68 94 60 -48 -60 17 -58 -156 31 -34 208 143 105 241 -117 80 14 -60 180 -56 -38 35
6535 35 -106 -121 -60 -487 68 82 -88 -113 119 285 -240 75 61 66 -44 14 241 -220 -43 -85 -23 -247 133 -315
6559 -315 -71 147 -312 54 -47 -16 -361 -196 -61 -76 278 29 278 -95 -57 -37 26 -37 -66 10 -120 -15 -162
6582 -162 90 20 139 -16 -47 81 -8 287 -192 -72 223 17 76 228 40 -145 168 -26 -48 -52 -102 62 -94
6605 -94 33 -33 126 -29 229 224 -40 240 -79 -42 -105 -90 -213 2 -12 -178 113 -204 68 -249 123 -173 -9
6628 -9 206 -223 124 -198 58 -275 -169 -43 54 134 -276 185 -305 212 -54 -220 7 -197 56 -52 214
6649 214 -227 -157 -102 140 51 -29 187 -51 142 -211 2 11 14 -14 -63 41 -152 -45 -117 251 215 -48 197 77
6673 77 140 -142 -154 135 -94 -43 -189 36 93 100 -199 311 -187 57 1 9 54 -182 42 -80 207 -124 70 -90
$$ packed form
6510b65L84r0m4n3J62l4j08j2P7p5r8J87o5K42o5l8J36l58J97o6p4K40k36J8P3
6535C5j41j5O1m27N55J4j70k5K32J66n25L15j4Nj10N8K27m61J77m2O2k24L80m48
6559c15K44K18m59L66j01L1l45J65J35j5L54k49K49l73L8K0O3o3k9P6j30J05j47
6582a62K52p0J19j55l1J28q9K95m79J20K95k06N9J52j88j85L13j94k2mn0J64j56
6605i4J27o6J59j55K58nk64K80l19L7o3J5j23K15j4j66K91l17K72l17L72k96J64
6628iK15m29L47l22K56l33J06J26R7Q0m10M61m90N17k66j66K27k04K53j08K66
6649B14m41P0N5K42q9q0K16k38J93l53K13RLk8m9J04j93J07p2L68l6k63K45j20
6673G7O3k82j2K89k29N1j46K25N7Pk99N10m98K44n6QM5k36K24j22K87l31J94j60
$$ plain form
6697 -90 42 255 -146 251 -195 -52 -13 -150 46 -291 101 -40 25 -99 161 -27 -115 188 -324 77 -249
6718 -249 62 1 4 215 91 387 -111 102 -115 107 -148 -79 -117 185 33 0 100 -51 125 -4 -287 -161
6740 -161 29 105 -96 257 -2 232 -34 -76 9 97 -103 -303 62 170 393 46 19 -26 -313 125 -26 57
6762 57 -40 -11 126 53 146 -105 40 -35 58 -193 -10 -25 36 126 -165 94 76 -188 -13 57 9 -64 -46 -240 -25
6787 -25 35 42 -62 -168 110 -247 -82 34 112 -14 -23 30 54 -17 -121 141 -53 119 184 150 -109 -91 163 -209
6811 -209 -72 -385 238 148 -125 113 -143 185 -369 -10 -101 16 -9 147 127 -123 119 -161 85 -69 -117 67
6833 67 -481 84 -123 149 -37 -68 77 135 230 25 41 -17 157 -272 -280 115 213 -95 -339 609 438 94 90 -80
6857 -80 187 -101 -87 -38 196 50 -103 -188 -96 251 -105 175 -84 -36 76 195 163 -260 112 -66 6 -233 63
$$ packed form
6697i0J32K13m01L97m46J43L9j37J96l37L92j41O5j24K60j88q8L03n12M01l26
6718b49L11o1LK11j24K96m98K13k17K22k55O9l8L02j52l3J00j51J76j29k83J26
6740a61J90P6k01L53k59K34k66m2Q5Q8k00k00L65J08K23l47k7m5k87M38j51Q3
6762E7r7K9J37p3R3k51J45p5R3k51J83j5O1R0k91K59j8k64J75P0m8p3J8j94K15
6787b5O0Pj04j06K78l57J65J16P8j26rN3K4p1j04K62j94J72O5l4k59J8K54l72
6811b09J37l13O23r0k73K38k56L28n54L59r1J17k5J56k0k50K42k80K46j54m8J84
6833F7n48N65k07K72j86l1J45N8R5k05J6n8J74m29qL95R8l08k44R48j71l44mj70
6857h0K67k88J4M9K34j46j53q5R2L47l56K80k59M8J12J19l2m23L72j78P2k39K96
$$ plain form
6880 63 58 27 46 -224 -75 -189 132 94 133 193 -26 -71 -93 41 55 -90 -259 -61 77 -58 308 63 194 -96
6904 -96 172 -197 -32 59 -204 5 14 73 -171 96 -143 -34 -253 -54 20 -61 161 -79 113 -174 54 245
6926 245 49 -84 -375 -36 -196 85 -18 30 -139 -165 107 -230 173 -78 -105 18 -105 156 -146 108 -66
6947 -66 13 -190 89 58 139 5 -51 256 -192 120 -67 1 135 -40 114 -21 102 -77 210 -142 79 186
6969 186 -201 -32 -125 133 74 -20 -30 -27 -95 -28 54 -73 63 -49 -18 171 -152 52 -44 235 20 -90 -174 112
6993 112 -302 -236 1 -35 -2 -87 70 -120 42 194 -76 22 -89 26 -275 93 47 46 173 -134 187 -221 116
7016 116 64 -90 -182 -146 31 89 207 -245 112 -286 211 362 -70 -106 -108 246 -195 94 25 226 286 -379 252
7039 252 -5 -7 216 18 -140 -86 -85 -53 251 -64 297 101 260 206 96 138 102 187 -134 55 -135 326 31
$$ packed form
6880F3nl1J9k70J49j14L21l8L9O0k19m5k2J34J4j45j69J98J38j35L66k45J31k90
6904i6K68l69J65R1k63K09RN9k44K67k39J09k19J99P4q1K22k40J92k87K28J91
6926B45j96j33k91L39j60K81j03M8j69k6K72l37M03k51k7J23j23K61l02K54j74
6947f6P9k03K79l1Q1j34n6L07m48L12j87O8J34j75J54j35J23j79K87l52K21J07
6969A86l87J69r3K58n9r4j0Lo8O7Q2j27J36j12L1J89l23K04r6K79k15j10q4K86
6993A12m14O6K37l6L3q5J57j90J62J52k70R8j11J15l01L68m6jJ27l07L21m08L37
7016A16n2j54r2L6J77N8J18m52L57l98M97J51m32l6kL54m41K89o9K01O0o65O31
7039B52k57kK23j98j58N4JL2L04l15L61j96J59n4j10M2l6Q5l21J89j90M61k95
$$ plain form
7062 31 -247 180 -181 247 117 229 129 482 201 -38 239 132 128 245 -239 492 20 276 218 6 -330
7083 -330 652 40 185 -323 -560 237 319 -347 321 553 -330 -657 -194 23 -172 5 3 -276 -2 207 -35
7104 -35 164 -157 49 -95 -118 -33 53 -5 51 239 112 5 19 263 -47 154 136 94 -46 -184 28 -9 331
7127 331 -218 291 -82 -87 293 4 -66 -21 155 -46 -80 -90 40 99 -117 46 67 191 -144 -27 44 -179 50
7150 50 80 374 114 253 60 -45 126 -130 139 -24 75 -252 34 134 -146 -52 -99 130 -275 -36 418 29
7172 29 155 293 69 -87 85 -146 -283 -65 -196 112 47 -135 -76 153 -201 126 29 -91 -38 -46 272 -261
7194 -261 71 28 142 135 86 -57 137 258 -302 -182 -7 -124 -3 137 97 -221 -130 -93 148 -105 -33 -14 -120
7217 -120 200 -147 248 30 -13 -117 -41 49 -145 58 -260 83 -124 158 -36 10 -112 -10 151 -215 -1
$$ packed form
7062C1k78M27l61M28j30J12j00L53k81k39K77j07mJ17m84P31m72K56n8k12l36
7083c30R82o12J45n08k37P97Q2o66O68K32q83l27M63K17j95J77kk79K74K09k42
7104c5J99l21K06j44k3Q5Q6n8N6J88j27j07J4K44l10K01j8m2j40j38K12l7L40
7127C31n49N09l73nL80k89p0M5J76k01l4j0J30N9k16J63K1J24l35J17P1k23K29
7150E0L0K94k60J39j93j05J71k56K69j63R9l27K86J00k80R4m7K29m05K39M54l89
7172B9J26J38k24j56J72k31j37K18j31L08o5j82N9K29l54L27r7j20N3qL18n33
7194b61L32m3J14pm9j43J94J21n60J20J75j17J21J40m0l18R1L7K41k53P2J9j06
7217a20L20l47L95k18m3j04P6R0j94K03l18L43k07K82j94M6j22J02J61l66K14
$$ plain form
7238 -1 445 -216 -332 -98 51 -11 -107 -40 -98 23 -35 60 -23 133 -180 89 -297 -181 140 -21 -106 -276 81
7261 81 -26 -152 -201 184 73 -35 186 9 78 -21 94 -120 31 18 -132 180 -192 145 -203 274 174 -310
7283 -310 1 -36 207 23 81 -84 -42 -118 -6 174 -132 11 -41 -32 218 68 313 -5 42 14 183 109 -25
7306 -25 -49 143 147 -178 -28 -77 48 -135 -105 -104 89 -82 -213 -130 144 -257 -225 -163 87 48 27 29 85 -178 106
7331 106 -285 60 131 104 -106 -51 115 0 0 21 -66 21 -92 -72 -83 -282 -27 -36 -15 184 -11 -28 -6 51 284
7356 284 42 134 -33 49 -101 -107 4 49 328 -419 61 95 -323 -179 -54 -3 120 73 32 -119 -68 -147 96 -129
7380 -129 -43 -279 -96 -89 -127 117 -85 139 -148 95 -332 114 -53 -54 -115 -47 94 -199 94 -322 81 -37 -158
7403 -158 3 -24 -17 -21 40 107 -103 -71 -60 218 -128 42 -122 -173 -178 82 136 27 216 -272 -108 49 159 -218
$$ packed form
7238aM46o61j16K34J49o2r6O7n8J21n8R5q3J56l13K69l86J16L21j61q5j70L57
7261H1j07j26m9L85j11j08K21j77O9r9J15k14J51j3j50L12l72L37l48M77j00m84
7283c10L11l7K43j84N8j65M2p6J12J80l06J43n2RK50j50K45l18M7k8J69p4j34
7306b5k4J92Ml25J50m9J25j83L0JJ93j71j31Q3K74m01L2O2K50l9k1KN6k63K84
7331A06l91L45P1k7k10N5J66j15%K1q7Q7j13K0j1j99K55rK1J99j95j7K2N7K33
7356B84k42R2j67Q2j50oJ11M5K79p47M80L4m18J44J25N1J23m7m1j51N1p9K43k25
7380a29Q6k36J83Pl8K44k02K24k87K43m27M46j67jo1O8J41k93K93m16M03j18j21
7403a58J61k7PmO1O7k10L2J1K78l46J70j64n1nK60N4j09J89m88J64J57J10l77
$$ plain form
7427 -218 76 13 -202 125 -152 14 -148 -215 148 -131 10 -149 -94 -30 125 145 -181 54 -150 133 99 86
7449 86 -130 138 50 165 123 -109 93 -307 32 -183 -34 -85 -110 101 35 -37 119 -8 -222 30 -219 -16
7471 -16 200 -157 162 -118 -98 160 -68 -93 -167 222 -294 0 73 -137 187 60 30 51 505 -18 -144 -169 -51
7494 -51 368 -19 -72 -195 228 83 252 -84 -204 108 -58 274 -253 24 162 209 180 119 32 -2 -248 -92
7516 -92 -165 -237 -43 -40 -95 -3 -93 -111 39 110 136 113 -265 11 144 -69 116 -26 131 25 144 164 -81 5 129
7541 129 16 -210 -23 -150 123 88 130 22 -168 208 30 85 15 -161 46 -58 189 -9 -17 36 -37 -95 154
7564 154 -35 -159 212 26 35 -144 220 128 -100 139 -20 -40 -98 20 262 326 -51 -194 61 53 -4 -56 -36 -111
7588 -111 3 -5 -17 154 -12 24 102 14 44 10 -207 -261 298 82 66 9 16 -146 -48 45 86 -129 -139 12 -69 -65 56
$$ packed form
7427b18K94o3k15L27k77J66j62o7L63k79J41j59N5O4J55K0l26K35k04K83l4j3
7449H6k16K68q8J15m2k32K02m00L39k15J49n1k5K11o6p2J56j27k14K52k49K03
7471a6K16l57L19k80K0K58k28k5p4L89n16K94P3k10L24j27l0K1M54n23j26k5J18
7494e1M19l87n3j23M23j45J69l36j20L12j66L32n27K77J38M7k9o1q7l4k46J56
7516i2p3p2J94Ln5R2r0j8J50P1K6k3l78K76J33k13J85j42J57j06J19K0k45Q6J24
7541A29j13k26J87j27K73l5M2j08j90L76j78N5p0j76K07j04K47j98qN3p3n8K49
7564A54j89j24L71j86Rj79L64r2k28K39j59k0n8J18K42O4l77j43K55qn7n2K0p5
7588a11J14qj2J71j66L6P8q8L0l4k17n4N59k16j6n7Pj62R8R3M1k15j0J51q1MJ21
$$ plain form
7615 56 -73 -137 -128 116 180 9 230 -95 101 278 -37 14 27 41 58 43 30 -31 1 18 -37 -70 -175 -43 19 -213
7641 -213 133 13 168 1 88 36 64 -68 22 -65 -60 73 128 34 125 88 30 157 45 -115 107 -160 61 -121
7665 -121 -90 89 12 65 159 -109 99 105 57 -42 38 -240 96 -60 185 -90 82 129 85 204 136 -142 -78 -284
7689 -284 -135 177 189 134 77 -88 122 -104 -28 -23 -66 106 95 35 77 111 197 -40 -50 -51 191 -84 -117 -11 41 129
7715 129 117 -85 106 62 40 149 -89 54 -110 -137 -157 146 192 103 -38 -4 -81 -44 -18 -64 52 -26 -255 -96
7739 -96 -38 196 -44 102 290 33 116 -112 39 -129 157 -103 95 44 -27 -17 27 19 -217 155 171 147 127 -41
7763 -41 27 -63 126 -96 -279 256 54 28 -76 101 -33 58 -156 -164 45 -426 247 -111 -57 -158 -54 70 179
7786 179 -60 50 -173 52 129 -99 135 -164 -149 242 -52 211 57 7 -16 -48 -132 -34 148 -147 -148 -54 -75 -239
$$ packed form
7615E6j29o4RK44O4j71K21l25J96J77l15N1J3J4J7j5j3o1L2J7n5l3j05J32O2k32
7641b13L46j20J55j67Q7n2K8j32R0q7NJ33N5r4R1l7n8J27j12j60K22k67K21j82
7665a21L1J79p7N3R4k68K08Om8r9Q0k78L36j56K45k75J72M7m4J19o8k78O4k06
7689b84J49L12J2n5n7j65K10k26P6Nm3J72j1o0M2L4Q6k37j0jK42k75l3J06N2Q8
7715A29j2k02J91m4k2J09k38J43j64k7k0L03M6q9j41L4p7L7K6m6J16p8k29J59
7739i6N8K34k40J46J88k57Q3k28J51j68K86k60J98n1p1J0M4qk36L72J6k4k0j68
7763d1O8r0J89k22j83N35k02k6j04J77j34R1k14qK09m71O73l58N4j01J04J24J09
7786A79k39J10k23K25P7k28K34k99J5L91k94K63j54n0k3l2q4R8J82k95jR4k1j64
$$ plain form
7810 -239 -107 219 -62 47 -71 97 -148 20 147 -97 396 -108 70 88 231 -191 -114 -40 53 73 142 148 -210
7833 -210 98 -51 188 -180 -60 -128 -203 -55 -26 48 145 -76 199 29 192 -128 213 -103 -42 22 75 87 -55
7856 -55 -94 10 -23 -73 -55 46 -136 75 -169 0 -30 -70 -98 128 -25 18 -28 -72 61 -180 -108 -192 -168 58 323
7881 323 122 -63 380 -261 -4 -329 -290 287 60 -431 20 269 310 -502 -293 39 -8 -528 -23 -448 -428
7902 -428 -534 -232 117 -41 64 -65 -168 -272 226 146 -74 71 -198 111 136 98 314 -202 2 57 -86
7923 -86 -24 72 -18 25 -23 12 185 72 64 78 84 -238 -23 -69 44 12 94 86 -130 254 -147 -28 -24 -263 -170 199 -17
7950 -17 -33 -125 195 -12 42 -7 114 -150 114 -96 -51 53 -215 -166 -129 -4 -381 159 -193 -181 -1 -63 124
7973 124 -16 175 23 215 -14 -32 -135 85 167 -57 -98 -141 -83 -316 115 34 43 -52 195 51 -199 3 101
$$ packed form
7810b39J32L26k81J09j18J68k45J68J27k44M93n04J78J8J43m22P7P4R3K0O9Ol58
7833b10L08j49K39l68J20o8p5J48K9P4R7k21K75j70J63l20L41l16O1O4N3J2j42
7856e5l9J04l3n0J8J01j82K11k44J69l0m0k8K26j53M3m6m4J33k41P2q4K4K26K65
7881C23k01j85M43o41K57l25L9N77k27m91M51K49M1q12K09L32m7n20N05m25K0
7902d28j06L02L49j58J05j29j03j04M98q0k20J45k69L09K5l8K16n16K04N5j43
7923h6O2R6r0M3m8L5J73j13qJ4Ol22K15m6J13l2Q2qk16L84m01J19Mk39R3L69k16
7950a7j6r2L20k07N4m9J21k64K64k10M5J04k68M9L7J25l77N40l52J2J80o2J87
7973A24j40J91j52J92k29j8j03K20Q2k24m1m3N8k33M31q1Rr5K47j44k50K02R8
$$ plain form
7996 101 -83 1 83 -306 -153 -104 -64 43 -257 -225 42 53 105 -183 -73 -47 212 38 -37 29 0 253 56 65
8020 65 103 289 61 8 36 -190 232 179 68 -46 -82 -42 54 -176 -36 -82 -14 -75 28 -9 -122 13 -24 -131
8044 -131 -122 160 -13 -4 53 -42 20 7 -107 81 -99 100 -238 108 112 -213 -167 48 -19 8 -246 201 18 -108
8068 -108 -106 66 -50 87 -143 -137 -221 -260 238 23 -36 -21 107 -81 94 -88 37 115 -18 -212 -80 -35 66
8091 66 214 -209 102 96 -69 -45 -78 150 -90 7 -107 -64 217 -325 145 -399 32 0 -137 -50 134 79 -85
8114 -85 195 -117 -154 219 -174 47 112 -145 163 37 64 173 -29 -15 206 -74 -199 -134 89 182 -44 -24 -71
8137 -71 124 -195 142 121 -138 -4 3 128 -5 -25 -254 53 -22 27 217 136 81 -82 229 -51 -45 231 -55 -40
8161 -40 -84 85 -119 39 6 -175 198 13 111 159 190 -50 -179 66 -79 43 -43 33 -181 56 -134 214 -97
$$ packed form
7996A01j84Q4Q2l89J53M9M0J07l00L2K67J1N2k88J10K6K59j74p5O6k9K53j97R
8020F5L8J86k28n3K8k26M22n3j11j14l6M0R6k30J40m6O8o1J03l7j13J35l7j07
8044a31RK82j73RN7r5O2j3j14J88j80J99l38L46Ml25M6K15o7K7k54M47j83j26
8068a08KJ72j16J37k30Oq4l9M98k15n9J5J28j88J75j82J25P8j33j94J32M5J01
8091F6J48m23L11oj65K4l3K28k40R7j14M3K81n42M70n44M31l2j37Q7J84n5j64
8114h5K80l12l7L73l93K21O5k57L08j26K7J09k02J4K21k80j25O5K23R3k26K0m7
8137g1J95l19L37k1k59J34PJ25j33k0k29L07p5M9J90q1n5j63L11k80OK76k86J5
8161d0m4J69k04J58l3j81L73j85R8M8L1k40j29K45j45J22q6P6k14K37j90L48l11
$$ plain form
8184 -97 16 -187 -43 -77 -308 -195 -85
$$ packed form
8184i7J13k03J44l4k31J13J10
8191h5
$$ Imaginary data points
##PAGE= N=2
##DATA TABLE= (X++(I..I)), XYDATA
$$ plain form
0 0 0 0 0 0 0 0 0 0 0 0 0 0 0 0 -8 8 -8 8 -8 16 -16 16 -24 24 -32 38 -41 49 -57 66 -78 89 -102 114 -130 149
36 149 -167 190 -210 238 -262 294 -326 361 -400 444 -490 542 -599 657 -724 798 -878 968
54 968 -1068 1178 -1304 1445 -1606 1793 -2013 2276 -2593 2995 -3515 4229 -5285 7059 -10983
69 -10983 45512 -1493 64108 79393 34873 38054 64529 57272 21105 59447 28684 68642 -16159
82 -16159 65785 38722 -18743 51499 17689 -644 2575 38688 -36143 16584 1099 -28031
94 -28031 11339 -38050 9409 -40008 -13518 -15972 -27271 -36761 -9019 -19411 -68288 26306 -51942
107 -51942 -35105 -7110 -24680 -31939 -27579 5109 -41840 -8080 -24514 11723 -38189 -15463
119 -15463 31183 -47245 3120 7595 -350 -30665 27985 -962 -20371 20735 -7660 17560
$$ packed form
0@%%%%%%%%%%%%%%qJ6j6J6j6K4l2L2m0M8n6P0p9R0j06J23j44J67j91K16k44K79
36A49l16L57m00M48n00N56o20O87p61Q44r34J032j141J256j381J522j676J846
54I68k036K246k482K749l051L399l806M289m869N588o510P744r514J2344j8042
69a0983N6495m7005O5601J5285m4520L181K6475p257l6167L8342l0763L9958q4801
82a6159Q1944k7063n7465P0242l3810j8333L219L6113p4831N2727j5485k9130
94b8031L9370m9389M7459m9417K6490k454j1299r490K7742j0392m8877R4594p8248
107e1942J6837K7995j7570p259M360L2688m6949L3760j6434L6237m9912K2726
119a5463M6646p8428N0365M475p945l0315N8650k8947j9409M1106k8395K5220
$$ plain form
131 17560 -25025 28171 1166 -13205 14967 7118 -3036 -12536 36538 -30362 10795 8382 -9265
144 -9265 1328 -5598 13925 -26019 14436 -8803 -1233 -13082 4569 1577 -31581 24138 -19077
157 -19077 -7399 -7966 7961 -19398 -12645 17108 -27519 410 -11262 8937 -28561 -760 7897
170 7897 -28025 1152 -8625 3229 -33042 12452 -8489 -23000 -1 -7990 -5834 -30274 18974
183 18974 -25888 -13073 -1150 -11115 -12501 -18342 11308 -31373 -572 -10522 -4860 -18675 -7964
196 -7964 8421 -34948 9498 -8738 -8639 -14517 9035 -10031 -17411 16408 -17824 4694 -12825
209 -12825 12935 -8925 -8677 15749 -8391 -1729 -1076 19338 -25420 16585 8582 -14662 13089
222 13089 -1778 9029 -12509 15953 -3090 1028 -1868 7694 5035 -21307 29323 -16080 -3730
$$ packed form
131A7560m2585N3196k7005j4371K8172p849j0154r500M9074o6900M1157k413j7647
144i265J0593o926J9523l9944M0455k3239P570j1849J7651k992l3158N5719m3215
157a9077J1678n67J5927k7359O753K9753m4627K7929j1672K0199l7498K7801Q657
170G897l5922K9177r777J1854l6271M5494k0941j4511K2999p989K156k4440M9248
183A8974m4862J2815J1923r965j386n841K9650m2681L0801r950N662j3815J0711
196g964J6385m3369M4446j8236R9n878K3552j9066p380L3819l4232K2518j7519
209a2825K5760k1860K48K4426k4140O662O53K0414m4758M2005q003k3244K7751
222A3089j4867J0807k1538K8462j9043M118k896R562k659k6342N0630m5403J2350
$$ plain form
235 -3730 9169 -176 -10559 2241 9860 -21428 13150 -11659 6466 -12099 -3661 11359 -22636
248 -22636 5209 43 -4491 -18703 19213 -15394 -13032 16075 -19103 3386 -10066 6562 -10918
261 -10918 -4038 1020 -2115 -6703 -8301 19651 -29191 10914 5142 -15378 3975 2999 -1610 -11006
275 -11006 16042 -12596 6799 -5464 4759 5848 -17192 21527 -7851 -2826 5050 10901 -15018
288 -15018 8817 12773 -18754 17458 -5793 7360 -5137 4778 6952 -6571 4560 2764 6771
301 6771 -17465 23576 -8274 -7795 16106 -7860 706 -1615 10538 -12724 7731 -1692 1304
314 1304 -843 -5835 17051 -19610 9286 4429 -5545 -3278 10231 -1273 -11810 19610 -11262
327 -11262 5601 -1953 6627 968 -6614 14590 -4116 2060 -986 15945 -13363 7138 12838
$$ packed form
235c730J2899r345j0383J2800P619l1288L4578k4809J8125j8565Q438J5020l3995
248b2636K7845n166m534j4212L7916l4607K362K9107l5178K2489j3452J6628j7480
261a0918O880N058l135m588j598K7952m8842M0105n772k0520J9353r76m609r396
275a1006K7048k8638J9395j2263J0223J089k3040L8719k9378N025P876N851k5919
288a5018K3835L956l1527L6212k3251J3153j2497R915K174j3523J1131j796M007
301F771k4236M1041l1850M79K3901k3966Q566k321J2153k3262K0455r423K996
314A304k147m992K2886l6661K8896m857r974K267J3509j1504j0537L1420l0872
327a1262J6863p554Q580n659p582K1204j8706O176l046J6931k9308K0501N700
$$ plain form
340 12838 -12016 10604 209 7454 -8153 11578 497 -1519 4924 348 7790 -12512 17502
353 17502 -6418 -1593 6715 -25 -1452 -2901 12918 -14351 8864 -869 373 -2667 466 8251
367 8251 -13947 11235 -2468 1265 -5621 9314 -427 -9931 14692 -6114 2392 -3758 12009
380 12009 -7558 -1755 11736 -7258 2676 -2170 10977 -12201 5852 4687 -5530 1940 -1723
393 -1723 8323 -14519 10080 -2432 -4886 547 529 -852 -10127 11489 -12236 2532 -2689 -429
407 -429 -2171 -5758 8442 -11033 4407 -2559 4019 -8507 6174 4955 -11942 14172 -2962
420 -2962 3422 -743 10925 -414 713 11317 755 8394 -3082 19999 -3744 4039 16355
433 16355 149 4739 7712 13550 -7300 15922 3150 3547 5921 1861 11993 -8236 10700
$$ packed form
340A2838k4854K2620j0395P245j5607J9731j1081k016O443m576P442k0302L0014
353A7502k3920M825Q308o740j427j449J5819k7269K3215r733J242l040L133P785
367H251k2198K5182j3703L733o886J4935r741r504K4623k0806Q506o150J5767
380A2009j9567N803J3491j8994R934m846J3147k3178J8053j165j0217P470l663
393a723J0046k2842K4599j2512k454N433j8j381r275K1616k3725J4768n221K260
407d29j742l587J4200j9475J5440o966O578j2526J4681j219j6897K6114j7134
420b962O384m165J1668j1339J127J0604j0562P639j1476K3081k3743P783J2316
433A6355j6206M590K973N838k0850K3222j2772L97K374m060J0132k0229J8936
$$ plain form
446 10700 1998 -51 -2301 8419 -3409 -7692 13433 -14367 2984 -3370 -2539 -5238 -4034 -555
460 -555 -9933 -571 -9888 3412 -16717 1434 -1256 -16589 3893 -6585 -5981 -8488 5955 -13109
474 -13109 -1427 359 -7435 2593 -10578 9357 -8863 -2369 3969 -1007 -5715 3240 7420 -14427
488 -14427 13151 -3075 -970 2386 463 3789 -5424 6569 -2007 3644 -6442 9979 -3415
501 -3415 -6311 13184 -9946 2326 539 2665 -6993 4258 220 -5357 4630 -6245 7685 -10406
515 -10406 4712 1681 -6940 2516 894 -1005 -7212 11678 -10436 2112 2627 -3510 2517 -4993
529 -4993 7301 -6833 2352 -1225 3236 -5713 1334 6358 -12460 8682 -3417 -1194 -2501 2933
543 2933 -2566 -4977 5371 -6684 3109 -7055 5645 -6153 -4321 5656 -7394 -664 -2919 3812
$$ packed form
446A0700q702k049k250J0720j1828m283K1125k7800J7351o354Q31k699J204L479
460e55r378R362r317J3300k0129J8151k690j5333K0482j0478O04k507J4443j9064
474a3109J1682J786p794J0028j3171J9935j8220O494O338m976m708Q955M180k1847
488a4427K7578j6226K105L356j923L326r213J1993q576N651j0086J6421j3394
501c415k896J9495k3130J2272j787K126r658J1251m038n577R987j0875J3930j8091
515a0406J5118l031q621R456j622j899o207J8890k2114J2548N15o137O027p510
529d993J2294j4134R185l577M461q949P047N024j8818K1142j2099K223j307N434
543B933n499k411J0348j2055R793j0164J2700j1798J832R977j3050O730k255O731
$$ plain form
557 3812 -11176 4319 -1123 -6516 1699 -4033 3165 -9897 5722 -3311 -3116 -892 875 -270
571 -270 -7875 9450 -7713 1249 -440 1422 -1873 -2347 6621 -7780 4925 -2461 3586 -4308 2123
586 2123 3195 -6656 6590 -3652 3112 -5006 5858 -2308 -3152 5889 -4110 2171 -3672 7017
600 7017 -7471 2393 3055 -4202 1990 -2293 5654 -7906 5595 -158 -1435 -509 1364 3370 -8680
615 -8680 9347 -3994 -341 199 2077 -1236 -3644 6877 -5914 3602 -3370 5304 -3618 -1662
629 -1662 6218 -6802 3128 -1403 2703 -6632 5325 -1825 -4222 4936 -5411 4178 -5626 4486
643 4486 -2637 -1264 1600 -540 25 -4044 8660 -9566 4111 2006 -3681 1708 10 3144 -5303
658 -5303 6318 -2749 3483 -2556 2565 4005 -7639 9050 -2478 213 178 5497 -3750 1165 6146
$$ packed form
557C812j4988J5495n442n393Q215n732P198j3062J5619r033J95K224J767j145
571b70p605J7325j7163Q962j689J862l295m74Q968j4401J2705p386O047p894O431
586B123J072r851J3246j0242O764q118J0864q166q44R041r999O281n843J0689
600G017j4488R864O62p257O192m283P947j3560J3501n753j277R26J873K006j2050
615h680J8027j3341L653N40J878l313k408J0521j2791R516o972Q674q922J956
629a662P880j3020R930m531M106r335J1957p150k397R158j0347R589r804J0112
643D486p123J373K864k140N65m069J2704j8226J3677k105n687N389j698L134q447
658e303J1621r067O232o039N121J440j1644J6689j1528K691l5N319r247M915M981
$$ plain form
673 6146 -5704 6070 -3762 5336 -2797 290 4280 -2739 931 -204 4623 -8187 8243 -2634
687 -2634 -3283 4561 -3735 1885 -3570 4154 -4709 1522 -2429 821 -616 -5366 8149 -9186 2596
702 2596 434 -1844 -2363 1677 252 -6193 6288 -5994 3153 -4168 1148 1281 -5507 4749 -2418
717 -2418 101 -3397 6486 -6353 833 4307 -6052 4373 -2932 3531 -3650 2819 144 -158 526
732 526 -692 5348 -7578 7977 -1422 -1182 3038 414 1076 -1685 6326 -4887 4806 -1104 3001
747 3001 727 -1959 7080 -4789 3922 -29 3007 -3308 4308 1811 -4352 6374 -3685 3339
761 3339 -3330 3648 -1110 -1519 2724 -2523 1833 -4462 5963 -5951 915 1438 -3523 938 -2731
776 -2731 3257 -6572 3791 -2555 -949 -778 -1247 1990 -6474 5177 -4015 311 -1538 1072 -1081
$$ packed form
673F146j1850J1774r832R098q133L087L990p019L670j135M827j2810J6430j0877
687b634o49P844q296N620n455P724q863O231l951L250j437m750J3515j7335J1782
702B596k162k278n19M040j425o445J2481j2282R147p321N316J33o788J0256p167
717b418K519l498R883j2839P186L474j0359J0425p305O463p181O469k675l02O84
732E26j218O040j2926J5555r399K40M220k624O62k761Q011j1213R693n910M105
747C001k274k686R039j1869Q711l951L036o315P616k497o163J0726j0059P024
761C339o669O978m758m09M243n247M356o295J0425j1914O866N23m961M461l669
776b731N988r829J0363o346J606J71m69L237q464J1651r192M326j849K610k153
$$ plain form
791 -1081 -3331 5323 -5166 2974 -2035 3012 -2665 548 3244 -4535 4070 -2305 3529 -3886 3547
806 3547 543 -2336 3379 -2127 3377 -4447 6012 -3006 -186 2782 -1728 1574 -2389 5232 -5207
821 -5207 3721 -904 130 428 -1650 4661 -5574 4561 -1261 1075 -1381 2304 739 -3797 6229
836 6229 -4490 3278 -1579 1995 -335 -1039 3681 -2414 2586 -2809 5101 -4395 2325 2236 -4066 3727
852 3727 -1896 2233 -3297 3896 -2700 78 553 -2293 2849 -5443 5417 -4104 -420 507 -452 -1931
868 -1931 -1307 3746 -7055 4331 -3146 223 -957 -1370 2246 -4427 2560 -2095 2096 -4071 3890
883 3890 -640 -3078 5657 -3852 2777 -1497 3043 -1683 1739 1422 -560 3447 -2831 6723 -3795
898 -3795 3228 2217 -1195 2447 852 2439 -2680 6405 -3570 3090 1416 -449 3188 -2880 4888
$$ packed form
791a081k250Q654j0489Q140n009N047n677L213K696p779Q605o375N834p415P433
806C547l004k879N715n506N504p824J0459r018K820K968m510L302l963P621j0439
821e207Q928m625J034K98k078O311j0235J0135n822K336k456L685j565m536J0026
836F229j0719P768m857L574k330p04M720o095N000n395P910r496O720q9o302P793
852C727n623M129n530P193o596K778M75k846N142q292J0860r521L684R27r59j479
868a931O24N053j0801J1386p477L369j180m13L616o673O987m655M191o167P961
883C890m530k438Q735r509O629m274M540m726L422l17j982M007o278R554j0518
898c795P023j011l412L642j595J587n119R085r975O660j674j865L637o068P768
$$ plain form
913 4888 -2328 2274 -223 2770 -2052 603 4457 -5641 5245 -1797 1267 -1235 1444 299 -2195
928 -2195 2505 -2370 3200 -4975 4361 -1389 -2694 2997 -2825 866 -2847 3170 -4546 2195 -1337
943 -1337 -1619 1525 -4321 3595 -4845 1966 -1618 -305 -1225 -469 806 -4455 4507 -4843 1558 -1006
959 -1006 -287 -267 -1821 2904 -3866 2644 -2624 2711 -2742 591 2613 -4195 3687 -1408 2365 -3086
975 -3086 3354 -597 -1186 2843 -1717 3288 -3714 4622 -1972 621 1496 -449 1333 -2466 4645 -4201
991 -4201 2882 -838 229 149 -1404 2686 -4272 3230 -2944 1133 -2002 150 179 -3270 3030 -4480
1007 -4480 1844 -3175 1309 -2484 -1461 1658 -4162 2018 -2963 1895 -3793 1506 -515 -2814 2007
1022 2007 -2667 2458 -3919 3095 -1625 -1046 781 -898 1328 -3384 4578 -3937 1995 -236 -266 744
$$ packed form
913D888p216M602k497K993m822K655L854j0098J0886p042L064k502K679j145k494
928b195M700m875N570q175R336n750j305N691n822L691l713O017p716O741l532
943a337k82L144n846P916q440O811l584J313r20P56J275n261Q962r350O401k564
959a006P19K0j554M725o770O510n268N335n453L333K022o808P882n095L773n451
975c086O440l951n89M029m560N005p002Q336o594K593Q75j945J782l799P111q846
991d201P083l720J067q0j553M090o958P502o174M077l135K152K9l449O300p510
1007d480O324n019M484l793J023L119n820O180m981M858n688N299k021k299M821
1022B007m674N125o377P014m720N79J827j679K226m712P962q515N932k231l0J010
$$ plain form
1038 744 -1374 3322 -3236 2907 -2016 2193 -1793 425 2286 -3793 3652 -2608 1529 -1721 1876
1053 1876 -1073 -894 1917 -3269 3449 -3681 2759 -1894 -148 1088 -2001 1095 -1933 2622 -4350
1068 -4350 3387 -1549 -1111 1493 -2317 2324 -3310 2508 -2145 1120 -1295 686 332 -3462 4401
1083 4401 -4243 1925 -963 208 -723 -105 1305 -2807 2980 -3350 2905 -2380 786 1307 -2705 2519
1099 2519 -1578 1422 -2435 3431 -2541 936 1474 -2604 3413 -2587 3270 -1745 1471 145 613
1114 613 723 -623 3817 -3735 4532 -1160 590 1346 -150 1686 -1330 3491 -2219 3248 -1931 2077
1130 2077 423 -1723 3800 -2523 2247 -727 2038 -1898 1782 762 -1807 3468 -2940 3075 -2350
1145 -2350 1878 -5 -979 1051 -849 1581 -2973 3814 -3003 1154 513 -1334 1596 -1997 2404
$$ packed form
1038G44k118M696o558O143m923M209l986K218J861o079P445o260M137l250L597
1053A876k949J79K811n186O718p130O440m653J746J236l089L096l028M555o972
1068d350P737m936M38K604l810M641n634N818m653L265k415J981l54l794P863
1083D401q644O168k888J171r31O18J410m112N787o330O255n285L166N21m012N224
1099B519m097L000l857N866n972L477N38m078O017o000N857n015L216j326M68
1114F13J10j346M440p552Q267n692J750P56j496J836l016M821n710N467n179M008
1130B077j654k146N523o323M770k974K765l936L680j020k569N275o408O015n425
1145b350M228j883r74K030j900K430m554O787o817M157o41j847K930l593M401
$$ plain form
1160 2404 -2681 2238 -1844 1142 -350 -822 2536 -3523 3262 -2011 1116 -1130 838 -128 -1445
1175 -1445 2643 -3097 2800 -2215 1893 -695 -586 1716 -1848 1987 -1923 2626 -2541 1892 -129
1190 -129 -976 2243 -1738 2762 -2505 2990 -1393 929 331 -414 1778 -2007 3538 -2419 2436 -570
1206 -570 571 746 -955 2651 -2835 2992 -1836 1587 -879 594 1113 -2017 2502 -2583 1978 -2040
1222 -2040 1633 -1061 -995 1425 -2423 1658 -2714 2212 -2603 809 -61 -2168 1066 -2561 1690 -3106
1238 -3106 1770 -1842 -181 -155 -1529 1473 -3391 2652 -2218 821 -483 -2 236 -1325 2324 -2693
1254 -2693 2650 -1714 1531 -275 -288 1983 -1568 2445 -1366 2202 -1722 2286 195 -628 3210 -2052
1270 -2052 2960 -981 2296 -554 1207 1021 -216 2295 -1601 3579 -2158 2444 426 -272 1523
$$ packed form
1160B404n085M919m082K986j492m72L358o059O785n273L127k246J968r66j317
1175a445M088n740N897n015M108k588J09K302l564L835l910M549n167M433k021
1190a29q47L219l981M500n267N495m383K322n98p45K192l785N545n957M855l006
1206e70J141J75j701L606n486N827m828L423k466J473N19l130M519n085M561m018
1222b040L673k694O6K420l848M081m372M926m815L412q70k107L234l627M251m796
1238c106M876l612J661K6j374L002m864O043m870L039j304M81K38j561L649n017
1254b693N343m364L245j806j3K271l551M013l811L568l924M008k091q23L838n262
1270b052N012l941L277k850J761j86j237K511l896N180n737M602k018o98J795
$$ plain form
1285 1523 -154 2174 -1720 3338 -1776 1829 -221 -66 1731 -2323 2685 -1579 1190 -1282 1417
1300 1417 -1252 -772 1542 -3077 2255 -2707 964 -1461 -649 -123 -1502 459 -2801 1522 -3614 1456
1316 1456 -1823 -1497 390 -2593 523 -2503 1133 -2976 724 -1791 -1002 536 -2528 2124 -2975
1331 -2975 1048 -1375 153 -715 94 818 -2041 2809 -2333 1923 -625 521 935 -954 1812 -837
1347 -837 2121 -1678 2708 -1027 759 1724 -1649 2214 -1562 1956 -1274 1710 -544 280 774 -1935
1363 -1935 2424 -2767 1858 -1685 54 -55 -875 303 -1765 1505 -2838 1585 -1566 -560 -231 -1797
1379 -1797 968 -2665 1186 -2346 798 -1841 39 -253 -2268 1710 -2614 1412 -1976 757 -947
1394 -947 -601 721 -1638 1573 -2282 1979 -1887 647 248 -888 1036 -1604 1529 -2174 1619 -1455
$$ packed form
1285A523j677K328l894N058n114L605k050J55J797m054N008m264K769k472K699
1300A417k669M80K314m619N332m962L671k425Q12N26j379J961l260M323n136N070
1316A456l279L26J887k983L116l026L636m109L700k515P89J538l064M652n099
1331b975M023k423J528q68Q09P24k859M850n142M256k548J146M14j889K766k649
1347h37K958l799M386l735J786R65l373L863l776L518l230K984k254Q24M94k709
1363a935M359n191M625l543J739j09q20J178k068L270m343M423l151J006L29j566
1379a797K765l633L851l532L144k639J880k92k015L978m324M026l388K733j704
1394i47L46J322k359L211l855M261l866K534l99j136J924k640L133l703L793l074
$$ plain form
1410 -1455 303 75 -898 1512 -2125 1836 -1850 996 -728 222 364 -1104 1803 -2259 1923 -1334
1426 -1334 1243 -427 -30 1064 -1367 2041 -1606 1658 -1271 1535 -13 -28 1376 -1399 2121 -1591
1442 -1591 2167 -1163 662 572 -675 1192 -1411 1967 -2124 1913 -1120 186 719 -1267 1464 -2066
1458 -2066 1790 -1583 1220 -1020 303 256 -1524 2351 -2091 1372 -1170 480 -582 -527 629 -1412
1474 -1412 1607 -2000 1744 -1497 767 725 -1157 1421 -1055 1549 -1390 2119 -709 939 680 -791
1490 -791 2274 -1132 2593 -909 1450 72 1021 738 -94 2587 -1613 3130 -868 1445 816 21
1506 21 1598 -645 2220 -1283 2434 -1089 1502 559 -721 2295 -1369 1795 -817 1468 -725 1007
1522 1007 135 -434 1859 -1748 2317 -1632 1000 -146 -385 305 -845 1060 -2084 1885 -2101 782
$$ packed form
1410a455J758k28r73K410l637L961l686K846j724R50J42j468K907m062M182l257
1426a334K577j670L97J094k431L408l647L264k929K806j548j5J404k775L520l712
1442a591L758l330J825r0j247J867k603L378m091M037l033J306N33j986K731l530
1458b066L856l373K803k240J323m7j780L875m442L463k542J650j062N5J156k041
1474a412L019l607L744l241K264m2j882K578k476K604k939L509k828J648k59j471
1490g91L065l406L725l502K359j378R49k83q32K681m200M743l998K313o29p95
1506B1J577k243K865l503L717l523K591r43j280L016l664L164k612K285k193J732
1522A007q72n69K293l607M065l949K632j146k39O90j150J905l144L969l986K883
$$ plain form
1538 782 -239 -758 821 -1551 1353 -1515 1144 -1795 1082 -665 -775 1147 -2099 1677 -1543 888
1554 888 -662 260 -52 -323 1345 -1619 1967 -1571 1477 -351 -158 1186 -595 1409 -880 2160
1570 2160 -1375 1706 153 -40 1519 -1223 2058 -1084 2035 -726 1027 280 -110 1083 -1360 2583
1586 2583 -1378 1850 -447 814 517 -435 1534 -996 2299 -1511 1342 -1035 -285 399 -1630 1627
1602 1627 -1601 1503 -1864 329 -506 -740 332 -613 1155 -1243 1419 -623 348 -449 -221 912
1618 912 -810 1482 -1466 1344 -1371 333 42 -467 1142 -1294 1788 -1928 1444 -821 437 315
1634 315 -1356 1466 -1491 1156 -1125 925 -84 -476 631 -1356 1251 -1211 1139 -953 898
1649 898 -614 67 1580 -870 1422 -1051 1467 -529 800 31 -197 1469 -1299 1336 -1324 1434
$$ packed form
1538G82j021n19J579k372K904k868K659k939K877j747j10J922l246L776l220K431
1554H88j550R22l12k71J668k964L586l538L048j828J93J344j781K004k289L040
1570B160l535L081j553j93J559k742L281l142L119k761J753p47l90J193k443L943
1586B583l961L228k297J261k97r52J969k530L295l810K853k377P50O84k029L257
1602A627l228L104l367K193q35k34J072r45J768k398K662k042R71p97K28J133
1618I12j722K292k948K810k715J704k91n09J609k436L082l716L372k265J258j22
1634C15j671K822k957K647k281K050j009l92J107j987K607k462K350k092J851
1649H98j512O81J513k450K292k473K518j996J329p69k28J666k768K635k660K758
$$ plain form
1665 1434 -827 -8 535 -788 1047 -1674 1384 -1567 833 -861 -475 533 -1673 928 -2178 843
1681 843 -1607 210 -918 -733 254 -2192 1124 -2261 963 -1300 1 -653 -960 339 -1555 1431
1697 1431 -2200 1113 -1149 -117 378 -1174 1090 -1284 1255 -1265 1302 -718 173 722 -1129 1677
1713 1677 -1785 1337 -611 655 -29 75 753 -1371 1517 -1919 1520 -1094 145 455 -657 977
1729 977 -1227 1273 -1593 1485 -1097 321 318 -1457 1639 -1508 1175 -868 1491 -846 -370 180
1745 180 -1356 1744 -1614 1273 -1179 464 66 -215 603 -696 1305 -1638 1653 -1054 777 171
1761 171 -789 1043 -1313 1415 -1393 1060 -850 457 60 -1049 1234 -1746 1408 -1408 494 -491
1777 -491 -199 252 -1111 1008 -1911 1165 -1650 347 -441 -626 504 -1165 967 -1766 1046 -1027
$$ packed form
1665A434k261Q19N43j323J835k721L058k951K400j694L86J008k206K601l106L021
1681H43k450J817j128J85R87k446L316l385L224k263J301o54l07J299j894K986
1697A431l631L313k262J032M95j552K264k374K539k520K567k020Q91N49j851K806
1713A677l462L122j948J266o84J04O78k124K888l436L439k614J239L10j112J634
1729I77k204K500k866L078k582J418lj775L096l147K683k043K359k337M76N50
1745A80j536L100l358K887k452J643l98k81Q18j299K001k943L291k707J831o06
1761A71r60J832k356K728k808K453j910J307l97j109K283k980L154k816J902r85
1777d91K92M51j363K119k919L076k815J997p88j85J130j669K132k733K812k073
$$ plain form
1793 -1027 507 -409 -678 1205 -1215 1392 -1263 1173 -594 572 628 -307 1349 -1044 1947 -889
1809 -889 1427 -165 781 878 -454 1739 -817 1938 -761 1269 -70 247 1181 -927 1532 -935
1825 -935 1455 -763 882 62 -172 1038 -943 1557 -1290 1277 -712 581 15 -790 1047 -1474
1841 -1474 1517 -1230 1058 -653 274 379 -900 1078 -1502 1407 -1346 693 13 -355 378 -589
1857 -589 1610 -1371 1497 -904 866 -186 -290 1058 -1035 1374 -1262 1284 -843 600 196 -816
1873 -816 947 -1386 1364 -1209 1057 -411 226 581 -921 1201 -1344 1547 -906 377 -209 -346
1889 -346 671 -1011 720 -1108 2125 -937 591 21 -314 938 -1362 1682 -1324 1021 -813 634
1905 634 271 -249 720 -1389 1072 -1156 1064 -669 -162 189 -353 888 -987 1587 -1913 1236 188
$$ packed form
1793a027J534r16k69J883k420K607k655K436j767J166N6r35J656k393K991k836
1809h89K316j592R46R7j332K193k556K755k699K030j339L17R34k108K459k467
1825i35K390k218J645q20k34J210j981K500k847K567j989J293n66q05J837k521
1841a474K991k747K288j711R27J05j279J978k580K909k753K039o80l68P33r67
1857e89K199k981K868k401J770j052j04J348k093K409k636K546k127J443m04j012
1873h16J763k333K750k573K266j468O37L55j502K122k545K891k453J283n86j37
1889c46J017j682J731j828L233l062J528n70l35J252k300L044l006K345j834J447
1905F34l63n20R69k109K461k228K220j733N07L51n42J241j875K574l500L149j048
$$ plain form
1922 188 -454 981 -737 790 -971 798 -1144 641 -316 17 949 -1218 1194 -1139 976 -449
1938 -449 639 137 -112 834 -1044 1547 -1431 1348 -495 145 635 -707 1011 -927 1194 -1340
1954 -1340 1028 -501 63 633 -1238 1417 -1165 1245 -882 772 -363 10 668 -848 1445 -1563
1970 -1563 943 -601 325 113 -541 799 -1259 1065 -1260 1099 -1074 -195 301 -1124 772 -1300
1986 -1300 1006 -1288 398 -1030 -146 120 -1513 960 -1703 952 -1112 325 -400 -571 235 -1173
2002 -1173 1231 -1860 1141 -1095 148 150 -774 694 -1349 1119 -1409 969 -573 325 341 -739 1097
2019 1097 -1117 1288 -1188 775 -411 211 685 -989 1268 -1006 1444 -771 646 -73 -243 929
2035 929 -982 1180 -1218 1336 -887 378 -161 -521 690 -1291 1380 -1118 1000 -663 136 233
$$ packed form
1922A88o42J435j718J527j761J769j942J785r57L33R32k167K412k333K115j425
1938d49J088n02k49R46j878K591k978K779j843O40M90j342J718j938K121k534
1954a340K368j529N64N70j871K655k582K410k127J654j135L73O58j516K293l008
1970a563K506j544R26k12o54J340k058K324k325K359k173Q79M96j425J896k072
1986a300K306k294J686j428Q84K66j633K473k663K655k064J437p25j71Q06j408
2002a173K404l091L001k236J243Kr24J468k043K468k528K378j542Q98J6j080J836
2019A097k214K405k476J963j186O22M74j674K257k274K450k215J417p19j70J172
2035I29j911K162k398K554k223J265n39l60J211j981K671k498K118j663P99R7
$$ plain form
2051 233 -789 708 -1501 1144 -1458 673 -525 1 515 -1034 907 -1442 1152 -1198 414 -614
2067 -614 -182 446 -1089 949 -1543 1064 -739 283 -160 -354 635 -1260 1176 -1525 770 -936
2083 -936 133 67 -770 1054 -1295 1204 -1126 697 -755 -91 376 -859 1306 -1446 1340 -655
2099 -655 667 -370 -169 645 -956 1275 -1442 1459 -677 465 133 -69 1005 -891 1607 -1080
2115 -1080 1130 65 679 235 -833 1348 -1133 1635 -897 1201 -184 207 49 -789 870 -1132
2131 -1132 1094 -772 -262 -3 -207 584 1 675 -1797 1284 -1538 467 -102 -840 318 -1690 99
2148 99 -1512 654 -1048 392 -269 -1097 515 -1121 840 -1329 559 -349 295 68 -737 1167 -992
2165 -992 1395 -1200 747 -28 95 817 -686 1182 -939 1441 -456 795 273 213 1101 -774 1557
$$ packed form
2051B33j022J497k209K645k602K131j198N26N14j549J941k349K594k350J612j028
2067f14M32O28j535K038k492K607j803J022m43j94R89j895K436k701K295j706
2083i36J069o6q37J824k349K499k330J823j452O64M67j235K165k752K786j995
2099f55J322j037K01Q14j601K231k717K901k136J142l32k02J074j896K498k687
2115a080K210j065O14m44j068K181k481K768k532K098j385L91j58q38J659k002
2131a132K226j866N10K59k04P91n83O74k472L081k822K005n69p38J158k008J789
2148I9j611K166j702J440o61q28J612j636J961k169J888r08O44k27q05J904k159
2165i92K387k595J947p75J23P22j503J868k121K380j897J251n22o0Q88j875K331
$$ plain form
2182 1557 -857 1412 -481 650 389 -194 980 -1166 1732 -1353 1236 -465 149 483 -384 961
2198 961 -1343 1551 -1244 854 -432 -356 510 -1069 939 -1265 783 -1026 381 -381 -301 559 -1097
2215 -1097 874 -1495 871 -1038 -137 40 -570 497 -1053 1102 -1297 580 -725 -224 210 -648
2231 -648 762 -1142 1249 -993 749 -503 -336 486 -925 1010 -1181 1214 -866 782 -278 -387
2247 -387 785 -916 888 -960 1352 -715 700 185 -225 883 -841 1689 -787 1139 -435 240
2263 240 384 -424 836 -911 1370 -649 818 -305 188 669 -713 835 -1212 1249 -719 156
2279 156 -189 -390 539 -1143 1295 -1209 929 -885 184 -373 -656 586 -1163 959 -1318 546
2295 546 -586 -49 9 -842 751 -1287 816 -1254 859 -484 -262 432 -936 820 -1022 950 -845
$$ packed form
2182A557k414K269j893J131k61n83J174k146K898l085K589j701O14L34q67J345
2198I61k304K894k795K098j286P6Q66j579K008k204K048j809J407p62Q0Q60j656
2215a097J971k369K366j909R01J77o10J067j550K155k399J877j305N01M34q58
2231f48J410j904K391k242J742j252J67Q22j411J935k191K395k080J648j060j09
2247c87J172j701J804j848K312k067J415n15m10J108j724K530k476J926j574O75
2263B40J44q08J260j747K281k019J467j123M93M81j382J548k047K461j968Q75
2279A56l45k01R29j682K438k504K138j814J069n57k83J242j749K122k277J864
2295E46j132N37N8q51J593k038K103k070K113j343K22O94j368J756j842J972j795
$$ plain form
2312 -845 766 -407 -28 473 -927 1181 -1062 1019 -607 588 185 -251 659 -455 1316 -974
2328 -974 1037 -355 126 415 -107 857 -535 1236 -734 936 -110 -101 558 -684 1180 -1008 959
2345 959 -669 572 -84 23 575 -647 981 -1129 1055 -550 398 -60 -309 477 -885 857 -793
2362 -793 821 -687 31 -166 -942 575 -991 684 -852 743 -504 -18 104 -678 909 -1433 903
2379 903 -731 521 -328 -280 350 -702 764 -936 901 -775 438 29 -207 670 -665 875 -849
2396 -849 824 -638 400 -62 -527 759 -869 814 -724 727 -238 463 171 -427 891 -1055 1300
2413 1300 -693 475 -183 -134 479 -527 1030 -900 859 -602 470 -147 -527 647 -661 810
2429 810 -720 720 -644 -66 125 -419 419 -1124 776 -1129 550 -537 -110 183 -671 716 -963
$$ packed form
2312h45J611j173L79N01j400K108k243K081j626J195m03m36R10j114J771k290
2328i74K011j392M81K89n22R64j392J771j970J670j046RO59j242J864k188J967
2345I59j628J241o56J07N52j222J628k110K184j605R48m58k49P86j362J742j650
2362g93J614j508P18j97p76J517j566J675j536J595j247M86J22p82J587k342K336
2379I03j634J252q49M8O30j052J466j700J837j676J213m09k36Q77j335J540j724
2396h49J673j462J038m62m65J286j628J683j538J451r65P01k92n98J318j946K355
2413A300j993J168o58M9O13j006J557j930J759j461J072o17l80J174j308J471
2429H10j530J440j364N78J91n44Q38j543J900j905J679j087M27K93q54J387j679
$$ plain form
2446 -963 1040 -927 340 -353 -150 228 -975 786 -1113 646 -698 308 -110 -519 372 -569 734
2463 734 -1085 570 -695 159 73 -340 727 -1051 858 -747 613 -448 54 302 -450 694 -801
2480 -801 827 -425 628 -168 -85 489 -421 986 -585 1046 -779 463 164 -100 542 -868 843
2497 843 -649 793 -639 360 -26 -406 735 -1031 825 -983 397 -365 239 -197 -503 580 -859
2514 -859 785 -1052 558 -207 -235 436 -847 616 -1141 761 -651 274 -137 -151 377 -748 794
2531 794 -674 827 -714 268 -92 -107 403 -707 851 -792 643 -152 227 232 -444 917 -493 973
2549 973 -689 616 -120 -248 609 -498 855 -698 794 -361 513 -147 -387 579 -481 923 -717
2566 -717 830 -246 395 1 -81 651 -618 871 -613 773 -535 175 166 -513 590 -858 710 -801
$$ packed form
2446i63K003j967J267o93K03L78j203J761j899J759j344J006m18m09Q91r41J303
2463G34j819J655j265Q54q6m13J067j778J909j605J360j061N02K48p52J144j495
2480h01J628j252J053p96Q3N74r10J407j571J631j825J242k99k64O42j410J711
2497H43j492J442j432R99l86l80J141j766J856j808J380p62O04m36l06J083j439
2514h59J644j837J610p65k8O71j283J463j757J902j412R25m11j4N28j125J542
2531G94j468J501j541R82l60j5N10j110J558j643J435p95L79No76J361j410J466
2549I73j662J305p36j28Q57j107J353j553J492j155Q74o60k40R66j060J404j640
2566g17J547j076O41l94q2P32j269J489j484J386j308P10ro79J103j448J568j511
$$ plain form
2584 -801 563 -392 32 180 -553 976 -588 711 -543 638 -214 -292 141 -838 612 -675 671
2601 671 -479 102 -57 -256 337 -738 570 -758 469 -557 6 183 -546 590 -725 815 -868
2618 -868 872 -186 132 372 -489 656 -897 860 -205 577 -117 98 657 -331 712 -676 799
2635 799 -409 348 19 -19 707 -537 928 -725 715 -252 426 107 -150 783 -634 950 -629 671
2653 671 -327 200 340 -612 763 -637 641 -611 372 -20 -341 470 -586 620 -603 492 -350
2670 -350 538 -41 -366 414 -788 779 -761 393 -373 61 -133 -405 511 -905 592 -810 397
2687 397 -211 -63 -31 -526 857 -606 929 -283 408 -169 -267 343 -368 703 -467 782 -278 443
2705 443 -211 -140 511 -646 709 -450 689 -641 143 353 -366 637 -467 704 -492 660 -406
$$ packed form
2584h01J364r55M24J48p33J529j564J299j254J181q52p8M33r79J450j287J346
2601F71j150N81j59j99N93j075J308j328J227j026N63J77p29J136j315J540j683
2618h68J740j058L18K40q61J145j553J757j065P82o94K15N59r88J043j388J475
2635G99j208P57l29l8P26j244J465j653J440r67O78l19k57R33j417J584j579J300
2653F71r98N27J40r52J375j400J278j252R83l92l21Q11j056J206j223J095q42
2670c50Q88n79l25P80j202J567j540J154p66M34j94k72R16j416J497j402J207
2687C97o08J48L2m95J383j463J535j212O91n77r8O10p11J071j170J249j060P21
2705D43o54P1O51j157J355j159J139j330P84K10p19J003j104J171j196J152j066
$$ plain form
2722 -406 310 167 -277 601 -577 629 -414 513 -271 -14 540 -374 809 -824 655 -452 251 -15
2740 -15 -212 223 -487 687 -700 683 -748 292 104 -369 437 -675 651 -556 244 -353 106 129
2758 129 -526 701 -834 747 -591 263 -113 -181 283 -649 616 -635 686 -649 428 45 -234
2775 -234 569 -769 766 -610 739 -411 302 94 -289 665 -344 821 -741 735 -182 -4 297
2792 297 -526 659 -598 794 -462 534 -51 109 280 -402 870 -644 717 -461 357 -127 -175 372
2810 372 -589 487 -742 334 -486 122 147 -229 339 -835 545 -788 212 -487 -125 84 -443 523
2828 523 -835 460 -714 117 -355 -169 45 -450 596 -931 561 -619 278 -40 -179 309 -732
2845 -732 542 -527 498 -473 316 46 -79 613 -544 795 -694 499 -224 247 374 -138 859 -521
$$ packed form
2722d06P16j43m44Q78j178J206j043R27p84K57N54r14J183j633J479j107P03k66
2740a5j97M35p10J174j387J383j431J040j88m73Q06j112J326j207Q00n97M59K3
2758A29o55J227j535J581j338Q54l76o8M64r32J265j251J321j335J077l83k79
2775b34Q03j338J535j376J349j150P13k08l83R54j009J165j562J476r17J78L01
2792B97q23J185j257J392j256R96n85J60J71o82J272j514J361j178Q18m84m8N47
2810C72r61J076j229J076q20O08K5l76N68j174J380j333J000o99L62K09n27R66
2828E23j358J295j174Q31m72J86K14m95J046j527J492j180Q97l18j39M88j041
2845g32J274j069J025r71P89k70j25O92j157J339j489J193p23M71J27n12R97j380
$$ plain form
2863 -521 642 -537 440 -188 116 216 -333 707 -750 580 -568 365 -60 68 421 -405 589 -490
2881 -490 643 -527 400 -153 -308 413 -663 685 -740 527 -460 153 101 -491 544 -517 457 -847
2899 -847 329 -274 -75 136 -621 216 -738 491 -644 349 -107 26 198 -403 393 -531 596 -404
2917 -404 197 -17 -175 570 -366 890 -891 610 -475 299 197 -358 668 -787 851 -631 415
2934 415 -79 89 256 -262 615 -609 602 -430 388 13 -25 499 -515 596 -586 682 -245 234
2952 234 -232 -307 449 -791 542 -594 319 -359 108 69 -461 480 -662 585 -626 473 -41 239
2970 239 355 -286 608 -633 562 -490 311 -165 -62 131 -681 504 -339 510 -442 240 53 -282 274
2989 274 -376 527 -561 646 -241 139 -33 -274 124 -708 679 -488 425 -217 83 290 -308 913
$$ packed form
2863e21J163j179R77o28L04J00n49J040j457J330j148R33m25J28L53q26R94j079
2881d90J133j170R27n53j55P21j076J348j425J267r87O13n2n92J035j061R74j304
2899h47J176o03J99K11p57Q37r54J229j135R93m56J33J72o01P96r24J127j000
2917d04O01k14j58P45r36J256j781J501j085P74j02n55J026j455J638j482J046
2934D15m94J68J67n18Q77j224J211j032Q18l75l8N24j014J111j182J268r27M79
2952B34m66p5P56j240J333j136R13o78M67l9n30R41j142J247j211J099n14K80
2970B39J16o41Q94j241J195j052Q01m76J03J93q12J185q43Q49r52O82j87l35N56
2989B74o50R03j088J207q87L80j72k41L98q32J387j167R13o42L00K07n98J221
$$ plain form
3007 913 -514 635 -427 620 -190 -200 556 -319 703 -519 761 -214 467 221 -146 552 -460 582
3025 582 -534 624 -449 143 99 -40 359 -334 787 -589 626 -309 41 147 -389 212 -424 579
3043 579 -905 83 -245 -133 468 -393 440 -534 442 -539 181 -307 -171 183 -607 741 -598 419 -304
3062 -304 333 -3 -362 445 -533 708 -589 395 -288 36 196 -309 281 -679 527 -554 143 -83 -94
3081 -94 67 -326 796 -575 787 -397 412 117 -182 468 -513 539 -351 556 -294 148 109 -211 525
3100 525 -492 472 -306 339 -393 371 139 -285 599 -513 651 -302 417 -177 -168 163 -367 591 -722
3119 -722 505 -401 544 -123 -83 452 -449 433 -773 528 -441 1 -176 -332 292 -691 443 -579 484
3138 484 -362 -8 -10 -5 378 -663 696 -515 339 -66 -11 446 -450 477 -758 839 -432 359 -177 24
$$ packed form
3007I13j427J149j062J047q10j0P56q75J022j222J280r75O81k46l67O98j012J042
3025E82j116J158j073N92m4j39L99o93J121j376J215r35L50J06n36O01o36J003
3043E79j484R88l28J12O01q61Q33r74R76r81P20m88J36L54p90J348j339J017p23
3062c04O37l36l59Q07r78J241j297R84o83L24J60n05N90r60J206j081O97k26j1
3081i4J61l93J122j371J362j184Q09k95k99O50r81J052q90R07q50M42l9l20P36
3100E25j017R64p78O45p32P64k32m24Q84j112J164r53P19n94RL31n30R58j313
3119g22J227r06R45o67M0N35r01Q82j206J301r69M42j77j56O24r83J134j022J063
3138D84q46L54kNL83j041J359j211Q54m05N5M57q96R27j235J597j271P91n36K01
$$ plain form
3158 24 330 -430 640 -716 648 -127 181 83 -137 278 -254 580 -411 377 -418 260 -164 -107 745 -710
3178 -710 451 -525 469 -294 -125 222 -405 622 -499 530 -530 225 -232 -151 117 -520 225 -584 395
3197 395 -430 196 -153 -50 361 -344 370 -374 208 -329 86 -227 -353 548 -532 691 -496 419 -235
3216 -235 -105 391 -332 392 -380 525 -547 325 22 -271 150 -392 559 -415 517 -524 445 73 -198
3235 -198 389 -394 570 -717 592 -170 256 -104 -165 684 -420 633 -342 579 -212 164 114 -271 542
3254 542 -180 532 -475 362 -183 -111 71 -385 481 -692 407 -210 264 -33 -147 205 -451 480 -719
3273 -719 630 -417 63 -70 -221 442 -594 330 -340 436 -397 14 58 -188 429 -402 595 -450 306
3292 306 -154 -84 110 -283 332 -504 402 -334 295 -83 -99 150 -351 494 -518 448 -230 94 83 -62 458
$$ packed form
3158B4L06p60J070j356J364p75L08r8k20M15n32Q34r91P88p95O78m24N7Q52j455
3178g10J161r76R94p63J69L47o27J027j121J029j060P55m57Q1K68o37P45q09R79
3197C95q25O26l49J03M11p05P14p44N82n37M15l13j26R01j080J223j187R15o54
3216b35J30M96p23P24p72R05j072Q72l03k93M21n42R51r74R32j041R69l72k71
3235a98N87p83R64j287J309p62M26l60o1Q49j104J053r75R21p91L76n0l85Q13
3254E42p22P12j007Q37n45P2J82m56Q66j173J099o17M74k97j14L52o56R31j199
3273g19J349j047M80j33j51O63j036R24o70P76q33M11M4k46O17q31R97j045P56
3292C06m60P0J94l93O15q36R06p36O29l78j6K49n01Q45j012R66o78L24j1j45N20
$$ plain form
3313 458 -186 705 -460 535 -141 234 448 -438 508 -506 455 -287 271 -84 0 210 -80 854 -636
3332 -636 486 -364 398 72 -135 253 -265 481 -566 347 -320 59 -26 -365 206 -358 412 -220 419 -57
3352 -57 -68 83 -231 259 -644 357 -672 436 -358 -181 148 -172 387 -484 466 -389 297 81 -151 396
3372 396 -442 498 -433 476 -336 117 207 -381 485 -189 434 -527 660 -99 297 118 -208 468 -122 620
3392 620 -505 348 -93 134 144 -73 476 -195 423 -259 -70 120 -56 -37 -233 163 -552 366 -278 38
3412 38 -206 -242 494 -569 609 -693 493 -42 162 -201 -352 458 -485 613 -639 231 -123 -278 119
3431 119 -196 312 -703 320 -612 268 -51 -24 -57 -587 259 -564 402 -472 334 26 -129 138 -314 555
3451 555 -365 434 -529 78 -258 -118 452 -181 360 -278 218 -184 257 126 -346 438 -388 672 -489
$$ packed form
3313D58o44Q91j165R95o76L75K14q86R46j014R61p42N58l55Q4K10k90R34j490
3332f36J122q50P62l26k07L88n18P46j047R13o67L79q5l39N71n64P70o32O39m76
3352e7j1J51l14M90r03J001j029J108p94J77L29l20N59q71R50q55O86k16k32N47
3372C96q38R40r31R09q12M53R0n88Q66o74O23r61J187p59L96j79l26O76n90P42
3392F20j125Q53m41K27J0k17N49o71O18o82J89J90j76J9j96L96p15R18o44L16
3412C8k44l6P36j063J178j302J186n35K04l63j51Q10r43J098j252Q70l54j55L97
3431A19l15N08j015J023r32Q80l19K7l3n30Q46q23R66q74Q06l08j55K67m52Q69
3451E55r20P99r63O07l36J40N70o33N41o38M96m02M41j31m72P84q26J060j161
$$ plain form
3470 -489 400 100 -206 152 -40 703 -339 535 -260 401 -249 -85 332 -349 414 -314 193 -217 267 190
3490 190 -202 139 -295 517 -175 139 -112 190 38 -84 551 -489 380 -503 -53 -226 172 269 -619 404
3510 404 -740 232 -535 56 -156 -148 59 -226 10 -497 316 -188 126 42 -306 361 -492 298 -483 234 -301
3531 -301 72 346 -373 185 -632 422 -495 416 -119 -132 186 61 405 2 317 -399 383 -160 130 173
3551 173 -141 475 -243 478 -135 353 -122 -247 253 -320 158 -235 372 -244 117 -40 -257 131 -386 313
3571 313 -426 107 107 -180 -14 -285 297 -396 440 -481 -181 25 -192 162 -420 300 -228 105 -347 148 -256
3592 -256 -319 193 -388 474 -163 177 -124 64 -64 -350 210 -362 566 -307 47 -291 -162 299 -214 266
3612 266 -400 400 -304 378 69 40 328 -540 467 -304 249 -239 449 162 -209 279 -311 421 -516 370
$$ packed form
3470d89Q89l00l06L58j92P43j042Q74p95O61o50J64M17o81P63p28N07m10M84p7
3490A90l92L41m34Q12o92L14k51L02j52j22O35j040Q69q83M50j73L98R7q88J023
3510D04j144R72p67N91k12QK07k85K36n07Q13n04L14q4l48O67q53P90p81P17n35
3531c01L73K74p19N58q17J054r17R11n35j3L18j25L44m03L15p16P82n43K90M3
3551A73l14O16p18P21o13M88m75j25N00n73M78l93O07o16L61j57k17L88n17O99
3571C13p39N33%k87J66k71N82o93Q36r21L00K06k17L54n82P20n28L33m52M95m04
3592b56o3N12n81Q62o37L40l01J88j28k86N60n72R28q73L54l38J29M61n13M80
3612B66o66Q00p04O82l09k9K88q68J007p71N53m88O88k87l71M88n90P32r37Q86
$$ plain form
3632 370 -281 4 -69 -115 263 -405 217 -477 44 -339 44 263 -286 405 -546 188 -255 5 -16 30 1 -430
3654 -430 312 -533 212 -258 -14 81 -224 267 -391 261 -168 78 -257 100 7 -230 334 -97 389 -552 118
3675 118 -104 -40 211 -255 174 -275 502 -274 184 -122 134 144 -120 334 -126 387 -512 334 -71 -44 148
3696 148 -261 430 -325 595 -117 -62 -126 43 425 -216 445 -493 343 -121 -47 26 -112 398 -328 55 -133
3717 -133 323 -345 -43 147 -213 105 -361 337 -186 140 12 -88 111 -479 614 -161 382 -254 0 -119
3737 -119 -191 17 -519 348 -314 498 -134 42 168 -417 125 -412 323 -349 152 39 225 36 -207 377
3757 377 -300 172 -449 192 -45 -188 299 49 395 -401 201 -113 332 270 -4 247 -111 381 -129 310
3777 310 -233 40 165 -116 157 -358 505 -291 198 -128 -122 154 -418 542 -373 355 -351 177 -17 -105 21
$$ packed form
3632C70o51K85p3m6L78o68O22o94N21l83L83K19n49O91r51P34m43K60k1M6k9m31
3654d30P42q45P45m70K44R5l05M91o58O52m29K46l35L57r3k37N64m31M86r41O70
3675A18k22O4K51m66M29m49P77p76M58l06K56J0k64M54m60N13q99Q46m05K7J92
3696A48m09O91p55R20p12N5o4J69L82o41O61r38Q36m64P4P3j38N10p26L83j88
3717a33M56o68L02J90l60L18m66O98n23L26j28j00J99n90J093p75N43o36K54j19
3737a19p2K08n36Q67o62Q12o32J76J26n85N42n37P35o72N01j13J86j89k43N84
3757C77o77M72o21O41k37j43M87k50L46p96O02l14M45o2k74K51l58M92n10M39
3777C10n43K73J25k81K73n15Q63p96M89l26OK76n72R60r15P28p06N28j94q8J26
$$ plain form
3798 21 -450 525 -413 343 -229 -77 -235 -316 -55 -569 504 -515 163 -240 68 15 -285 96 -449 236
3818 236 -242 270 -107 -318 89 -240 300 -343 314 -403 264 -56 46 289 -122 319 -164 292 -280 -46
3838 -46 -67 -85 442 -81 473 -369 325 -216 92 236 -229 252 -156 385 -421 430 -164 137 237 -232 242
3859 242 -208 273 -259 458 74 187 313 -168 185 -501 438 -358 -140 -79 -143 157 -248 258 -202 250 -292
3880 -292 -25 191 -193 258 -204 253 -362 104 -156 8 -4 -279 344 -333 278 -226 57 -48 -101 42 -57
3901 -57 186 -327 333 -276 174 -179 -38 102 -511 150 -579 449 -298 162 170 12 467 -93 401 -423 201
3922 201 -38 -27 86 -321 489 -109 340 -216 105 -202 -139 378 -197 466 -205 417 -324 109 -56 -26 231
3943 231 -79 301 -360 320 -268 333 11 -242 324 -300 145 -348 398 -351 -201 189 33 259 -342 480
$$ packed form
3798B1m71R75r38P56n72J52j58q1K61n14J073j019O78m03L08n3l00L81n45O85
3818B36m78N12l77k11M07l29N40o43O57p17O67l20J02K43m11M41m83M56n72K34
3838d6k1j8N27n23N54q42O94n41L08J44m65M81m08N41q06Q51n94L01J00m69M74
3859B42m50M81n32P17l84J13J26m81L53o86R39p96K18O1o4L00m05N06m60M52n42
3880b92K67K16l84M51m62M57o15M66k60J64j2k75O23o77O11n04K83j05n3J43r9
3901e7K43n13O60o09M50l53J41J40o13O61p29J028p47M60Qj58M55n60M94q24O24
3922B01k39J1J13m07Q10n98M49n56L21l07O3N17n75O63o71O22p41M33j65L0K57
3943B31l10L80o61O80n88O01l22k53N66o24M45m93P46p49J50L90j56K26o01Q22
$$ plain form
3963 480 -383 -185 -94 -108 -65 -436 198 -359 245 -398 158 -164 -171 327 -181 517 -145 85 -154 242 -25 -68
3985 -68 26 -314 232 -461 219 -93 89 302 -110 370 -231 363 -286 425 -82 70 158 -85 552 -286 302
4006 302 -214 69 -204 -171 176 -207 322 -212 185 -262 232 139 -193 239 -254 349 -417 406 -164 -18 91
4027 91 -157 294 -288 3 -340 118 -223 258 84 -6 111 -334 512 -124 200 127 -114 149 -101 480 -397
4048 -397 414 -236 238 -79 -148 186 -292 240 -281 235 -100 70 308 -158 66 -311 393 -419 179 -163
4068 -163 -119 132 -100 297 -229 382 -46 179 143 -11 -15 -36 455 -216 326 -296 170 164 93 51 -190 359 -241
4091 -241 290 6 199 -14 -258 29 -313 344 -427 466 -46 51 94 -278 177 -273 262 -142 318 -119 60
4112 60 194 -410 405 -311 302 -283 171 -136 -286 30 -281 487 -328 338 -265 163 135 12 318 -117 404
$$ packed form
3963D80q63J98R1j4M3l71O34n57O04o43N56l22pM98n08O98o62K30k39L96k67m3
3985f8R4l40N46o93O80l12J82K13m12M80o01N94o49P11n07J52Q8k43O37q38N88
4006C02n16K83k73L3L47l83N29n34L97m47M94r3l32M32m93O03p66Q23n70J46J09
4027I1k48M51n82K91l43M58l41M81j74r0J17m45Q46o36L24p3k41K63k50N81q77
4048c97Q11o50M74l17o9L34m78N32n21N16l35J70K38m66K24l77P04q12N98l42
4068a63M4K51k32L97n26O11m28K25l6j54mk1M91o71N42o22M66op1m2k41N49o00
4091b41N31k84J93k13k44K87l42O57p71Q93n12R7M3l72M55m50N35m04M60m37J79
4112F0J34o04Q15p16O13n85M54l07j50L16l11P68q15O66o03M28k8j23L06m35N21
$$ plain form
4133 404 -155 202 -75 204 -98 -330 356 -406 337 -524 427 -197 -26 209 -217 355 -374 219 -301 58
4153 58 33 -40 167 19 220 -243 498 -173 90 82 -239 341 -142 338 -456 117 -71 -295 -155 -171 345 -261
4175 -261 246 -236 175 -175 -78 274 47 139 -264 269 -303 -30 51 -25 128 -201 330 -385 116 -102 99
4196 99 -95 -238 37 -272 240 -439 87 -226 202 -41 -140 74 -94 258 -302 197 -48 -157 272 -68 363
4217 363 -305 254 -197 204 198 -203 423 -31 403 -267 236 -48 127 92 -106 284 -257 321 -219 171 163 -47
4239 -47 -195 -203 53 -126 231 -200 284 -195 81 56 -328 302 -500 143 -260 -90 -63 12 25 -267 228 -320
4261 -320 37 -279 97 14 -351 193 -290 155 -462 36 -195 136 -3 -251 -57 -59 343 -174 239 -474 152
4282 152 -103 29 278 -300 360 -74 179 -160 -48 235 -214 697 -357 40 -259 187 -233 -14 228 -160
$$ packed form
4133D04n59L57k77K79l02k32O86p62P43q61R51o24J71K35m26N72p29N93n20L59
4153E8k5p3K07j48K01m63P41o71K63ql21N80m83M80p94N73j88k24J40j6N16o06
4175b61N07m82M11l50R7L52k27R2m03N33n72K73Q1p6J53l29N31p15N01k18K01
4196I9j94j43K75l09N12o79N26l13M28k43r9K14j68L52n60M99k45j09M29l40M31
4217C63o68N59m51M01om01O26m54M34o70N03k84J75l5j98L90n41N78n40L90qk10
4239d7j48qK56j79L57m31M84m79K76k5l84O30q02O43m03J70K7P5J3k92M95n48
4261c20L57l16L76q3l65N44m83M45o17M98k31L31j39k48J94kM02n17M13p13O26
4282A52k55J32K49n78O60m34K53l39J12K83m49R11j054L97k99M46m20K19K42l88
$$ plain form
4302 -160 538 55 122 -192 342 -34 35 76 -288 -57 -168 348 -136 -60 268 -91 56 -784 590 -265 -315
4323 -315 -15 -86 9 -124 108 -142 570 -295 25 -771 252 22 -569 852 -285 201 -468 -230 -72 354
4343 354 259 -159 -283 -152 517 -47 -261 -39 -517 -81 -564 -72 -16 383 73 242 122 -362 606 86 231
4364 231 -69 232 65 -70 144 -260 573 -292 337 132 268 22 275 -141 -357 28 -348 181 -56 92
4384 92 292 279 14 -92 197 -217 342 -141 -139 439 -244 553 -735 243 124 507 -455 -71 258 -387 120
4405 120 -186 113 3 358 183 -131 165 -201 179 -126 256 -201 139 -153 163 312 -387 198 -265 176
4425 176 -64 -44 247 -85 201 -379 183 -366 -29 -369 167 78 333 -4 -61 566 -497 -10 167 267 597
4446 597 -205 126 -203 409 45 -395 38 -389 164 -121 477 -306 608 309 -8 242 -45 110 -161 361
$$ packed form
4302a60O98m83O7l14N34l76O9M1l64K31j11N16m84P6L28l59J47q40J374q55n0
4323c15L00p1R5j33K32k50P12q65L20p96J023k30n91J421j137M86o69K38J58M26
4343C54r5m18j24J31O69n64k14K22m78M36m83M92N6L99l10J69j20m84R68n20J45
4364B31l00L01j67j35K14m04Q33q65O29k05J36k46K53m16k16L85l76N29k37J48
4384I2K00j3k65j06K89m14N59m83KN78o83P97j288R78j19L83r62L84L29o45N07
4405A20l06K99j10L55j75l14K96l66L80l05L82m57L40k92L16J49o99N85m63M41
4425A76k40K0K91l32K86n80N62n49L37l40N36q9K55l37n7O27j063M87J77J00L30
4446E97q02L31l29O12l64m40M33m27N53k85N98p83R14k99l17K50k87J55k71N22
$$ plain form
4466 361 -7 101 17 111 -237 -285 105 173 774 -520 -231 -898 -680 504 -247 979 -628 280 790 715
4486 715 -117 -193 1141 540 489 102 413 -768 872 -385 -249 586 -17 174 -223 223 -109 -297 522
4505 522 498 175 568 -197 274 266 308 -491 826 -161 441 -102 164 -107 -411 130 -12 57 -444 12 211
4526 211 520 10 159 265 -590 153 -671 371 -268 657 -208 -428 310 -133 353 -35 536 -772 297
4545 297 -234 354 -354 -379 49 -6 276 -137 258 9 -47 421 -112 -145 -444 371 9 21 -101 -446 126 -301
4567 -301 406 -206 110 -254 -281 145 53 247 -178 279 40 -47 -150 -90 182 -641 343 -235 84 -103 16
4588 16 -10 -25 203 -340 338 -317 161 -140 117 116 -92 273 122 43 -3 225 80 -63 239 -283 334 -503
4610 -503 204 -18 384 3 66 217 -365 198 -206 31 -157 273 -136 -202 156 -219 218 -138 101 -252 223
$$ packed form
4466C61l68J08q4R4l48m8L90O8O01j294K89o67K18J184p51J226j607R08N10p5
4486G15q32p6J334o01n1l87L11j181J640j257J36Q35o03J91l97M46l32j88Q19
4505E22k4l23L93p65M71qM2p99J317r87O02n43K66k71l04N41j42O9n01M56J99
4526B11L09n10J49J06q55P43q24J042o39R25q65k20P38m43M86l88N71j308J069
4545B97n31N88p08k5M28n5K82m13L95k49n6M68n33l3k99Q15l62J2j22l45N72m27
4567c01P07o12L16l64k7M26r2J94m25M57k39q7j03O0K72q23R84n78L19j87J19
4588A6k6j5K28n43O78o55M78l01K57jk08L65j51p9m6K28j45j43L02n22O17q37
4610e03P07k22M02l81O3J51n82N63m04K37j88M30m09o6L58l75M37l56K39l53M75
$$ plain form
4631 223 -35 -178 13 -273 501 -179 135 -256 137 91 -362 269 -91 328 83 57 -185 -22 154 -184 513
4652 513 -294 313 -40 200 -97 -81 -38 -324 387 -247 293 133 178 226 -8 475 -423 -126 35 73 -280 -451
4674 -451 428 -506 606 -240 297 -749 224 163 21 848 -24 647 -160 -341 -318 240 -221 100 151 -441
4694 -441 151 -512 205 -389 153 407 -102 73 -626 153 -265 331 -421 -333 48 15 54 -362 245 -507 196
4715 196 128 658 676 -754 -149 -157 161 79 -190 77 29 177 -392 216 -245 223 -103 -140 44 -335 -139 -456
4737 -456 -35 -59 128 107 173 64 -291 293 35 31 -136 -40 106 28 64 -240 260 -339 150 -38 50 -82 95
4760 95 291 -138 53 -321 199 -25 23 11 -28 -229 -235 192 -254 -39 -66 129 128 -266 186 -399 209 -229 -6
4783 -6 67 10 287 -375 247 -20 335 -148 3 64 12 139 -27 32 -595 147 -256 -64 81 86 121 -279 137
$$ packed form
4631B23k58j43J91k86P74o80L14l91L93m6m53O31l60M19k45k6k42J63J76l38O97
4652E13q07O07l53K40k97J6M3k86P11o34N40j60M5M8k34M83q98K97J61L8l53j71
4674d51Q79r34J112q46N37j046R73o1j42Q27q72O71q07j81K3N58m61L21N1n92
4694d41N92o63P17n94N42K54n09J75o99P79m18N96p52Q8L81l3L9m16O07p52P03
4715A96o8N30J8j430O05qL18q2k69K67m8J48n69O08m61M68l26l7J84l79J96l17
4737d56M21k4J87k1O6j09l55N84k58mj67R6J46p8L6l04N00n99M89j88Q8j32J77
4760I5J96m29J91l74N20k24M8j2l9k01oM27m46K15k7J95jl94M52n85O08m38K23
4783fP3n7K77o62O22k67L55m83J51O1n2J27j66N9o27P42m03J92J45NL5m00M16
$$ plain form
4806 137 -329 199 96 251 -53 -180 282 -245 61 -229 788 -70 -128 -56 -97 540 -144 193 -356 306 190
4827 190 17 713 -82 324 -48 207 538 -28 -95 -48 226 -438 67 -601 229 -164 -285 493 -323 70 -574
4848 -574 530 -667 205 -248 -118 407 250 15 -692 -69 80 284 32 -54 55 -51 131 -42 317 38
4868 38 330 8 -143 61 -512 86 -146 23 -166 -141 -181 -203 -19 -466 300 -331 107 367 126 298 -229
4889 -229 177 -438 299 129 87 -31 62 157 -454 354 -371 190 60 81 -56 47 377 -207 303 -241 250
4910 250 -176 -84 154 -140 52 -233 238 -317 227 -95 -168 82 -79 268 -194 -16 -233 245 -273 -39 -94
4931 -94 -177 89 -277 202 -219 175 -4 -79 51 -407 98 -161 -6 -298 -21 162 -122 237 -226 394 58
4952 58 103 -21 105 -89 -92 128 87 27 -314 215 -102 -46 50 -177 69 -355 52 -116 198 -6 -223 66 -191
$$ packed form
4806A37m66N28j03J55l04j27M62n27L06k90J017q58n8P2m1O37o84L37n49O62j16
4827A90j73O96p95M06l72K55L31n66o7M7K74o64N05o68Q30l93j21P78q16L93o44
4848e74J104j197Q72m53J30N25j57k35p07O23J49K04k52q6J09j06J82j73L59k79
4868C8K92l22j51K04n73N98k32J69j89K5m0k2J84m47P66o31M38K60k41J72n27
4889b29M06o15P37j70m2j18R3R5o11Q08p25N61j30K1j37J03L30n84N10n44M91
4910B50m26R2K38k94J92k85M71n55N44l22p3K50j61L47m62J78k17M78n18K34n5
4931i4q3K66l66M79m21L94j79p5J30m58N05k59J55k92K77J83k84L59m63O20l36
4952E8M5j24J26j94lK20m1o0l41N29l17N6R6k27K46m24M07j68L14k04k17K89k57
$$ plain form
4975 -191 184 -262 191 -134 136 -35 73 417 -201 404 -184 418 -77 -6 280 -85 280 -348 116 -132
4995 -132 342 -12 -115 50 -350 201 -151 232 -86 -108 -51 -153 229 -358 313 -120 233 -213 -218 39 -173
5016 -173 -47 -231 -89 -680 270 -30 -90 219 -36 84 -283 -67 -212 80 -16 -119 304 -166 206 78 348
5037 348 -32 -36 5 45 308 -145 98 -237 370 -144 -35 62 -65 292 -258 300 -166 103 -208 -66 -114 -32
5059 -32 398 -63 323 -139 205 -40 -154 -53 -178 306 -384 87 -17 183 45 26 106 -110 256 -290 335
5080 335 -63 75 136 -445 -40 -109 115 -171 407 -147 -67 161 -228 99 -10 120 -306 -153 -129 -97 -121 -278
5102 -278 284 -57 352 -244 -7 113 -216 310 -98 295 -93 232 -201 231 282 -171 427 -517 257 -500
5122 -500 321 58 -125 -101 53 -26 -348 206 -347 139 -216 -183 122 -326 436 -219 143 -62 173 123 -209
$$ packed form
4975a91L75m46M53l25K70j71J08L44o18O05n88O02m95P1K86l65L65o28M64k48
4995a32M74l54j03J65m00N51l52L83l18k2N7j02L82n87O71m33L53m46nK57k12
5016a73J26j84J42n91R50l00o0L09k55J20l67K16j45K92r6j03M23m70L72j28K70
5037C48l80mM1M0K63m53K43l35O07n14J09R7j27L57n50N58m66K69l11J42m8Q2
5059c2M30m61L86m62L44k45j14J01j25M84o90M71j04K00j38j9Q0k16L66n46O25
5080C35l98J38O1n81M05o9K24k86N78n54Q0K28l89L27j09J30m26J53K4L2k4j57
5102b78N62l41M09n96K37J20l29N26m08L93l88L25m33M32N1m53N98r44P74p57
5122e00Q21k63j83K4J54p9l22N54n53M86l55L3L05m48P62o55L62k05K35n0l32
$$ plain form
5143 -209 146 -396 158 -280 38 -138 -88 -107 26 155 -529 128 -185 94 49 -125 55 -68 -82 -157 102 -219
5165 -219 258 58 167 223 -151 165 -153 53 -225 132 111 -288 195 -1 477 -282 233 -191 235 -52 -168
5186 -168 201 -125 344 -255 157 -186 -92 -171 -175 397 -215 193 -135 270 67 110 51 -179 491 -201 34 106
$$ packed form
5143b09L55n42N54m38L18j76N0j9J33J29o84O57l13K79m5j74J80j23j4p5K59l21
5165b19M77k00J09N6l74L16l18K06k78L57k1l99M83j96M78p59N15m24M26k87j16
5186a68L69l26M69n99M12l43R4p9mN72o12M08l28M05k03M3n9k30O70o92K35P2
$$ [...]
8191c3
##END NTUPLES=NMR FID
##END=
