##TITLE=1H_AN-AD-100
 CDCl3, 8 sc, 
 13.05.2021
##JCAMPDX= 6.0         $$ Bruker NMR JCAMP-DX V2.0
##DATA TYPE= NMR FID
##DATA CLASS= NTUPLES
##ORIGIN= UXNMR, Bruker Analytische Messtechnik GmbH
##OWNER= root
$$ XWIN-NMR		Version 3.5
$$ Thu May 13 13:42:16 2021 Russian Standard Time (UT+4h)  she@DPX200
##.OBSERVE FREQUENCY= 200.131506
##.OBSERVE NUCLEUS= ^1H
##.DELAY= (6, 6)
##.ACQUISITION MODE= SIMULTANEOUS
##.ACQUISITION SCHEME= undefined
##.AVERAGES= 8
##.DIGITISER RES= 18
##SPECTROMETER/DATA SYSTEM= spect
##.PULSE SEQUENCE= zg30
##.SOLVENT NAME= CDCl3
##.SHIFT REFERENCE= (INTERNAL, CDCl3, 0, 15.7039)
##AUDIT TRAIL= $$ (NUMBER, WHEN, WHO, WHERE, WHAT)
$$ ##TITLE= Audit trail, XWIN-NMR		Version 3.5
$$ ##JCAMPDX= 5.01
$$ ##ORIGIN= Bruker BioSpin GmbH
$$ ##OWNER= she
$$ F:/spectra/data/she/nmr/H-F/1/audita.txt
$$ ##AUDIT TRAIL=  $$ (NUMBER, WHEN, WHO, WHERE, WHAT)
(   1,<2021-05-13 13:41:22.70 +0400>,<she>,<DPX200>,
      <created by zg, POWCHK disabled, PULCHK disabled
       configuration hash MD5:
       00 E9 B6 7A A2 85 ED C7 34 08 36 98 17 FE 4E 26
       data hash MD5: 16K
       69 DD 28 7A AE 1A 38 F6 47 06 C1 BF EE 65 3F 2C>)
$$ ##END=
$$ 
$$ hash MD5
$$ 4F 59 DA 78 E0 A7 66 4F C2 56 D1 9E 4F CA 39 F3
##$RELAX= 
##$RELAX= 
##$RELAX= 
##$RELAX= 
##$RELAX= 
##$RELAX= 
$$ Bruker specific parameters
$$ --------------------------
##$DU= <F:/spectra>
##$EXPNO= 1
##$NAME= <H-F>
##$PROCNO= 1
##$TYPE= <nmr>
##$USER= <she>
##$AMP= (0..31)
100 100 100 100 100 100 100 100 100 100 100 100 100 100 100 100 100 100 
100 100 100 100 100 100 100 100 100 100 100 100 100 100 
##$AQSEQ= 0
##$AQ_mod= 1
##$AUNM= <au_zg>
##$AUTOPOS= <>
##$BF1= 200.13
##$BF2= 200.13
##$BF3= 200.13
##$BF4= 200.13
##$BF5= 200.13
##$BF6= 200.13
##$BF7= 200.13
##$BF8= 200.13
##$BYTORDA= 1
##$CFDGTYP= 0
##$CFRGTYP= 5
##$CHEMSTR= <none>
##$CNST= (0..31)
1 1 145 1 1 1 1 1 1 1 1 1 1 1 1 1 1 1 1 1 1 1 1 1 1 1 1 1 1 1 1 1 
##$CPDPRG= <>
##$CPDPRG1= <>
##$CPDPRG2= <>
##$CPDPRG3= <>
##$CPDPRG4= <mlev>
##$CPDPRG5= <mlev>
##$CPDPRG6= <mlev>
##$CPDPRG7= <mlev>
##$CPDPRG8= <mlev>
##$CPDPRGB= <>
##$CPDPRGT= <>
##$D= (0..31)
0 1.2 0 0 0 0 0 0 0 0.06 0 0.03 0 0 0 0 0.0002 0 0 0 0 0 0 0 0 0 0 0 0 
0 0 0 
##$DATE= 1620898882
##$DBL= (0..7)
120 120 120 120 120 120 120 120 
##$DBP= (0..7)
150 150 150 150 150 150 150 150 
##$DBP07= 0
##$DBPNAM0= <>
##$DBPNAM1= <>
##$DBPNAM2= <>
##$DBPNAM3= <>
##$DBPNAM4= <>
##$DBPNAM5= <>
##$DBPNAM6= <>
##$DBPNAM7= <>
##$DBPOAL= (0..7)
0.5 0.5 0.5 0.5 0.5 0.5 0.5 0.5 
##$DBPOFFS= (0..7)
0 0 0 0 0 0 0 0 
##$DE= 6
##$DECBNUC= <off>
##$DECIM= 32
##$DECNUC= <off>
##$DECSTAT= 4
##$DIGMOD= 1
##$DIGTYP= 9
##$DL= (0..7)
0 120 120 120 120 120 120 120 
##$DP= (0..7)
150 150 150 150 150 150 150 150 
##$DP07= 0
##$DPNAME0= <>
##$DPNAME1= <>
##$DPNAME2= <>
##$DPNAME3= <>
##$DPNAME4= <>
##$DPNAME5= <>
##$DPNAME6= <>
##$DPNAME7= <>
##$DPOAL= (0..7)
0.5 0.5 0.5 0.5 0.5 0.5 0.5 0.5 
##$DPOFFS= (0..7)
0 0 0 0 0 0 0 0 
##$DQDMODE= 0
##$DR= 18
##$DS= 0
##$DSLIST= <SSSSSSSSSSSSSSS>
$$ [...]
##$SUBNAM2= <"">
##$SUBNAM3= <"">
##$SUBNAM4= <"">
##$SUBNAM5= <"">
##$SUBNAM6= <"">
##$SUBNAM7= <"">
##$SUBNAM8= <"">
##$SUBNAM9= <"">
##$SW= 16.9725357007746
##$SWIBOX= (0..15)
0 0 2 0 0 0 0 0 0 0 0 0 0 0 0 0 
##$SW_h= 3396.73913043478
##$TD= 16384
##$TD0= 1
##$TE= 0
##$TE2= 300
##$TE3= 300
##$TEG= 300
##$TL= (0..7)
0 120 120 120 120 120 120 120 
##$TP= (0..7)
150 150 150 150 150 150 150 150 
##$TP07= 0
##$TPNAME0= <>
##$TPNAME1= <>
##$TPNAME2= <>
##$TPNAME3= <>
##$TPNAME4= <>
##$TPNAME5= <>
##$TPNAME6= <>
##$TPNAME7= <>
##$TPOAL= (0..7)
0.5 0.5 0.5 0.5 0.5 0.5 0.5 0.5 
##$TPOFFS= (0..7)
0 0 0 0 0 0 0 0 
##$TUNHIN= 0
##$TUNHOUT= 0
##$TUNXOUT= 0
##$USERA1= <user>
##$USERA2= <user>
##$USERA3= <user>
##$USERA4= <user>
##$USERA5= <user>
##$V9= 5
##$VALIST= <valist>
##$VCLIST= <CCCCCCCCCCCCCCC>
##$VD= 0
##$VDLIST= <DDDDDDDDDDDDDDD>
##$VPLIST= <PPPPPPPPPPPPPPP>
##$VTLIST= <TTTTTTTTTTTTTTT>
##$WBST= 1024
##$WBSW= 4
##$XGAIN= (0..3)
0 0 0 0 
##$XL= 0
##$YL= 0
##$YMAX_a= 374287
##$YMIN_a= -230493
##$ZGOPTNS= <>
##$ZL1= 120
##$ZL2= 120
##$ZL3= 120
##$ZL4= 120
##$ABSF1= 10
##$ABSF2= 0
##$ABSG= 5
##$ABSL= 3
##$ALPHA= 0
##$AQORDER= 0
##$ASSFAC= 0
##$ASSFACI= 0
##$ASSFACX= 0
##$ASSWID= 0
##$AUNMP= <proc_1d>
##$AZFE= 0.1
##$AZFW= 0.1
##$BCFW= 1
##$BC_mod= 2
##$BYTORDP= 1
##$COROFFS= 0
##$CY= 11.3945322036743
##$DATMOD= 1
##$DC= 2
##$DFILT= <>
##$DTYPP= 0
##$F1P= 15.9154993809931
##$F2P= -4.1035820241983
##$FCOR= 0.5
##$FTSIZE= 0
##$FT_mod= 4
##$GAMMA= 1
##$GB= 0.15
##$INTBC= 1
##$INTSCL= 1
##$ISEN= 128
##$LB= 0.24
##$LEV0= 0
##$LPBIN= 0
##$MAXI= 10000
##$MC2= 0
##$MEAN= 0
##$ME_mod= 0
##$MI= 1.114404
##$NCOEF= 0
##$NC_proc= 0
##$NLEV= 6
##$NOISF1= 3.799351
##$NOISF2= 2.8
##$NSP= 1
##$NTH_PI= 0
##$NZP= 0
##$OFFSET= 15.70392
##$PC= 1
##$PHC0= -11120.03
##$PHC1= 9.601
##$PH_mod= 1
##$PKNL= yes
##$PPARMOD= 0
##$PSCAL= 0
##$PSIGN= 0
##$REVERSE= no
##$SF= 200.130013532006
##$SI= 16384
##$SIGF1= 3
##$SIGF2= 2
##$SINO= 400
##$SIOLD= 16384
##$SREGLST= <1H.CDCl3>
##$SSB= 0
##$STSI= 0
##$STSR= 0
##$SW_p= 3612.71676300578
##$SYMM= 0
##$S_DEV= 0
##$TDeff= 0
##$TDoff= 0
##$TI= <>
##$TILT= no
##$TM1= 0
##$TM2= 0
##$TOPLEV= 0
##$USERP1= <user>
##$USERP2= <user>
##$USERP3= <user>
##$USERP4= <user>
##$USERP5= <user>
##$WDW= 1
##$XDIM= 8192
##$YMAX_p= 0
##$YMIN_p= 0
$$ End of Bruker specific parameters
$$ ---------------------------------
##NTUPLES= NMR FID
##VAR_NAME=  TIME,          FID/REAL,        FID/IMAG
##SYMBOL=    X,             R,               I
##VAR_TYPE=  INDEPENDENT,   DEPENDENT,       DEPENDENT
##VAR_FORM=  AFFN,          ASDF,            ASDF
##VAR_DIM=   8192,          8192,            8192
##UNITS=     SECONDS,       ARBITRARY UNITS, ARBITRARY UNITS
##FACTOR=    0.0002944,     1,               1
##FIRST=     0,             0,               0
##LAST=      2.4114304,     0,               0
##MIN=       0,             -230493,         0
##MAX=       2.4114304,     374287,          0
$$ Real data points
##PAGE= N=1
##DATA TABLE= (X++(R..R)), XYDATA
$$ [...]
2262B13o18R81j577K251k611K039q70m95J186j691J871r90P79j080J406j543J128
2279C79q3r19K050k411K034j549R06Rm52L04n34J012j711K311j783J425p75k13
2297@R55j387J708k047K000j502Q28m13k09O48j120J588k066K075j522Q93j7o45
2315b33J242j669J792j724J385r93P96k45k29R23j743K009j929J676j109l7O68
2332E80o82P83q70J301j764K252k164R95M21j406J983j884J309q21N26q68P58
2349D49l29KJ027k080K337j929J252l88q23J218q86P12j013J358j850J998j500
2366d45O77O65j838K314j957J107q68P58p36O03j36o04J488k084K013j644O93
2383Frp55J144r95R46j055J006r76J059m66k85J082j739J614j493J399j127M30
$$ plain form
2262 213 -405 576 -1001 1250 -1361 678 -192 -687 499 -1192 679 -311 468 -612 794 -749 379
2279 379 296 -623 1427 -984 1050 -499 407 416 -36 268 -266 746 -965 1346 -437 988 213 0
2297 0 955 -432 1276 -771 1229 -273 555 142 -67 581 -539 1049 -1017 1058 -464 429 412 -233
2315 -233 1009 -660 1132 -592 793 -200 596 351 122 1045 -698 1311 -618 1058 -51 -88 580
2332 580 -102 681 -189 1112 -652 1600 -564 431 852 -554 1429 -455 854 33 559 -309 449
2349 449 120 122 1149 -931 1406 -523 729 341 -482 736 -150 562 -451 907 -943 1055 -445
2366 -445 232 897 -941 1373 -584 523 -345 413 -323 280 144 -460 1028 -1056 957 -687 6
2383 6 -3 -758 386 -609 337 -718 288 -688 371 -95 -380 702 -1037 577 -916 483 -644 -214
2401b14m3j31J013j363J295j668J858j347P17o7m41Q92j497J668j389J152j231
2418g96J003l40k46O61j373J668j286J278p41M5K97m97N26j142J344j369J170
2435B02j077O90K35j142J420j305J285j446J450j115L19J37n54J151j723J883
2451D10j506R47o53O5O19o14R34j559J814j839J279n00n65J250j072J144j248
2468a094J511j261P63j93j54O22j367J759j803J493j027P40m27K01L85j157J732
2485G23k028J909j152M68J8o01O26o67J211j655J522j357J225j66j171J644j701
2502a152J598j107P98p38N42n39J89Q58j571J906k141J580m73k35K94l73Q39j030
2520g55J285j731J544j021M68K61q28J599j797J124p70P46p13P16l45o30J384
$$ plain form
2401 -214 -257 -388 625 -738 557 -1111 747 -600 117 50 -391 501 -996 672 -717 435 -796
2418 -796 207 -133 -379 282 -1091 577 -709 569 -172 -127 170 -327 199 -943 401 -968 202
2435 202 -875 -185 50 -1092 328 -977 308 -1138 312 -803 -484 -347 -901 250 -1473 410
2451 410 -1096 -149 -802 -737 -118 -732 202 -1357 457 -1382 -103 -603 -1168 82 -990 154 -1094
2468 -1094 417 -844 -81 -274 -428 194 -1173 586 -1217 276 -751 -11 -438 -237 148 -1009 723
2485 723 -1305 604 -548 -80 -62 -663 -37 -704 507 -1148 374 -983 242 76 -1095 549 -1152
2502 -1152 446 -661 137 -601 -59 -598 -409 449 -1122 784 -1357 223 -250 -485 -191 -564 275 -755
2520 -755 530 -1201 343 -678 -210 51 -777 822 -975 149 -621 125 -588 128 -217 -847 537
2537E37j923K141j473R26m31l18O21p88R34j065J287j291J208r53M09K80j014
2554i13J486j628J381j331J149n13J60M52j196J491j605J473j263J349n97m34
2570e39R76j205J616j752J252q14L71P1k51R25j230J233j627J647j346Q32o0o43
2588e44J318j384J143j329J465j255J085m17l91R45j436J613j486J204p40J15
2604i4J83n97R40j319J604j881J625q12K12J19p11J185j133J433j520J324q09
2621b51J48L16p50J366j852J978j406R90o55m0L96r04J017j296J501j000R23o66
2639a85M6O35j093J485j697J310r50Q91m49J9N43j131J419j724J742j244Q19j33
2657C03m59Q77j020R66j001R89j047P28l34R5M62j230J423j355J089p65M78j15
$$ plain form
2537 537 -1386 755 -718 208 -223 -541 80 -708 226 -839 448 -843 365 -588 -179 101 -913
2554 -913 573 -1055 326 -1005 144 -369 -209 243 -953 538 -1067 406 -857 492 -105 -539
2570 -539 437 -768 848 -904 348 -466 -95 -24 -275 650 -580 653 -974 673 -673 159 99 -544
2588 -544 774 -610 533 -796 669 -586 499 82 -309 636 -800 813 -673 531 -209 -94
2604 -94 89 -508 432 -887 717 -1164 461 -351 -139 -20 -731 454 -679 754 -766 558 -251
2621 -251 -103 213 -537 829 -1023 955 -451 539 -116 -156 240 -664 353 -943 558 -442 481 -185
2639 -185 -139 496 -597 888 -809 501 -449 442 -7 12 555 -576 843 -881 861 -383 436 303
2657 303 -156 721 -299 667 -334 655 -392 336 2 97 559 -671 752 -603 486 -279 199 84
2675H4m42O38q57J334j283J238j081N10J14o19R87j147J217j196J011q88N57j38
2693C9l05Q59j126J267j194R52p37N26j43o76J366j348J124j149J012l56m32Q01
2711D80p48O91j120J368j173J065m02j84M76r22J256j131J078j130J229r24M83
2728C92K95j203J625j666J511r83K81j77J32R3l98J010j429J281j059Q13j16o52
2746b50J094j148R63o78O45j020R44n52k40J120j621J851j588Q58n80J78J44j96
2764g6L72q70J087j255J517j248L30N57j084J366j444J017r19R93p27L57K4l61
2782c64J081j482J530j075Q26n44L11J54m77N21p90J259j389J257p50M15M38j331
2800d10J393j151R59p69O21m56J38K06p45J082j267J299j221J150o09j87O33r53
$$ plain form
2675 84 -358 280 -577 757 -526 712 -369 141 255 -364 623 -524 693 -503 508 -380 177 39
2693 39 -266 593 -533 734 -460 492 -245 281 138 -538 828 -520 604 -545 467 111 -321 480
2711 480 -268 423 -697 671 -502 563 161 -23 453 -469 787 -344 734 -396 833 -91 392
2728 392 687 -516 1109 -557 954 -29 252 75 207 300 -98 912 -517 764 -295 518 402 -250
2746 -250 844 -304 659 -19 626 -394 550 -2 -242 878 -743 1108 -480 378 -202 -24 120 -76
2764 -76 296 -574 513 -742 775 -473 -143 414 -670 696 -748 269 -650 343 -384 -27 -3 -364
2782 -364 717 -765 765 -310 516 -28 283 437 -40 481 -309 950 -439 818 68 483 921 -410
2800 -410 983 -168 791 22 643 187 325 531 -214 868 -399 900 -321 829 220 33 666 -287
2818b87J032j203J107j225J254p60J41J70q39J375j622J263q03M04k50j03M10
2835F4o46J091j297J346p87M05k25n09R52r14R24j123J178q84P11k80m0Q19j271
2854d86J283j367J195n49j14K55n96J045j130J341j277J143r10K56J8j63P03j269
2872f22J205j030J136q14J92K42n98Q89j288J448j105O56n96L98J82q18R99j203
2890g27J441j183O81m39J09M34p00J059j499J595j327J009o55K0N23q19R53j084
2908f09R78q90R10m07l03O81j250J539j591J411r52K43mn9O39j220J459j282J186
2927D79r80N47R7o57Q04r71J284j363J280q79L73j9m02O41j073J519j232J228
2945F76j270P99k73l28R30j223J559j370R91o73K62m6k28P66j275J347j247R67
$$ plain form
2818 -287 745 -458 649 -576 678 -82 59 229 -610 765 -857 406 -397 7 -243 -346 64
2835 64 -582 509 -788 558 -229 176 -49 -558 394 -520 404 -719 459 -425 286 6 -34 785 -486
2854 -486 797 -570 625 76 -38 217 -379 666 -464 877 -400 743 -167 89 107 -56 647 -622
2872 -622 583 -447 689 -125 67 309 -289 600 -688 760 -345 311 -285 113 295 -523 476 -727
2890 -727 714 -469 212 -227 -118 316 -384 675 -824 771 -556 453 -202 -182 341 -478 475 -609
2908 -609 369 -521 389 -18 -321 360 -890 649 -942 469 -483 -240 -244 -303 336 -884 575 -707 479
2927 479 -501 46 143 -514 290 -681 603 -760 520 -359 14 -5 -407 234 -839 680 -552 676
2945 676 -594 205 -68 -396 534 -689 870 -500 491 -182 80 34 -194 572 -703 644 -603 364
2963C64o62M41K6n07P85r87R33r99J263j199N73K80j195J444j407J157j079Q88
2981A19m85K15J24o58J356j555J256j058O79o6l95O33p71R26j126J319j327J150
2999C36p03j46J027j240J295j290J150q05O14j99M5L25j098J497j536J447r09
3016a90M22R0n15P16q00J045j274J283j011O28j27l27O42j198J501j149R10o31
3034A5N06k77l51P18j128J321j327J031o89o8N94q62R95q76P81j055R78q14M98
3053a0K42r93J268j398J471j508J004n13J59K9n58R88q94J027q22Q93o68L5N91
3072C43r24J139j000J071q78M78k01R9L90p70R94j273J226q69O53l59p5N11p40
3091a85R61j164J005j100J029o33PO33j435J647j574J415q10J66J07l19N89j028
$$ plain form
2963 364 -298 143 169 -338 447 -540 393 -606 657 -542 31 311 -884 560 -847 310 -769 119
2981 119 -366 -151 -27 -685 671 -884 372 -686 -7 -73 -468 165 -606 320 -806 513 -814 336
2999 336 -367 -513 514 -726 569 -721 429 -376 238 39 84 409 -689 808 -728 719 -190
3016 -190 232 322 -193 523 -277 768 -506 777 -234 394 267 -60 582 -616 885 -264 646 15
3034 15 521 244 -107 611 -517 804 -523 508 -181 -249 345 -517 478 -398 383 -672 306 -508 -10
3053 -10 232 -761 507 -891 580 -928 76 -437 -278 -249 -807 181 -713 314 -508 385 -283 -248 343
3072 343 -581 558 -442 629 -249 229 28 127 517 -253 741 -532 694 -175 478 119 44 555 -185
3091 -185 776 -388 617 -483 546 -87 -80 553 -882 765 -809 606 -204 -38 69 -250 339 -689
3109f89J041r86J057j025N98O9m25N32p35J113j333J387q86J33J02m11P76r41
3127f23J029j218J268p19R4K51p57J208r77J090j318J084p05L01L43o05J023j437
3145f68J474j450J009n99J57L58p30Q77p93J014j356J163o12j88Q72j186J270
3162F12j210R00o53N19l76rM85q37J189j251J104q49N91k10k97P96j063R88p32
3181c03R00r78P28k75k10O74j013J240j231J014r16N77o6m48N82q14J067j165
3199f37R94p43M66l4m76O24q87J393j093P41q41N45K5o37Q78r61J506j465R76
3218C74q06P1M70p02Q79j176J251q03N81n24J89L70q73J106q66J014j151Q67m53
3237a82J57L18q07Q46r54J488j191O93o50Q6P06j051R32r24P83q22P37k35k44
$$ plain form
3109 -689 352 -634 423 -602 -4 65 -360 172 -563 550 -783 604 -282 -149 -47 -458 318 -623
3127 -623 406 -812 456 -263 -169 82 -675 533 -444 646 -672 412 -293 8 351 -254 769 -668
3145 -668 806 -644 365 -234 -77 281 -449 428 -365 649 -707 456 -156 -344 528 -658 612
3162 612 -598 302 -351 168 -208 -217 268 -569 620 -631 473 -376 215 5 -292 504 -559 429 -303
3181 -303 597 -381 347 72 -138 536 -477 763 -468 546 -370 207 141 -307 275 -539 528 -637
3199 -637 357 -386 80 46 -430 194 -693 700 -393 348 -493 52 77 -560 318 -643 863 -602 374
3218 374 -432 -361 109 -593 286 -890 361 -442 139 -385 -196 174 -699 407 -459 555 -596 271 -182
3237 -182 -25 293 -514 332 -622 866 -325 368 -282 -196 510 -541 391 -533 250 -572 165 -70 -314
3256c14J75l17Q60j187J037p72P70l77j06L38o91J169j363J221r97N25n1n68J119
3275D71j234J271j166Q63n95N09k52o8N19q69R16j001J184q03J95J20p13R44o69
3294c78P15r06O70m01M97k82l20Q46j107J097j196R31o81M48j60m0N69r65J267
3313F04j163O10m65L45K23n42P47j068J121j041Q51o10J22M34n76Q81q95R61r76
3332d37N78j78M8N44q45Q37j348J199p67M96m8J4M43r69J030q62Q20p88N42m41
3352a32J60J32o74R25j192J210q82O38k94j95N95o99R92j038R50r11N15r9k75
3371b74O38j100J194j032R59p28L80K7k26O45j050J240j161R12m02K69N8l85M66
3390D30r28J074j005Q45m09L2L30n27R13j039R68q77Q44q20L97K76o25O31o78
$$ plain form
3256 -314 -139 -456 404 -783 254 -518 252 -125 -231 107 -584 585 -778 443 -554 -29 -80 -648 471
3275 471 -763 508 -658 205 -390 119 -133 -201 318 -551 365 -636 548 -255 -60 60 -653 291 -378
3294 -378 337 -569 101 -300 197 -85 -405 441 -666 431 -765 166 -515 -67 -227 -267 302 -663 604
3313 604 -559 51 -414 -69 154 -388 359 -709 412 -629 222 -388 -266 168 -408 473 -422 539 -437
3332 -437 141 -37 11 555 -290 547 -801 398 -369 127 79 93 536 -433 597 -265 555 -233 309 -132
3352 -132 28 160 -514 411 -781 429 -453 185 -109 -304 291 -408 584 -454 496 -415 100 1 -274
3371 -274 364 -736 458 -574 385 -343 37 64 -162 483 -567 673 -488 424 22 291 349 -36 430
3390 430 -498 576 -429 416 7 39 369 -158 755 -284 684 -193 651 -169 228 504 -121 510 -168
3409a68N87o33R16q58L67J81n44O61q95J154q50O87l55r1K65n67P04r87J054o96
3429f8L99k41p6O44q85Q26r88Q18p49M26o6k52O42p58R55r46O75o73O54k44m37
3450c44M84l71R07j085Q62m51M03j05l45M55o14Q92q98N39n22M16J97n03M34n87
3470b36J031j072Q37p40O34K2n84P11r86J212q14L38m15L5K66l23M14l61R20j151
3490b62O26m65L38N2m90N75o02Q82q77O63l30N7L50p59O98q36P58p64M82k11M54
3511C39on88N74p81J042r45N73k08k4L25n74O55p97P88p99O62k20j13M25q05R66
3532D89r34R93p19R8K72m81N66p07Q29q85P58n97K74j87J56N05r56J265j085O38
3552B92n80M77j05p9O35j168J010r86Q42l72K8N05p98R16n49L87n41M19k92J70
$$ plain form
3409 -168 419 -214 702 -156 211 392 -152 509 -386 768 -82 605 250 159 424 -143 561 -426 628 -68
3429 -68 331 90 14 658 -227 599 -389 429 -320 106 40 -212 430 -328 627 -319 356 -317 337 93 -344
3450 -344 140 -231 676 -409 453 2 405 300 -45 410 -204 688 -210 329 -193 223 420 -83 351 -236
3470 -236 795 -277 560 -180 454 476 -108 603 -383 829 15 353 -62 -27 239 -84 330 -31 889 -262
3490 -262 364 -101 237 289 -201 374 -228 654 -223 440 110 167 517 -242 456 -380 378 -386 96 -115 339
3511 339 333 -255 319 -462 580 -365 208 0 -24 301 -273 382 -415 373 -426 236 16 -97 328 -477 489
3532 489 -445 548 -171 -73 199 -282 284 -423 406 -479 279 -318 -44 -231 -75 430 -526 739 -346 292
3552 292 -288 189 84 5 640 -528 482 -504 338 -34 -6 499 -299 617 68 455 -86 333 41 211
3572B11J36p49Q51r29R32q91P22k44k05K98m83M64p23J030r46P05m81K74J52o04
3592d80P61r22Q08p65O82m37j4J66m01P71j038J079o80O66j86j31K29o62P23q13
3612f44J026p72L30j8r2M11n90Q12j136J024k55Q8j3J0L8m94P62p08O76n92L31
3633A94L2l38L74p88J192o91K15k94L86l48j27L10n31Q63j015N21k81L13J1l80
3653c82N68o79N63o43O17j46M0k1k67M33q20O25l03O71m67J29J26n49P56n59O16
3674C08o18M59j89k51K42k56O41m76P76r76P03k92k03N19p04P85q90J126q88M87
3694C03k53k9P2l04O00r05J033o53J73J5k45M69n96O21o88O46m95M87j20j91N05
3715D45o79O68o53P98q43M56m1n13P38n89O34n99K51k73mL91n18P28r58R14o13
$$ plain form
3572 211 347 -402 449 -480 452 -439 283 39 -166 132 -351 113 -610 420 -526 179 -302 -28 124 -480
3592 -480 281 -641 167 -598 84 -353 -367 -201 -602 169 -869 210 -470 196 10 -121 108 -554 169 -644
3612 -644 382 -390 -60 -78 -170 241 -349 463 -673 351 96 184 171 181 219 -275 487 -221 455 -137 194
3633 194 226 -112 262 -526 666 -25 190 -104 282 -66 -193 117 -414 449 -566 -45 -326 -13 -2 -382
3653 -382 186 -493 70 -573 44 -102 -62 -83 -350 83 -737 -112 -415 256 -211 -82 44 -505 251 -308 308
3674 308 -310 149 -40 -291 -49 -305 336 -140 636 -340 363 71 -132 387 -317 468 -422 704 -184 303
3694 303 50 21 93 -211 389 -516 517 -136 37 52 -193 276 -320 301 -387 259 -236 251 131 -60 445
3715 445 -234 434 -219 579 -264 192 151 -362 376 -213 421 -178 73 -200 -204 187 -331 397 -561 353 -260
3736b60L61l14L02n0m72P12r02P59n69Q58n70K50l46j37P05q98Q09p80O18l35
3756b59K09Q9m89Q68r34R43p47L36q8J07Q6o23P89o72P41m87N88l62k18L90o46
3777c79R45p90O21o31M73n6k06R7k03N02q53P03l97L38j07m5M10q05Q78j081Q09
3798B23k91L41l31k46O38p29P32n48N06p96N75j77l01N95p92R34p79P94o57N68
3818B59j98o78P13n19R65j014P29o81K50L27m52L12n78P39p57Q34k60j87L20n48
3838d24Q12o72N71n47N91n85K34K6l97R19p15L69n94O60l12J43J33l19M45o19
3858b81O16n27K77k24j03N13p05Q30o71M89o64M71o8k05L47m51P38q91P75o85
3878d19M74k81j64O16o78N22l39N48o93M80j47j94K43m71P84r69J006n19K44j46
$$ plain form
3736 -260 101 -213 89 39 -433 279 -623 136 -433 425 -145 105 -241 -378 327 -571 238 -542 76 -259
3756 -259 -50 39 -450 418 -516 427 -320 16 -72 35 121 -502 287 -385 356 -131 457 95 -123 267 -379
3777 -379 566 -224 397 -234 239 183 -23 74 -129 373 -480 223 -174 164 57 12 422 -383 495 -586 223
3798 223 -68 273 -58 -304 334 -395 337 -211 295 -501 74 -103 -404 191 -601 333 -446 348 -309 259
3818 259 61 -617 96 -423 542 -472 257 -424 -174 153 -299 13 -565 174 -583 251 -9 -196 124 -424
3838 -424 388 -284 287 -260 331 -254 -20 6 -391 528 -187 182 -412 248 -64 79 212 -107 338 -281
3858 -281 335 -192 85 -139 -242 271 -434 396 -275 214 -450 21 -47 -252 95 -356 382 -509 266 -419
3878 -419 55 -226 -390 226 -452 70 -269 279 -414 66 -81 -275 -32 -503 281 -688 318 -201 43 -103
3898a03N3K52o34N31m79L70J9j33J38k19M25p46P82p82Q78k94J0n8j01K35m91
3919c47O95q01Q03m59J08K4k96L36n18O56o23O26k67J62P5l94M28m03M50l85L62
3940B32k75j32N1k68K60k7M39m31R4Lj99K53j69N80o49N99l51J92l42P3K91n11
3962b87R11r51M11j67K78j49n6L55n22O65r68O84m53K17J31j73M54n87N46n14
3982a75L59k73J99O2m10O02q85R92n43J78j62O8O8l57O67p86R06q23P41l52j27
4003e1K24k89P66j057O09n08L92k54M17j97j89M69l72N82o41K90j39J2L69p56
4023c23J025p62M95m54K88l20J49K22m74N41o00O98m87J10l39M00L4m34O25q07
4043d13O31n79N68j95j80L60m10N45p24P63o59L75N3j18n4l13P67o33K61j44J78
$$ plain form
3898 -103 -50 202 -432 99 -380 -10 9 -124 14 -205 220 -526 256 -526 352 58 68 10 -91 144 -347
3919 -347 348 -453 350 -109 -1 23 -273 63 -455 201 -422 204 -63 99 174 -220 208 -195 255 -130 232
3940 232 -43 -175 -124 -392 -132 -159 280 -151 -57 -54 -253 0 -169 411 -238 361 10 202 -140 -67 224 -287
3962 -287 624 -327 84 -83 195 46 -10 345 -177 488 -480 204 -249 -32 99 -74 380 -207 339 -175
3982 -175 184 -89 110 172 -238 364 -521 471 -72 106 -56 12 80 -277 390 -396 510 -313 428 76 -51
4003 -51 173 -116 650 -407 202 -306 86 -168 249 52 -137 332 -40 542 -99 191 52 64 433 -323
4023 -323 702 -60 435 -19 269 -51 98 320 -154 387 -213 485 -2 108 -231 169 203 -231 394 -413
4043 -413 218 -361 207 12 -168 192 -218 327 -397 366 -293 82 135 17 -37 -350 417 -216 45 -99 79
4064G9j12M9R9l94L77l01O44n27J65k86o2N23l33K57n19N67k22M5J69k41K02l96
4086b17M92m62O70l11pj07q7K13o94R04n81M32n4j52N1m01O11n90P10n78M19l06
4108d5J03K80p08P54r16P48m75L76k05j50N00m57N63l74L18m47K98l04J16J24
4128I9q2J97m35K76l08O54j62l70M63o08M68o39Q71n07K53j67Q7M11o74P74j252
4149f51J019m66J0K42l80M41k81N30p43O04l60K1k22J5K19k07M91l96K09l20L03
4170G8K6l59O45p35Q29p45N88k24K2k01m5M14n70N48m31M10o31M49l1j83M57o93
4192c82O91m80J76J75k91K38n00P21o58O98o39M80j98l31M55o08O32n31P09m10
4212e3J76j22J59k4k96O15r33O01l78M19l01J10J19k92M68n96O03q48Q90l35k08
$$ plain form
4064 79 -33 16 115 -279 98 -203 441 -86 79 -207 -269 254 -79 178 -341 226 4 49 218 -23 179 -217
4086 -217 275 -187 483 172 165 58 -29 184 -510 394 -187 245 191 39 90 -311 300 -290 420 -158 261 -45
4108 -45 58 338 -370 384 -532 216 -259 117 -88 -238 262 -195 368 -6 312 -135 163 -141 -25 99
4128 99 17 214 -221 55 -253 401 239 -131 332 -276 192 -447 424 -83 170 3 90 501 -173 601 -651
4149 -651 368 -98 -88 154 -226 215 -66 464 -279 325 -35 -14 -236 -221 -2 -209 282 -114 95 -225 78
4170 78 104 -255 390 -345 484 -261 327 103 125 -76 -121 293 -277 271 -160 250 -381 68 37 -146 311 -382
4192 -382 309 -171 5 180 -111 127 -373 348 -310 388 -251 229 31 -300 155 -453 179 -352 357 -53
4212 -53 123 1 160 136 -160 455 -478 123 -255 164 -137 -27 92 -200 268 -328 275 -573 317 -18 -226
4233b26K56l84N92o38M69k93J56K6p3K31m46O66m66K53j92m9R6j52L18k12N34
4254D66n74M38n76L65k37l4L23m53M66m66L31k78K7L23l17L13n04L69l15N21n54
4275c66M09L1m54M81o83Q39o62N47n15L32J55m78O51o39N63n33L43j22J29P9l75
4296b68M83m22M31q31Q24k86J29K56m82M08m88P86j111O98j92j6K91l06K20l90
4316b66N32l72L33k64k5O0l01N36j09K1l78L25j61j63K51l74P50o31L07j74N1
4337e2J38l94M00l80O27o45O00m86O8J92l62K77l32N83k97J48j61P6j23p1L89
4358A95n67P54o48K91m94L11kk22O67n17M13m07L67j12k84M16m77N62o22N32l97
4379b41M97k63n6L56j94L42o28N00n47O36n96Q2J74l92M84j41K95l41K10k39J26
$$ plain form
4233 -226 30 -354 238 -400 69 -224 -68 -42 -115 116 -330 336 -130 123 -69 -118 -22 -174 144 -68 466
4254 466 -108 330 -246 119 -118 -152 171 -282 184 -282 49 -229 -202 121 -196 117 -387 -18 -333 188 -366
4275 -366 43 74 -380 101 -582 257 -405 142 -373 -41 114 -364 287 -352 211 -322 21 -101 28 107 -268
4296 -268 215 -207 224 -607 217 -69 60 316 -166 242 -246 540 -571 127 -65 -81 210 -96 124 -266
4316 -266 266 -106 227 -37 -62 -2 -303 233 124 145 -233 92 -69 -232 19 -355 395 -236 71 -103 -52
4337 -52 86 -308 92 -288 339 -306 294 -192 -124 68 -294 -17 -349 234 -63 85 -76 0 -123 -194 195
4358 195 -372 382 -266 25 -469 -158 -160 -382 285 -232 181 -226 141 29 -255 161 -316 246 -376 156 -241
4379 -241 256 -7 -63 293 99 441 -187 313 -234 402 -194 -112 62 -330 154 13 308 -33 177 -62 64
4400F4j21o5K83k73M06l34M04l56k11K58k90N70o80N28m88M27k32R4N3l17O85
4421D05p98L45j51J26L8j5J84l35M25m54M17k30O6Kl2L48p56P44p13N89l60OK36
4444H7k33M74m89L44m84K59J29j49J96k99M08l84M58l71J41j32%K06k12K46m03
4465b08N73p03K06P4J50q5k03M61l43L04n12K66q2M8P8q7M48o87M45l71M96l45
4487g7j90N31n96M17p86P88j37J84j68o1K63k64M66m09Q1k91N14k32l72K75k92
4508c56L56k48N08k37Q7pk21J57k61M23l58L71j35p1J43l31M26n69M85m50N12
4529B24j34p2J12j90N36o27L06l48O22n75L52o6k29N01n38K04m62N89l84L46j91
4550b4k83N29j38J84m09M08m06K25J43l11K81l43J03k80M12l68J41K56m11M95
$$ plain form
4400 64 -57 -122 161 -112 294 -40 364 8 -203 55 -235 335 -345 183 -305 122 -110 -16 37 -280 405
4421 405 -393 -48 -199 -73 -35 -50 134 -201 224 -230 187 -43 23 25 -7 341 -415 329 -384 205 -155 -149 87
4444 87 -146 328 -161 183 -301 -42 87 -62 134 -165 243 -141 317 -54 87 -45 -45 161 -51 195 -208
4465 -208 365 -338 -132 -58 92 7 -196 265 -78 226 -286 -20 -102 -54 24 -63 385 -302 143 -228 268 -77
4487 -77 -267 264 -332 85 -701 87 -50 134 -34 -95 168 -96 370 -39 42 -249 265 33 -339 -64 -356
4508 -356 0 -248 260 23 110 103 -118 39 -222 201 -157 214 79 8 151 -180 246 -323 162 -288 224
4529 224 90 18 130 -60 476 -151 155 -193 429 -146 206 140 -89 412 -126 78 -384 205 -179 167 -24
4550 -24 -307 222 84 268 -141 267 -139 86 229 -82 199 -144 -41 -321 91 -277 -136 120 -291 204
4570B04n67N99m10N3N4m3M48n90O30m74K10k09J26P1l44K26j70N08n12L73j52
4591C1N7j30j93L77k80K92l24J75r4R3J02m11M45k67L38m69L44R7J22k65k02M17
4613B55q03P75l07L72n30R2N7J53j8l27O38m68J61j98K18J86m67M29m95O41m46
4634h2K75k48J61Q6l21N46o45M35k73K64l97P4K22k97L45k86N72p04L85j93p3
4655a54L99l44L27o39O50k48J15j18m8K68l53L57o72P42m18M21j76m46N68l37
4675a06L37o22Q31p78N46n9j29M52q79P84o80N81l49K30K46l54J13k55L22l87
4695a56L42j10q5j25J21J69m05N53o58O20l70n3K90k03K34m60L75l42K79j04n3
4716a41J33l05P11n63K66j2J31l25l8J99k47O13q10O48l29L07k3j60j6J19J82
$$ plain form
4570 204 -363 236 -174 -121 -67 -110 338 -252 378 -96 114 -95 31 102 -242 -16 -186 322 -190 183 31
4591 31 88 -42 -235 142 -138 154 -170 5 -89 4 106 -305 140 -127 211 -258 86 183 305 40 -162 255
4613 255 -548 227 -80 292 -238 -146 -89 64 46 -281 357 -111 50 -148 70 256 -211 218 -277 364 -82
4634 -82 193 -55 106 192 -129 417 -228 207 -66 198 -199 -125 97 -200 145 -141 431 -273 112 -81 -154
4655 -154 245 -99 228 -411 239 -9 106 -12 -60 208 -145 212 -460 282 -136 285 109 -337 231 -106
4675 -106 231 -391 440 -338 208 149 20 472 -407 377 -303 278 -71 159 405 51 164 -91 231 -156
4695 -156 186 76 -9 -134 -13 156 -249 304 -354 266 -104 -157 133 -70 164 -296 79 -263 16 -88 -141
4716 -141 -8 -313 398 -165 101 89 220 -105 -143 56 -191 422 -388 260 -69 238 215 55 39 158 340
4737C40n06N19n43N31m63K01j88j77O57l74M01m34K54l61m1K24j14K14l25N52
4757C67l81J57r3k04L09k10L02n54M50l73K92L2k57L44l23N05o00O88o08M36k78
4778AmK36k95K54l89L93l56J82K63l45K55l36N30o87M69j43L3k1m05P72o48N37
4800B96l69J87R6k65j44J19J25k63L04k09J82k38K27N7k03J3j65M70m82O23k56
4821A05n0R2l74M20k16K78n12L54k46j4L75m96P13o94L05j49M37m89K5L62l30
4842a04O03r26N05k46K67Qj68J85n88P44n76N50k70J53n8l60M81l80L51l60M17
4863B28m29M16j05k11J84k65M10k99J84l96K16L6QJ22k42K77m83M34j97l9J20
4884c1j42L32m74O13m92L02j98m5J26p7M42n05K30l83M63k80O3j9q0J96j77J91
$$ plain form
4737 340 -166 353 -190 341 -122 79 -109 -286 371 -3 398 -36 218 -143 -184 40 -74 140 -185 367
4757 367 -14 143 50 -154 155 -55 247 -307 143 -230 62 94 -163 181 -142 363 -237 451 -157 279 1
4778 1 -3 233 -62 192 -197 196 -160 22 285 -60 195 -141 389 -298 171 28 61 40 -365 407 -241 296
4800 296 -73 114 210 -55 -199 -80 45 -218 86 -123 59 -179 48 105 -98 -85 -250 220 -262 361 105
4821 105 55 147 -227 193 -23 255 -257 97 -149 -163 212 -284 429 -265 40 -109 328 -161 -136 226 -104
4842 -104 499 -427 78 -168 99 107 -61 124 -464 280 -296 254 -16 137 79 -281 200 -180 171 -189 228
4863 228 -201 215 110 -101 83 -182 228 -71 113 -283 -67 -31 -23 99 -143 134 -349 85 -112 -151 -31
4884 -31 -173 159 -315 298 -194 108 -90 -135 -9 -86 356 -149 81 -302 161 -119 -56 -75 -155 41 -136 55
4906E5l18M45l03PM76l96M40o40L47k22L16m14L02L5l64M91l22K82n29N46Om23
4928a83L05l97M47k73L47n51N34j42j74J86k76M28m50L46m31L00P8n27L39l06
4948d00M81l86K43j07J39j7k00N36n22N78p15N11l48J60K69k92K10m19N40n33
4968b72L67q8j36P2r3M22l06K94k73J27m38K68L95l81M50o53M94o59M16q0R7Q3
4990A06k55M87m85L64k81L23j97l4K99n96K95j35K39k10L52l69j16M62k04J75
5010B20o36M63k85L07j08J67N2l93L18k16K65l68K68j6k74L20n35M99j54K48l53
5031b11K03j12K4N70n87L95o84P86n83j39L96l11M35n84O14m64N87l98P0O9k33
5052a57L48m10K53k42M85m34J02Q0l10O71o95O04n26K02L39r8kj75j2l18M94k79
$$ plain form
4906 55 -263 182 -121 -114 362 -34 406 -234 113 -109 207 -207 95 130 -234 257 -65 217 -312 234 240 -183
4928 -183 122 -275 172 -101 246 -305 229 87 -87 99 -177 251 -199 147 -284 16 94 -433 -94 -400
4948 -400 81 -305 -62 -169 -30 -47 -247 289 -233 345 -370 141 -207 -47 222 -70 140 -279 261 -272
4968 -272 95 7 -129 -57 -150 272 -34 260 -13 114 -324 -56 339 -42 408 -245 249 -410 6 -74 23 106
4990 106 -149 338 -147 217 -64 259 62 28 327 -269 26 -109 130 -80 272 -97 -213 249 45 220
5010 220 -416 47 -238 69 -39 128 180 -213 105 -111 154 -214 54 38 -236 84 -451 48 -106 142 -211
5031 -211 -8 -120 -96 474 -113 282 -402 384 -199 -338 58 -253 182 -402 212 -252 335 -63 7 76 -157
5052 -157 191 -219 34 -208 277 -157 -55 25 -285 386 -309 295 -231 -29 310 212 210 35 23 -295 199 -80
5074h0K75m48L46R8m42N89n51L02r6J08k74O5J81l54L12q5K21l76J81p4K16k29
5096a15j30M29n77M79l37J67R4k33K76l85N00k60K39l50L02j19k06L65l26L06
5116A19o20P19j46J5K5k07O8o5J60j49K82l10L52l7l66L01l51J03K2L00k91r8
5138a74L09j33k2j42N29m79K09l48L97Ll01L47m24N11n60M44l00k9L57l53O25
5159D66n48L63n19M58j54k06M06l34L13m31L43l62M13k28l1L9l93P70n37L40m58
5180b90L95R4l63L81n31M44l90N90m07K16j70m4K97k10M84p67N69k79l11J72Q8
5201c2J65j96L44n86N35k83J07J85m96K04m0M31o38O45o12L83k7l00M65l33K67
5222A88l20K04j58M55j85l77M11l53L71j83J76l73K74K08p18N18l64K40j72J12
$$ plain form
5074 -80 195 -253 93 191 -251 338 -213 89 -7 101 -173 -108 73 -281 31 -54 167 -209 -28 -102 114 -115
5096 -115 -245 184 -393 86 -251 -84 10 -223 53 -332 168 -92 147 -203 99 -20 -226 139 -187 119
5116 119 -501 218 72 87 112 -95 -27 -92 68 -81 201 -109 243 206 -160 141 -210 -107 -85 215 -76 -174
5138 -174 135 2 -20 -162 367 -112 97 -251 146 149 -152 195 -229 282 -278 166 -134 -163 194 -159 466
5159 466 -82 281 -238 220 66 -140 266 -68 245 -186 157 -205 208 -20 -51 -12 -405 365 -172 168 -290
5180 -290 105 199 -164 217 -314 130 -260 330 -77 139 -31 -75 222 12 496 -271 298 19 -292 -120 -32
5201 -32 133 -63 281 -305 230 -53 54 239 -257 -53 -93 338 -300 345 -267 116 89 -211 254 -79 188
5222 188 -132 72 -86 369 184 -193 218 -135 236 53 229 -144 130 338 -380 138 -226 14 -158 -46
5242d6JQ6J67m54O43n70K90l28N54l44J4K91m16K59l32L89m08L74l78K29J27p8
5264G0J18m32K53J7J98l94K05J58k65K68k61L16m96K17j91J92K14k26R3k06M07
5285B55j65j61k8J34O7l04L96l74K60k75L61O4o6K00o12M09n26O63m32L04q6m46
5307c62M75k44J48j34L29k63K6M1j61J42j82L51k58L95m75J82n8oL84n98L51l78
5329b95L40q4J12J09j87n9l27N97m69L35k32N4L8J21K31m91L83l22L11k16R6J33
5351A78k00M26o76O41k69q5J27j55J51k03L80n46M79n34M80k00J21J04m23M18
5371B14l66R1J27O0N7l03L94k86K25l96M69m62J99J9j28K07k09R1m63O81k84J49
5393H6j8k67L44l27J64k54L97k34M75k73k60N34m79L90m32L61j32j69K35q6ml58
$$ plain form
5242 -46 -45 41 208 -246 397 -173 117 -211 343 -1 13 304 -112 147 -185 204 -204 170 -208 21 148 70
5264 70 188 -244 9 26 224 -170 35 193 -72 196 -65 251 -245 -28 -219 -27 187 -39 54 -152 255
5285 255 90 -71 -99 35 102 -202 194 -180 80 -195 166 230 164 364 -248 161 -365 298 -134 170 84 -362
5307 -362 113 -131 17 -117 212 -51 -25 16 -145 -3 -185 166 -92 303 -172 10 -48 -54 330 -268 83 -295
5329 -295 45 -39 73 182 -5 -64 -391 206 -263 72 -160 -106 -68 53 284 -207 176 -146 165 -51 45 178
5351 178 -22 404 -272 369 100 15 142 -13 138 -65 315 -231 248 -286 194 -6 115 219 -204 214
5371 214 -152 -61 66 126 183 -120 274 -12 213 -183 286 -176 23 42 -86 121 -88 3 -460 221 -63 86
5393 86 68 -199 145 -182 -18 -272 125 -109 366 93 -167 367 -112 278 -154 207 75 -94 141 55 51 -307
5415c07N07q9p5l6M0Q3l71M36l83J22j48J31K52o9L11m92K55j82o9n5J62O1k00
5438a16J36n8K45l65L31j70j20P0j49J04J40J89l60M14k88J02K49k69M2n58N72
5459A41m07M94m30K15m4J96J8l79L19m53N34k85J51Nn25P78m36L83o57M81m53
5480c54K85K41l52M01m19K06j13p6l7J84J86l4k2m01P24n61K89l43L72K9j73J33
5502A65n34O15l82L43j49m1L68m79N0K4p0M7J7J81r5K55n33M34l66J99j70L30
5524B09j50o1L4k16K77j93K07l41M31j0l71J73k09O48m29J76k35L4J23l0J54k56
5546c5L18n05M28k28j0L5j04L23m88N56m48K14p8J43J99n30M63m62L82k73J93
5567I3l18J31L53j34m7q0J71k91L55l92mK37k11K97n14O33m24J07j01J22K01l76
$$ plain form
5415 -307 200 111 36 0 40 123 -248 188 -195 -73 -221 -90 162 93 404 -88 167 -15 -84 -139 23 84 -116
5438 -116 20 -38 207 -158 173 3 -117 -47 -196 -92 48 237 -123 291 3 105 354 85 127 -431 141
5459 141 -266 228 -202 13 -31 165 183 -196 123 -330 204 -81 70 75 -450 328 -108 275 -382 99 -354
5480 -354 -69 172 -180 221 -198 8 -105 -181 -218 -34 152 118 96 -305 419 -142 147 -196 176 205 32 165
5502 165 -369 246 -136 207 58 17 385 -94 -44 -20 -90 -43 -26 155 60 315 -218 216 -150 49 -121 209
5524 209 59 -2 32 -184 93 -100 107 -234 197 187 -184 -11 -220 428 -1 175 -60 -26 97 67 221 -35
5546 -35 283 -222 206 -22 -32 3 -101 222 -266 290 -158 56 -22 121 320 -210 253 -209 173 -100 93
5567 93 -225 -94 259 125 78 -2 169 -122 233 -159 -163 74 -137 160 -354 279 -145 -38 -139 -17 184 -192
5589a92M02m56L61l56K07K7K6K44k84K70l40J14r6L1K98k81L15l47M54p48N12
5610A61o8r5J51j95L11n40N15l30K96l62M9J46j24N35o62K84k82J64j54K81M4
5631A25l58O88p14K14O2J56m89L76o2k15J70k79L48j93L21j72j73J16j98J47k0
5652a50K77l95J44K3M6p4o3K74l86L75k60N19l69r2L08m65N73n80N16n02J69K25
5674A13m5J32k05L01n31L64q8M6j51J26Nj94L97m75M73o41L20L28k68K36l59K40
5696A24m47N33j97j91K33J58J9m05J03j67L81k63J68j13p8M04m34K71m00J97k71
5717c75K73J96k37K04m78P35o09N38j54j0j24n5M3j02N59o44N21n75J00J72K21
5738A99j46m8J2j43J2K88%j59j7M13l68l4m8k0J05k2P0k15J44r0J82j81J99j38
$$ plain form
5589 -192 210 -246 115 -241 -34 -7 19 263 -21 249 -91 23 -73 -42 256 -25 290 -57 397 -351 161
5610 161 93 -2 149 -46 265 -275 240 -90 206 -156 -107 39 -85 450 -212 72 -210 -46 -200 81 125
5631 125 -233 455 -259 -45 17 173 -316 60 -2 -217 -47 -326 22 -171 150 -22 -195 -79 -277 -130 -150
5652 -150 127 -268 -124 -101 -55 -129 -192 82 -304 71 -189 330 -39 -131 177 -288 285 -295 221 -281 -112 113
5674 113 68 200 -5 296 -235 129 41 87 -64 62 67 -127 270 -205 268 -373 -53 275 7 243 -116 124
5696 124 -323 210 13 -178 55 213 232 -173 -70 -237 144 -119 49 -64 -142 262 -172 99 -301 -104 -375
5717 -375 -102 94 -143 61 -417 318 -291 247 93 83 -41 -96 -53 -155 404 -240 281 -294 -194 -22 199
5738 199 53 5 17 -126 -114 174 174 15 -2 411 43 9 -39 -59 46 24 94 -121 23 -67 115 -66 133 -5
5762eQ9Q0l78M99m29M28l61J72R1l49J77l31M03k15J01l09K38j6K24o2k52K26
5784B1o5K53l59L04k46L6K20l87L93m22M64l73Q8P4j09M86m69J38l07L15j54l2
5806a31R2l61O16m09N48n02K15rj28K51k24K29l58N06l56J32j44K77k29j29K07
5827I3m17L96j69L38m9l1r8k16N12o47O45m07J12p5k37M83m35N77n75K07j73K93
5849A27l01j56O13m54L93m29K85k44O9P1j54L29k89K65k46K22l70L20k27J23J64
5870A11l40M43m35N16l49K17l1l00M66o33M03k94M45j14K4j68J10J4j94M20l56
5891d5N63n00%k49R2K88l28K87j26J01P2j62J71k43L86m60J39J03P0k80kJ62j76
5914a37K11k30L39k06J27k0j05J26n53N66k70L20m15k7L80k75M28m13K08k01K80
$$ plain form
5762 -5 84 164 -214 285 -144 284 -77 95 186 -163 14 -317 86 -129 -28 -337 -99 -115 109 47 -205 21
5784 21 -44 209 -150 154 -92 -56 164 -223 170 -252 212 -161 -73 1 -108 378 -91 47 -260 55 -99 -131
5806 -131 -39 -400 216 -193 355 -147 68 59 -69 182 -42 187 -171 335 -21 111 -33 244 15 -114 93
5827 93 -324 72 -97 241 192 161 63 -153 359 -288 357 -50 62 -13 -250 233 -202 375 -200 7 -166 127
5849 127 -174 -330 283 -171 222 -207 78 -166 -97 -26 -180 149 -140 125 -121 101 -269 51 -176 -53 111
5870 111 -229 214 -221 295 -54 163 132 -168 298 -335 68 -226 219 105 129 -39 71 85 -109 311 -45
5891 -45 518 18 18 -231 -139 149 -179 108 -18 83 155 -7 164 -79 307 -153 -14 89 159 -121 -123 39 -137
5914 -137 74 -156 183 -23 104 84 -21 105 -448 118 -152 168 -247 -274 106 -169 259 -154 54 -147 133
5935A33l55N04k26m2o3q1L93n17L60j55k81J84K0J20m6L18l84J73m7J40n0r9p3
5958g4o8K72l33M60k29kN9l10J66j82J80j6J87k37K67j48j04K20k24L78l83K56
5980A35l10L35k11KK75k49J36l05M50k46J40j57N5J97p04N51m40L71p5P5K7j59
6002a07K58j55K1j80K76j71n3K65m0M9m45M49k39L00p54M06J94l23N29n61J14
6023a67j51L73j66o3O06p82N28k90M38l97K33j57n3K43j99K30k09K31j88j53j3
6044a06K5K50k25L58m46K31j60n8K18j04K73l26J33j38K65k72j37K74j09J71l4
6065H3P4q4J01j19K2l6r9K89k43K49m15M77k18k00M31l18L9m03L65k33J18K21
6087A01j37K04j09J25k52J60k37K36j90oN3k38M55m70O15m28J98J21j57m4j54
$$ plain form
5935 133 -222 282 56 14 -49 -130 263 -254 106 -49 -330 -146 -126 -6 -52 266 -118 55 8 148 98 -1 -74
5958 -74 -142 130 -203 257 28 26 85 -225 -59 -241 -61 -77 110 -127 140 -8 -112 108 -116 262 -121 135
5980 135 -175 160 -51 -49 226 -23 113 -192 258 12 152 -5 50 247 -457 94 -346 25 -50 25 52 -107
6002 -107 151 -4 17 -163 113 -58 -111 154 114 163 -282 167 -72 228 -526 -120 74 -249 280 -281 -167
6023 -167 -318 55 -111 -174 432 -350 178 -112 326 -71 162 5 -48 195 -4 226 17 248 60 -93 -106
6044 -106 -81 169 -56 302 -144 87 -73 -131 87 -17 256 -70 63 -75 190 -82 -219 55 -54 117 83
6065 83 157 73 174 55 77 41 -58 231 -12 237 -178 299 81 -119 312 -6 33 -370 -5 -238 -120 101
6087 101 -36 168 59 184 -68 92 -145 91 -99 -105 -52 -290 165 -305 310 -118 80 201 44 0 -154
6108a54N05n18K48j52J31J67l69Q1k16M54l47M83m78j36M05j71L71l43K48o58
6128d49O06l19L77j67j49J47k16L82n60N70j79N4k7p7K81n36M41l70PJ17L4M3
6150A0L0Q2l81J35L7K86j53Rn3k17K86l69L95j85J48j04j05J78j11K35j59K13
6172B07l34J33J34l76K39m0K19l41L45l87K18j1L4L6j93N03k98K17k59j37r1J70
6194a2K54n48L17k04K47J0n8J67l01L57j59j12k6Q2q1J47K6j59R6k35N26m59O2
6217f3J06J2p5J6J25j81K74l34K87k29q3J29k25K08j25J0J1K25k56J21j21J48
6239b0Kk69L49m7M7lj87O0k73O89n29K46j69M79m86K10L0l29K64k43L62n43O78
6262C18l09m5J91m34M07m8J80k00k02Q5M1J32l71L32k48J47j68J95k40K25J76
$$ plain form
6108 -154 351 -167 81 -71 60 227 -142 -61 -277 177 -170 313 -165 -301 104 -67 304 -39 209 -449
6128 -449 157 -162 215 48 -101 46 -170 212 -348 222 43 97 70 -7 274 -262 179 -191 -184 -67 -33 10
6150 10 40 122 -259 -124 -87 199 46 55 2 -215 71 -298 97 -88 60 -44 -149 29 -82 153 -6 207
6172 207 -127 6 140 -236 3 -37 182 -159 186 -201 17 6 40 76 -117 386 88 305 46 -91 -182 -12
6194 -12 242 -306 11 -193 54 64 6 173 -128 229 70 -42 -68 14 -67 80 106 -53 43 -192 334 -125 -63
6217 -63 43 55 -20 -4 121 -60 214 -120 167 -62 -145 -16 -241 -33 -158 -148 -137 88 -168 -47 -168 -20
6239 -20 -18 -287 62 15 62 59 -128 -68 -341 348 -181 65 -104 375 -111 99 129 -200 64 -179 183 -360 318
6262 318 9 -36 155 -279 128 80 260 60 -142 -57 -16 116 -255 77 -171 -24 -192 3 -237 -12 164
6283A64m96O08l98K95n9j36k8o8J22n2O7l47M03k18J93j79j14M17j56r0j66M01
6305A63p7j9J61k94K26j84R8j71Q0j53j8K49k36K31j26J58k13J98j69Q5K14l17
6327a14K16l42L87m2m8j79J40R2l80L16k08m3J97J57o5l8j82o8L44j71N9r2rl5
6351a08K44j29j95K43k43L62m15L16j98K8K95m24J97q0J15j82K47l9j16M42k60
6372A00n1j67J37r3R3N5p2J67k27Q3k78K32R7j73K72k98J35k95K04k65L35j41
6394a50J71K3k75K18j30M4k1J65J39k72J16j43L03k72K97l94K28J32l3J2k57L37
6416B38l50M96m71P9Q0j98N4q1K67o4L28l86J08k9j49K06k53K76j93M92n21L0
6438d1n4KL10m27J55M8J96j95J95r9j73K82m80N03n14M51k38J85r7k68M67k95
$$ plain form
6283 164 -332 276 -122 173 114 -22 -50 -118 4 -48 19 -328 75 -143 50 -129 -243 174 18 -72 -238 163
6305 163 86 67 228 -66 160 -24 74 -97 -17 -170 -188 61 -175 56 -70 88 -125 73 -96 -11 203 -114
6327 -114 102 -240 147 105 57 -122 18 110 -270 46 -162 -205 -8 149 84 46 -136 -204 140 -31 28 -64 -73 -108
6351 -108 136 7 -188 55 -188 174 -241 75 -123 -95 200 -224 -27 -107 8 -174 73 34 -82 360 100
6372 100 49 -118 19 -74 19 74 2 169 -58 25 -253 -21 76 -97 175 -123 12 -283 -79 -344 -9 -150
6394 -150 21 44 -231 -13 -143 -99 -120 45 184 -88 28 -115 188 -84 213 -181 47 179 146 158 -99 238
6416 238 -112 384 -87 -8 72 -126 -72 -153 114 50 378 -8 100 71 -78 128 -125 151 -42 450 -71 -41
6438 -41 -95 -93 217 -210 -55 -7 189 -6 189 90 -83 199 -281 222 -292 159 -79 106 9 -259 208 -87
6460h7J35j68K31q8k13K38j97N1K63j93J21o9k21L33P1k40K60l26N18o79L51k43
6482a52J70J8K0J95j55j7n26N78j20m3Qn1O7j53L47j59k8O9r1K39n6J0l64L30
6506A36k79L40j56o5J90l42K23l14N33l72J74j25pJ06r2L20m00K23j80J67o9o7
6528e6l1j80L93n02O34m52M05j56R3Q6m55M68k23K28m74M08j33L6K1k73K09k20
6550a74K59L7k44J59k91L78k16J35k71L77Q4j74J68j80J23m03L76k19J20k11J75
6571HK4l1L0l19K82J86j08k05M07k51k09L64l47J99m7K65k95J69J07m37L48m58
6593c18M31l09K37K33k55J5j07k2N0K7q9j07K15j47J10J65K7l06P1K33j90j45
6615a81K26r7n3J29K8J32j63nM1k85M83n02J85l8J18k0m67N90k38K77j44J02q0
$$ plain form
6460 -87 48 -120 111 23 -190 48 -149 -98 165 -28 93 24 -197 136 207 -33 227 -99 419 -260 91 -152
6482 -152 18 36 56 251 96 79 -447 131 11 -32 -24 -75 -8 -161 186 27 -1 68 -23 216 160 170 -194 136
6506 136 -143 197 41 -24 166 -176 47 -267 266 -106 68 -57 -64 42 -50 270 -130 93 -87 80 11 -56
6528 -56 -87 -267 126 -376 258 -194 211 55 148 234 -221 247 24 252 -222 186 53 89 110 -163 46 -174
6550 -174 85 122 -122 37 -254 124 -92 43 -228 149 233 59 227 47 170 -233 143 -76 44 -167 8
6571 8 32 1 31 -288 -6 180 72 -133 274 23 -186 178 -169 30 -17 248 -47 122 229 -208 140 -318
6593 -318 113 -196 41 274 19 34 -73 -95 -45 -18 -107 -214 1 -146 -36 129 156 -150 -79 154 -36 -181
6615 -181 45 -52 -105 24 52 184 21 16 57 -228 255 -247 -62 -100 18 -2 -469 121 -117 160 16 118 38
6638C8l7k39J16M0p6L87n91M98j97K38m76J56L74m41L65k48K59l29j06L05J64
6659B00r0j63K42k24J20L3p3k58P5J40q0K41k50M8J70j80M2k34K83l80L23o1J19
6682D3o8O0O5k39K27m09M94n78N89j10k27J26J28j14k65M30l12K72j00l11L28
6703B9j6K8j55O5K4PK4j56J74%M1l29N16m60L35j03K9m0j97K66q6J43j27j5k0
6728b3K83n9k86K55l41K04O4p3q4mJ10k22L97j99J85o49O40J17n57N34n88N54
6750B58n80N20m5q9k9j8j82q3L19j68K26j70J29M7j26J54j56L20j68K9l93L25
6772A20k2j11K24k75J47k5O3j53P6J06k46L20k22K4n6J48j15J4R8m51N59l23J60
6795F0k49K54K3m24M20l59M19j88L06m91M39Qk20J41k88K32k36J8K78o4R4J8p9
$$ plain form
6638 38 1 -238 -122 -82 -158 229 -362 136 -61 177 -299 -143 231 -210 155 -93 166 -163 -269 36 200
6659 200 110 -53 189 -35 85 118 45 -213 -138 2 -78 163 -87 -39 131 -49 -7 -241 42 -338 -15 -76 43
6682 43 -25 35 100 -139 88 -321 173 -405 184 74 -153 -27 101 -13 -278 152 -160 112 12 -299 29
6703 29 13 41 -114 -49 -25 -18 6 -150 24 24 65 -264 252 -208 127 24 53 13 -184 82 -4 139 12 -3 -23
6728 -23 260 201 -85 170 -171 33 97 24 -60 -64 46 -176 221 22 207 -442 198 315 -242 292 -296 258
6750 258 -322 198 153 64 35 17 -165 -248 71 -97 129 -41 88 135 9 163 7 327 159 188 -205 120
6772 120 98 -13 211 -64 83 58 121 -32 44 150 -96 224 2 26 -30 118 3 17 115 -336 223 -100 60
6795 60 -189 65 88 -336 84 -275 144 -44 262 -229 210 218 -2 139 -149 83 -153 -135 143 79 173 191 112
6818A12j04K88m47K26j98L22j81J02N3n49K58j76M32k91K90l12K25K17l06J13
6838G4j39L26k96K9J69l55L77l99J07Q5m0l3J11Q5j15K17l10K98j86l0P8J1J37
6861B01j44k25J22L5m5J39o2J15J1r7K40l00K45j99J25j12j2J28k90K45j53K08
6883A75j97N1n9M2J16m02N08l07Lm5N7J28n5J89n39M97l01K43J00n3n6j85K90
6906B00n9Pk50J06J58m6L4J19l48j64K92j65R8k14K93j25J17K4k97K22l68L63
6928cJ28k17K30m15K40q4J95k39J87o5q8J98k48L51k21p8j11M84M2k65M3n3J28
6951A39l04K45j44K33o0k48J73j24J32j24J36R1j93J45Q6j32MJ23j25J3l11J63
6973h2K39l74K87K6j81p5o8M37j24N8j37l20O4M65l83M27l12n7J26j78K18r7J00
$$ plain form
6818 112 8 296 -151 75 -123 199 18 120 173 -376 -118 -294 138 -153 137 -175 50 267 -39 74
6838 74 -65 261 -35 -6 163 -192 185 -214 -107 -22 -62 -95 16 101 -14 203 -107 191 5 -25 53 64 201
6861 201 57 -168 -46 -11 -56 83 21 136 147 50 290 -10 235 36 161 49 37 165 -125 120 -33 175
6883 175 -22 29 -30 12 128 -274 234 -73 -70 -115 -58 70 15 204 -335 162 -139 104 204 151 95 -90 200
6906 200 141 148 -102 4 162 116 150 269 -79 -243 49 -116 -18 -232 61 -64 53 77 -220 2 -366 -3
6928 -3 125 -92 138 -277 -37 -121 74 -165 22 -43 -131 67 -181 170 -51 -129 -240 244 286 21 64 11 139
6951 139 -165 80 -64 169 109 -139 34 -90 42 -82 54 145 -48 97 183 51 55 178 53 66 -245 -82
6973 -82 157 -217 70 96 -85 -160 -228 209 85 143 6 -314 -250 215 -168 259 -53 -110 16 -162 56 -41 59
6996E9k26K65j52K2R1N1J08m11L46j77l6q2J03N0k8p3j18M58m37K74j87l4J38
7019Dj26J05j23J68l50M42l61N1M02j71j75J60O1K4J87m00QQ2j52M32m39m5M51
7042B35j43Q4J4j02j53K59m26K49Lj05J48jpn9M4j44J76k96K20r6J58r4j21K72
7066A15l02M54k89J88l34K33m3j06K47l10K32j22m1M0J19l12p9L83k93K49Q3j51
7088c9K1r9K06l17K49j65J93l8k4L8k71K08l24N22Oj36q9K70P3k09L2j36L02l13
7112d0r2R7r5M7M1K84k47J53j16N6j43O7k9O5J8l24K57J06k16Q7q0K56j32M8m1
7137B7l5Q9k82J49M8J53m29M35N8k0l68K70J71j50k56J19j00J1K74l73M5l3K01
7160DJ90k75J2l1K97k46j2L23j10j18j45J96j08J39Q4r9p1k5K95m96L3J0K49j85
$$ plain form
6996 59 -167 98 -54 -32 59 110 218 -193 153 -24 -60 -142 -39 11 -17 -90 -208 250 -187 87 -100 -134 4
7019 4 -122 -17 -140 28 -322 120 -241 -190 212 41 -134 26 87 111 298 -102 -94 -12 -164 268 -171 -216 235
7042 235 92 176 190 88 -65 194 -232 17 20 -85 63 62 55 -4 40 -104 72 -224 -4 -100 58 -36 -157 115
7066 115 -187 267 -22 166 -168 65 22 -84 163 -147 85 -37 -78 -38 81 -231 -310 73 -220 29 112 -39
7088 -39 -18 -117 89 -228 21 -144 49 11 -13 25 -246 -38 -362 160 166 30 -59 211 284 75 107 -29 273 -40
7112 -40 -132 -35 -130 -83 -42 242 -5 148 32 88 -55 12 -17 48 66 -258 -1 105 -111 -24 -104 152 20 68 27
7137 27 -8 81 -201 -52 -4 149 -280 155 213 193 -175 95 266 116 -140 -21 -121 -110 164 -209 -164 -197 4
7160 4 194 -81 -69 -100 197 -49 -61 262 152 34 -111 85 -23 116 200 101 30 5 300 -196 -163 -153 96 -89
7184h9k3N46o37L70m4j0j59n1J70J34K9l26J99j44P3j09J14j22NL87l64J47j75
7207g9m8m7J50N9r7N2j4J51j52P1q5j48J04K96k69n6K26k19J84k93M50l16j68
7230b48N38m23J57n4K4J7j57L16k02Q7j97Q5n0P2k4J52j00Q0j32J94j01j28J55
7253F1K1j15J05o8J90k11K47k52r6J27r4J59N8l45Q2k2J21O6q1k60M51l89J89
7276e6p0K36n9j15Q6r8J70j63J55N8Rk94q9J31J62K27k77P9j55J25rk08L16n9
7300A02l45M56k94p0M98n04J61q8P9K7k76L71n72N34j13j04K56l33K00o4K00k12
7322i1J30j32Rn2J84k15J55K47m14L05j85K23m00K08J63j40J83n0M0r3k8k13J66
7345@r6l7M56m96K18q5j80K95l3%QKO4j6Qk55K4J42L1l11L63rL6j58P6J39k97
$$ plain form
7184 -89 -112 434 -203 167 123 113 -46 -97 73 207 236 -90 109 -35 38 -71 43 -79 -74 313 -51 96 -79
7207 -79 -127 -174 -24 35 -62 -10 -24 127 -25 46 -39 -187 -83 213 -56 -112 114 -105 79 -214 236 -80 -248
7230 -248 290 -133 24 -30 -6 11 -146 170 -32 55 -142 -57 -107 -35 -59 93 -7 73 -59 135 34 -94 61
7253 61 82 -33 72 4 194 -17 230 -22 -118 9 -85 74 132 -213 -131 -153 -32 34 -47 -307 144 -245 -56
7276 -56 -126 110 51 -64 22 -76 94 -69 86 144 153 -141 -230 -99 63 290 13 92 -63 62 53 -155 161 102
7300 102 -243 213 -81 -151 347 -157 4 -84 -5 22 -254 117 -455 79 -34 -138 118 -215 -15 -79 121 -91
7322 -91 39 -93 -84 -136 48 -167 -12 235 -179 126 -59 164 -236 -28 135 -5 178 128 168 75 47 -166 0
7345 0 -96 -133 323 -173 45 -40 -220 75 42 42 50 52 116 100 108 -147 -123 19 50 -261 102 93 129 -29 47 186 -111
7372a11Q7n4Q9rK0n9J41r4p3j34J26J34j32j63M7o6K47n1J51m50L53j46K70j38
7396a5k36K96o8K4k2K72k70j45L10j21l3m4K71m31K09K3q3J44j17L95l76L31l69
7419e5J66R0k98j56J35L13Q2n09K26P6p0J61l75L03j85J35O2k32K24N1r3j33K02
7442A20J35m21K97m73N04l02J58M5j04J08k95L06j77Q6Qk25M23j18j10j66K87
7463H6j52NO7kJ28n7j9j96J91l74N82l06r6K85k66J39J33p3k52J11J12j27L37
7486B56l05j06Q0J46M9m8J61l82L06j30O6jP4j86J61k54N4K99j64N9q9j36K56
7509A66r9j3k45K64k31K86r7r0L6O1j26n1L19k89O4Q1j2j50j9J35J6J31m03K80
7533A4j78K03J3k2O1l2k30j0K44j78J96r0k03K32K6L5j58J68j95L9p3K35m5j70
$$ plain form
7372 -111 -24 -78 11 2 22 -37 104 10 -63 -197 -71 63 -69 -232 -185 -251 -4 -55 96 -354 -1 -147 123 -15
7396 -15 -251 45 -23 1 -21 251 -19 -164 146 25 -8 -52 219 -212 -3 20 -63 81 -36 359 -17 314 -55
7419 -55 111 201 -97 -253 -118 195 277 -232 -6 70 0 161 -214 89 -96 39 101 -131 93 144 51 -82 120
7442 120 255 -166 131 -342 162 -140 18 63 -41 67 -228 78 -99 -13 -5 -230 193 75 -35 -201 86
7463 86 -66 -61 6 4 132 75 56 -140 51 -323 259 -47 -143 142 -124 15 148 75 -177 -66 46 -81 256
7486 256 -49 -155 -75 71 120 72 233 -149 157 27 93 92 166 -20 141 -113 -59 240 76 135 46 -90 166
7509 166 67 54 -191 73 -158 128 31 -59 -23 38 -88 -139 180 -109 -45 36 24 -126 -145 -10 6 137 -266 14
7533 14 -164 39 52 30 91 59 -171 -181 63 -115 81 -9 -212 20 46 81 -77 91 -104 -65 -138 97 52 -118
7557a18M9J64J80l53P5J07q7j50J2K21l06L82p3j9j28j69K39pJ60k11J37K5j61
7580c1K94k98J78l26N15k83K17k51O3j08J67j11j51J12n3n7P5l0P1j2j05J58J24
7603A58n8K8l30K38J57m44J13n5K74k06J42q8J67j39r9J83k2j11J31P7k0k95K7
7626a72J34R6r8J47j71K39j02p6k5K6o1O9K17l50K40k49Q2J51l50R0M3M62l08
7649C4J31k57Q6rJ01o3o9K34k10J8j7Mj21J11K68j41j60J07j37J1J5K31k84M7
7673g0k4J61J13j10p7p1J26j14R9j27J62K15m05j21L43n6k05k6L79j67N9k10N7
7696f9r1J19M6j06J15r8J0j15K60l50K41K1l7O7L2l4L5J52n23K58M1L9p7K4j97
7721b37K39K55l58N7k3oP4j05J38P6k76J84M8p8n2J84j69N6N0p7QL94k36o1r9
$$ plain form
7557 -118 -69 95 275 -78 -3 104 17 -133 -121 100 -206 176 103 84 -44 -213 26 19 179 -32 105 130 -31
7580 -31 263 -35 143 -183 332 49 266 15 78 -30 137 26 -125 -13 -66 -123 -48 -78 -7 -19 -124 34 158
7603 158 100 128 -202 36 193 -251 -138 -193 81 -125 17 -71 96 -43 -142 41 19 -92 39 116 96 -199 -172
7626 -172 -38 58 -40 107 -64 175 73 -3 -28 -2 -63 6 223 -127 113 -136 -54 97 -253 -163 -120 342 34
7649 34 165 -92 -6 -15 86 23 -46 188 -22 -4 -21 -17 -138 -27 241 100 -60 47 -90 -79 -64 167 -117 -70
7673 -70 -94 67 180 70 -7 -78 48 -66 33 -94 68 283 -122 -243 100 44 -161 -187 192 25 84 -126 -69
7696 -69 -160 -41 5 -101 14 -84 -74 -189 71 -279 -38 -17 -54 13 45 11 46 198 -325 -67 -26 13 -64 -40 -237
7721 -237 2 257 -101 -44 -67 -73 1 -104 34 110 -166 18 66 -12 -64 120 -49 7 57 -20 -12 382 146 85 -14
7746a4l8O7O1m2n9P7j36J50j17J12L5m5J3j95M3j5R5j70m3J09j75M03k9j2l2j02
7772e9J26j46J79j86K96k5n1k54K07j36L7J06P2R0l23J00J90j28J30j63r7R3j88
7795a30O8J54L6j81J21q8M6j67J62k42M65j88J0K06m27R0j56K53l0J60j00m2k10
7818a90o0L08n0J01rK6k81M7K09j08J63n9k05L5m8J14Qj00kL1K3J61k21K07L1
7843A31j47O4rj0O8k30J14J27l02K63M1m9Oj61L54j74k82J7K76N2q4j25j09L79
7867B10j06Jj53j49M27j12j03j08J6J17J87m31K72qk22J65k84J93J96k06j26L24
7889A00j00n0K29k17L74l21J44j74J48p3m5m4J43k1k54J65k5m0P0j47L44k20N8
7912D4j37l5Q4M8k4k4j9J5J59L3j93r0p2K04lj25N2j28J04K9Q9j61K73j43Rj92
$$ plain form
7746 -14 -52 15 76 34 -25 52 -84 66 -51 61 96 51 64 -131 -88 -103 -8 -178 -221 -112 -287 116 87 75 43 -59
7772 -59 67 -79 100 -86 210 185 134 -120 87 -49 -12 94 166 256 -67 33 223 95 225 62 -35 58 -130
7795 -130 -62 92 128 -53 68 -20 26 -141 21 -221 244 56 66 272 -155 -65 -221 32 2 162 62 20 -190
7818 -190 -250 58 8 109 100 126 -155 -108 101 -7 156 97 -108 -73 -121 -7 1 -99 -101 -70 -47 114 -107 100 131
7843 131 -16 48 39 29 97 -133 -19 108 -194 69 110 61 67 -94 260 86 -196 -179 97 149 65 -60 -169 210
7867 210 104 105 -48 -197 230 118 15 -93 -77 40 227 -204 68 60 -162 3 -281 -88 108 -98 -224 100
7889 100 0 -50 179 -38 336 15 159 -15 133 60 15 -29 114 93 -161 4 -21 -61 9 -138 206 -14 44
7912 44 -93 -128 -44 4 -20 -44 -63 -48 111 144 -49 -139 -211 -7 -10 -135 -83 -211 -107 -78 11 -150 123 -20 -11 -203
7938b03L41j06n7J96j14J26k34M6k27N66l52J08l19L05j06J90k31J42j45J14j39
7959i9j0K15k10J22J18l29N10k30J05L8k02m3j01m2K28Q7K4k21K54j65j36J88
7981A01Q5j19l2J54j98J4j55J89k46P5J94n8j92MK25k50M43k48K2j8J21j31j81
8004b01K58JK04l05P6J17k50J59J53k37l7l3M03m14J03OO7l37K66N6L0L1j79P8
8028A5j63J80l75N08k38Q6m3j95O9K8K79l42L93m51K44p4J4J85j54Q3k08M66k20
8051H7k99R7J42j20K18j14j92K59k47Q8L8J00N6k74P3J70P8k61o4K28j0j38QJ9
8075e8n0P4k6J10j02P1j14M8K1r9K06q1r8K00j18j43J85r4K9Q4q4J37j54K99l17
8100g4J80n9Q5j96J37j54J47qj38n4J6J31k3q1j07L06j62Q2j85L28l88Q2K79q5
$$ plain form
7938 -203 138 32 -25 171 57 183 -51 -5 -232 334 -18 90 -229 76 -30 160 -71 71 -74 40 -99
7959 -99 -109 106 -104 18 136 -193 317 87 192 230 28 -15 -116 -158 70 157 181 -40 214 49 -87 101
7981 101 186 67 35 189 -9 5 -150 39 -207 -132 62 4 -188 -184 41 -209 234 -14 8 -10 111 -20 -201
8004 -201 57 58 262 -43 33 150 -100 59 212 -25 -62 -95 308 -106 -3 3 70 -267 -1 55 85 116 -63 15
8028 15 -148 32 -343 165 -73 13 -30 -225 -156 -128 151 -191 202 -249 -5 -79 -65 120 -34 49 -159 307 87
8051 87 -212 -115 27 -93 125 11 -181 78 -169 -81 -43 57 113 -161 -88 82 160 -101 -165 63 53 -85 -77 -58
8075 -58 -108 -34 -60 50 -52 19 -95 -47 -26 -125 81 0 -98 102 -16 -159 26 -68 -39 45 -39 98 -56 243 -74
8100 -74 106 47 132 -64 73 -81 66 58 -80 -134 -118 13 -10 -91 -198 108 -54 28 -157 171 -217 -135 144 59
8124E9j53RN8o6J71k26n4L4L8R3Q6j78o2K31o9p4k7J79K5n4k3j0k4L5J77j21k2
8151C2ok4J12m3k49K55k8j5l0%L34l23k6l0j21K27k02L80j35k48J36M4m6j82N09
8176C21m08L1o6Q9J22j99Q0j07K31k9M5j05j73K29R0
$$ plain form
8124 59 -94 -85 -27 -93 78 -148 -202 -168 -130 -37 49 -129 -191 40 -29 -103 -130 49 74 20 -3 -13 -37 -2 175 54 32
8151 32 26 2 114 71 -178 77 49 34 4 4 338 15 -11 -41 -162 65 -137 243 108 -140 -4 40 -6 -188 321
8176 321 -87 -56 -122 -33 89 -110 -30 -137 94 65 110 5 -168 61 151
8191A51
$$ Imaginary data points
##PAGE= N=2
##DATA TABLE= (X++(I..I)), XYDATA
0@%%%%%%%%%Qj6J6j6K0k8M0n1N9p2Q8j10J34j60J92k25K65l11L62m19M83n57O37
32C39p25Q27r38J059j193J340j504J684j880K094k328K584k863L168l501L865
48B028m264M700n176N698o277O919p630Q423r315J0326j1482J2818j4382J6244
62H630j8505K1325k4954K9828l6801M7793o8905J85974l02775L75992J20207m53795
74a15986M30838k01457n2365K73231l59077J37012K46218n00167L36313J0452
84B05012k41136K06261j30075N3206J7893j82555J99097m6813k00915K57684j46825
95i166n6295J82847k64221K06944m1740j86179K61485j26303j15104K39328j66593
106g4997l3149K08218k49611J41435N8482j85082J74624m3560n4957Q6224l9582
$$ plain form
0 0 0 0 0 0 0 0 0 0 0 8 -8 8 -8 12 -16 24 -27 32 -40 48 -62 72 -88 104 -121 144 -167 195 -224 259 -298 339
32 339 -386 441 -497 562 -631 709 -795 889 -991 1103 -1225 1359 -1504 1664 -1837 2028
48 2028 -2236 2464 -2712 2986 -3291 3628 -4002 4421 -4894 5432 -6050 6768 -7614 8630
62 8630 -9875 11450 -13504 16324 -20477 27316 -41589 144385 -158390 217602 337809 -115986
74 -115986 314852 113395 61030 334261 -24816 112196 358414 -141753 194560 205012
84 205012 -36124 170137 40062 93268 111161 -71394 127703 80890 -120025 137659 -9166
95 -9166 -65461 117386 -146835 60109 18369 -167810 93675 -32628 -147732 91596 -74997
106 -74997 -108146 100072 -149539 -8104 50378 -134704 39920 -3640 -58597 27627 -11955
117a1955k0740J00398j09565M3604P8796j12740N9305O908J1257m4063K3221L5604
129F0030l3742j5136J3471N1717q6657K1806L4598r008n8700K9000M7885p8380
141b3116J4125L91M3561q0830J225P4384o4994k3830L2552K2825o5539K1822R48
154d6476K8974n4213j4320R6437r0753O742L4406j596k7605P412J4701R691k0673
167e7273k4195Q6116p2612Q512L3828j4074N99j4771L3563j5405N203k3884M5826
180h567j9501k0610K7620m093N323l3564M6856k8464J0721j0772q57L4281n2769
193e4396K3286J5160j1723k8234M3567k3895K959L134k6932O7236p3359J8173
205d5024M0593m0185k208K5105j3357J867N673l4214P7058p5109R225O3863p1339
$$ plain form
117 -11955 -32695 67703 -41862 1742 80538 -32202 27103 34011 45268 1205 24426 60030
129 60030 26288 11152 24623 76340 -10317 11489 46087 37079 -21621 7379 55264 -23116
141 -23116 -8991 -8600 34961 -45869 -44644 29740 -35254 -59084 -26532 -3707 -69246 -47424 -46476
154 -46476 -17502 -71715 -86035 10402 -80351 -73609 -39203 -40799 -68404 -60992 -46291 -36600 -57273
167 -57273 -81468 4648 -67964 -59452 -25624 -39698 -39099 -53870 -20307 -35712 -30509 -54393 -8567
180 -8567 -28068 -48678 -21058 -25151 -19828 -53392 -6536 -35000 -24279 -35051 -35908 -1627 -54396
193 -54396 -31110 -15950 -27673 -55907 -12340 -36235 -33276 -30142 -57074 10162 -63197 -45024
205 -45024 -4431 -44616 -46824 -21719 -35076 -33209 -27536 -61750 15308 -59801 -50576 13287 -58052
218e8052K8014Q373j3199J2780n741k8491P2439o3411j1514Q4907q9453M0676
230b2672M566k5435L2724k2535j9005N9766m4498l1180R4086q7129L0383J8461
242a2468m2848N2689l8827j0155N5312l5794l8537R1273o9247P984M0785o1144
254f0977O7883m3852j2360O3186m2587l0702Q1800n2644j2054N9862p2219P0482
266A5818l6578k7935Q2134n9306j7867P0745m4642j8495O3910p3090O0759j8055
278b602n0765R8607p1768r605O4708m7160j1002N2823o2388M5603Q7o8355J06692
291D4875p0929j3744O8008n5166M938L3901m7455L3914J1204p3383J00787n5985
303a9035k8164P9225o4623J8332J9473l7125L3029O420o3309Q5687l6784m4143
$$ plain form
218 -58052 -30038 -21665 -34864 -22084 -27825 -56316 16123 -47288 -58802 26105 -63348 -22672
230 -22672 -18106 -43541 -10817 -33352 -52357 7409 -37089 -68269 25817 -61312 -30929 -12468
242 -12468 -55316 -2627 -41454 -51609 3703 -32091 -70628 20645 -48602 -40618 167 -60977
254 -60977 6906 -36946 -49306 13880 -28707 -59409 22391 -30253 -42307 17555 -54664 15818
266 15818 -20760 -48695 33439 -25867 -43734 27011 -17631 -36126 27784 -45306 15453 -2602
278 -2602 -53367 45240 -26528 -36133 28575 -18585 -29587 23236 -39152 6451 6538 -61817 44875
291 44875 -26054 -39798 28210 -26956 -22018 11883 -35572 -1658 9546 -63837 36950 -19035
303 -19035 -47199 32026 -32597 -14265 5208 -31917 1112 7532 -55777 29910 -6874 -51017
315e1017Q8836o9981K3383J7539m0383M1370o673m6122O7579k2798n0579Q8387
327C9541o6091J7555K4799m9935N2927k0426k9439N1264j6343m1434O9641m9858
339a7799Q163L1796n7098N9124k6945j9379M1244j8010k0682L8986k6221R39K8408
352B2526n3145N7056k5422k0369M0724k2890k588J0797n726j879J6763l8918M3049
365A9978j2351l1220M3696k2259J069l888J0214m566j131j1700J9741J213l5977
378b7181M0050j3498n223n493J5645j743j8354J5172j02N373k7588L0357l989
391C426j5120N907R056K892k5242K7491q422K011j1937J5273N018k1821J7709
404F241k743O567k0826K3281n660p608P698m829J2135j8919J4674n424N801j3373
$$ plain form
315 -51017 37819 -32162 -8779 8760 -31623 9747 3074 -43048 24531 1733 -48846 39541
327 39541 -26550 -8995 15804 -34131 18796 -1630 -31069 20195 3852 -37582 32059 -17799
339 -17799 -9636 22160 -34938 24186 -2759 -22138 19106 1096 -19586 19400 -6821 -5882 22526
352 22526 -30619 26437 1015 -19354 21370 -1520 -4108 6689 963 -916 15847 -23071 19978
365 19978 7627 -23593 20103 -2156 -1087 -4975 5239 673 -458 -12158 7583 8796 -27181
378 -27181 12869 -629 -5852 -11345 4300 2557 -15797 -625 -727 4646 -22942 7415 3426
391 3426 -11694 -5787 3269 6161 -19081 8410 -12 1999 -9938 5335 10353 -11468 6241
404 6241 3498 10065 -10761 12520 6860 -748 6950 2121 14256 -4663 10011 4587 10388 -2985
418b985J1789J525j7462K5538k5400J5942k549q510O241M064j2535O832O439k3411
432a4482L6434l8104J6167J9007m1467K9466Q89j9744J4899J213j9269L7509m3908
445b1390J8528L4142p0055N6065n636l1729L5669j6028p506L2568m4763K2761
457B626L5642q1173P0046r936m2714N4566l4350O846K0773l8634K7252J8859o3532
470c3729O2659j5678l5322N6265n0020K9561O54l3863M4903j6972l0667N2375
482C0166l1051j4006N0232o3084M7044m862m3757O3558l6479j4275M2935k9769
494c348q048M0099m8305K9774P766m2317M9059k4060n735J4845m034o048O122
507E770j987j693P996j5076J6387j0362P151j0634J0438M431k5336L0964j7735
$$ plain form
418 -2985 8804 10329 -7133 18405 -6995 8947 6398 -2112 4129 8193 -4342 2490 8929 -14482
432 -14482 21952 -16152 15 19022 -22445 7021 7910 -11834 3065 4278 -14991 22518 -21390
445 -21390 -2862 31280 -38775 17290 11654 -20075 15594 -434 -7940 24628 -20135 2626
457 2626 38268 -42905 27141 17205 -25509 29057 -5293 1553 22326 -16308 10944 29803 -33729
470 -33729 28930 13252 -22070 34195 -15825 13736 14390 -19473 25430 8458 -22209 30166
482 30166 -885 -14891 35341 -27743 19301 14439 -29318 34240 -2239 -16514 26421 -3348
494 -3348 -11396 28703 -19602 10172 17938 -24379 24680 620 -5115 9730 5696 -352 5770
507 5770 3783 2090 10086 -4990 11397 1035 8186 -2448 7990 12421 -12915 18049 314
520C14J925M338n211N130q95r343J2666J645k4490L5816k8716J0684Q100k4190
534a2227L2315k4166N48K0241j9773r03K4781l4844K5456J210l4831N5296m4982
547a1879Q732K7903m1912K8632J303l1128M0173j5814l0984O4937n7251J1701
559e587L6840n8988M7776j4405k5811M7440l0202j9888N8672n0585K463M1811
571B9536n5402M1734j6930j3479L7201l5408L853K9282l1740L100K6210l4518
583a6561K8537j9006K019K6203m4862L1463L994k4944J5998O937j9330J9458j3028
596c122m07K3923m1798L4210k333k3103K1477k819r112O030K421r719J6142k0910
610i120J5580j68j5172J7557j0620L865n581Q992q908L098J229k601K017o293
$$ plain form
520 314 2239 6577 1366 6496 5601 -3742 8924 10569 -13921 21895 -6821 3863 11963 -12227
534 -12227 20088 -4078 -3530 16711 -3062 -3965 20816 -14028 11428 12638 -22193 33103 -11879
547 -11879 -3147 24756 -17156 11476 12779 -18349 21824 6010 -24974 39963 -17288 -5587
559 -5587 31253 -27735 20041 5636 -20175 27265 -2937 -22825 35847 -14738 -12275 29536
571 29536 -25866 15868 -1062 -14541 22660 -12748 -8895 20387 -11353 -8253 17957 -16561
583 -16561 11976 -7030 -5011 21192 -23670 7793 11787 -13157 2841 9778 -9552 9906 -3122
596 -3122 -3529 20394 -21404 12806 10473 -12630 8847 6028 -3084 2946 5367 -4352 11790 -9120
610 -9120 6460 6292 -8880 8677 -1943 1922 -3659 5333 -3575 -477 752 -1849 168 -6125
624f125J2384j6281J2709n970N32J218m853J0961j3243P479j353M533j2231J1406
638A166O44j0483J0780p510J1526j5381R253M162p771j243P381K498j5871J7856
652G007r568O201p834K162J2676j8612P050N929k475j2700J9486j1313k8M953
666B934j0129J9184k2143Q297R898j1819l862J5461j0715l611J4129j9553K2204
679A0275j7424J283J6964k0911P320R007j1221l44J5029k2585K1468j0242q498
692i879K5454k8090J4560M793j4119Q698O564j9312J9198l836j7380L1231k9273
705a1391J3234O595j9740J8481m177j2518J6157k644j8979L0758k4845O426J2450
718I807k5193K5191j2087p853J7141o405j4400K4947j7000j514J9149k8307K6336
$$ plain form
624 -6125 6259 -10022 2687 -3283 -2751 -1533 -6386 4575 -8668 -1189 -2542 1991 -10240 1166
638 1166 1810 -8673 2107 -5403 6123 -9258 -5 4157 -3614 -4857 2524 5022 -10849 7007
652 7007 -2561 3640 -4194 -2032 10644 -7968 -918 5011 2536 -10164 9322 -1991 -2019 2934
666 2934 -7195 11989 -10154 -1857 8041 -3778 -7640 7821 -2894 -6505 7624 -11929 10275
679 10275 -7149 -5866 11098 -9813 -2493 6514 -4707 -5051 9978 -12607 8861 -1381 -9879
692 -9879 15575 -12515 2045 6838 -7281 1417 7981 -11331 7867 4031 -13349 17882 -11391
705 -11391 1843 8438 -11302 7179 3002 -9516 6641 3997 -14982 15776 -9069 -2643 9807
718 9807 -15386 9805 -2282 -10135 7006 601 -13799 11148 -5852 -7366 11783 -16524 9812
731I812j1847q481K0711j3438n187J7374j0768o028K1007k6077K1611o190j3530
744a1031K5836j9153J367J1577q436m682J6514j9343J2844J873j8989K7749k0444
757d318K363J0549r970M8Q114j0264M330P790k1488K5062j5119k878J3773j3385
771e393N179J712m353q1Q823j7787J7592n764j0988J9547j6083O663N98k973M20
786b888O209j1986R423L780j7927K2539j4844L523N301p953N305J476o305L507
800h40Q083j8789J9791j0011k218J0968j4174J1899m321l341L394M995j3162J3134
814E408m711o675J4921j8398J4954n427n188Q481k486n701O452P08r506J4835
828G667j6124J1543j567q646J2414p943K163j249M220o852P269n551L219J686
$$ plain form
731 9812 -2035 -10516 10195 -3243 -8430 8944 -1824 -7852 13155 -12922 8689 2499 -11031
744 -11031 14805 -4348 -2981 8596 160 -4522 11992 -7351 5493 7366 -11623 16126 -4318
757 -4318 -1955 8594 -1376 -1328 6786 -3478 852 8642 -12846 12216 -2903 -5781 7992 -5393
771 -5393 -214 1498 -2855 -2936 5887 -11900 5692 -72 -11060 8487 -7596 -933 -335 -3308 -2888
786 -2888 3321 -8665 758 4538 -13389 9150 -5694 -2171 3130 -4823 482 1958 -4347 -840
800 -840 7243 -11546 8245 -1766 -3984 6984 -7190 4709 388 -2953 441 5436 -7726 5408
814 5408 697 -5978 8943 -9455 5499 72 -5116 3365 879 -4822 1630 2338 -7168 7667
828 7667 -8457 3086 1519 -7127 5287 -2656 -493 -1742 2478 -4374 2895 -2656 563 2249
842B249q236J1959j0832P833n327K847P23m081M631l548L733n735P707q242O629
857B310l290k243P036r921R539p799N631m012J301J112j684J438l473O674r059
872f440R122q193O203L22r048J3089q749J637J003L184p328Q020m245m57P823
887E943j4376J5515o794k563L975L347o548J336Q076j1725J0007o661M523p40
901C315k236J928J113J9q100J5431j3294L541L327l657J873m188O451n600K171
916B094k939O447r489O053P4p522J2944j6411J3348k577j0798J3554l083j2540
930a0845J6781m621j5821K9067k5851Q230J2988k5344K1993m734j3913J9321n363
943A888j6217K8844k0837O89J8611k6021K2694j0427m759J7068j5666J494J5365
$$ plain form
842 2249 -5987 5972 -4860 2973 -2354 493 1216 -2865 1766 -1782 1951 -3784 3923 -4319 2310
857 2310 -980 -3223 3813 -6108 3431 -4368 1263 -2749 -1448 -336 -2020 -582 -4055 2619 -6440
872 -6440 2682 -5511 692 1014 -8034 5055 -3694 -2057 -1054 2130 -5198 2822 -1423 -1880 5943
887 5943 -8433 7082 288 -2275 1700 5047 -1501 -165 7911 -3814 6193 -468 4055 3315
901 3315 1079 3007 4120 4139 -3961 11470 -1824 1717 5044 1387 3260 -928 5523 -77 2094
916 2094 -845 5602 -3887 2166 2240 -5282 7662 -8749 4599 2022 -8776 4778 1695 -10845
930 -10845 5936 1315 -14506 14561 -11290 -3060 9928 -15416 6577 1843 -12070 7251 1888
943 1888 -14329 14515 -6322 -5633 12978 -13043 9651 -776 -5535 11533 -4133 -2639 12726
956A2726j8734P061J0773k3132K6411j8560Q60K0610l0339J8862N093k1140J6359
969F850K583k0190K4834j7239o30K1257l3595K5229j569j9952K1175o179j0816
982h242J6206j1090k056J6395k6298K2344m789j5634K2540j3446p72P235n079
995b686j106P695j2500J2115l712r343J8191j6027P441M86l017L072k270Q92J813
1010A044r63m257J1388j3393Q619l3n744P917p264O129m203K093j335L299n060
1025a763K366L557p869P613n417M927o403M787J63m933O040n373M868n223L887
1040A227k061J817m065L308K740j0303J2228p808K851o47m98J807k737K134j501
1055a508M334q663R642n346rL317m409N437o696N538k848K352l534L035Kl920
$$ plain form
956 12726 -6008 1053 11826 -11306 15105 -3455 -2595 18015 -12324 6538 11631 -9509 6850
969 6850 9433 -10757 14077 -3162 -3792 17465 -16130 9099 7530 -12422 8753 2574 -8242
982 -8242 7964 -3126 -5182 11213 -15085 7259 2470 -13164 9376 -4070 -4842 2393 -2686
995 -2686 -3792 3903 -8597 3518 -194 -9537 8654 -7373 68 554 -2463 609 -1661 -769 1044
1010 1044 81 -4176 7212 -6181 2438 2405 -3339 4578 -2686 3443 -760 1333 -2 3297 -1763
1025 -1763 603 4160 -3709 3904 -1513 3414 -2989 1798 1961 -2972 3068 -2305 2563 -2660 1227
1040 1227 -834 983 -3082 226 2966 -7337 4891 -2917 -66 -713 -1211 596 -2141 -7 -1508
1055 -1508 2826 -5837 3805 -1541 -1550 1767 -2642 2795 -3901 1637 -1211 1141 -2393 642 644 -3276
1071c276O279o428N965n718M014j376n95J675l060M773p018P189n120K563j179
1086a312l95J741k354L384n918Q228q134M899k00l630N644n186L402j917K737
1101I89n030P255n953Q59N293q728R469p137L297Q64j817m69L058k315j989P541
1117E187j0648J0070n599n31N155o418L939n86k03k624O388q736O811j728n095
1132d618R503j0140N884j254j077m61K909m465K896K173q626J1508r363L540J759
1147A68m195L168p60l47o43M498q898J0465o203j417P418q247N982k783P82n74
1163a586L250o277O976k200n586J1316j0911N577j04k231K149n1k470K797J186
1178A835q028J2210j0405L403L699p214O096l000l63J259J469o893J0029p539
$$ plain form
1071 -3276 3003 -3425 2540 -3178 836 -540 -1135 540 -2520 2253 -4765 2424 -2696 -133 -1312
1086 -1312 -1707 34 -2320 1064 -4854 3374 -4760 139 -61 -3691 1953 -3233 169 -1748 989
1101 989 -4041 3214 -2739 -1880 3413 -5315 4154 -2983 314 1178 -639 -1108 1950 -365 -2354 5187
1117 5187 -5461 4609 -990 -1521 3634 -2784 1155 569 366 -2258 4130 -4606 2205 477 -4618
1132 -4618 4885 -5255 629 -625 -1702 -2163 746 -3719 -823 1350 -7276 4232 -5131 -1591 168
1147 168 -4027 -859 -1619 -1966 -2609 1889 -7009 3456 -2747 -4164 3254 -4993 989 -1794 -1012 -1586
1163 -1586 1664 -4613 2363 163 -5423 5893 -5018 559 455 -1776 373 322 -2148 649 1835
1178 1835 -6193 6017 -4388 -985 2714 -4500 1596 -1404 -1767 -508 961 -5932 4097 -3442
1192c442l12Q146j1772R538m085j598M003j504l173O072m016k957J0289j2970
1206g781R627k551m237P077n168Q57K266j513k752Q066j0442P267L26p537J0973
1221D478q959L417J211k553j19L834n758L684K460r103J1715r263L272K338m783
1236d129L942j253j094P62K390o317Q431o365J060M353p159P612n178K281o00
1251a264J054k257L130j404j906N395p205P023m944J939Q24j891J753k033L047
1266A261l890M251m140L326j974l02K314l892M452n027M949m050J795N94j790
1281b123J882k491L701m488M192l867L233j295j701M477m973M175l111K981k578
1296a986J857n22m39K004l660N749n763M099j120k74J126j302K433k929L860m589
$$ plain form
1192 -3442 -3754 4392 -7380 2158 -1927 -3525 478 -1026 -4199 1873 -2143 -5100 5189 -7781
1206 -7781 1846 -705 -4942 2135 -3033 -2176 90 -1423 -4175 3891 -6551 716 1042 -6495 4478
1221 4478 -4481 -1064 147 -2406 -2525 1309 -4449 -765 1695 -7408 4307 -4956 -1684 654 -4129
1236 -4129 -187 -1440 -2534 -1772 618 -5699 2732 -3633 -2573 1780 -5379 2233 -2945 -664 -1264
1251 -1264 -210 -2467 663 -741 -2647 2748 -4457 2566 -2378 -439 385 -1506 247 -1786 1261
1266 1261 -2629 1622 -2518 808 -1166 -1468 846 -3046 1406 -3621 1328 -2722 -927 -333 -2123
1281 -2123 -241 -2732 969 -3519 673 -3194 39 -1256 -2957 1520 -3453 722 -2389 592 -1986
1296 -1986 -129 -651 -1090 914 -2746 3003 -2760 1339 219 -55 1071 -231 2202 -727 3133 -1456
1312a456M609l316N49K588l757L512k614K716l839M567m346K346Q49m288N890
1327D010n797L439j175J77j453K805k631j23L928o887P479n958K498J955m487
1342b220M028j146r46L92L206o479P663n190M26N599q765Q184k968j959L459k50
1358C034l633N638l255j766P618j0695R121k823l485O059m293O35J871j647j470
1373I09N578p988O899k366l958Q025q215M455n02j481Q64J253l554L094j75m427
1389a589P419p236M549j161j526K789k837K057j368K061k917L975l925K476l23
1404B444k087M370n183M703k901J613r42P07O85k040K632k882K986l103L144k741
1420A405K016n55k596O003p279M978q45k076K068Q2k483K526K89m886Q481q679
$$ plain form
1312 -1456 3153 -163 386 2974 -783 2729 115 2831 -1008 3559 -787 1559 2408 -1880 4010
1327 4010 -1787 1652 477 654 -799 2006 -625 -748 3180 -3707 3772 -2186 312 2267 -2220
1342 -2220 1808 662 -284 108 3314 -3165 4498 -692 -266 5333 -3432 4752 1784 -175 3284 3034
1358 3034 -599 5039 1784 18 7636 -3059 6062 3239 -246 5813 1520 2155 4026 2379 909
1373 909 6487 -1501 5398 3032 -926 7099 -1116 3339 2837 1356 2220 3473 -81 3013 2838 -1589
1389 -1589 5830 -1406 3143 1982 456 3245 408 2465 1097 3158 241 4216 291 2767 2444
1404 2444 357 4727 -456 4247 1346 2959 2017 2724 3409 1369 4001 1119 4105 1002 4146 1405
1420 1405 3421 2866 270 6273 -1006 3972 3127 1051 3119 3201 718 3244 3533 -1353 7128 -1551
1436a551M473J818o052O003k755n79J533J76k916N118n326K623K048o482Q247
1451F378o375K210J713l093J801O32k535K121P61n762Q946p904J939L766o569
1466a971N473k451j022J913m47l387O245n612L63N199q059O334l245J09J523j691
1482g26N88J000j320o43M438o522N614k649j4K356l769M096k839J288l65J628
1498B161l195K926o3k277L656m052M647l691J691M47j357M38k19J631l185L282
1514B840l127K390k013M06J628l863L795l411K334k453J872q26q43R42j379K319
1530F11l973M060l144J004j09j073K177k952K728k044J683k728L456j657j100
1545c061L406l455L131k365K043j212N65k31P31M80k728N053m755K782o50j32
$$ plain form
1436 -1551 2922 4740 -1312 4691 1936 1357 2890 3066 150 5268 -58 2565 4613 -1869 6378
1451 6378 3 2213 3926 833 2634 3266 731 2852 3613 -2149 6797 -1107 832 4598 -1971
1466 -1971 3502 1051 29 1942 1495 -1892 4353 -1259 -896 4303 -3756 2578 -667 -558 965 -726
1482 -726 -138 862 -458 -1101 3337 -3185 2429 -220 -234 2122 -1647 2449 -390 898 533 2161
1498 2161 -1034 1892 1829 -448 3208 -844 3803 112 1803 2250 893 1331 1112 2743 -442 2840
1514 2840 -287 2103 90 496 2124 -1739 2056 -1355 979 -1474 398 -428 -1271 -329 -1708 611
1530 611 -3362 698 -2446 -1442 -1551 -2624 -447 -3399 -671 -2715 -1032 -3760 -304 -1961 -3061
1545 -3061 345 -3110 21 -2344 -301 -1513 -948 -1179 -448 32 -2696 2357 -2398 384 -266 -398
1561c98J069j510J391j047J475k752M447m269J320J882l666L193k450J883j416
1576h48Q04j764K514k404k52L519n476M684k691M47P31j274M08L17o35j322M365
1593A123n861M566j411j920L665l387K278o08j75n12K463l729L039O9l733O017
1609A884n584K935p8j273J346J31j552J459J080m523O254m724J320J478l211L395
1625C37k034L70KR85k683L689k881j80L499m910M392k812J080L21n38m30J287
1642e06l14j779L919m951M027j697l71J726k058J669j224J527k361K967k753J227
1658i52R86k326L086l255K385j659J612j614J058j08j362K733l384L238k527J180
1674i09m69L25J03r01K075k934L491l890K927n34j577K198j906J407j355J817
$$ plain form
1561 -398 671 -839 552 -495 980 -1772 2675 -1594 -274 1608 -2058 1135 -1315 568 -848
1576 -848 -44 -1808 706 -1698 -1950 1569 -3907 777 -1914 -1467 -736 -2010 -1602 -1285 -1920 -3242 1123
1593 1123 -4738 -172 -1583 -3503 162 -3225 -947 -1555 -1730 -2242 221 -3508 -469 -400 -4133 1884
1609 1884 -3700 -765 -843 -2116 -770 -639 -2191 -732 348 -4175 2079 -2645 -1325 153 -3058 337
1625 337 -1697 -1327 -1325 -340 -3023 666 -2215 -2395 1104 -3806 586 -2226 -1146 -825 -1363 -1793 -506
1642 -506 -820 -2599 1320 -3631 396 -1301 -1672 54 -2004 -335 -1559 -32 -2393 574 -2179 -952
1658 -952 34 -2292 794 -2461 -76 -1735 -123 -1737 -679 -787 -2149 584 -2800 438 -2089 -909
1674 -909 -1378 -1053 -950 -1851 224 -2710 781 -3109 -182 -716 -2293 -95 -2001 -594 -1949 -132
1690a32k780L207k320P09J973l571L689k640J182m95N34q97J262m46j362L332
1706A245m304M132k519N44R20j495J414q84J221j812K815l515K787j083r51K913
1722A428l762L628k398J566j314R01m97K48R32k445L455l599L237j757L13R08
1738H44j549J619j780K126k141J645j590J105k5r30J857k872L221k839J914p24
1754a19l79R10j416J338j537K200k689K401j762M93J311k664K697k498K107j698
1770a305J165p57M57l0r99K139k570L194k901J751m27p06J777j602J488j156K067
1787A585k670K484j265j52J730k461K765k329K030j327J058j095L61J252k677
1802g11L017k539J660j038O84o46o7Q85k066K867l940L374j637l11J253j434P24
$$ plain form
1690 -132 -2912 295 -2025 -1316 657 -2914 775 -1865 -683 -1178 -644 -1541 -279 -725 -2087 1245
1706 1245 -3059 1073 -1446 -902 18 -1477 -63 -947 274 -1538 1277 -2238 549 -534 -1485 1428
1722 1428 -2334 1294 -1104 462 -852 49 -448 -200 732 -1713 1742 -1857 1380 -377 -64 844
1738 844 -705 914 -866 1260 -881 764 -826 279 254 -676 1181 -1691 1530 -1309 605 -119
1754 -119 -498 412 -1004 334 -1203 997 -1692 709 -1053 -560 751 -1913 784 -1714 393 -1305
1770 -1305 -140 -897 -440 -470 -1469 670 -1900 1294 -1607 144 -283 -989 788 -814 674 -482 1585
1787 1585 -1085 1399 134 -18 1712 -749 2016 -313 1717 390 1448 353 714 1966 -711
1802 -711 2306 -233 1427 389 1073 427 360 1245 -821 2046 -1894 1480 -157 -468 785 -649 75
1819G5p24J090k130K805k995K250l68k333L688l692K184p58L08m6R38j539J107
1836a40Q77l146N085m637K723J91k041K295j174j5Q19L31k244M606m680J891K144
1853B885m741M951l150Q47M92m66o01J925k666Q94K558n228N195l407M22J372
1869A282k363K194q25n68k1J823l355L743k558l64K554l893M114k761Q68N15m58
1886g3q89J923j023o87K683l755L725k484L99J485j947J725q37P29j237K066k180
1903c77J676n45q01K102k863L049k545J445r30N22P4o95J115j633K049k462K503
1920A684k015O80O88k011K206k311K382j973J345r79Q84m86l88J848k830K924
1936A648k720J882n56l87R12j457J784j670J836k068K046j320M51N61j470K677
$$ plain form
1819 75 -649 441 -1689 1116 -1879 371 3 -2330 1358 -2334 -150 -908 -600 -646 292 -1247 -140
1836 -140 737 -2409 2676 -1961 762 953 -1088 1207 33 18 837 1168 -1076 3530 -1150 741 2885
1853 2885 -1856 3095 -55 792 1284 818 217 2142 -524 370 2928 -2300 2895 -512 -90 1282
1869 1282 -1081 1113 288 -280 -301 1522 -1833 1910 -648 -1012 1542 -2351 1763 -998 -130 385 -73
1886 -73 -962 961 -62 -749 1934 -1821 1904 -580 -181 1304 -643 1082 245 974 -263 1803 -377
1903 -377 1299 754 -47 2055 -808 2241 -304 1141 211 733 807 112 1227 -406 1643 -819 1684
1920 1684 -331 349 1037 -974 1232 -1079 1303 -670 675 -304 580 94 -294 1554 -1276 1648
1936 1648 -1072 810 254 -133 779 -678 1106 -564 1272 -796 1250 -70 381 942 -528 2149
1952B149l059K364j483P85p41L62P41j454J964k461K424k086J337j72p49R69j128
1969b38J487j885J814j799J340n51m91J296j849K033j956J818j820J419l15q99
1985e96J601k171K370j993J552j211Q19m11l84J232k028K638k602K292j352L14
2001G0N18p06J070j402J649k392K391k001J127M24j675K244k161J782j420J448
2017I66j232R61n36m70J770k687K950k583J464m25j56P14j013J247j479K003k365
2034h71K073q95m54J273j657J770j847K003k166J705r48J68O00j722K620k600
2050i48J877j315P58p78L28M98j300J941k511K232j712P52M28j073N81o63J601
2067F96k077K535k365J473k53q47J920k387K048j320J272j480J589q20j30J297
$$ plain form
1952 2149 -910 1454 -29 756 15 377 1118 -336 1628 -833 1591 -495 842 670 -79 890 -238
1969 -238 1249 -636 1178 -621 719 168 -323 973 -876 1157 -799 1019 -801 618 303 -596
1985 -596 1005 -1166 1204 -789 763 -448 371 -40 -424 808 -1220 1418 -1184 1108 -244 70
2001 70 588 -118 952 -450 1199 -1193 1198 -803 324 748 -927 1317 -844 938 -482 966
2017 966 -266 695 159 -311 1459 -1228 1722 -861 603 178 22 736 -277 970 -509 1494 -871
2034 -871 1202 307 -147 1126 -531 1239 -608 1395 -771 934 -14 154 754 -968 1652 -948
2050 -948 929 -386 372 -406 -78 420 -880 1061 -1450 782 -930 -178 250 -823 -242 -905 696
2067 696 -1381 1154 -1211 262 9 -838 1082 -1305 743 -577 695 -785 804 -16 -146 1151
2083A151k277L214k889J704l85k57L18j62K74p60J974l057L312k497L50J452k417
2100i52K037j578J160j267J505k021J587p29r13K462l550L012j898P97J86m68
2116f30o4J04J91j356K746k798K274j250n17K020k369K049j423J332j131J169
2132C47r30P61J80j686K910k959K329j274P65j10k26P02j143J379j848K112j972
2149f63J257l55n34J561k200J883j804J540j321P89l26l69N81j497K099k473K328
2166D96j590L59N35j145J143j545J663j630J718j256Q18l91m41J484j946K555
2182H27k185J587p05K07O76q42R27j295K184k220J972j289N35M04r77J496j789
2199d87J960j868J533j172N97Q3j240J905j984J821j776J314j221L43M27j109
$$ plain form
2083 1151 -1126 2088 -801 903 518 261 579 417 691 -69 1905 -1152 2160 -337 13 1465 -952
2100 -952 1085 -493 667 -600 905 -1116 471 -258 -1171 1291 -2259 753 -1145 -348 -162 -630
2116 -630 -694 -590 -399 -1755 991 -1807 467 -783 -1300 720 -1649 400 -1023 309 -822 347
2132 347 -583 178 358 -1328 1582 -1377 952 -322 443 333 107 809 -334 1045 -803 1309 -663
2149 -663 594 239 -295 1266 -934 949 -855 685 -636 153 -173 -542 39 -1458 641 -1832 496
2166 496 -1094 -735 -200 -1345 -202 -1747 -84 -1714 4 -1252 -434 -825 -1266 218 -1728 827
2182 827 -1358 229 -476 -269 407 -435 492 -803 1381 -839 1133 -156 379 783 -194 1302 -487
2199 -487 1473 -395 1138 -34 563 646 -594 1311 -673 1148 -628 686 -535 -192 235 -874
2215h74J709k285K222j590P57n99R7L41j148J819k274K319j859J365l01o71J290
2232C18j461J628j693J692j446J429j020M78P93j894K403k043J757q88J60j68
2248D5K38L18p07J800k619K644j910P65N96j371J635j550J077j116J510j774J671
2265A252r87n24J733k557K595k074J294n52m42P07o80N23j093J954k655K279j071
2282b98J16P77j309J340j338J048j259J362j061O10R0j027J735j913J867j574
2298h34J174n02r7M47j044J413j334J722j581J248r41N17M56j415J970k314J992
2315H77j444O34K65o58R19j174J574j618J696j847J393l40m23J059k034K122j780
2332g79J250p32N24n06L80J77j282K413k829K237j251kP13r57N20m53R88j744
$$ plain form
2215 -874 835 -1450 772 -818 -61 -660 -563 -222 -1370 449 -1825 494 -1365 0 -301 -972 318
2232 318 -1143 485 -1208 484 -962 467 -553 -75 718 -1176 1227 -816 941 53 213 45
2248 45 283 601 -106 1694 -925 1719 -191 574 1170 -201 1434 -116 961 -155 1355 -419 1252
2265 1252 265 -259 1474 -1083 1512 -562 732 180 -262 445 -235 288 -805 1149 -1506 773 -298
2282 -298 -182 595 -714 626 -712 336 -923 439 -622 -12 78 -949 786 -1127 740 -834
2298 -834 340 -162 -259 188 -856 557 -777 945 -636 612 -329 188 644 -771 1199 -1115 877
2315 877 -567 67 332 -326 593 -581 993 -625 1071 -776 617 277 -146 913 -1121 1001 -779
2332 -779 471 -261 263 -243 137 314 -968 1445 -1384 853 -398 -400 313 -644 -124 -577 411 -1333
2350a333K263k229J234R1j045J811k058J520j072R82j001P63o69l7R02j525K130
2367G27k315J564m45l06P96r21P28r23J333j573J855j364O46L15j493K023k028
2384a381J374p54P23o45M15J77n82J084j872K238j925R14j4l00O30j102J531j420
2402i09J438j584J084p03J41O17j245J849j912J824j308P98k35l50N33j027J636
2419F47j865J512j439J179l49n44J266j387J368j430J181j014N98j93k90R53j531
2436a338J916j875J672q39L08k24j98Q68j421J687j718J603j320O88M14q83J048
2453C88j244J321j525J369q35L66j7m93J310j768J714j040N59n19K62L93p71J056
2471E26j501K013k021J421n50q6Q24n21N26j125J516j708J507p99Q8O44j326J486
$$ plain form
2350 -1333 930 -1299 -65 26 -1019 792 -1266 254 -818 164 -837 -74 -743 -780 122 -1403 727
2367 727 -1588 -24 -469 -775 21 -900 -172 -1095 238 -1335 520 -844 -198 117 -1376 647 -1381
2384 -1381 -7 -761 -38 -683 -268 -91 -673 411 -1461 777 -1148 -234 -248 -548 82 -1020 511 -909
2402 -909 529 -1055 29 -674 -533 84 -1161 688 -1224 600 -708 90 -145 -495 38 -989 647
2419 647 -1218 294 -1145 34 -315 -859 407 -980 388 -1042 139 -875 -277 -470 -760 193 -1338
2436 -1338 578 -1297 375 -464 -156 -380 -578 290 -1131 556 -1162 441 -879 -191 223 -660 388
2453 388 -856 465 -1060 309 -526 -160 -177 -670 640 -1128 586 -454 105 -414 -152 241 -530 526
2471 526 -975 1038 -983 438 -112 -198 626 105 631 -494 1022 -686 821 22 110 754 -572 914
2489I14j339J206r15O67p24M29K92q99J554k244K136j578N75J22o09Q13q19P67
2507C48j081J157j193J026l92k16J138j820J572j152P10o01P31k97M1O71j558
2524i16J984k050J534p90N6M46n77J048r17J135j596J422r77O83J44q11J006j080
2542b56J300j451J261n86J14K8m08Q49j129J690j756J148l94n0M59j058J159j126
2560b06J357j288Q65o59R7M54r19J387j707J606j501J225m68k03M22q69J247j429
2578e89J453j445J215p15k8M31p91J378j609J336r64L07p7q7N66q24J306j353
2596d90J372j275P03o5l40N38r68J259j043J110j027P26l33l22R91j549J740j494
2614d67J211q40O26k36l48P98j204J514j588J530j144N74k3n45J000j148J333
$$ plain form
2489 914 -425 781 -134 533 -191 238 530 -369 1185 -1059 1077 -501 74 196 -413 400 -419 348
2507 348 -733 424 -769 257 -135 -351 787 -1033 539 -613 97 -504 227 -70 -29 642 -916
2524 -916 1068 -982 552 -238 -182 264 -313 735 -182 953 -643 779 -198 485 629 -182 824 -256
2542 -256 1044 -407 854 268 382 410 2 851 -278 1412 -344 804 410 360 819 -239 920 -206
2560 -206 1151 -137 728 69 166 620 -299 1088 -619 987 -514 711 243 40 462 -407 840 -589
2578 -589 864 -581 634 -81 -109 322 -469 909 -700 636 -328 -21 -98 -185 381 -443 863 -490
2596 -490 882 -393 310 245 -95 443 -525 734 -309 801 -226 500 167 -155 836 -713 1027 -467
2614 -467 744 -96 530 294 -54 744 -460 1054 -534 996 -148 426 403 -142 858 -290 1043
2631A043j335J052o48J42K01n73J066j653J774j679J333n77j80O19q01P85j318
2648g49J602j074J129j032J32M46j014J478j561J420j037N82m40k4N17q79J273
2665G69j225J337j483P61j81k53Q50j151J422j498J347j345J120l70P2J57q68
2682e39J382j587J614j068P64k57l40O20p92J350j631J593j259N70K52p60P42
2699F54j104J595j468J368j167M91L5l44Q13j307J565j374R60p79N36j08m62J111
2717A015j541J353j377R77m11o5J77m76P99j190J467j601J367p31p1Q02j026R69
2735D37q19O93j047J050o74L39K80p50J199j711J737j244P41j94R2k8l23R48j532
2754h06J923j699J094m81k41Q19r73R13r43J238j035R90q33J35N68j304J784j857
$$ plain form
2631 1043 -292 760 112 254 455 -118 948 -705 1069 -610 723 146 -34 585 -216 569 -749
2648 -749 853 -221 908 -124 8 454 -560 918 -643 777 -260 322 -118 -142 375 -504 769
2665 769 -456 881 -602 159 -22 -275 575 -576 846 -652 695 -650 470 100 172 329 -539
2682 -539 843 -744 870 -198 566 309 -31 589 -203 1147 -484 1109 -150 420 672 -88 654
2699 654 -450 1145 -323 1045 -122 369 404 60 873 -434 1131 -243 717 -62 474 366 -96 1015
2717 1015 -526 827 -550 427 16 -49 128 -348 451 -739 728 -873 494 -237 -308 494 -532 437
2735 437 -382 311 -736 314 -360 -21 259 -491 708 -1003 734 -510 231 37 129 101 -222 726 -806
2754 -806 1117 -582 512 31 -210 609 -364 549 -394 844 -191 799 -34 101 669 -635 1149 -708
2772g08J239l70M8Q6n96Q60r86J164j461J427j319O76J18q46J315j207J109j217
2790f68Q61o26N91m37j55P65j229J725j536J306q73N23k06m26P86q34Q87j215
2808g61J319p05K17K11q46J056j124J186j229Q40l80J65J70n92Q50j254J562j498
2826h13J223o38J36M27p63Q88j241J185j054R57p94K99K97j059J455j335J318
2843D88r98N60l04j20M68q19J082j197J460j150Q18l88L8M16r80J070j030J084
2861D98q87M97Ql28Q50j544J509j236J151j024P75k56m72Q69j296J440j426J396
2879E24j078M85j97n40J208j179J215j288R31n46L6L08n08P92j048J326j356J227
2897C12o09J06J35m82J087j257J141j122Q19l39k5M05q66J088j302J737j412Q65
$$ plain form
2772 -708 531 161 209 295 -301 559 -427 737 -724 703 -616 60 178 -668 647 -560 549 -668
2790 -668 193 -433 158 -279 -434 331 -898 827 -709 597 -276 247 41 -385 401 -433 454 -761
2808 -761 558 -147 70 281 -565 491 -633 553 -676 164 -216 -51 119 -473 377 -877 685 -813
2826 -813 410 -228 -92 335 -428 460 -781 404 -650 307 -487 -188 109 -950 505 -830 488
2843 488 -510 50 -254 -374 94 -725 357 -840 620 -530 288 -100 -62 354 -626 444 -586 498
2861 498 -389 108 116 -212 638 -906 603 -633 518 -506 269 13 -459 410 -886 554 -872 524
2879 524 -554 -69 -266 -806 402 -777 438 -850 81 -465 -429 -121 -629 163 -885 441 -915 312
2897 312 -297 -191 -56 -538 549 -708 433 -689 130 -209 -234 171 -695 393 -909 828 -584 281
2915B81n58J51M01q91J234j291J210j027Q16k38k07O56j069J375j389J234j124
2932d36N62l23L01J74j030J351j486J542j085P96k17m80O10j032J378j530J342
2949D37j079P77j17l78P28j050J202j080J101r19M58q1m27J005j164J003j188
2966g72J162q90N77J27m51R02j222J407j349R67r08M74J97n79Q01q93J119j280
2984f11J033p92L41N13q86J059j277J041o45O06n85K57j02l46J305j644J559j223
3002c97Q73o36j01N52n78R33j054R38j127J131o23p2M67p00J227j217J069j030
3020c45L16M0J8M58r54J142j342J075p43M36J7k91P32q98R75j234J143j083R95
3039D57n78j43Q75j153J217j060P99o08L88m21p7O19j040R96j027J109p47L73
$$ plain form
2915 281 -277 -126 275 -616 618 -673 537 -490 326 88 -119 537 -532 843 -546 688 -436
2932 -436 126 -197 104 278 -752 599 -887 655 -430 366 149 -331 279 -753 625 -905 437
2949 437 -642 135 18 -360 368 -682 520 -560 541 -378 80 -1 -428 577 -587 416 -772
2966 -772 390 -500 77 204 -247 655 -567 840 -509 458 -450 24 221 -358 443 -450 669 -611
2984 -611 422 -370 -29 484 -402 657 -620 421 -224 382 -203 54 -48 -394 911 -733 826 -397
3002 -397 476 -160 -261 291 -287 646 -408 530 -597 534 -89 -161 306 -394 833 -384 685 -345
3020 -345 -29 11 29 487 -467 675 -667 408 -335 101 118 -173 559 -339 636 -598 545 -538 457
3039 457 -121 -264 611 -542 675 -385 414 -194 194 -227 -304 315 -725 271 -756 353 -394 -21
3057b1P3o54R80j111J075j026J080o52K50l07j01R67j344J299j318J033n43O4
3075b56M09o01R26j143J271j178R80m43J54K70r00J486j695J467r35N50m63L41
3093B40j2m36J128j448J416j119M45l54K41M85o77N88j216J486j225Q01k79l50
3111b86P13r41J157j289J143r17M78Kn68O23r34J142j165J049o75M13j98j25N27
3130A49r72J336j309J326j166M13K55m56R51j039J119j143J133o91J3J51m45Q96
3148E21j004J259j322R28n97N61j27m95J078j156J267j379R19n01P6N27p39Q17
3166F33j036Q77j054R94p16J58M01q28J091j182J129j003O45l58K36M14j132J070
3184C39q72J013j183R67m31j76P22p55O60r99J251j127P00k35k12P59p84R65j443
$$ plain form
3057 -21 52 -602 378 -733 342 -684 396 -256 -6 -313 -414 553 -791 508 -810 223 -320 -256
3075 -256 153 -448 478 -665 606 -572 408 -35 119 389 -511 975 -720 747 -188 362 -101 240
3093 240 228 -208 920 -528 888 -231 214 -140 101 586 -91 497 -719 767 -458 343 64 -286
3111 -286 427 -514 643 -646 497 -420 58 60 -508 115 -819 323 -842 207 -468 -55 -253 -378 149
3130 149 -823 513 -796 530 -636 -223 32 -424 527 -512 607 -536 597 -94 -81 70 -375 521
3148 521 -483 776 -546 382 -215 346 219 -276 802 -354 913 -466 453 -48 28 555 -184 633
3166 633 -403 474 -580 414 -302 -144 257 -571 520 -662 467 -536 109 -249 -13 401 -731 339
3184 339 -533 480 -703 264 -167 -343 379 -376 284 -715 536 -591 109 -126 -338 421 -363 602 -841
3203h41J323p47L95O1m68P07j039J118j061J165j099P40j52m98Q02j168J341j146
3221e67R99r14O24q2j91N03p49J061j254O38l21K00N9k33O95q59J173j017P22
3240D87m93L67K6p94J113j189J372r51M88o27L23O4n57R29q57R84j142J010p89
3259b36J19K67p26R16r16J001r34O75n65N20m6o97R39j118J376j030O40k02l12
3278c29M90p47J085j176J189q19M56j01o1K95n28Q55j107J345j192Q66l67j32
3296B2N89p22J050j134J028q36K91Q8l85O52p29R29j145R40n93L18k1l87Q13j179
3316d11J137j060J023q12L23L5l29P04j079J010j034J072o48L56J6o15O28p45
3334d29Q62p53P86o60M60J15r35R38o73J003r93N60k44K00O9o55R62r81R94o86
$$ plain form
3203 -841 482 -265 130 191 -277 430 -609 509 -552 613 -486 254 102 -396 406 -762 579 -567
3221 -567 432 -482 142 60 -131 372 -377 684 -570 68 -253 -53 6 -227 468 -391 782 -235 487
3240 487 -6 361 387 -407 706 -483 889 -62 426 -201 122 186 -371 558 -299 685 -457 553 -236
3259 -236 -117 150 -576 340 -576 425 -509 166 -399 121 75 -622 317 -801 575 -455 185 -17 -329
3278 -329 161 -586 499 -677 512 -307 149 48 -13 282 -246 609 -498 847 -345 521 154 22
3296 22 611 -111 939 -195 833 -3 288 376 -9 643 -86 843 -302 638 45 363 342 -45 768 -411
3316 -411 726 -334 689 -123 200 235 -94 610 -469 541 -493 579 -69 287 303 -312 316 -429
3334 -429 433 -320 466 -194 266 381 -554 384 -289 714 -279 281 37 237 306 -349 613 -368 626 -60
3354f0N53n34J42L32q89J078j110J281r97O56m94J23N26q70N60o13Q75o87N87
3373D59j68l60P71j044J023r94R62n96M73k67k31N02p08P77j020J114q08M18J21
3392D24o92Q38r03O77o15P79n07K93O0o47Q57r96J046j187J058m70K9J04l58N49
3412C39q03J131j094Q00n08M7J50m85P15r56J257p05L84j71m17N48n16P79j134
3431f39J264j098N98j51n8K07k82M01q92J230r52Q75n70l9M43r73J117j043Q29
3450B67o32Q91n05j64M40o48R04j157J105n79K12Qk13L69p27Q42r63J000o49L04
3470A05j16k83P59j165J123r06Q39n26N4M3j52N24r92R85n64L97m60K17Q5k45
3490b78O14q46Q46p07N48n84K58k14M3O22j092J076r57P64k49kO3n19Q20q42P74
$$ plain form
3354 -60 493 -41 101 433 -456 622 -488 793 -204 452 -42 81 607 -263 297 -316 559 -128 459
3373 459 291 -69 702 -342 681 -313 649 53 526 259 28 530 -178 599 -421 693 -115 303 424
3392 424 -268 570 -333 344 -271 508 1 294 354 -293 564 -432 614 -573 485 15 44 148 -210 339
3412 339 -464 667 -427 373 -135 -88 62 -423 292 -664 593 -112 272 101 -316 232 -284 495 -639
3431 -639 625 -473 125 -26 -84 123 -159 242 -650 580 -372 503 -67 -106 337 -636 481 -562 267
3450 267 -365 526 21 -143 297 -351 553 -604 501 -78 134 142 -71 298 -429 413 -550 450 -199 105
3470 105 -11 -294 465 -700 423 -483 356 -170 -116 -73 -225 299 -693 292 -272 125 -335 -118 -33 -278
3490 -278 336 -510 336 -371 177 -407 -149 -363 -320 302 -790 286 -671 93 -156 -158 -95 -614 206 -636 138
3511A38p89Q99o83M46N0l04N96o84N49n49P05p03L68Q2m92N86l77P79p80K36k26
3532a53K05J27l57N64r11Q63n74K38n1k16N40p68P34q69R39j064Q66m58k33Q22
3552B44r06J168j009Q12p86N26l43j63M97q86R45n22L83k95K21o8l22N85p40J180
3572E21q87P15o03K31k01Q8K07m61Q56j021Q73m29Q0K73m19M58p77J038r46P56
3592C52m28K95j83n99J072r62R53q44N32j64k41M27o04O82p57M65k85J15j9o9
3612b62R8k66Q39p71P64j007P07m02n2N54n11P84r73Q13m70N01l76k03O58p47
3632c22Q70r09J133j104M00m0l53R34j067R95j133R94n62L40q0j21M21o54N76
3651C18o41N69k82P9J00k59J58n23P04o84N85j57P3L0k84L06m46O57q29Q23l96
$$ plain form
3511 138 -651 248 -435 11 61 -243 353 -331 218 -331 374 -329 39 121 -371 215 -162 617 -163 73 -153
3532 -153 52 179 -178 386 -525 338 -236 2 -49 -265 275 -493 241 -628 311 -753 113 -345 -578 244
3552 244 -662 506 -503 309 -477 49 -294 -457 40 -846 99 -423 -40 -335 -114 -182 -504 81 -659 521
3572 521 -366 349 -254 -23 -224 -136 71 -390 466 -555 318 -111 -31 242 -177 281 -496 542 -404 352
3592 352 -76 219 36 -563 509 -453 500 -344 188 24 -217 210 -394 288 -469 -4 -289 -174 -193 -262
3612 -262 -164 -430 409 -362 402 -605 102 -300 -352 202 -309 475 -498 315 -155 346 -30 -233 425 -322
3632 -322 548 -361 772 -332 68 28 -325 609 -458 537 -596 398 -164 176 96 -25 396 -258 318
3651 318 -323 246 -36 43 143 -116 42 -481 223 -461 124 -33 40 70 -214 92 -354 303 -526 297 -99
3672i9P8M0k86N24l65N98o45L74p3j38J05k28P01r09R24o18L96m96J3K52k20M19
3694C47p34P47l36M70l73l79M01n24N92n25P06p38N05j60O8J92m65N08p70Q46
3714C78p59P74n22j41M90p63P05o86P33l42K5k5K0L40p93Q35p10O22m06L49o9
3735E5l89P62q24Q33q46Q74n35J26K5k80N87q33P13r19J114o78K24n4l08P12p95
3756d36Q37p79O05n49M1K87k24M75o29O47o92M55k90K21J59l01M08n21Q30q99
3776c55M66m80J43M13k64L80o26O79o35L72j85p6K31m05N66q40R41o49N28l14
3796a10k74N81n85P42n73P30q15N40k09j26J41m56Q17r32Q25n59L92l62J40L31
3816B38o30Q17r73Q94q36M57l3k46N73m79M35n63O43o81N63j30m67P42n81O85
$$ plain form
3672 -99 -21 19 -267 257 -108 490 -155 219 146 8 113 -115 586 -323 601 -17 379 -117 -104 148 -72 347
3694 347 -387 360 24 494 121 -258 143 -381 211 -314 392 -346 159 -1 67 259 -206 302 -468 378
3714 378 -381 393 -129 -270 220 -543 162 -524 209 -133 -108 -133 -113 227 -566 269 -441 181 -225 124 55
3735 55 -334 428 -396 437 -409 465 -70 56 81 -199 388 -445 268 -651 463 -215 9 -45 -353 359 -436
3756 -436 401 -378 227 -322 -281 6 -218 257 -372 275 -417 38 -252 -31 128 -173 235 -286 544 -355
3776 -355 111 -369 -226 187 -77 303 -323 356 -279 93 -92 -168 63 -342 224 -616 325 -324 204 -110
3796 -110 -384 197 -388 354 -219 511 -304 236 27 -99 42 -414 403 -529 296 -263 129 -233 -93 238
3816 238 -392 425 -548 346 -490 -33 -66 -312 261 -218 217 -346 297 -384 179 49 -418 324 -257 428
3836D28p92O88l85K26j57m7M73n37L86n64N69l68J82k1K4L55p84O17m54M32m01
3857a30M15M7m57L73n16M22k50L96n56L74j22l26R38j070O66o64N98m11N9K49
3877C5k14N79o43N17n54J16J33l6k8l73R51r69P85n08L10k83J17K53m37N09n34
3898b74O72o03K00n3L34J24p60P19l62L38m67M18Q4m58L73l32M16p26Q43n33N19
3919D72J14o89O52q47P64n91L97m33N06O0n84P35p16N56q90R35j74l31J26j42
3939h0K98o54N93l63N27n62M08r9n5K59o88O38o60O80r5k57J60m31O59p08P70
3960C40o06M60l40M29L2m35O16o80R85q29M06k10qL77m92N37o89N68m50L47m37
3981g9K34L16n55O78q25O78n99J34P1oN18o25N56n86M50n49M32q3m1P6m01N07
$$ plain form
3836 428 -364 324 -61 165 8 -39 434 -103 283 -281 288 -80 102 81 105 460 -324 293 -161 271 -130
3857 -130 285 332 -125 248 -268 154 -96 300 -256 118 -4 -330 608 -462 204 -460 138 -273 -214 35
3877 35 -179 400 -243 274 -280 -164 -31 -67 -95 -468 483 -486 299 -209 101 -182 -65 188 -249 260 -274
3898 -274 398 -205 -5 -58 276 400 -360 359 -3 335 -132 286 370 -88 285 -47 369 -357 486 -47 472
3919 472 586 -103 549 -298 466 -125 272 -161 345 405 -179 556 -160 396 -494 441 267 -64 62 -80
3939 -80 218 -436 157 -206 321 -241 167 68 13 272 -416 222 -438 242 147 -110 50 -381 278 -430 340
3960 340 -266 194 -146 283 315 -120 496 -184 801 -28 378 168 160 537 45 582 -107 461 11 358 -79
3981 -79 155 471 -84 594 -231 447 -152 -18 53 47 565 -60 496 -90 360 -189 243 160 119 195 -206 301
4003C01n38O24m50J52O0j22K52l94L39o23P16l84J11K38o93O52p01P91m84M22
4023B69o51L62o3j50N75o72P96o43M41k52J84j53m60Q11o86N66m83M01l39Q1L42
4044B76k99L42n21M98o83O78l14K6L59q07P31n61N84m79L19p8mR0m0K44q81Q10
4066B90m65K26j4j29N11n11P19q02O21o26K26R9m07L00n96Q89p75N99m78N55m40
4087b08j41M32n37P50m23L10m11K57o3l6M12n09L10n13N51l32L2j93K51K98o73
4108d36M02k12O14n15K75j34k2O2m69R32q20J95J09J61q1k29M74o93O89m48M41
4129B95k50j01M6l01R21j022Q12o80M06k13qM40n12N32p40R20q38L64k78K34J67
4150A94n23P92o39O17q75N55p6k62N45n83N17o23N30m05K92k41J1K65l13N59o97
$$ plain form
4003 301 -237 387 -63 89 149 27 279 -115 224 -399 317 -67 44 282 -411 241 -460 331 -153 269
4023 269 -382 -20 -83 -233 342 -330 466 -177 264 12 196 43 -417 394 -292 274 -209 192 -147 -66 276
4044 276 -23 319 -202 296 -387 291 -23 3 362 -445 286 -275 309 -170 149 71 67 157 117 361 -520 290
4066 290 -175 51 37 -92 419 -92 627 -175 446 -180 46 145 -262 38 -558 331 -444 155 -323 232 -208
4087 -208 -349 83 -454 296 -127 183 -228 29 -34 -70 342 -167 143 -370 181 -151 -119 -312 -61 237 -436
4108 -436 -34 -246 368 -147 128 -6 -28 34 -435 497 -323 -128 -19 142 61 -168 306 -387 302 -146 295
4129 295 45 -56 -10 -311 610 -412 400 -280 126 -87 -95 345 -167 365 -375 545 -293 71 -207 27 194
4150 194 -329 463 -176 441 -434 121 45 -217 328 -255 262 -361 169 -236 56 -185 -174 91 -222 337 -360
4171c60O93o05K53k28r9N94p36O28o01P18n96M77l96j20N12p41R20p93N58l48
4191b70K18Kj87M48n56O87n65M97o36N90l5l94M99p24P11l53J80J7k23K23j55
4212b6M17o55O76p03N48P5o36L76k61K20l04M24m31M13m79M12j37l73N08n37P46
4233B73m77K06k05o3M77m67M51n83M86m88M48jl49K98l32P04q38N57j34l7j32
4254b06O6K43n86O33k56J49k71M47o5l18L65q1J46p71Q47m22n2J38l4M32p45M69
4276A28l47L13k07P8J89q1K04n62N66m59O43n28N0K03m20M59m47N84p52O39j75
4297G8k4J37m36N32m64L54l29L48o00M81k22l2N03o41N30k28j73J41k3K00m37
4318c05P46o44Q18o50J81j99k16O56o95P29o84O13o29N89m53N9K07k87M26n28
$$ plain form
4171 -360 333 -272 -19 -247 -346 248 -488 140 -461 257 -339 138 -258 -378 134 -607 313 -480 78 -270
4191 -270 -52 -50 -237 211 -345 342 -223 274 -362 228 193 -201 298 -426 285 -68 112 129 -94 129 -26
4212 -26 391 -264 412 -291 257 332 -304 72 -189 31 -273 151 -280 133 -346 66 -71 -444 64 -473 273
4233 273 -204 2 -203 -266 211 -256 195 -388 98 -390 58 57 -292 6 -326 378 -460 97 -37 -74 -206
4254 -206 -140 103 -483 150 -106 43 -228 219 154 -164 201 120 266 -505 342 -80 -132 6 -28 404 -341 128
4276 128 -219 94 -113 -35 154 73 277 -285 281 -178 465 -63 -13 190 -230 229 -218 366 -386 253 78
4297 78 54 191 -245 287 -177 177 -152 196 -404 77 -145 -177 326 -315 215 -13 -186 -45 -68 132 -305
4318 -305 441 -203 615 -35 146 -53 -269 387 -308 421 -263 350 -279 310 -143 -84 123 -164 262 -266
4338b66M20k76L65m57j32M15k20J99l03M12l16K97o7p8J35k97L25l65K80k48L90
4359B13m4k17J76m44P55o89N35m31N06l12l40N72o04N32m88O25n41L32O6Pj42
4380F7k27L43n18P16m71K61P5l71N47r66P83n30N21l37J73j1m52P72n35Q7k14
4401b87L92j3l3k17K62J66m98N59l80N6j0J53Q9m75N97o39N53n19L90j24j05J95
4423A12l88O56p37N80l60L79l94N8J78m14P35q03P87n94L76l68K05K00n02N91
4443B97k82J70k86K13O2p3K86p01O65n19J94J01R8q3k71L53o61O19l94M52k77
4464c7R6k39K94J09l24M32m58L45l97L32K69n80M61m85M54m64M92m79J44N5n4
4485c4L49m24O19o17L24m62J49M1j88O87p01L70l67M86k94j57K82n3J49l65O11
$$ plain form
4338 -266 154 -122 243 -214 -346 69 -151 48 -255 157 -159 138 71 -7 128 -169 156 -209 71 -177 213
4359 213 169 -48 128 -316 439 -250 285 -146 360 48 -292 280 -324 208 -280 345 -196 136 202 209 67
4380 67 -160 183 -335 381 -90 171 246 -125 422 -544 239 -291 230 -107 66 55 -397 375 -160 -73 -287
4401 -287 105 92 59 -158 104 270 -228 331 -49 7 -3 150 239 -236 361 -278 275 -244 146 22 -83 112
4423 112 -276 380 -357 223 -137 242 -152 -94 84 -330 405 -398 389 -205 171 -197 8 208 -294 297
4443 297 15 185 -101 112 174 101 387 -314 351 -168 26 127 225 142 -129 224 -437 182 -212 240 -37
4464 -37 59 -180 114 223 -101 331 -127 218 -179 153 422 -158 303 -182 272 -192 300 -179 -35 20 -34
4485 -34 315 -109 510 -107 217 -245 -96 -55 -243 444 -257 113 -254 232 -62 -219 63 10 159 -206 405
4506D05n47R7K71l04J45j53L79o38O34m92M74k79J46R7m98K82l67P87m57J35o3
4527E4k88M40k65M05m01L37m61J92k05J02K56k11K47l78M30k51M2n0j76N88n86
4548a79M80n84M04j01P9P8o91N49l63O79n51K94l72L24k64j13M89m91M00m38L17
4569e4Q6o6q5r4L02k26K98l57N73k79q2o4l49O73k65N49n96qR7N4l1l93N32n27
4593c12O14m63J93j62J12K20m40L82k56N14l75J55oj74J37j82M67q04N93o13L02
4614i8NR3R3j35L96m25K55l67K82k25r7N43o02M98l02J61j7J53j34m09M78l21
4636a75L67m87K53K82j07k41O4J87k99M31l94K24m99N01K0k43K04k41K58m12L91
4657H4j24J19K7j69K47o14P99o33N79j47K2m69J75M01n37O99o23J28j13P1K21
$$ plain form
4506 405 -142 -45 226 -78 67 -86 293 -345 289 -203 271 -8 138 235 -263 19 -348 439 -18 117 54
4527 54 -234 206 -59 346 -55 282 -179 13 -192 -90 166 -45 202 -176 254 3 45 -5 -181 407 -179
4548 -179 301 -283 121 20 99 177 -514 35 -328 351 -200 94 -278 46 -218 -331 158 -333 67 -371 -54
4569 -54 32 -34 -119 -213 89 -137 161 -196 377 98 16 -48 -397 276 11 560 -36 -44 53 107 76 -317 215 -312
4593 -312 302 -161 32 -130 -18 202 -238 144 -112 402 27 182 176 2 139 -43 424 -380 213 -400 -98
4614 -98 -93 0 93 -42 354 -71 184 -183 99 -126 -223 320 -282 216 -86 75 58 211 77 -332 146 -175
4636 -175 192 -295 -42 240 133 -108 -44 143 -156 275 -119 105 -394 107 127 -116 88 -153 105 -307 84
4657 84 -40 79 106 -63 184 -430 369 -264 315 168 190 -279 -104 297 -240 459 -164 -36 -149 -78 143
4678A43m06N18k97L20m06L19k84R8k64O4M00l44M32l22Q7j83o2L36l99M95n36
4699b91N03l72K63j08L2J56n20P17q51O45m23J82L34j00m3m80P41p15M35m43L54
4720A6Q3l71L91k67O46p43N16n34K83j21r6L44l84N46l32J62j88J76J36m58O98
4741E03o82L28m54M98n20L48K51m94O44m97L99m24K05M6j97P5k26L46k99L06k91
4762a35K34k20K45N8m83J14l63Q56k85P5l04J30J52rQ4l76O09o34M29k39k56M65
4784A47k84L05l00L79l88K29p6j66L05l89P17o73M98m76N25k61j13N4k43N72l84
4805b2L17o24L00J47j87L72n59N41o65M62l83M39j44k28O69p43M80n65O52k49
4825A0J9j8j36L07l63K90j28K0l9M6J46k66L09l67L97m61M29k72l2L10n88O26
$$ plain form
4678 143 -263 255 -42 278 -128 191 -93 5 -259 -195 205 -139 293 -29 58 -125 -187 149 -250 245 -291
4699 -291 212 -160 103 -5 27 183 -337 380 -471 174 -249 -67 267 167 124 -356 385 -330 105 -338 16
4720 16 99 -272 119 -148 498 -245 271 -263 20 -101 -197 147 -237 309 -23 139 -49 127 263 -195 503
4741 503 -179 149 -305 193 -327 21 272 -222 422 -75 324 -100 105 151 -46 29 -197 149 -150 156 -135
4762 -135 99 -121 124 182 -301 -187 -550 306 21 96 -208 -78 74 65 149 -227 382 -252 177 -62 -318 147
4784 147 -137 168 -132 247 -141 88 12 -154 151 -238 479 -194 304 -172 353 92 -21 33 -210 362 -22
4805 -22 295 -329 -29 118 -69 303 -256 285 -380 82 -301 138 -6 -234 435 -308 172 -393 259 10
4825 10 29 11 -125 182 -181 109 -19 1 -38 8 154 -112 197 -170 227 -234 195 -77 -109 201 -387 239
4847B39o47M42j62L45l04J8o5N2M21q60O36l58L16j76m6K08k82L24l60N20l77
4868a16J02j37J00K28l81M71n98N47l31J19k42k6L89l83M97n80N74l59J36l9j70
4889a99M93l86M10m15J41k39M03j98k46N24l02M55l25J34k99j33K88l10J81j69
4909a92L88n42M72n05J88J50k32M29o47O86n46M73k9J51k91k54M77m47M27l56
4929b00L47l72m3M43n70N27l59L37m00L89j44p2O7q7O45o00J84n19O89j39j90
4950f7Q1j29K74j73J88k90J55j48O0L12n41O12o09O68m98Q1L1j96L52l47M02m38
4972b20N01n36L7K96j83K76m80N74m01K78k76K08k82R4K67n25N40n62P10n52K46
4993A0o1k05L44k10M35n32J88L8J65l32j20L93j10L56n33N01n99K04J46l46M12
$$ plain form
4847 239 -408 34 -128 217 -87 -69 -134 -82 339 -521 115 -243 73 -103 -149 59 -223 101 -259 261 -116
4868 -116 -14 -151 -51 177 -204 267 -331 216 -115 4 -238 -264 125 -258 239 -341 233 -126 10 -29 -199
4889 -199 294 -92 318 -97 44 -195 208 10 -236 288 -14 441 116 250 -49 -182 106 -204 -23 -192
4909 -192 196 -346 126 -379 -191 -41 -273 156 -491 195 -351 122 93 244 -47 -301 176 -271 156 -200
4929 -200 147 -225 -268 175 -395 132 -227 110 -290 99 -45 -117 -50 -137 508 -92 92 -427 262 123 -67
4950 -67 14 -115 159 -14 174 -116 39 -109 -49 263 -278 334 -275 393 -105 -24 7 -189 163 -184 218 -220
4972 -220 281 -255 -218 78 -105 171 -309 265 -136 142 -134 74 -208 -114 153 -372 168 -394 316 -236 10
4993 10 -51 -256 88 -122 313 -219 -31 7 172 -160 -280 113 3 359 -174 327 -272 -68 78 -268 144
5014A44k05L25m11J74K9k09J98j04K30n94P61l61K04N8m93L02jj4l72L51k33L37
5036A16j05j08K97k59L27p88O28k09L5Oj90N76p21P17o10N85n88Q0L03k14K05
5057H3m52N64n22M23k22K48l23J53J90l07K89m01L90l41M89j67j99M09o84M47
$$ plain form
5014 144 -61 264 -147 27 56 -153 45 -59 171 -423 338 -23 181 239 -254 48 47 33 -339 12 -221 116
5036 116 11 -97 200 -59 268 -520 108 -101 -66 -60 -250 326 -395 322 -288 297 -291 -211 92 -122 83
5057 83 -369 195 -327 96 -126 122 -201 -48 142 -165 124 -277 113 -228 261 94 -105 304 -380 67
$$ [...]
8191e7
##END NTUPLES=NMR FID
##END=
