##TITLE=1H_Roal
 , 8 sc, 
 9.04.2021
##JCAMPDX= 6.0         $$ Bruker NMR JCAMP-DX V2.0
##DATA TYPE= NMR FID
##DATA CLASS= NTUPLES
##ORIGIN= UXNMR, Bruker Analytische Messtechnik GmbH
##OWNER= root
$$ XWIN-NMR		Version 3.5
$$ Fri Apr  9 16:40:09 2021 Russian Standard Time (UT+4h)  she@DPX200
##.OBSERVE FREQUENCY= 200.131506
##.OBSERVE NUCLEUS= ^1H
##.DELAY= (6, 6)
##.ACQUISITION MODE= SIMULTANEOUS
##.ACQUISITION SCHEME= undefined
##.AVERAGES= 8
##.DIGITISER RES= 18
##SPECTROMETER/DATA SYSTEM= spect
##.PULSE SEQUENCE= zg30
##.SOLVENT NAME= CDCl3
##.SHIFT REFERENCE= (INTERNAL, CDCl3, 0, 15.7039)
##AUDIT TRAIL= $$ (NUMBER, WHEN, WHO, WHERE, WHAT)
$$ ##TITLE= Audit trail, XWIN-NMR		Version 3.5
$$ ##JCAMPDX= 5.01
$$ ##ORIGIN= Bruker BioSpin GmbH
$$ ##OWNER= she
$$ F:/spectra/data/she/nmr/H-F/1/audita.txt
$$ ##AUDIT TRAIL=  $$ (NUMBER, WHEN, WHO, WHERE, WHAT)
(   1,<2021-04-09 15:39:23.62 +0400>,<she>,<DPX200>,
      <created by zg, POWCHK disabled, PULCHK disabled
       configuration hash MD5:
       00 E9 B6 7A A2 85 ED C7 34 08 36 98 17 FE 4E 26
       data hash MD5: 16K
       20 18 B5 1C 1A 5A 28 A8 D9 3D 4B AB 3D 72 AC 83>)
$$ ##END=
$$ 
$$ hash MD5
$$ 0A 2A 81 CF C3 FE F8 92 9E 74 CC 14 CC 7A BE 90
##$RELAX= 
##$RELAX= 
##$RELAX= 
##$RELAX= 
##$RELAX= 
##$RELAX= 
$$ Bruker specific parameters
$$ --------------------------
##$DU= <F:/spectra>
##$EXPNO= 1
##$NAME= <H-F>
##$PROCNO= 1
##$TYPE= <nmr>
##$USER= <she>
##$AMP= (0..31)
100 100 100 100 100 100 100 100 100 100 100 100 100 100 100 100 100 100 
100 100 100 100 100 100 100 100 100 100 100 100 100 100 
##$AQSEQ= 0
##$AQ_mod= 1
##$AUNM= <au_zg>
##$AUTOPOS= <>
##$BF1= 200.13
##$BF2= 200.13
##$BF3= 200.13
##$BF4= 200.13
##$BF5= 200.13
##$BF6= 200.13
##$BF7= 200.13
##$BF8= 200.13
##$BYTORDA= 1
##$CFDGTYP= 0
##$CFRGTYP= 5
##$CHEMSTR= <none>
##$CNST= (0..31)
1 1 145 1 1 1 1 1 1 1 1 1 1 1 1 1 1 1 1 1 1 1 1 1 1 1 1 1 1 1 1 1 
##$CPDPRG= <>
##$CPDPRG1= <>
##$CPDPRG2= <>
##$CPDPRG3= <>
##$CPDPRG4= <mlev>
##$CPDPRG5= <mlev>
##$CPDPRG6= <mlev>
##$CPDPRG7= <mlev>
##$CPDPRG8= <mlev>
##$CPDPRGB= <>
##$CPDPRGT= <>
##$D= (0..31)
0 1.2 0 0 0 0 0 0 0 0.06 0 0.03 0 0 0 0 0.0002 0 0 0 0 0 0 0 0 0 0 0 0 
0 0 0 
##$DATE= 1617968363
##$DBL= (0..7)
120 120 120 120 120 120 120 120 
##$DBP= (0..7)
150 150 150 150 150 150 150 150 
##$DBP07= 0
##$DBPNAM0= <>
##$DBPNAM1= <>
##$DBPNAM2= <>
##$DBPNAM3= <>
##$DBPNAM4= <>
##$DBPNAM5= <>
##$DBPNAM6= <>
##$DBPNAM7= <>
##$DBPOAL= (0..7)
0.5 0.5 0.5 0.5 0.5 0.5 0.5 0.5 
##$DBPOFFS= (0..7)
0 0 0 0 0 0 0 0 
##$DE= 6
##$DECBNUC= <off>
##$DECIM= 32
##$DECNUC= <off>
##$DECSTAT= 4
##$DIGMOD= 1
##$DIGTYP= 9
##$DL= (0..7)
0 120 120 120 120 120 120 120 
##$DP= (0..7)
150 150 150 150 150 150 150 150 
##$DP07= 0
##$DPNAME0= <>
##$DPNAME1= <>
##$DPNAME2= <>
##$DPNAME3= <>
##$DPNAME4= <>
##$DPNAME5= <>
##$DPNAME6= <>
##$DPNAME7= <>
##$DPOAL= (0..7)
0.5 0.5 0.5 0.5 0.5 0.5 0.5 0.5 
##$DPOFFS= (0..7)
0 0 0 0 0 0 0 0 
##$DQDMODE= 0
##$DR= 18
##$DS= 0
##$DSLIST= <SSSSSSSSSSSSSSS>
##$DSPFIRM= 0
$$ [...]
##$SUBNAM2= <"">
##$SUBNAM3= <"">
##$SUBNAM4= <"">
##$SUBNAM5= <"">
##$SUBNAM6= <"">
##$SUBNAM7= <"">
##$SUBNAM8= <"">
##$SUBNAM9= <"">
##$SW= 16.9725357007746
##$SWIBOX= (0..15)
0 0 2 0 0 0 0 0 0 0 0 0 0 0 0 0 
##$SW_h= 3396.73913043478
##$TD= 16384
##$TD0= 1
##$TE= 0
##$TE2= 300
##$TE3= 300
##$TEG= 300
##$TL= (0..7)
0 120 120 120 120 120 120 120 
##$TP= (0..7)
150 150 150 150 150 150 150 150 
##$TP07= 0
##$TPNAME0= <>
##$TPNAME1= <>
##$TPNAME2= <>
##$TPNAME3= <>
##$TPNAME4= <>
##$TPNAME5= <>
##$TPNAME6= <>
##$TPNAME7= <>
##$TPOAL= (0..7)
0.5 0.5 0.5 0.5 0.5 0.5 0.5 0.5 
##$TPOFFS= (0..7)
0 0 0 0 0 0 0 0 
##$TUNHIN= 0
##$TUNHOUT= 0
##$TUNXOUT= 0
##$USERA1= <user>
##$USERA2= <user>
##$USERA3= <user>
##$USERA4= <user>
##$USERA5= <user>
##$V9= 5
##$VALIST= <valist>
##$VCLIST= <CCCCCCCCCCCCCCC>
##$VD= 0
##$VDLIST= <DDDDDDDDDDDDDDD>
##$VPLIST= <PPPPPPPPPPPPPPP>
##$VTLIST= <TTTTTTTTTTTTTTT>
##$WBST= 1024
##$WBSW= 4
##$XGAIN= (0..3)
0 0 0 0 
##$XL= 0
##$YL= 0
##$YMAX_a= 281635
##$YMIN_a= -255714
##$ZGOPTNS= <>
##$ZL1= 120
##$ZL2= 120
##$ZL3= 120
##$ZL4= 120
##$ABSF1= 10
##$ABSF2= 0
##$ABSG= 5
##$ABSL= 3
##$ALPHA= 0
##$AQORDER= 0
##$ASSFAC= 0
##$ASSFACI= 0
##$ASSFACX= 0
##$ASSWID= 0
##$AUNMP= <proc_1d>
##$AZFE= 0.1
##$AZFW= 0.1
##$BCFW= 1
##$BC_mod= 2
##$BYTORDP= 1
##$COROFFS= 0
##$CY= 11.3945322036743
##$DATMOD= 1
##$DC= 2
##$DFILT= <>
##$DTYPP= 0
##$F1P= 15.9154993809931
##$F2P= -4.1035820241983
##$FCOR= 0.5
##$FTSIZE= 0
##$FT_mod= 4
##$GAMMA= 1
##$GB= 0.15
##$INTBC= 1
##$INTSCL= 1
##$ISEN= 128
##$LB= 0.24
##$LEV0= 0
##$LPBIN= 0
##$MAXI= 10000
##$MC2= 0
##$MEAN= 0
##$ME_mod= 0
##$MI= 1.114404
##$NCOEF= 0
##$NC_proc= 0
##$NLEV= 6
##$NOISF1= 3.799351
##$NOISF2= 2.8
##$NSP= 1
##$NTH_PI= 0
##$NZP= 0
##$OFFSET= 15.70392
##$PC= 1
##$PHC0= -11197.23
##$PHC1= 7.600952
##$PH_mod= 1
##$PKNL= yes
##$PPARMOD= 0
##$PSCAL= 0
##$PSIGN= 0
##$REVERSE= no
##$SF= 200.130013532006
##$SI= 16384
##$SIGF1= 3
##$SIGF2= 2
##$SINO= 400
##$SIOLD= 16384
##$SREGLST= <1H.CDCl3>
##$SSB= 0
##$STSI= 0
##$STSR= 0
##$SW_p= 3612.71676300578
##$SYMM= 0
##$S_DEV= 0
##$TDeff= 0
##$TDoff= 0
##$TI= <>
##$TILT= no
##$TM1= 0
##$TM2= 0
##$TOPLEV= 0
##$USERP1= <user>
##$USERP2= <user>
##$USERP3= <user>
##$USERP4= <user>
##$USERP5= <user>
##$WDW= 1
##$XDIM= 8192
##$YMAX_p= 0
##$YMIN_p= 0
$$ End of Bruker specific parameters
$$ ---------------------------------
##NTUPLES= NMR FID
##VAR_NAME=  TIME,          FID/REAL,        FID/IMAG
##SYMBOL=    X,             R,               I
##VAR_TYPE=  INDEPENDENT,   DEPENDENT,       DEPENDENT
##VAR_FORM=  AFFN,          ASDF,            ASDF
##VAR_DIM=   8192,          8192,            8192
##UNITS=     SECONDS,       ARBITRARY UNITS, ARBITRARY UNITS
##FACTOR=    0.0002944,     1,               1
##FIRST=     0,             0,               0
##LAST=      2.4114304,     0,               0
##MIN=       0,             -255714,         0
##MAX=       2.4114304,     281635,          0
$$ Real data points
##PAGE= N=1
##DATA TABLE= (X++(R..R)), XYDATA
0@%%%%%%%%%%%Kj0J6k0K8m0N0o2Q2j02J27j57J90k30K79l33L93m65N46o36P38
32C96q54R83j127J287j464J661j878K118k381K671k988L333l712M126m577N069
48B663n606O193o832P529q293R128j0044J1054j2173J3416j4805J6369j8147K0190
62A0642k2566K5381k8792L3059l8653M6583n9896J25845l09101K39073l8997J40224
74A22802k55723K61253k27038K7772K59455k65740O1713p5049K92749m26250M55036
85B30980l77936J42426l2242K48994l71474Q9523K01668j99716J45134j57826
95h0469J34879k09741M22430m27976J59456j4053J04216j68756J28107j6108k02443
106a70458L39794j88859L1652j77721L67939l22413K12884j49573K7867K6105
$$ plain form
0 0 0 0 0 0 0 0 0 0 0 0 0 2 -8 8 -12 16 -24 26 -36 46 -56 71 -86 104 -126 153 -180 213 -252 294 -342 396
32 396 -458 525 -602 685 -779 882 -996 1122 -1259 1412 -1576 1757 -1955 2171 -2406 2663
48 2663 -2943 3250 -3582 3947 -4346 4782 -5262 5792 -6381 7035 -7770 8599 -9548 10642
62 10642 -11924 13457 -15335 17724 -20929 25654 -34242 91603 -217498 21575 -17422 122802
74 122802 -132921 128332 -98706 -70934 188521 -77219 -15506 -90555 202194 -224056 230980
85 230980 -146956 -4530 -36772 212222 -159252 -69729 131939 -67777 77357 -80469
95 -80469 54410 -155331 267099 -160877 -1421 -15474 88742 -80014 48093 31985 -170458
106 -170458 169336 -19523 12129 -165592 202347 -120066 92818 -56755 -28888 -2783
116b783J03489j22407j27760L10055k36895J36715j31999J63179k51604L12835
126A52825j65459m1030K9922O7835j7334p7319J23561k22610K78431j38886L0480
137B0416j60811K76474j66371K1202K0997m2582L6267L779O5930k14871K24679
148H5109j24721J01748j16883R6396j26016J48382j0202j33519O9001K8160N0555
159F8010j57527J56697j45579J37573o7891L8472j04914J10778j2743m8315N9435
170C3996q3852O5959k7271R8601j94375J30970j9232M1337q9300M3224p182J1671
182D546M4796j05562O5850k5299P2307j09908R2828q0431N1519L444Q521n9023
194c6412J2016P5228o2233K4207o1282P7778l4553M6049r3418N4555J4009k385
$$ plain form
116 -2783 100706 -21701 -149461 160594 -76301 60414 -71585 91594 -160010 152825
126 152825 -12634 -53664 -23742 44093 26759 -50560 73001 -149609 128822 -10064 20416
137 20416 -140395 136079 -30292 -9090 11907 -30675 5592 9371 75301 -139570 85109
148 85109 -39612 62136 -54747 41649 -84367 64015 53813 -79706 -10705 17455 68010
159 68010 -89517 67180 -78399 59174 -8717 29755 -75159 35619 22876 -25439 33996
170 33996 -49856 16103 -11168 87433 -106942 24028 4796 46133 -43167 57 -7125 4546
182 4546 49342 -56220 9630 -15669 56638 -53270 39558 -40873 10646 14090 22611 -36412
194 -36412 -24396 50832 -11401 12806 -48476 29302 -5251 40798 -52620 1935 15944 13559
206A3559k5011j08K2791l1501N9184n8095J8521k7238O8285m5567N027k5326K9887
219D408K3778l0584j5519l001O1288m9059R312k2732L9414k2047J7979k1190j974
232i927J1166N292Q459l2690J2421m57L6976m0578o415N965L5512k0796k1035
245a6107Q386J4267P191k1715N757m804J4738p286O387j4839K3J1568J0821j4922
259e35j7942J7439J6673p196k5493Q620J9635K4j9443q80J2736J927n325j447
273a207j348m90M828O695j0141p891N748J7374q110j7976L613K0156j49k1693
287a0591K772J1428O504j4935K029J065N022l943K792j249o748M520O905K155
301G726j9345O762J1339M781k0963J737J2838M132j1999n392J1601K08k442n620
$$ plain form
206 13559 -11452 -11560 11231 -20270 38914 -19181 -660 -27898 40387 -5180 -153 -25479 4408
219 4408 28186 -2398 -17917 -20918 40370 -8689 623 -22109 17305 -4742 13237 -7953 -9927
232 -9927 1239 6531 14990 -17700 -5279 -5736 31240 -9338 -15753 -9788 25724 4928 -16107
245 -16107 -7721 6546 13737 -7978 -2221 -7025 7713 427 6814 -8025 -8002 3566 14387 -535
259 -535 -18477 -1038 15635 8439 -17054 -8434 11201 11225 -8218 -9098 3638 5565 240 -1207
273 -1207 -2555 -3045 1783 8478 -1663 -9554 -3806 13568 5458 -12518 -8905 11251 11102 -10591
287 -10591 -7819 3609 10113 -4822 -2793 -1728 3294 -649 2143 894 -5854 -1334 5571 7726
301 7726 -11619 -4857 6482 11263 -9700 -7963 4875 9007 -2992 -8384 3217 3425 983 -4637
315d637Q125n645J011K859L297r895j289J2044Q63j0979n121J4469K785j0300
329b413o054J0395N262q915l032N758K548n907J099N178n539j699L421P652j1962
344d208o06N013Q549j0780n663R320M077l644j2129J4941l944K137j1186J4444
358F321p416J3o09M898n69j1015J2931n342Q887k2084K0398o408O868j8545J4389
373B717K831p887J466m008J6381k2670J9397j7721K2804k5514J7724q302R459
386F677j1954o06J8030j8955J1837j9549L5040l5302K4663k2918K7055k1064P827
399G81j321j48R146k4900L2813k8716K7455l7997M5254l4749J9572j7493J8702
412H399o088j1648J8348k1195L2918m4434M2862l6956M0154m5039L6267j7507
$$ plain form
315 -4637 3488 -2157 -1146 1713 5010 -4885 -6174 5870 6733 -4246 -9367 5102 7887 -2413
329 -2413 -8467 1928 7190 -1725 -4757 1001 3549 -2358 -1259 3919 -1620 -3319 102 7754 -4208
344 -4208 -4814 199 8748 -2032 -7695 1625 5702 2058 -10071 4870 926 3063 -8123 6321
358 6321 -1095 -1082 -1691 3207 2638 -8377 4554 -788 8099 -13985 6413 5 6873 -11672 2717
373 2717 5548 -2339 -873 -4881 11500 -11170 8227 -9494 13310 -12204 5520 -2782 6677
386 6677 -5277 -5883 12147 -6808 5029 -14520 20520 -14782 9881 -13037 14018 -7046 781
399 781 -540 -688 8458 -16442 16371 -12345 15110 -22887 22367 -12382 7190 -10303 8399
412 8399 2311 -9337 9011 -12184 20734 -23700 19162 -17794 22360 -22679 13588 -3919
424c919O021m631k313K1496l7901M0502m0972M9808n5359M7459l8329L7504l1736
437a2370J1833P234j3301J8408l4930N2939n7765N3413n3338N7312n2614L6760
449A3581k2699J5484k836j9497L5970l9949M6843o2520O9736o1043N2540n2011
461b6401M5701k6466O491N059j5302L2675n1903O1184o0605O2403o8740O5716
473B9812m9687L6013k8948J3459J1354k7276L3184m6658O6905p4867O8123o2251
485c0837O2606n9281M4655k2803L934Q883k3589M2814n6560O2951p2829Q2113
497D2057p3958N5555m9807N0643l3499K032K0291l0237M0554n4712O8463p8214
509d0832P9939p3479O3133m9916L5967k6794J4811J3837m5743N4137m8339N8372
$$ plain form
424 -3919 2102 -2529 -4842 16654 -21247 19255 -21717 28091 -27268 20191 -18138 19366 -12370
437 -12370 -537 6697 -6604 11804 -23126 29813 -27952 25461 -27877 29435 -23179 13581
449 13581 -9118 6366 3530 -15967 20003 -19946 26897 -35623 34113 -26930 25610 -26401
461 -26401 19300 -7166 -675 4384 -10918 21757 -30146 31038 -29567 32836 -35904 29812
473 29812 -19875 16138 -12810 649 12003 -15273 17911 -28747 38158 -36709 31414 -30837
485 -30837 31769 -27512 17143 -5660 -1726 7157 -16432 26382 -30178 32773 -40056 42057
497 42057 -31901 23654 -26153 24490 -9009 -6977 13314 -16923 23631 -31081 37382 -40832
509 -40832 39107 -34372 28761 -21155 14812 -11982 2829 16666 -29077 25060 -23279 35093
521C5093p9312Q4228p2758O0160m6805L1387k0489R778J1469l8329N7698o4722
533c2602O1876o0546P2940q5021O9754l6946K0800k0047P996J4998l4317N3544
545C2429p1466P1797o0407O1845p3818P2556n1651K2833n13n005M688k4292N8913
558C7909p4965O8278o3780O4195n9150N7218n7024L5000K939k0304J5068j9765
570a4381M2931o6287P7144p0365N2017m4728N3403n1212K7954m177j3209L0108
582A9198l5334K9883m3310P3967p9382N3554l5786L8278l9487L0687j2794j5047
594a5573L6416l5948L1804m2846N6822o3097O4424n1039K3848j5111K9468k3965
606d797j1992L7273l7592L7073m1006M2825n1696O1741n0174K5404j4001J2965
$$ plain form
521 35093 -44219 40009 -32749 27411 -19394 11993 -8496 1282 12751 -25578 32120 -32602
533 -32602 29274 -31272 41668 -43353 26401 -10545 10255 -9792 -1796 13202 -21115 32429
545 32429 -39037 32760 -27647 34198 -39620 32936 -18715 4118 3605 -1400 3288 -21004 37909
558 37909 -37056 31222 -32558 31637 -27513 29705 -27319 7681 10620 -9684 5384 -14381
570 -14381 28550 -37737 39407 -30958 21059 -23669 29734 -21478 6476 2299 -10910 19198
582 19198 -16136 13747 -29563 44404 -34978 18576 -17210 21068 -18419 12268 -526 -15573
594 -15573 20843 -15105 16699 -26147 30675 -32422 32002 -19037 4811 -10300 19168 -4797
606 -4797 -16789 20484 -17108 19965 -21041 21784 -29912 31829 -18345 7059 -6942 6023
618F023q175M08J5959m2663N1832l3442K5949m5089N4151l9303K6337j8055K447
631c621N056J016P183l2618M4386l7802L1871k8834K9056l7839L6672j1427q167
644e068K068N80J4694k3697K5267l6688M0892k3510J4580k7763L1193j4118J28
657a442O210j2326J1049r041K3144l6560K8159j8302K2444j9996R660j2610J4487
670D876N741k0901J0205l996J7674k5163K0603k0368J7932p762P087j3047N082
683b037O603n650P675j7061J2654l697J4794k5324J1057J236P305r922j334L207
697d94J5Q295j3253N821n367J2032q827N122j0093N840N779q14q473k563J3086
712F106l080j651r485R398J263K204r307J713L767J978j190m132k6J224O802m248
$$ plain form
618 6023 -2152 -1744 14215 -28448 23384 -10058 15891 -29198 24953 -14350 11987 -6068 -3621
631 -3621 1435 2451 9634 -22984 21402 -16400 15471 -13363 15693 -22146 14526 3099 -5068
644 -5068 -3000 -2420 12274 -11423 13844 -22844 18048 -5462 9118 -18645 12548 -1570 -1442
657 -1442 4768 -7558 3491 -5550 17594 -18966 9193 -9109 13335 -6661 2999 -9611 4876
670 4876 10617 -10284 -79 -4075 13599 -11564 9039 -11329 6603 -1159 5928 -7119 -2037
683 -2037 4566 -1084 6591 -10470 2184 -1513 13281 -12043 -986 250 7555 -2367 -3701 -494
697 -494 -479 7816 -5437 384 -4983 7049 -1778 3344 -6749 -909 4870 4056 -4417 -6980 6106
712 6106 3026 1375 -8110 1288 2551 4755 -4552 -2839 928 2906 1716 -2416 -2442 -1218 5584 1336
728A336n319o09Q591J320p097m465O056O163l939o938K145M903K018n127j389
743b351j76M829O10k471m095N89P310o95m587o434R896K138k054r187M973M947
759C242O90n408l344N980L16K240p230K863k393Q148l561l151l775O962M511o931
775h41l061j81J0931n647j904n866R956j022q32m796J359L359J30J289p638L908
791h56M63P063r209o53L98Q507l074o681N73M803M433q215O06r70O957l649K49
808G45m260K805K712O71l124m355N306K710J92q563K611M795K585o794k071M159
824A24K977j344m179O07J851K507j451k716p10K216L893k744m398K87O436N64
840C920o659n93L216M866n254j028j742O205j371j626j929Q20K784r51K056q056
$$ plain form
728 1336 -3983 -4592 3999 5319 -1778 -6243 -187 5976 2037 -4901 -2756 2147 4165 -962 -2351
743 -2351 -2527 2302 2912 441 -3654 -3065 4245 3550 -1037 -7471 2425 4563 2509 -6678 -1705 3242
759 3242 3932 -1476 -4820 1160 1476 3716 -3514 -651 -3044 5104 1543 -1608 -5383 1579 6090 -841
775 -841 -3902 -4083 6848 1201 -703 -6569 3387 2365 1533 -3263 -1904 1455 1585 2874 -4764 -856
791 -856 -393 6670 -2539 -3192 -2794 5713 2639 -4042 -3469 1334 5767 -2448 -1842 -2812 4145 496 745
808 745 -3515 -710 2002 2673 -451 -4806 500 3210 3402 -5161 -2550 2245 4830 -1964 -4035 124
824 124 3101 1757 -2422 -1815 36 2543 1092 -1624 -2334 -118 3775 1031 -3367 -3080 3356 3920
840 3920 -2739 -3332 -116 4750 -504 -1532 -3274 2931 1560 -66 -1995 -1175 1609 658 2714 -5342
856e342N771L55M617j0503L883J170L911l232m754L984M65N416j1783Q227n379
871c194P882p394O015p729L962M247l887Pn549J1756r335R714j5390J2127m001
886g69O741j2086N462L840n315O010q728Q909j1390J8023j7999J1174r396J0485
900D961o424L449l658l959J5319j4332P567j2077K1123k0886J6260j3424Q568
913B487m409N563l671o175J4253j6259J7548j7309J5450j9911K6526k0303O209
926ak377N934k396o160J2614j9555K4866k1818J7127k0546K5664k3125J4965n225
940c3k915L727j408R335k4528K9810k4443K1562k2462K1794k1713K0231r420n017
954e480R541o914R750j9415K9036l3277K8679j9596J7664k2776K1176r444k153
$$ plain form
856 -5342 429 784 5401 -5102 -1219 -49 3862 630 -4124 -140 325 5741 -6042 2185 -3194
871 -3194 4688 -2706 3309 -4420 -458 3789 -98 -91 -5640 6116 -3219 6495 -8895 3232 -769
886 -769 5972 -6114 -652 3188 -2127 3883 -4845 4064 -7326 10697 -7302 3872 -5524 4961
900 4961 -1463 1986 -1672 -5631 9688 -4644 2923 -9154 11969 -8917 7343 -6081 2487
913 2487 -1922 3641 -30 -6205 8048 -8211 9337 -7972 7478 -12433 14093 -6210 -1
926 -1 -2378 3556 1160 -5000 7614 -11941 12925 -8893 8234 -12312 13352 -9773 5192 -33
940 -33 -2948 779 -629 8706 -15822 13988 -10455 11107 -11355 10439 -11274 8957 -463 -5480
954 -5480 4061 -2853 6897 -12518 16518 -16759 11920 -7676 9988 -12788 8388 -1056 -3209
967c209R549j4889J6130j6096K4046l5835L6209k5105J7078j7235J8392j4270
979e235K925J1796k0078J9075j8613K4841l2189L5421l3413K4513j3341J0506
991F208j3764Q055Q699k2112K4850k3280K3928k8292L4347l5379K7041j5448Q738
1004C591o386L474L524j6097K8768l1298K4945k3353L0385l4368K8244j7489Q069
1017B009j687j254M323j3042K5163l2210L1132k6542K4407k7044K9416k2974Q615
1030C12K083m205N861j3040K2220k9366L3000l1092K5380k2604K4197k2774J3504
1043C476p48q335J1293j2347J7889k7495L3108l0760K5741k2633K0158j7020J2757
1056E084m696o815J4906j6161J6667k1979K8746l0673K6511k0097J5831j3984
$$ plain form
967 -3209 6340 -8549 7581 -8515 15531 -20304 15905 -9200 7878 -9357 9035 -5235
979 -5235 -2310 9486 -10592 8483 -10130 14711 -17478 17943 -15470 9043 -4298 6208
991 6208 -7556 499 9198 -12914 11936 -11344 12584 -15708 18639 -16740 10301 -5147 3591
1004 3591 -2795 679 4203 -11894 16874 -14424 10521 -12832 17553 -16815 11429 -6060 2009
1017 2009 322 -932 3391 -9651 15512 -16698 14434 -12108 12299 -14745 14671 -8303 312
1030 312 2395 -1810 4051 -8989 13231 -16135 16865 -14227 11153 -11451 12746 -10028 3476
1043 3476 2728 -5607 5686 -6661 11228 -16267 16841 -13919 11822 -10811 9347 -7673 5084
1056 5084 388 -6427 8479 -7682 8985 -12994 15752 -14921 11590 -8507 7324 -6660
1068f660J0535l179n387J2311j7338J9914k0307K2070k6241K7085k1023J3420
1080E200r886Q092l362m165J1453j6476J8987k0190K1367k2303K2222k0466J5857
1093F330q968L640j462j861R161j6054J8276j8255J9297k0220J9195j6879J3701
1106E901r092L719R05m339P506j1665J6224j8284J6857j5295J5711j4950J0748
1119C946o045L035L39m898Q286j0039J2191j4677J5352j3882J1886j0460R047
1132D081o110J651J953l687N896r460J1537j1145J1183j2220J1235q153N989m826
1146b076K312J305l942N409o854Q576r886R783q445P605p478N777k346K76J36
1161A52j968N041o155N713o460P567o708M951m217L765k386L38J495k289K327
$$ plain form
1068 -6660 3875 696 -4691 7620 -9718 10196 -10111 11959 -14282 12803 -8220 5200
1080 5200 -4686 3406 44 -4121 7332 -9144 9843 -10347 11020 -11283 10939 -9527 6330
1093 6330 -2638 1002 -460 -2321 6840 -9214 9062 -9193 10104 -10116 9079 -7800 5901
1106 5901 -3191 528 1433 -2906 4600 -7065 9159 -9125 7732 -7563 8148 -6802 3946
1119 3946 -2099 936 1275 -3623 4663 -5376 6815 -7862 7490 -6392 5494 -4966 4081
1132 4081 -2029 -378 1575 -2112 3784 -5676 5861 -5284 5899 -6321 4914 -3239 2750 -2076
1146 -2076 236 1541 -2401 3008 -3846 4730 -5156 4627 -3818 3787 -3691 2086 -260 16 152
1161 152 -1816 3225 -2930 2783 -3677 3890 -2818 2133 -2084 1681 -705 -367 1128 -1161 1166
1176A166l240M982n114L601l383M204l059R32q16J216M73k306J981j330K077k876
1192a492K694k029J307j103J430r13m67N54L60L94j763Q35N52N45j711L64Q16
1209C73J48q38J23J83K42m97P36q24M59p53J621j018k73m25J437J34j770P55j20
1228c07J908k811J632j387K333k111J137p55K87L01m48J282k672K469j624K787
1244B021l898K276r73K151k133l18J299m12J133k900L058k697L114l061K600k638
1260a378J888l71K70m58j497L052j926J699l878M183k086J895l089K007j24O3
1276B50R0j424K020k124K921k939K145k721L238j402J42j363J083J583k027N14
1292a4j436L257k365J204k091K244r23N68n87l94O48k31J358k263Q02k54K031
$$ plain form
1176 1166 -2074 2908 -2206 1395 -1988 2216 -843 89 -727 489 962 -1344 637 -693 1384 -1492
1192 -1492 1202 -827 480 -623 807 -106 -573 -19 341 735 -1028 -193 359 904 -807 -443 373
1209 373 521 -317 -194 -11 231 -266 470 -354 105 -648 973 -45 -318 -743 694 828 -942 -187 -307
1228 -307 1601 -1210 422 -965 1368 -743 394 -361 -74 227 -221 1061 -1611 858 -766 2021
1244 2021 -1877 399 -574 1577 -556 -874 425 13 1146 -1754 1304 -1393 1721 -1340 1260 -1378
1260 -1378 510 139 409 -49 -1546 1506 -420 1279 -2599 1584 -502 1393 -1696 311 187 250
1276 250 340 -1084 936 -1188 1733 -1206 939 -1782 1456 54 196 -1167 -84 1499 -528 -14
1292 -14 -1450 1807 -558 646 -1445 799 -124 444 -143 -537 111 -120 1238 -1025 -223 -477 1554
1309A554j850m19J50J434j14j560K74O13Q38j133j06R0K10N74m15l20p23J434
1327E31K01p46p81J74J923j143k48j602L026j124J10j482J388Q4k25N60k087K194
1345G53j523K741l698K504k315L331j748n94l70J151J908m281L223l054M703m667
1361a936L950m714M248j703N65n45j070K647l100N148p464O075m072N840p292
1376c423M656k065J563L03k855L030l636O971q949P818o939O758n773N454n169
1391b256J464L166l633K914n630Q602q965R638j0345P774m931N725o003K028K468
1406B016m780O447p230P298r789J3285j2327Q347o788O405m222K245k81m923J0016
1421E719r665P814j0215J3709j3839J1839q752M719k868L296n77n760J0030j1147
$$ plain form
1309 1554 -296 -715 -565 869 755 -805 -531 82 920 -213 -319 -229 -19 555 140 -180 -903 531
1327 531 732 -14 -795 -621 1302 159 -89 -1691 1335 211 321 -1161 227 311 86 646 -1441 753
1345 753 -770 1971 -1727 777 -1538 1793 45 -549 -919 232 2140 -2141 1082 -1972 2731 -1936
1361 -1936 2014 -2700 1548 -155 410 -135 -1205 1442 -1658 3490 -3974 2101 -1971 3869 -3423
1376 -3423 1233 -832 731 1034 -1821 1209 -2427 4544 -4405 3413 -3526 3232 -2541 2913 -2256
1391 -2256 -792 2374 -1259 1655 -3975 4627 -4338 5300 -5045 2729 -2202 3523 -2480 -452 2016
1406 2016 -2764 3683 -3547 3751 -6038 7247 -5080 3267 -3521 2884 -1338 907 626 -4297 5719
1421 5719 -3946 3868 -6347 7362 -6477 5362 -3390 1329 -1539 1757 1180 -4580 5450 -5697
1435e697J1877j1686J1098j3317J5293j0936L803j373J737N34m750R092j3533
1448g858J5134j2448J0785j3037J4329j1590P062j895k653L368k762P393j4947
1461i119J7187j4415J2600j2351J2079j2182J0094l137l768N301m937P548j2101
1474g201J6396j8707J6215j0944R803j2373J0830m026k248O132q665R113r744
1487e419J4468j9525J8191j2641R294q682Q176o082L28P723j1634J0061r760J3526
1501H024j6860J7342j5568J0818n386M356n633J942O171j1715J2809j2210J1738
1514E828j3281J6785j7131J1635n630L478k647N39K935q597J4546j5352J1752
1527D860j1125J4696j6117J2891p860K949K88p19J764p032J3080j4983J3738j2188
$$ plain form
1435 -5697 6180 -5506 5592 -7725 7568 -3368 435 -938 799 1333 -3417 5675 -7858
1448 -7858 7276 -5172 5613 -7424 6905 -4685 2377 482 -2171 1197 -1565 5828 -9119
1461 -9119 8068 -6347 6253 -6098 5981 -6201 3893 756 -3012 2289 -2648 4900 -7201
1474 -7201 9195 -9512 6703 -4241 5562 -6811 4019 -7 -2255 3877 -4788 4325 -5419
1487 -5419 9049 -10476 7715 -4926 4368 -4314 3862 -2220 -1892 5831 -5803 4258 -5502 8024
1501 8024 -8836 8506 -7062 3756 -1630 2726 -2907 -965 5206 -6509 6300 -5910 5828
1514 5828 -7453 9332 -7799 3836 -1794 1684 -963 -424 2511 -6086 8460 -6892 4860
1527 4860 -6265 8431 -7686 5205 -2655 294 582 -137 1627 -5405 7675 -7308 6430 -5758
1541e758J1221j1857J3020j0040K707K286k421K816o206J0218j3358J4802j2828
1554e398R417q938J0273q754M109Q23m524N934n469O957j1669J4469j2376R305
1568D159q152P390o301M868j156m235O902o274O538r070J1443j2162J0766p419
1582b703M918n106M788j202l053N367o763P596p389Q086j0341J0569p305M200
1596A662l294K666j082j285M464p021P067o184O868p969P639o545M942k200J19
1611a53j78k96L254n960O254n780N747n605N593n602M214j775L00L01j325K404
1627A393l344M910n944M897l632M176m661L278j594P09L77j509J820k265L500
1642B111m194L862l441K988k360K201k022O16R60j073R07j839K578k296K289k656
$$ plain form
1541 -5758 5463 -6394 6626 -3414 -707 1579 -842 1974 -4232 5986 -7372 7430 -5398
1554 -5398 4019 -4919 5354 -3400 709 1532 -2992 2942 -2527 4430 -7239 7230 -5146 4159
1568 4159 -3993 3397 -2904 1964 808 -3427 3475 -2799 3739 -5331 6112 -6050 4716 -2703
1582 -2703 2215 -2891 1897 695 -2358 3009 -3754 3842 -3547 4539 -5802 4767 -2538 1662
1596 1662 -1632 1034 -48 -1333 3131 -3890 3177 -3007 3861 -4108 3531 -3014 1928 -272 -153
1611 -153 -331 -627 2627 -3333 2921 -2859 2888 -2717 2876 -2726 1488 -287 13 314 -1011 1393
1627 1393 -1951 2959 -2985 1912 -1720 2456 -2205 1073 -521 188 565 -944 876 -1389 2111
1642 2111 -2083 1779 -1662 1326 -1034 1167 -855 -239 721 -352 555 -1284 1294 -1002 1287 -1369
1658a369K099j145J048j100M30K92o73J046j112Q78j180J627j180N90q18Q62r0
1675B05j79l12J16O21n30L0j71M44k67J24j70P8p0K55j44J6m45O75k21J68q00
1696e77Q09j71J44m94J70L94l67L46p90J100j103J127j096J025j130R99l56n0
1714b0o5k54J066j282J086j464J944j655J213j297J266o90J19K30n92R37j295
1731g53J746j948J771j741J899j542Q30o21N33K29j051J166j214J727k094J980
1747I17j787J691j462J097o31O2L48o07J135j723J750j560J821k042J568j008
1763d31R37p31L0N31p15R49j357J611j639J538j359J287j163O88j43j6J34p00
1781e49J142j012R49j292J362r21O38o71N10r2k21L81m58N38p23Q16o08L92m80
$$ plain form
1658 -1369 730 -415 633 -467 -37 255 -418 628 -484 394 -786 841 -339 251 -567 295 205
1675 205 26 -286 -170 451 -79 -49 -220 224 -43 81 -89 -11 -81 174 30 46 -399 276 55 223 -577
1696 -577 232 61 205 -289 -119 275 -92 254 -536 564 -539 588 -508 517 -613 386 30 -20
1714 -20 -85 -339 727 -555 531 -933 1011 -644 569 -728 538 -152 -33 197 -395 542 -753
1731 -753 993 -955 816 -925 974 -568 262 -359 174 403 -648 518 -696 1031 -1063 917
1747 917 -870 821 -641 456 -175 -113 235 -372 763 -960 790 -770 1051 -991 577 -431
1763 -431 506 -225 -195 336 -379 570 -787 824 -815 723 -636 651 -512 176 33 17 151 -549
1781 -549 593 -419 530 -762 600 -321 317 -354 156 64 -157 224 -234 304 -419 397 -211 181 -299
1800b99M63k4k42L3k2M19m90J33l5J90r3j97L35l46L58l72M29l89Q9J56j13K54
1822B37p52R68p65Q14j157J080o30M47m06L3M88q30J076j356J611j814J858j616
1840g14J394j309R02j20l88O03j199K002k315K323k587K796k509K026j616J101
1856C90l68m36J258j976K453k968L532l639L292l068K847k022R10j69n36J693
1872A193k793L363l757M184m348M153l717K981k043J116k2j264K296l092M110
1887B360m970N017m732M735m483L446k181J101J23j518K700l756M825n570N837
1902B934n800N392m655L954k998J260O26j825K828m267N562o195O532o598N985
1917B735m991M133l059J384N39k317L801m820N619o666P444p091O037n155M170
$$ plain form
1800 -299 164 140 -102 -69 -91 328 -162 -29 -64 126 33 -164 171 -175 183 -189 240 -149 -60 96 -17 237
1822 237 -515 453 -312 502 -655 425 -205 242 -164 -131 357 -473 603 -753 858 -956 902 -714
1840 -714 680 -629 273 153 -235 368 -831 1171 -1144 1179 -1408 1388 -1121 905 -711 390
1856 390 22 -414 844 -1132 1321 -1647 1885 -1754 1538 -1530 1317 -705 205 36 -500 1193
1872 1193 -1600 1763 -1994 2190 -2158 1995 -1722 1259 -784 332 310 -954 1342 -1750 2360
1887 2360 -2610 2407 -2325 2410 -2073 1373 -808 293 416 -1102 1598 -2158 2667 -2903 2934
1902 2934 -2866 2526 -2129 1825 -1173 87 713 -1112 1716 -2551 3011 -3184 3348 -3250 2735
1917 2735 -2256 1877 -1182 202 741 -1576 2225 -2595 3024 -3642 3802 -3289 2748 -2407 1763
1932A763k669J052N68k619M600n590O048o812P517p501O742n341L670k367J209
1947B70O53k994M779n943O863p264P279p524P460o027L799k127R34O36k629M688
1963B853o499P429p403P391p668P346o129M407k264J08J279k359M355o733P879
1978C992p745P442p182O702n971M492k030m02J906l066M546o134P554q380P873
1993C597o470N730n572M352j928m19K284l783M732n581P029q254Q016o757N572
2008B548m646L729k493K94K475m214M651n303O646p595P685p132N760l998L002
2023A409k363O32J978m023N102n607N839o391P245p063N343l524K462j425L8J441
2039A093l306N277n985N477n411O086o141N114l565J822l90l07J159k968M725
$$ plain form
1932 1763 -906 146 714 -1905 2695 -2895 3153 -3659 3858 -3643 3099 -2242 1428 -939 270
1947 270 923 -2071 2708 -3235 3628 -3636 3643 -3881 3579 -2448 1351 -776 158 794 -1835 2853
1963 2853 -3646 3783 -3620 3771 -3897 3449 -2680 1727 -537 -429 850 -1509 2846 -3887 3992
1978 3992 -3753 3689 -3493 3209 -2762 1730 -300 -702 1204 -1862 2684 -3450 4104 -4276 3597
1993 3597 -2873 2857 -2715 1637 -291 -710 1574 -2209 2523 -3058 3971 -4283 3733 -3024 2548
2008 2548 -2098 1631 -862 -568 1907 -2307 2344 -2959 3687 -3908 3777 -3355 2405 -1593 1409
2023 1409 -954 -322 1656 -2367 2735 -2872 2967 -3424 3821 -3242 2101 -1423 1039 -386 -348 1093
2039 1093 -2213 3064 -2921 2556 -2855 3231 -2910 2204 -1361 461 71 -236 923 -2045 2680
2054B680n421N460n341M969m773M827l861J692j7n32J179k440L701m726N338n011
2070b276M240m062M077l295J943n75q13J764k002K588m015M875m414L749l470
2085a686L021k399J814o96q87J811j983K399l101L532l757L602k691J804j727
2100i44J518l59p97J338j870K361k341K406k951L017k214J513j225Q22l39j35
2116b00R57j773J809j601J956k248J957j732J611r50K52k52J84N92j220J229j278
2133g07J422j287J245j391J072m63L19k63j84M21l32O32j084Q37m29O44q20M63
2151I5k27K84n6j94N7k9L07l04J02k32K73J6J2l44J95J49P9l56J23l0L39l51P9
2174a3j52L05r9l8k7j69M05k94L22o77O94m20N57p48L90r4K77j77l50N09m14O68
$$ plain form
2054 2680 -2741 2719 -2622 2347 -2426 2401 -1460 232 215 -317 862 -1578 2123 -2603 2735 -2276
2070 -2276 1964 -2098 1979 -1316 627 52 -761 1003 -999 1589 -2426 2449 -1965 1784 -1686
2085 -1686 1335 -1064 750 54 -833 978 -1005 1394 -1707 1825 -1932 1670 -1021 783 -944
2100 -944 574 215 -582 756 -1114 1247 -1094 1312 -1639 1378 -836 677 -548 274 -65 -200
2116 -200 757 -1016 793 -808 1148 -1100 857 -875 736 -214 38 -214 -30 562 -658 571 -707
2133 -707 715 -572 673 -718 354 -109 210 -53 -237 184 -148 484 -600 237 -192 452 -368 95
2151 95 -132 152 96 -98 -41 -70 237 -67 35 -197 76 92 104 -240 -45 104 183 -173 -50 -80 259 -92 -13
2174 -13 -165 140 41 3 -24 -193 212 -82 240 -437 257 -163 394 -354 36 -58 219 42 -308 201 -213 455
2196D55r10Q27q52R90p94N07n07L45J04k73K91p08J080r18Q65j196J172p65O54
2215C67o62K68J30k16M55q55R69r95J209j198R36r33R31m61M5m0j59P01r00Q17
2235D09j050J287j094Q98r23P40l81J93J3m14O14o31Q99j133R72q57J003q70M13
2254H8k59K83P5m82N02n62Q22q46P46p89P36m70L34k89J9K38k00K95o31O24l89
2275a55M65o18L83j34J70r7j58K18j84L05l45K15j90K16m5o4l5n6L27k75M2j31
2297a46K48l7j44J10k00M19m15L30m16M43k92J83n9k11L47l17N31q82Q78o83P36
2318D23p67N18l21K24J03n32P04p81J004j241J336j344J202q63O59n94K31L47
2336C08p31J000j355J575j600J758j935J700j184Q33n76J66L41r23J533j888J955
$$ plain form
2196 455 -455 372 -480 510 -284 223 -284 61 165 -108 183 -525 555 -363 502 -694 478 -287 367
2215 367 -295 -27 103 -113 342 -513 456 -539 670 -528 408 -525 406 -55 -10 -50 -209 492 -408 409
2235 409 -641 646 -448 450 -473 267 -114 79 92 -322 292 -339 560 -573 399 -458 545 -325 88
2254 88 -171 112 187 -295 207 -355 467 -379 367 -422 314 -156 178 -111 -92 146 -54 241 -390 234 -155
2275 -155 310 -308 75 -59 111 14 -144 74 -110 195 -150 65 -125 91 46 -18 -53 -109 218 -57 -15 -146
2297 -146 102 65 -79 31 -169 250 -165 165 -251 192 -100 83 24 -187 160 -157 374 -508 370 -313 423
2318 423 -344 174 -147 77 180 -352 352 -429 575 -666 670 -674 528 -335 324 -270 -39 308
2336 308 -423 577 -778 797 -803 955 -980 720 -464 369 -207 -41 300 -623 910 -978 977
2353I77k071K289k293J999j606J062l61j25M55j107J966k474K554k568K585k520
2369a238K354j890J076k61l27Q70j503K147k771L241l246K880k673K625k199J306
2385C91l32m92J196j777K354l060L651l761L466l081K685k260J670o60o07J552
2401I35k060K596l334L923m132L978l471K780k208J639o97n75J775k623L143l524
2417a855L971m418M372l677K813k095J352m30o39J840k976L675l904M101m405
2432b275M475m006L089k037J088k91o44J869l048L825m243M421m419M361m158
2447a993L461k269J063j48p00J768k924L906m489M596m473M329m055L406k389
2462i11J184N4j099J930k837L870m589M712m489M182l766L137k226J044K47j368
$$ plain form
2353 977 -1094 1195 -1098 901 -705 357 -4 -129 326 -781 1185 -1289 1265 -1303 1282 -1238
2369 -1238 1116 -774 302 41 -286 584 -919 1228 -1543 1698 -1548 1332 -1341 1284 -915 391
2385 391 59 -433 763 -1014 1340 -1720 1931 -1830 1636 -1445 1240 -1020 650 -10 -617 935
2401 935 -1125 1471 -1863 2060 -2072 1906 -1565 1215 -993 646 -51 -626 1149 -1474 1669 -1855
2417 -1855 2116 -2302 2070 -1607 1206 -889 463 33 -606 1234 -1742 1933 -1971 2130 -2275
2432 -2275 2200 -1806 1283 -754 334 43 -601 1268 -1780 2045 -2198 2223 -2196 2165 -1993
2447 -1993 1468 -801 262 114 -586 1182 -1742 2164 -2325 2271 -2202 2127 -1928 1478 -911
2462 -911 273 327 -772 1158 -1679 2191 -2398 2314 -2175 2007 -1759 1378 -848 196 443 -925
2478i25K236l011L756m366M691m584M053l411K833k079R64K86j371K284l071L673
2494A958m134M472m463M041l405K673j871R83O6j230K250k938L445l940M220m152
2510b025L836l312K546j652Q06P9j117K118k870L385l696L841l825L553k962K200
2526I05j415N51L91j252J976k661L223l474L463l365L117k594J904j155L71M22
2542D07j173J879k469K846l064L171l056K684k246J759j084L07L54r58J627k178
2558a194K478k654K746k661K392k000J485q91L30K51r01J442j789K096k327K309
2574A112k132J966j668J144o04J68K86q01J233j545J774j861J831j736J547j231
2590e17Q70n11O8L69o51Q99j231J460j451J388j341J173r28P01m21P1K27m51O75
$$ plain form
2478 -925 1311 -1700 2056 -2310 2381 -2203 1850 -1561 1272 -807 157 443 -928 1356 -1715 1958
2494 1958 -2176 2296 -2167 1874 -1531 1142 -729 254 320 -910 1340 -1598 1847 -2093 2127 -2025
2510 -2025 1811 -1501 1045 -607 199 278 -839 1279 -1591 1794 -1902 1939 -1886 1667 -1295 905
2526 905 -510 41 432 -820 1156 -1505 1718 -1756 1707 -1658 1459 -1135 769 -386 -15 407
2542 407 -766 1113 -1356 1490 -1574 1597 -1459 1225 -1021 738 -346 -39 315 -643 984 -1194
2558 -1194 1284 -1370 1376 -1285 1107 -893 592 -299 31 282 -619 823 -966 1130 -1197 1112
2574 1112 -1020 946 -722 422 -182 -14 272 -529 704 -841 933 -928 903 -833 714 -517
2590 -517 353 -158 -90 279 -372 527 -704 756 -695 693 -648 525 -403 298 -123 -52 175 -276 399
2609C99q49R38j030J072r36P54o91N94l20M2Q7k51M66n30N52o45O73n88M90m06
2629a79K89j83J15J9j82K00j77K83l48K43k01K54j75N6p8J13m0j6j7K2j0N6n7
2652a3j1LN1Oq4O0r1K32k49J98k49L22k75K01k06J48k7n4J26k46L24l53M48n09
2676b48M43m09M50l68J62q2N7J36l40L77m36N86o37N76n60N28l85K63j68l1K29
2697A43k96M19o22O81o18O61p08N64l89L25j84o8K34l36M93o20O46o84P11o17
2717b65M89m46L14o3p9J62l66N55n72N74o75O72n23M49l90K11l4o7K17l75M17
2738B05m61N71n54M23m18M13k22O5m4m4K41l11K79l54M23l52K84k80J90q5M8K9
2760D6j64J81j25J95k68J62q0J26o3p0Q3m1J20j94J24p2P9pp8P0j30K63k69K00
$$ plain form
2609 399 -450 488 -542 530 -406 348 -343 251 -69 -27 60 -191 275 -255 297 -348 325 -263 227 -179
2629 -179 110 -73 42 61 -121 79 -98 185 -163 80 -121 133 -42 14 -64 49 9 -7 -24 -2 -12 44 -13
2652 -13 -24 -21 30 36 -48 12 -79 153 -96 102 -147 175 -100 101 -105 43 16 -38 88 -158 166 -187 261 -248
2676 -248 195 -214 236 -132 30 -52 5 141 -199 178 -258 328 -309 267 -293 235 -150 113 -55 -86 143
2697 143 -153 266 -356 325 -293 368 -340 224 -165 160 -24 -92 142 -194 299 -321 325 -359 352 -265
2717 -265 224 -222 92 29 -50 112 -254 301 -271 303 -372 300 -223 226 -164 47 13 -54 163 -212 205
2738 205 -256 315 -239 184 -234 179 -43 22 -22 -66 175 -136 143 -211 212 -140 144 -136 54 -31 17 46
2760 46 -118 63 -62 133 -135 27 -53 73 10 -60 23 -18 102 -92 32 -40 39 32 -46 24 -106 157 -112 88
2784H8k34K64j24J2kj25L21l57L38m58N48m92M40l83K17o9j3J80m31N69o28P63
2806D24q21P30o92P00n01J71Kj24L83o52Q34j007J129j078J004j011Q93o14L43
2825A13k9l59O07p56J062j416J506j394J336j250J027p74M58K6n17Q13j048J370
2843G75j639J795j848J685j347J078q92M74J57o86J080j450J719j861K073k207
2859a094J978j527J134p90L64J40p45J404j832J956k109K346k413K215j855J341
2875E13p41K82J11p39J515k064K303k431K490k499K485k175J498p82K62K39q66
2892e99J511k154K680k815K637k532K535k281J631q28O9N93j084J604k295K884
2908A556l069K925k698K423k114J697r53o3Q89j359J802k392K923l228L222k867
$$ plain form
2784 88 -146 118 -6 6 4 -121 200 -157 181 -277 271 -221 219 -164 53 -16 -29 151 -280 289 -339 424
2806 424 -397 333 -359 341 -160 11 13 -111 272 -380 454 -553 576 -502 502 -509 384 -230 113
2825 113 84 -275 332 -424 638 -778 728 -666 670 -580 447 -327 131 157 -360 453 -595 775
2843 775 -864 931 -917 768 -579 499 -393 81 238 -448 632 -818 901 -960 1113 -1094
2859 -1094 884 -643 491 -299 65 205 -540 864 -968 988 -1121 1225 -1188 1027 -828 513
2875 513 -228 54 165 -574 941 -1123 1180 -1251 1239 -1260 1225 -950 548 -234 28 267 -599
2892 -599 912 -1242 1438 -1377 1260 -1272 1263 -1018 613 -215 -146 447 -637 967 -1328 1556
2908 1556 -1513 1412 -1286 1137 -977 720 -233 -296 593 -766 1036 -1356 1567 -1661 1561 -1306
2924a306K378k019J655r65L5Q66j574K050k376K769l240L395l033K460j981J521
2940F35r39J92P39j654K219k462K735l105L297l132K620j900J239p51J54P50j685
2957a048K325k697K895k972L031l023K637j836J023m11j46Q26j613K373k864K958
2973A458k854K838k803K462j830J059k72l83Q70j430K175k755K914k812K664k500
2989a199K247j831J120k56m17Q89j384J922k414K765k817K545k199J970j668J062
3005C35k84m30J007j443J800k169K524k620K389k029J659j255Q18k68m49J115
3021G00j508J731j983K227k309K173j859J410r87O24j97l68R45j374J633j771
3037i13J865j955J942j674J242q47N04j18l09P18j128J450j564J572j603J581
$$ plain form
2924 -1306 1072 -947 708 -257 -222 644 -930 1120 -1256 1513 -1727 1668 -1365 1095 -886 635
2940 635 -304 -112 627 -1027 1192 -1270 1465 -1640 1657 -1475 1145 -755 484 -267 -113 637 -1048
2957 -1048 1277 -1420 1475 -1497 1534 -1489 1148 -688 335 -76 -222 604 -1009 1364 -1500 1458
2973 1458 -1396 1442 -1361 1101 -729 330 58 -325 545 -885 1290 -1465 1449 -1363 1301 -1199
2989 -1199 1048 -783 337 81 -336 553 -831 1091 -1323 1442 -1375 1170 -1029 941 -727 335
3005 335 51 -379 628 -815 985 -1184 1340 -1280 1109 -920 739 -516 302 34 -415 700
3021 700 -808 923 -1060 1167 -1142 1031 -828 582 -405 219 22 -346 599 -775 858 -913
3037 -913 952 -1003 939 -735 507 -340 164 46 -263 455 -673 777 -787 785 -818 763
3053G63j407J123p47L53k3k59N93r57J204j313J355j319J203j086R14n88K10P6
3071I5l12N43p80R63j076J104j020R02p95O31m04J85N1k98M75n71O91q03Q11p41
3091c49O69n82M37k81J40L3j97L09l93M52m74M83m90M48l37K47k04R3L1r5J40
3112H0k13K55k42K32k37K14j61J12n1MQk5O7p0M8m9M5k0j5J4J4Rj8k5M6n4Q1j14
3140f5J35j57J64j50J24r8O0Ll5O7j57K30k44K51k96L08k51K04j62R0Nq8J58k38
3164a42L04l43L85l87L61l43L07k04R2j1q2K02l02L45m04M62m56M26l86L13k28
3185i1J21jj22K27l02L97m71M71m59M44l98L00j92R9K0j52K47l16L84m30M49m51
3207b26M14l40K66j82O5N9j21K06l16L61l58L69l81L35k65K10j26K1M9j16J87
$$ plain form
3053 763 -644 479 -268 85 62 -197 396 -561 643 -670 685 -634 569 -517 397 -191 19 95
3071 95 -217 326 -454 509 -567 537 -483 419 -376 255 -149 36 87 -211 264 -307 384 -419 392 -349
3091 -349 320 -262 175 -106 34 67 -130 179 -214 238 -236 247 -243 205 -132 115 -89 4 35 -60 80
3112 80 -133 122 -120 112 -125 89 -72 40 -11 -7 1 -24 43 -27 21 -28 17 -3 -18 -4 10 19 1 -24 22 -32 49 -65
3140 -65 70 -87 77 -73 51 -47 13 16 -19 48 -109 121 -123 128 -168 140 -111 93 -69 21 26 -62 96 -142
3164 -142 162 -181 204 -183 178 -165 142 -62 30 19 -63 139 -163 182 -222 240 -216 210 -176 137 -91
3185 -91 30 29 -93 134 -168 229 -242 229 -230 214 -184 116 -76 23 43 -109 138 -178 206 -224 225 -226
3207 -226 188 -152 114 -68 -3 56 -65 141 -175 186 -172 197 -184 151 -114 96 -30 -9 40 -76 111
3228A11k34K62k94K99k56K13j99J38n2J4J3q1J49j49J45j64J66j36J05q3L9j1
3250elL7n3M6l6L7k4qK2l1O4r1O4l8L8ln4P8j14J67j86J91k09J93j47J17r1K0
3278a9Q3j53K03l00L86l94L89l92L37k57J84o2p4J91l01M31n20N58n99O16n54
3299b47M49l47K16m8j21K72m53O31p25P66p94P87p27O33m71K52o3j40L72n96P62
3320D08q82R83j005R63q82P63n69K99l8k17M88p41R45j106J209j196J132j025
3338d71Q39n70K69K5l53O46q88J135j343J422j387J289j133R01o22K91J01m84
3356c33P89j048J298j483J564j560J442j201R50o88L28J10n05Q49j168J397j555
3373h14J672j693J554j301J020o87L08R7n41R78j310J511j663J776j782J638j382
$$ plain form
3228 111 -123 139 -155 144 -112 101 -98 40 -12 2 15 -66 83 -66 79 -85 81 -55 50 -33 6 -5
3250 -5 -8 29 -24 22 -14 23 -1 -9 13 -18 46 -45 19 -19 19 16 -38 40 -74 93 -93 98 -111 82 -65 52 -39 -19
3278 -19 64 -89 114 -186 200 -194 195 -197 140 -117 67 5 -69 122 -179 252 -268 290 -309 307 -247
3299 -247 202 -145 71 23 -98 174 -279 352 -373 393 -401 386 -341 292 -179 73 10 -130 242 -354 408
3320 408 -474 509 -496 467 -415 348 -221 78 40 -177 311 -430 515 -591 618 -578 554 -471
3338 -471 368 -202 67 92 -261 385 -503 632 -711 711 -676 613 -520 381 -241 50 151 -333
3356 -333 456 -592 706 -777 787 -773 669 -532 418 -270 58 168 -337 512 -656 741 -814
3373 -814 858 -835 719 -582 438 -249 59 156 -385 593 -717 794 -869 907 -875 763 -619
3390f19J025o17K19J75o33J105j468J706j826J845j793J681j432J021n50J21K99
3407B59p46J165j529J833j955J887j798J687j439J042n69Q6L62p40J101j497J812
3424I61j943J912j796J615j385J083o34Q8M04p70J109j470J757j919J949j795
3440h34J533j280R85n63N2M48q93J256j487J697j894J946j777J473j161Q19m35
3457a15mM95r77J320j522J678j813J833j712J454j062O74l49oM57r20J259j461
3475g71J591j640J642j588J380j022O23k72n4M08p82J146j395J477j477J472j414
3492f76J232r38N90j97j66M38p19J059j321J400j384J310j190J035q24M80q2k31
3510a84M92p42R69j153J284j314J191j006Q66o82M02q9k13M80o78Q24r60J076
$$ plain form
3390 -619 406 -211 8 183 -450 655 -813 893 -933 912 -881 800 -632 389 -161 -40 259
3407 259 -487 678 -851 982 -973 914 -884 803 -636 406 -163 -77 285 -455 646 -851 961
3424 961 -982 930 -866 749 -636 447 -187 -99 305 -465 644 -826 931 -988 961 -834
3440 -834 699 -581 404 -159 -107 341 -552 704 -783 914 -980 966 -811 662 -499 320 -115
3457 -115 -119 376 -601 719 -803 875 -938 895 -817 637 -425 249 -100 -106 351 -569 690 -771
3475 -771 820 -820 822 -766 614 -408 215 -57 -111 297 -485 661 -734 743 -734 738 -676
3492 -676 556 -382 208 11 -155 283 -436 623 -698 702 -682 628 -562 473 -351 129 47 -184
3510 -184 308 -434 535 -618 666 -648 543 -463 403 -279 123 34 -179 301 -377 447 -513 563
3528E63j088R95q63P04n29L38j18j52M24n85O77p71Q56q79Q30p27N51l77K27n6
3548B0j49L40m92O05o50O52o67O60n55L92k55J21K5j68K79m04N29n35N05m94M54
3569B13l71K77j69L3O5j20J98k92L35l36L44l23K63k19J88j06ML8p7J30j64J76
3591H7j86J91j51J08q8N9k6PK5p3P7m9M5n5M3j4%K2m4N4m2N4n2QJ7l4P1r7R5j12
3621f0J30j32J00o6N1rm9Q3j25J75j93J97k02J99j60J14p4KO0j01J52k19K48k35
3645a14K45k53K20j71J37q0JP8j53K15k61K79l01L15k88K51k11J35n3lO2j66K53
3668A37k77K90l28L36k94K48k05J34n7j3R9j76K30k66L12l32L06k81K64j99J20
3689D8n3k4J01j77K24k59K97k96K78k55J98j47J12l6m6R5j35J82k22K22k25K33
$$ plain form
3528 563 -525 470 -393 311 -218 120 2 -150 274 -311 366 -405 451 -428 402 -325 226 -151 76 20
3548 20 -129 211 -281 324 -326 326 -341 319 -236 156 -99 22 47 -121 158 -246 283 -252 253 -241 213
3569 213 -158 119 -50 -17 48 -72 126 -166 169 -167 177 -146 117 -102 86 -20 -16 22 -55 75 -89 87
3591 87 -99 92 -59 49 -39 20 -6 1 26 -47 30 -19 26 -29 14 0 0 22 -22 32 -10 44 -8 0 17 -17 54 -43 52 -60
3621 -60 70 -62 38 -28 23 14 -35 48 -77 98 -95 102 -100 99 -61 53 -21 -19 41 -60 92 -127 121 -114
3645 -114 131 -122 98 -73 64 -16 -15 63 -90 125 -136 143 -158 157 -131 120 -91 44 -9 -12 50 -116 137
3668 137 -140 150 -178 158 -136 112 -93 41 -16 -29 70 -106 124 -142 170 -162 144 -137 127 -72 48
3689 48 -5 -29 72 -105 119 -140 157 -139 139 -116 82 -65 47 11 -35 60 -75 107 -115 107 -118 115
3711A15k10J54j03P0k2k4O7r8J29j43J42j57J56j37J16r3M7j4K1Nn4O2m2N1o6
3736b8M9m1M6l3J7k2K7l1L8m8M0l6N1n4K5j6K7qk6N8p3J09j36J47j73J82j60J40
3764G1j12O0j0l7R0j57K35k70K73k98L08k84K42j71Q5j9o7J65k58L45m09M34m39
3787b23M30l94L24k33J28j1j08K36l38M41n30N60n58N39n10M36l14J65j0j43K84
3808A71m08N50o46O80o94O71n90M92l76K01mj94L66n16O45p59Q31q32P78o82N63
3829B47m11K12J6k32M59o47P69q69R52r73R01p68O12m21K05K8k87N27p23Q68r79
3850e14J037j038R78q38O56m31J98K3k94N67p68R21j030J081j085J036r09O93
3868B83m42J89N9l21N94q41J011j108J157j142J068r18O93m40J57J42m09O63r06
$$ plain form
3711 115 -95 59 -44 26 4 -20 47 -51 78 -65 77 -80 76 -61 55 -38 9 -5 16 21 -33 29 -13 38 -28
3736 -28 21 -20 26 -7 10 -12 15 -16 22 -26 14 -22 29 -25 0 -16 11 3 -23 35 -38 71 -65 82 -91 91 -69 71
3764 71 -41 19 9 -28 62 -95 140 -130 143 -155 153 -131 111 -60 25 6 -61 104 -154 191 -218 216 -223
3787 -223 207 -187 137 -96 32 21 -87 149 -189 252 -278 282 -276 263 -247 189 -125 40 30 -113 171
3808 171 -237 313 -333 347 -347 324 -266 226 -150 51 47 -147 219 -297 348 -411 420 -412 366 -316 247
3829 247 -164 48 64 -168 291 -356 413 -456 496 -477 424 -344 268 -153 52 80 -207 320 -403 465 -514
3850 -514 523 -515 463 -375 281 -150 48 71 -223 344 -424 497 -533 548 -537 499 -410 283
3868 283 -159 30 89 -232 362 -479 532 -576 581 -561 507 -411 282 -158 -1 141 -268 395 -511
3887e11J098j213J245j199J083r19P09m22J08J85m65P33r64J124j238J267j188
3904e67J069r15O96m22J12J82m67P25r20J093j209J226j167J049q82O66m00J14
3922a7J88m80P22r19J088j182J191j145J034q34N98l48N6K36n14P71r67J088j171
3941f05J180j105R60p55N37k84JK84n45P61r36J060j127J118j039Q90o98M87k30
3960d6j7K70n18P15q59R60j022J016r30P96o39M42k19qK45m81O60p95Q87r23R02
3981D36q43P30n60L59j54n4K76m67O21p43Q21q38Q09p36O08m36K65r6r4K89m60
4002b67O04o92P23p20O86o10M98l73K18m8j02K43l76M87n63N86n84N50m88M06
4022A78k98J57j6r3J93k87L84m42M61m70M23l60L04k20J17nr7J98k69L25l48L59
$$ plain form
3887 -511 587 -626 619 -580 503 -416 293 -129 -21 164 -301 432 -532 592 -646 621 -567
3904 -567 502 -413 283 -139 -27 155 -312 413 -507 586 -623 603 -564 485 -397 269 -131 -17
3922 -17 171 -309 413 -506 582 -600 591 -554 480 -354 244 -104 -48 188 -326 445 -522 566 -605
3941 -605 575 -530 430 -325 212 -72 -71 213 -332 429 -507 553 -574 544 -495 395 -303 184 -46
3960 -46 -63 207 -311 404 -455 505 -517 499 -431 365 -274 168 -51 -59 186 -295 365 -430 457 -466 436
3981 436 -407 323 -237 122 -32 -86 190 -277 344 -399 422 -416 393 -343 265 -171 94 -2 -96 193 -267
4002 -267 337 -355 368 -352 334 -276 222 -151 67 19 -83 160 -216 271 -292 294 -290 260 -228 178
4022 178 -120 37 21 -72 121 -166 218 -224 237 -233 190 -170 134 -86 31 26 -71 127 -142 183 -165 194
4044A94l51L05k72K08j25M9K4j10J82k22K34k50K60k36K03j71J14n2MM1q3J14
4066F0j45J61j55J37j21J11o8L3rk4N0o3O7o6O8m9K8k3MK1k9L9n6M6l5K3j7MJ9
4095A1l5N7r0J01r3Q3o4M8k8KK8n8P8r8J28j30J28j32J17q5M5j2j9O2j07J36j59
4122h6J86j78J72j58J20p9L0Pn9J07j42J75k10K24k14K01j64J10p3K3L6q8J21
4145F1j63K07k25K37k20J99j69J26p8J5M8r9J36j73J93k08K33k27J96j57J20p0
4167a8J1M1r0J32j71J92k04K15j93J68j48R7m3jL4q1J20j42J70j79J71j62J47
4190F6j13P8l3nL8p2R7j23J48j43J31j22J13r4N7l8J0K3l9M9p2P6p8P6p4O9n5
4217c0M9l4J2j0RJ1j7Oj0K8k3J5l0K5j8L1m3M4l2L6m4M8m9N2l1MJ7k8N4p3P4j03
$$ plain form
4044 194 -157 148 -124 84 -41 8 32 -78 104 -118 116 -134 126 -110 93 -78 36 -16 -12 29 -54 60
4066 60 -85 76 -79 58 -63 48 -20 13 4 -20 30 -33 34 -32 36 -13 15 -8 -4 17 -12 27 -29 17 -18 5 -12 -8 11
4095 11 -24 33 -57 44 -49 34 -30 18 -10 -8 20 -38 40 -58 70 -60 68 -64 53 -32 13 1 -18 44 -63 73 -86
4122 -86 100 -78 94 -64 56 -23 7 14 -45 62 -80 95 -115 109 -105 96 -68 42 -31 -8 28 -60 61
4145 61 -102 105 -120 117 -103 96 -73 53 -25 -10 38 -61 75 -98 95 -113 120 -107 89 -68 52 -18
4167 -18 -7 34 -56 76 -95 97 -107 108 -85 83 -65 32 -11 -12 22 -59 61 -81 89 -90 81 -81 66
4190 66 -47 31 -2 -7 31 -41 56 -67 81 -62 69 -53 60 -34 23 -15 -5 18 -21 28 -44 32 -46 30 -44 25 -30
4217 -30 19 -15 -3 -13 -4 7 -10 -4 -14 14 -9 6 -24 1 -17 14 -29 15 -17 19 -25 23 -26 26 -5 -1 16 -12 42 -31 43 -60
4249f0J17j23J20j06R1p8N2j3k9O8j01J49j88K03k14K08j87J49j13P4oo4J24j69
4273i6K19k41K66l07L03k64K20j64R2k0m9J28k05K72l10L41l74L60l25K66j91
4294g9J13l3o2J53k42L28l80M10m20M15l85L25k32J21k7p1J81k90L96m68N03m88
4316b32M63m33L60k60J44pj35K49l63M70n41N68n65N45m82L84k77J43J1j61K75
4337A56l81M88n65O05o10N63m90M09l01J74j5j56L12m21M98n78O35o37N87n03
4357b30M13k94J53oj52L21m63N53o11O55o77O36n37L98k74J33K2j90L68n03O07
4378C22o54O79o84O53n64M08k55J12M6k11L66n08O10o52O67o52O04n25M15k51
4398g4Q6O1j95L23m66N80o40O49o32N84n01L83k50Q1P3k05L43m74N73o23O32n90
$$ plain form
4249 -60 57 -66 54 -52 39 -39 13 0 -29 39 -62 87 -101 102 -112 96 -91 58 -55 19 13 -51 73 -96
4273 -96 123 -118 148 -159 144 -120 100 -64 28 8 -41 87 -118 154 -156 185 -189 171 -154 112 -79
4294 -79 34 1 -61 92 -150 178 -202 208 -212 203 -182 143 -89 32 5 -66 115 -175 221 -247 256 -232
4316 -232 231 -202 158 -102 42 35 -100 149 -214 256 -285 283 -282 263 -219 165 -112 31 42 -119 156
4337 156 -225 263 -302 303 -307 256 -234 175 -126 48 33 -123 189 -232 266 -312 323 -314 273 -230
4357 -230 183 -111 42 36 -116 205 -258 295 -316 339 -338 298 -239 159 -115 18 40 -150 218 -285 322
4378 322 -332 347 -337 316 -248 160 -95 17 63 -148 218 -290 320 -332 335 -317 287 -238 177 -74
4398 -74 12 73 -122 201 -265 315 -325 324 -308 276 -225 158 -92 -11 62 -143 200 -274 299 -324 308 -282
4420b82N34m57L55k21P0Q7k36L62m76N56o09O20n90N34m32L18j90M6J11k55L68
4441B13m50N07n54N68n45M78l76K74j76M7R4k19L20l99M49m69M78m72M04l08K31
4462I5j36L4Q3j96K90l63M04m20M21l84L45k93J96q9j6R7j78K62l25L63l83L77
4484A84l39K79k24J57o6j5Q5j66K36k77L14l31L02k66K36j85J03k7l6Q8j36J85
4506A01k15K37k35K14j88J63j22P3l4j3O9j05J33j52J59j72J56j35J08p3M0Jl7
4529b7N8q3J11j18J14j00R3r3O3k7%K6m1M9p0P9p3O9n4M5k6kJ0k3L8l1L2k6K4
4558A7j0mPpJ1j9J5k1J9j8J5qrK7l8N3o1O5o9N4m3L2j7JK7m9O6p6Q9q8R2r1P8
4591D0n7L8j5j7M1o3P7q7J12j22J16r3O6n0L3j0k1M9q0J16j48J37j25J21j07P7
$$ plain form
4420 -282 252 -205 150 -71 -1 86 -150 212 -264 292 -317 303 -287 247 -185 133 -57 -11 100 -155 213
4441 213 -237 270 -284 284 -261 217 -159 115 -61 -14 80 -139 181 -218 231 -238 240 -232 172 -136 95
4462 95 -41 -7 76 -120 170 -193 211 -209 212 -172 173 -120 76 -13 -29 68 -110 152 -173 190 -193 184
4484 184 -155 124 -100 57 -9 -24 61 -105 131 -146 168 -163 139 -127 109 -76 27 0 -36 52 -84 101
4506 101 -114 123 -112 102 -86 77 -45 28 -6 -19 50 -55 78 -74 85 -87 69 -66 42 -31 9 10 -27
4529 -27 31 -52 59 -59 55 -45 48 -45 18 -9 -9 17 -24 25 -45 34 -39 30 -24 21 -5 -7 3 -20 18 -13 19 -7 17
4558 17 7 3 10 3 14 -5 10 -11 8 -10 5 -3 -12 15 -23 30 -31 34 -35 19 -24 8 -9 -8 19 -30 36 -40 49 -39 53 -38 40
4591 40 -17 21 6 -11 30 -33 44 -43 69 -53 63 -30 36 -14 19 9 -12 37 -43 73 -75 62 -63 58 -49 28
4617B8n6L2Ol9P0r4J18j35J42j48J42j20R8o0K5J5o1R0j14J35j49J49j46J42j18
4642d8Q7n3J4J7n4R1j14J27j47J53j46J34j11Q1o0K2L8o0P3j01J26j35J34j35
4666f7J18r0P4m3JK8m7P1r7J13j11J10j05R0q5O9l6oL3m3N7p8Q2r7J04q4Q7p6
4694b8L6j4PKk6M3o1O4n3N3n5N7l9L1k7RJ1rJ4l1L0j4J4k4K5j5J0k0J5rj1K4j6
4727gMkP%rmlJ5%pJ5k1L1l8L6l3L4l5L7k8J6Qk8M2o4O9p7R0q6P9o9N9l9LK9n6
4763c2P7r1J01j23J20j07R6q7P6n3K1J6n2P4r7J27j43J45j46J40j11R4n1J9Nn2
4789c4R6j27J48j70J73j68J52j34J13p3L1J8p0J16j55J80k00K14k08J83j69J22
4811C8n2J1L6j02J51j88K23k37K40k22K03j85J35p6K1L6r0J40j84K21k37K46k38
$$ plain form
4617 28 -28 4 10 -29 41 -53 65 -70 72 -76 66 -54 44 -16 9 24 -37 53 -61 74 -75 74 -72 70 -48
4642 -48 39 -14 0 17 -37 54 -60 67 -80 73 -73 61 -50 31 -29 -7 31 -29 44 -57 69 -66 68 -67
4666 -67 51 -39 35 -8 -7 21 -26 45 -52 61 -50 60 -45 45 -40 29 -7 -13 20 -23 34 -44 38 -59 45 -39 48 -28
4694 -28 8 -6 1 3 -23 20 -41 23 -30 23 -32 25 -14 17 -10 -1 10 1 15 -16 14 0 14 -10 15 0 10 -10 5 -4 -15 9 -7
4727 -7 -3 -5 2 2 -7 -11 -14 1 1 -6 9 -12 19 -19 17 -16 18 -17 20 -8 8 16 -12 30 -34 35 -42 48 -38 41 -28 31 -8 -5 24 -32
4763 -32 45 -46 55 -68 52 -55 41 -46 30 -23 -2 14 -38 36 -61 66 -77 68 -78 62 -49 45 -6 13 18 -34
4789 -34 62 -65 83 -87 86 -82 70 -64 49 -24 7 25 -45 71 -84 96 -104 110 -98 85 -84 38
4811 38 -14 -3 33 -69 82 -106 117 -120 120 -102 101 -84 51 -25 -4 32 -58 82 -102 119 -118 128 -110
4834a10K15j77J17n8kL8r0J49j93K39k54K48k40K18j91J33p2J5M8j08J66k07K26
4857A10k55K71k51K25j88J38p8MO1j08J64k15K63k80K74k56K19j75J32p5mO2j15
4880g7J79k18K45k56K56k47K09j71J21o7OO5j18J70k20K26k28K43k19J92j54J06
4902D3n8MN1j21J80j98K12k26K35k22J95j54R0m0j6O7j01J49j99K20k27K21j98
4925i3J77j43R1m5j4O4j03J33j69J97j98J87j74J57j23P9k4j1M4q3J21j37J53
4948H6j63J58j53J29r9O8k6j0L8o9Q5j15J30j31J33j24J05q8N5j8j4M3p0R2j06
4973f4J17j22J14r1Q0p0N3k4rL3m8O4p8Q6q5Q6p9P1n0K3j1mK5l7K7k9L8n1N3m8
5003c0K9j9K4j3NrMK2l7K9k6L4l0K5k2J4jKkJKj0J4oKQpjNoMkJ9j7J1j3J4k1J3
$$ plain form
4834 -110 105 -72 45 -13 -15 23 -67 82 -111 128 -126 122 -118 100 -91 42 -30 -15 33 -75 91 -116 110
4857 110 -145 126 -125 100 -88 50 -28 -24 37 -71 93 -122 141 -139 135 -121 98 -77 55 -20 -24 38 -77
4880 -77 102 -116 129 -127 129 -118 91 -80 41 -26 -20 45 -73 97 -123 103 -125 118 -101 91 -63 43
4902 43 -15 -11 40 -81 99 -99 113 -113 122 -100 95 -59 31 -9 -25 42 -59 90 -109 111 -116 105 -93
4925 -93 84 -59 32 -13 -27 37 -66 67 -102 95 -103 84 -90 67 -56 23 -1 -12 32 -51 70 -67 86
4948 86 -77 81 -72 57 -42 26 0 -10 28 -41 44 -71 59 -72 61 -63 42 -46 9 -9 -23 20 -50 42 -64
4973 -64 53 -69 45 -46 34 -36 17 -7 -16 17 -31 33 -45 41 -44 42 -37 34 -16 7 -4 -8 17 -20 7 -22 16 -35 18 -30
5003 -30 -1 -20 4 -9 -4 -13 -9 13 -24 5 -21 13 -17 8 -14 0 -1 1 -1 0 2 -8 6 0 2 10 3 2 7 1 5 3 22 5 16 3 17 -4 9
5042Ij1%njJ6j5L2m1L5l4L8m4M0k2J1jj7K1k8M2m3M8n6N9n0M1l2K2mk1K5k9M6
5075C1n3N1o1P2q0O0k9J9j4oK7m8O6q4P9o4O6o1N5n2L4j7j0M7m9N8p3Q5q3Q0p7
5106c1O5m7K3pj1L5n6P6q5J00j06Q6q0O8o0K8Nj5L1n0N4p0R8r1P4p8N9l9L4j5
5136ej0L6m8N5o0P3p9P3o6N3m1K6lj0L9o7O9p2O8o1O4o3M9l0KK1m0M1n1O1n2O0
5168C2o2N4n2L6j0%Ol0M3l9N4n7N6n3L3k0K7j4LPk1L5m2L3k0J1j7J9nMjrmj7K9
5203Ij7J7k1K1j7ROj8J8pK5k6J6k2J1k%J6k3K6k3J8j7J3j9K0j3mJ7k0K5l9M8n1
5237b4N4n2M1j9mJ5k2L7n7N8o3O9p3O1l8L6k5NJ3l4N2n7P4r0Q8p7P7n8K7j4oL1
5269B5n1O8p8Q5r7R4r5Q5o0M0j1j8M5p0P9r2J04j25J29j08Q3o8M8j2j6M8q5J09
$$ plain form
5042 9 -2 -2 -7 -8 8 -7 25 -16 19 -15 23 -21 19 -3 8 7 -10 11 -17 25 -18 30 -26 33 -17 24 -8 14 10 -11 14 -15 31
5075 31 -22 29 -32 40 -40 20 -9 10 -4 -10 17 -31 35 -49 30 -34 32 -29 26 -26 8 -9 -19 28 -21 37 -36 49 -34 46 -31
5106 -31 34 -13 10 3 -8 27 -29 47 -38 62 -44 42 -38 30 -30 -2 3 -12 19 -31 23 -47 51 -40 34 -44 15 -24 10 -5
5136 -5 -15 21 -27 28 -32 41 -38 35 -31 22 -19 7 4 -6 33 -34 35 -37 31 -30 34 -29 20 -10 -8 13 -27 14 -37 24 -28 32
5168 32 -30 24 -28 8 -2 -2 4 -26 17 -22 32 -25 31 -22 11 -9 18 4 7 14 -7 28 -14 19 -1 10 -7 12 7 11 10 1 -3 -20 9
5203 9 -8 9 -12 9 -8 1 7 -11 7 0 25 -1 15 -7 4 2 2 18 -5 21 -2 16 -1 12 -7 13 0 -4 13 -7 18 -21 27 -24
5237 -24 30 -22 19 0 -4 11 -11 26 -31 27 -36 33 -40 21 -17 19 -6 -1 12 -22 30 -27 47 -43 45 -32 45 -13 14 0 -6 25
5269 25 -26 42 -36 49 -48 46 -49 36 -24 16 5 -13 32 -38 41 -51 53 -72 57 -51 32 -36 12 0 -16 32 -53 56
5297E6j29J40j39J34j19J09p7L4nj7N3r7J26j41J53j47J43j36J03o6L0%l1P0j02
5322e5J19j41J60j63J54j36J11q1N3nm0Q3j14J30j55J65j64J48j40J19p6L9J1
5345B2n6R4j23J56j67J74j78J54j40J12p4K8K2n9R5j20J38j72J89j79J57j55J25
5368D3p1L3J0n9R8j16J45j61J71j56J43j30R6o6K8J8m8Q3j19J42j53J46j50J46
5392G3j27J01p5L0J1n2R4j13J33j49J56j44J30j22R8o2L0J1n7Q4j06J30j38J49
5416H5j47J35j19Q8n5K3J2n4P6q8J22j34J35j39J10r6P2m2K1Nm1O2p1R4j18J18
5442E4j07J00q8O3m6K9Pl4N5q2R6r0Q7q3Q2p3M9l2J9J6l1L4o2Q0p4P5q3P5o7N4
5472B3m0K3lk2L7m9O0p0O6n8N8m6L7k3K0j0lJ0k9M2m3L8m2M4l4K8j7P%j0K6l4
$$ plain form
5297 56 -73 67 -72 62 -57 52 -25 9 4 -13 40 -57 69 -72 81 -66 77 -59 44 -22 8 8 -23 47 -55
5322 -55 64 -77 83 -80 74 -62 49 -32 21 16 -24 59 -55 75 -80 85 -79 69 -71 48 -28 11 22
5345 22 -34 60 -63 93 -74 100 -78 76 -64 48 -26 2 24 -35 60 -60 78 -94 95 -84 73 -82 43
5368 43 -28 5 15 -44 54 -62 83 -78 93 -63 80 -50 46 -20 8 26 -22 61 -58 84 -69 77 -73 73
5392 73 -54 47 -28 2 13 -39 55 -58 75 -74 82 -62 68 -54 44 -18 12 23 -34 50 -56 74 -64 85
5416 85 -62 73 -46 42 -13 10 22 -32 44 -44 78 -56 79 -60 50 -46 26 -16 5 10 -31 31 -40 54 -64 54
5442 54 -53 47 -41 22 -24 5 12 -22 33 -49 47 -43 44 -39 43 -30 19 -13 6 22 -9 25 -37 43 -31 44 -39 36 -31 23
5472 23 -17 6 3 -19 18 -31 29 -41 25 -33 25 -21 16 -7 13 3 0 10 -19 23 -20 18 -24 20 -14 14 -3 4 4 -6 20 -14
5504a4K9k9K4k0K9k8J8j4QKjj5PoPRk3J6nJ1j6K0j3J2pjj0K7k7J8JoQj0J2j9K8
5541B2j8J4l3K5j5JJ7okj1J4k7L8m3L4k7L6m1L4k6J2Nj3K1l1L0l8N1o2N3k7K5
5573A2k1K2jk1L4l7L0m0M9m5N0n1L7k7J5Kj0J1j7L6m5L6m4M6n3N3l5NJ0j2K4k7
5605a4M9o0M6n0M6k6L2k7J4jj3L0l5L9l6L8l6K2k4K5k5Rnj2L1m0M2m5M4l6L1l3
5637b0K1j3ONk2M2l6L6m2L2l0M0k6R%kMoJ4j4J6k5L3l2K1j2NKjJ6k9K3j7NpN%
5674AmNj0OoJ2j7J5j5LQmPj2K4k6K2k3K8rJ0j4%Pj8K3k8M1l5K9k8J9j8J0rKK2
5711A8m2M8m2N2n8N3n0L1j6J3Nl3M5n2N3o8P9o3N8m7K2JoJ7m0N7o0P5q5R4r5P6
5743D0o1L0k2LL6n7O8q7R7j01Q8q0P7n7L4nk2M4o3P7q9J06j08J09r9P9n9L2oj7
$$ plain form
5504 -14 15 -14 10 -10 19 -9 9 -5 3 5 4 -11 -4 -10 -3 6 -17 -1 -6 5 -11 9 -4 8 1 0 -10 17 -10 8 9 3 11 1 13 -6 22
5541 22 4 18 -15 10 -5 -4 13 7 5 -6 8 -19 19 -24 10 -17 19 -22 12 -14 -2 3 -10 11 -20 10 -28 23 -39 14 -13 12
5573 12 -9 13 12 -9 25 -12 18 -22 27 -18 32 -19 18 -9 6 8 -2 9 -8 28 -17 19 -25 21 -32 21 -14 -9 1 -11 13 -14
5605 -14 35 -25 21 -29 17 -9 23 -4 10 9 -4 26 -9 30 -6 32 -4 18 -6 19 -6 3 -2 -14 17 -23 19 -26 18 -18 13 -20
5637 -20 1 -12 -6 -1 -23 19 -17 19 -23 9 -21 19 -7 2 2 0 4 -2 12 -2 14 -11 22 -10 11 -1 4 6 5 21 -8 15 -2 3 -4 1 1
5674 1 -3 2 -8 -2 -8 4 -13 2 -13 -10 -2 -6 1 -11 13 -13 9 -14 14 5 15 1 1 8 -10 13 -15 26 -9 20 -8 11 -7 3 -6 -4 18
5711 18 -24 24 -18 34 -24 29 -21 10 -6 7 12 -21 24 -28 25 -43 36 -27 31 -16 6 7 1 18 -22 35 -25 50 -35 59 -36 40
5743 40 -21 9 -13 -10 26 -31 37 -50 47 -54 34 -46 31 -26 8 3 -19 25 -38 39 -50 56 -52 57 -42 37 -22 10 4 -13
5773a3M0p2J07j11J20j16J21j24Q3n6L8ml3O8j03J14j22J36j49J54j33Q9o7L9
5797FJl3P5j05J16j27J45j51J33j13Q9n8L9kl4N8r0J37j43J37j36J21j25J12o8
5822a6L4Nm8O6r6J32j42J51j57J34j28J01o2L1J2o1R2j15J34j57J63j53J45j17
5846e2R3n8J5J1m7J02j25J43j61J56j44J43j28Q9m7J7J4m6P2r6J26j46J47j42
5870f4J26j09Q5o6K8K2m9Q8j19J27j37J37j26J12j03P5l9RK3m9P3j00J34j47J42
5895G3j31J14r4P6o1J8K9n7Q5r2J02j23J27j18R9p5M0k5LL1n1O8q0R6j12J09j00
5922d9Q2o1M9l6PK4m5O3p1Q1q6R4p7O3n8L7j4qK9n2P0o5O7p9P8p0N3m5L0k4rK3
5954Ak9M5n2N3m6N6n7M5l1K0j3lK2k2L1l6M5m4L5l5L2k6K2j3jJ1j0J9k4J9j6N
$$ plain form
5773 -13 27 -45 62 -49 71 -45 76 -48 35 -21 17 13 -20 48 -55 59 -63 73 -76 78 -55 34 -33 6
5797 6 7 -26 49 -56 60 -67 78 -73 60 -53 36 -22 17 15 -19 39 -51 86 -57 80 -56 65 -60 52 -16
5822 -16 18 23 -25 41 -55 77 -65 86 -71 63 -65 36 -26 5 17 -44 48 -67 67 -90 73 -80 65 -52
5846 -52 41 -17 -2 9 -38 64 -61 82 -79 77 -67 76 -52 37 -10 7 21 -25 47 -49 77 -69 78 -64
5870 -64 62 -47 38 -28 0 22 -27 61 -58 69 -68 69 -57 55 -48 27 -12 -3 20 -29 44 -56 78 -69 73
5895 73 -58 56 -38 38 -23 -5 24 -33 52 -40 62 -61 66 -52 47 -28 12 -13 -10 21 -30 38 -42 54 -58 51 -49
5922 -49 33 -28 21 -15 -8 16 -29 34 -37 44 -42 52 -25 38 -20 17 3 -5 24 -28 42 -23 44 -35 43 -27 26 -19 11 -13 -22 1
5954 1 -28 17 -35 18 -28 28 -29 16 -15 5 -8 -11 11 -11 20 -16 29 -15 20 -15 17 -9 13 0 -1 10 0 19 -5 14 -2 3
5986Cj6K8l5J8lKNj5J2j6J5j1J4l%qJ6j3J0pJLQmqPLOj4J3pRj8J8k1K3l3K2k3
6025a9J9lNJ2k2J7j6J1j7K1j7J5j2MoPKoJlK9k8L3l3L7l2J2ojmJJ6rPk7L1l5L8
6063B2l4K4j8QKPMl3L5m0L8l3K7j3PqJ2lj7K2k4L5l9L8k1Qj6K8j5MJ0j1J7l7L8
6098B4l9L6m0L0k5L5j6j0J2j5K0l3L1k8M0m3L4j1PloNj7K8k6K5k7L2k1J2oJ5r
6131A1rljJ6j8J8k0K6k1MnP%lRj2J2j4Pj0Pj3PkMOj6K5j7RKqJ2j4J7j0KqK0j5
6171BPlJ3rj2MkK5k7J3l1L1j9QMj4K0j6K1l1L4k7K0l3L2k0RooL1l3M0n0N0l9M0
6207B6m1K9j2%Qj8L2l5L4m1M5n6N6n2M7l0lJ9k5L7m2O1p9O6m6N4n5L2k1OJ9m0
6239b5N4o8P9q3Q1o7O3m9K3q%K4l8N0o5P6p8P3p1P5o1L5j8j1L5n6N4p3J02j01
$$ plain form
5986 3 -13 15 -20 -2 -5 -3 2 -13 -1 -17 -2 -13 1 -2 -2 -10 6 -7 3 -4 -3 0 8 4 -4 3 6 12 -2 11 4 13 -5 13 -8 15 -18 4 -19
6025 -19 0 -3 2 14 -8 9 -7 4 -13 8 -9 6 -6 -2 -8 -1 1 -5 -4 -7 22 -6 27 -6 31 -1 11 5 4 0 1 17 8 15 -12 19 -16 22
6063 22 -12 12 -6 2 4 11 15 -18 17 -23 15 -18 9 -4 3 -5 7 4 -13 9 -15 20 -19 19 -2 6 -10 18 3 7 17 6 23 -14 24
6098 24 -15 21 -19 11 -14 21 5 -5 7 -8 12 -21 10 -18 22 -21 13 2 9 6 0 5 -12 16 -10 15 -12 20 -1 11 5 20 11
6131 11 2 -1 -2 14 -4 14 -6 20 -1 3 -2 5 5 2 11 -1 11 -3 4 -6 1 -12 -5 -7 -3 3 -13 12 -5 4 6 -2 10 -4 13 3 5 -3 17 2
6171 2 9 6 19 10 -2 2 0 25 -2 11 -20 11 -8 0 4 -10 10 -6 15 -16 18 -9 11 -22 10 -10 -1 -7 -13 18 -15 25 -25 25 -14 26
6207 26 -15 14 2 2 10 -8 24 -11 23 -18 27 -29 27 -25 22 -8 -11 8 -17 20 -22 39 -40 26 -20 34 -21 11 -10 -4 15 -25
6239 -25 29 -39 40 -43 38 -29 34 -15 8 0 0 24 -14 36 -29 47 -31 42 -29 46 -15 20 2 -9 26 -30 24 -49 53 -48
6269d8Q8q2P1o5M8j7j0M7p0Q2r7J03j01J12j00P8n4K4j1j2M6n5O8r0J06j16J16
6296F1j00P8n9L7j4j0L0o9Q9r2R8j11J11r7Q2n8K7mj9N0p5R4j07J09j07J14r5
6323c7P0m9L6mk8M0o6J04j15J12j03R6j05Q9o0L5rk4M2n4O9r7J12j11J12r8P9
6350C6n7K6J0k6L6o2Q0r1R7r4Q6p4P0n2K1Qk7N6p1Q0r5R3q9Q7p5N0l0J7ok1L9
6381B2n9P7q7R4j00Q7p7O2k8J1Ml4N7o2P0p7Q0p8O5n4M5k5MJ0k3L2m1O3o0N8o8
6412c2N6l8L4k3OjLK3m9M9m5M2m4M5m9L3k4J0KqJ8k3L7l8L0l4L8l4K0j7J0QmJ9
6446B0j8J9l6K8k3K0j5PrQJ6rkoJ1k3J9j2Pj5J2j0KMNj5J3jokLJ0nRoPj0J2qJ3
6486A4oKLmOnRk5K3k4J1j7K1j1MkJ3j3%j0RJ2k1J6j9J3%Mj5K1j2J6mnJ0k2J3k3
$$ plain form
6269 -48 40 -42 29 -36 12 -5 -15 32 -38 44 -53 50 -51 61 -39 39 -15 9 -2 -14 32 -23 45 -45 61 -55 61
6296 61 -39 39 -20 17 3 -7 23 -46 43 -49 49 -62 49 -48 34 -24 3 -1 -20 30 -45 49 -58 51 -56 58 -37
6323 -37 33 -16 20 16 -12 28 -38 66 -49 63 -40 56 -49 40 -20 15 6 -18 24 -30 39 -58 54 -57 55 -43 36
6350 36 -21 5 15 -11 25 -37 43 -48 49 -45 41 -33 37 -15 6 14 -13 43 -28 52 -43 50 -39 48 -27 23 -7 10 4 -17 22
6381 22 -37 40 -47 47 -53 34 -43 19 -9 2 6 -28 29 -33 37 -40 40 -38 27 -27 18 -7 -3 7 -16 16 -25 38 -22 36 -32
6412 -32 24 -14 20 -3 3 2 5 28 -21 28 -17 25 -19 26 -23 10 -14 -4 -2 -10 8 -15 22 -16 14 -20 18 -16 4 -13 -3 5 1 20
6446 20 2 21 -15 13 -10 10 -5 2 -7 1 17 8 6 0 11 -12 7 -5 2 -13 -1 -11 -9 -5 0 -15 -2 -3 -9 -11 -8 2 -3 6 0 7 -3 9 1 14
6486 14 8 10 13 9 15 10 19 -6 17 -7 4 -13 8 -3 1 -1 12 -1 -1 -11 -2 10 -11 5 -14 -1 -1 3 -12 9 -3 13 9 4 14 -8 5 -18
6524a8M1k6K6l1K9j8Qj0RKj6K2l4L4l0K7k7K7j9Pj1OMj5K0l5M4l3K4k0K0rOkK
6559DPl2M7m2L8m1M8l9L2k1J6pnJ2k0K8m3L7l7L9l3K1k2J7qmJ6k0K0k6K6k7L3
6592A4k9L1j4J0jj7J7j8L4l7L2l1K9l2K9j8J6qoJ8k8K0k4K7j8J6j8J2nj0J4qQ
6625Ej4J4k3K4rNj2J1lnJ6j9K6j2J3k2K7j5NlkkOpMRrKj2Rn%Ok5J0MJ1j5LkLN
6667Bn%j3J9j1J8j5Pj3K7nmNj1J7j5K3l4K3j6OmKNOKj9J2k4K9l5K0j6K9l2J2J
6704gj2K8k8K8k9L5m2M4l2J5lMJ1k4K9m0N3n0M1m1L7k6K3kpJ8k7J5k8M2m1L9m7
6737b4L4j9J0jj4J9k6L9m6N4m8M2n4M3k3K0nmJ2k6M4m1N0n2N2n0M6l7K8j7qJ3
6769A1k6M0m3M6n3N8n4M1l3K5j3mK0m1M7n6O4n9N1m9L5l2L0mj6K6k9M4o2P7o8
$$ plain form
6524 -18 23 -3 23 -8 21 3 11 1 10 12 -4 18 -16 18 -12 15 -12 15 -4 3 -8 -2 2 -13 7 -28 16 -17 7 -13 7 -2 4 2 4
6559 4 11 -21 26 -16 22 -19 29 -10 22 1 17 10 5 17 -3 25 -18 19 -18 21 -12 9 -13 4 -4 -8 8 -12 8 -18 8 -19 14
6592 14 -15 16 2 12 11 -6 11 -7 27 -10 22 -9 20 -12 17 -1 15 7 1 19 -9 11 -13 14 -4 12 -6 6 1 -9 5 -3 5
6625 5 -9 5 -18 6 -3 2 -10 1 -2 -7 9 -10 16 4 17 -5 22 7 12 9 7 5 11 4 8 17 8 10 -2 7 2 2 8 -17 -7 -3 8 -7 -4 -6 -3 2
6667 2 -3 -3 -16 3 -8 10 -5 2 -11 16 11 7 12 1 18 3 26 -8 15 -1 5 1 3 8 14 16 -3 9 -15 14 -21 -1 -17 12 -20 -8 -7
6704 -7 -19 9 -19 9 -20 15 -27 17 -15 0 -3 1 12 -12 17 -23 30 -20 21 -20 17 -9 14 12 5 23 -4 11 -17 25 -16 23 -24
6737 -24 10 -9 1 0 -14 5 -21 18 -28 26 -22 20 -34 9 -14 6 1 -3 9 -17 27 -14 36 -16 36 -14 32 -5 23 6 -2 11
6769 11 -15 25 -18 28 -25 33 -21 20 -13 12 -1 -5 15 -26 21 -35 29 -30 21 -28 7 -25 5 1 -15 11 -18 26 -36 41 -27
6800b7N2m2M8m5K9kj5K6m9N8o8P1p2P0o2M8l4K3j6lK0l4N4o5O5o8O6n8M7m8L8
6831GlqK1m3M5m3M3n4P0n3M2m0K0Pj9L0l6L9m6M0l8M4l9L7m0K2j4kJ9l8M2m2N8
6864B8o1N9n0L2k9L1j7NJ8k8L4n4O5n8M3l2M6l6J9j3KJ5l2L0l6N2n2N0n2L5k1
6895gK7k7NLqJ2l6M8m6M6m1M0l4K7j7R%j0K2k7L4k7L8m1L4l2L1k5Q%oJ1k0K8k9
6930a0L4k9L3m1L3k6J7j1lJ1j4J3j4K3l1L6k9J0pJ7j6MJ2j2NkK0k4J7j5K5k6J9
6963A9j0jpPJoJ1k3K4k4K3l8L7k1QkJKj6J1qJ9j9K8k2J6j6J9j1kJ6j1Oj5J5j1
6999@K0k4J5j1J4k5J6%MPk7K0l9N2m6L3k2J6k1RMpJ7k7L2k9J9j4K2j9K1rNlLP
7035A3k1K6l6L8k2J3j6J6j0Oj0NOj7J8k2K7k4J9k6K2k0J3NjljOk6M1l3L8l2J6
$$ plain form
6800 -27 25 -17 31 -14 15 13 -2 24 -25 33 -35 36 -36 34 -28 20 -14 9 -7 -10 10 -24 30 -35 30 -38 28 -30 17 -31 7
6831 7 4 -4 17 -26 19 -24 19 -35 35 -18 24 -16 4 11 -8 22 -14 25 -21 19 -19 25 -14 23 -17 5 -9 -11 8 -30 12 -30 28
6864 28 -33 26 -24 8 -21 10 -7 -2 16 -12 22 -32 33 -25 18 -14 32 -4 15 2 4 19 -13 17 -19 33 -19 31 -21 14 -7
6895 -7 20 -7 -2 1 -7 5 -31 17 -29 17 -24 16 -18 9 -8 1 1 -9 13 -14 20 -7 31 -10 24 -8 23 -2 6 6 0 11 -9 19 -10
6930 -10 24 -5 28 -13 20 -6 11 0 -3 8 -6 7 -7 16 -15 21 -8 2 -5 12 -4 0 12 0 5 3 23 -1 16 1 26 0 19
6963 19 9 8 1 8 9 3 14 -9 15 -9 14 -24 13 -8 0 -2 -1 1 -15 -4 -12 7 -12 16 -6 10 -6 13 2 0 16 5 11 -4 11 0
6999 0 20 -4 11 0 14 -11 5 5 9 16 -11 9 -30 22 -24 9 -13 3 -18 -9 -5 -12 5 -22 10 -19 0 -14 8 -11 10 1 6 3 6 13
7035 13 -8 18 -18 20 -2 11 -5 11 1 7 -3 2 8 -9 9 -13 14 -10 9 -17 5 -15 -2 3 2 -1 -2 4 -22 19 -14 24 -8 8
7069Hj3J6j3LJ0j1J1pJ9l2K3j6J1qJ1rMPoQk9K0k5K9j8jJ5rJ0qPk5J8k4K2rQJ
7107bkmkJ9j4J9l4M9l1K4k3J2oKNlQl2M7n3L8j7Kj3QmlJ6k6L5k6K6l3L3k8K8k0
7144eOrNK1l1K4k9L9l0K2k3J6N%kj0K3l3L6m9M5l2L6k8J1mj3J7l1L9m7N0n0M4
7178A3m3M8l4J7%j5J9l1N0o4O9o0N8m7N3l7K6j4k0M1m3M8n6N5o4O8o1M0l1K1K
7209Hj4K3m6O6p4P1p6O8o1M7k7KPj8L4m2O4q3R0p4O8n7M6j9j0J9k1L6n6P6q2P3
7241C8o7P1p0N2l4KK5l3M7o8P3q2P7o7O6o1L7oj5K6l5N5p9Q7r0Q9q8Q7p0N5k6
7272dNK0l6N2p5Q9r5R1p7O8o6L3j6OK2l8N6q5Q4q6Q9q6P0n7M3k3%L3n5N6p0R8
7304D6r2Q9q8P7n6L1j6%J9m3P4p9Q3r3R6q9P7o5L7k1%J7l6O0q1R4q9Q2q6O7m4
$$ plain form
7069 8 -5 11 -2 1 11 0 11 4 23 -9 14 -2 9 1 12 3 7 14 8 16 -13 7 -18 11 -7 -8 7 -2 8 0 7 -18 0 -24 -2 -11 -3 -2
7107 -2 -4 -8 -10 9 -5 14 -20 29 -2 22 -1 11 5 7 12 9 17 -15 32 -21 17 0 2 -11 -3 -7 -10 6 -20 15 -11 15 -18 15 -13 15 -5
7144 -5 1 -8 -3 18 -13 11 -18 21 -9 13 -10 6 11 11 9 -1 22 -11 25 -24 21 -11 25 -3 8 4 -9 8 -23 16 -31 19 -31 13
7178 13 -30 18 -16 1 1 -14 5 -26 24 -40 29 -31 27 -20 33 -4 22 8 -12 29 -14 34 -22 33 -31 37 -24 16 -15 6 8
7209 8 -6 17 -29 37 -37 34 -42 26 -35 12 -15 -13 -6 -24 10 -32 32 -51 39 -35 33 -24 22 3 -7 12 -9 27 -29 47 -35 38
7241 38 -29 42 -28 24 -10 -8 17 -16 31 -37 36 -46 31 -36 30 -31 6 0 -15 11 -24 31 -48 39 -51 38 -50 37 -33 22 -4
7272 -4 1 21 -15 37 -38 51 -44 47 -30 38 -28 5 -11 -5 17 -21 35 -50 34 -52 37 -49 21 -36 7 -16 -16 17 -38 18 -52 46
7304 46 -46 43 -45 32 -24 7 -9 -9 10 -33 41 -38 45 -48 48 -41 36 -29 8 -13 -13 4 -32 28 -53 41 -48 34 -52 15 -29
7335b9L8j5j2L1m7O0p1P6q8Q8p4P2n6L7j3pK9m3O3p5P4p9P3o5O9n8L1j4PJ4m2
7366b6N6p6Q0p6Q4p2N0m7K5j4j0L6m9N9o0O9p0O5m9M4l0K8rnJ3k4L8n1N0n0N1
7397C0m8M1k8J1%j2K7l9L7l9M3n2N3m7L5l5L4rj6Rj4L4m2M9m5N0l7L0l2K1lLJ7
7430B6l7L9l6L5l9L8m2N2k4Kj0LMj7K6m1L3l8L2l4L5j1Pj0J0jnLk0K2k2K8j7K1
7464A2j6MoMMlJ5k4K0j8L1k4QpNoPKoj3MJ0k2K6k3K2k1J4j6K2j4qK0k0J7oJ0k
7502BMj3QP%moJ1j2J2lLj7J4j2J0qmJ9j3KlMj6K0qRk1P%%%KOnJ1j1Qj2J1jL%L
7546GoJQkJ6k0OpJ1k4K1j1RJ1j4JlRj9J3j7J8j2RrpK1k0J7k5K4j0Nj0J2mNnmJ0
7586EqJ1j5L4k8J9k3J6j2PlrK1j9J8k9K8l1K6j9Lr%J0j0K8l2K5l4L8l2M2k9K0
$$ plain form
7335 -29 9 -6 -18 13 -34 26 -45 31 -57 31 -43 29 -27 10 -3 -10 19 -24 39 -36 38 -41 32 -33 36 -22 9 -5 2 16 -26
7366 -26 30 -46 34 -42 42 -30 20 -27 -2 -16 -26 10 -39 20 -40 29 -41 24 -25 19 -11 17 8 3 16 -8 30 -21 29 -21 30
7397 30 -18 23 -5 6 6 -6 21 -18 19 -20 23 -29 24 -23 12 -23 11 2 -14 -5 -19 15 -27 22 -23 27 -10 20 -12 9 6 9 26
7430 26 -11 28 -8 27 -12 26 -16 36 12 14 4 7 11 -6 20 -21 12 -26 6 -28 7 -4 3 -7 3 2 -3 0 -20 2 -20 8 -9 12
7464 12 -4 0 -6 -2 2 -1 14 -10 10 -8 23 -1 7 0 5 -1 6 8 2 -11 -7 3 -19 7 -16 6 -15 -1 -17 5 -9 -17 3 -17 0 -6 4 2
7502 2 6 -7 1 8 8 4 -2 9 -3 9 6 9 -8 6 -6 4 -4 -8 11 -2 0 -3 1 -15 5 -3 6 -15 -8 -8 -8 -8 -6 0 -5 6 -5 3 -9 2 1 4 4 7
7546 7 1 2 10 8 24 4 10 3 14 -10 11 0 9 20 6 7 4 13 -6 7 -10 8 -4 5 -4 -11 10 -10 7 -18 6 -4 1 -9 3 -1 4 -1 -5 5
7586 5 -3 8 -7 27 -1 18 -5 11 -1 6 3 -6 15 -4 14 -15 13 -18 8 -11 -8 -17 -17 -7 -17 11 -21 4 -30 8 -24 18 -11 9
7620Ij5OQj5L1l7L4m3L7k9L2l1J7j1RJ3k3K9l8M3m7M0k9K1k8J3jj2K1l5L8m5N1
7653A3l8M0m3L3j5J3pnK8l8M2n2O2o5O8n1M1l0J2%j1K0m8N9o4P4p4O4n8N6m8L2
7685A0mj8K3m3N5o2O9p7P0o1M9k9K0K1l5M1o3P5p0O9o9O8n9N3m0K0jk2M3o7P4
7716D0q4Q5r3R2o3L7k7J3Mk1M4p3Q7r4R8r3P1n8N4l6J9Pl4M9o1Q0q9R2q9Q6o3
7747b0N7m3QJj8M9p5Q7q8R4j01P7n6M8k9JRm1P0q3Q7q9Q9q3P0p0O7l6KK8m4N8
7779B6p1Q6r2J04q8P2o4N3k5lK2l9P0p7Q1r7R7r6P5o2M8l3KK3m3O3q1P9q7J05
7809D8r3P1o3M0k2QK7l8O1p6Q5q7Q6p9O6n4L1j2j2L3m3O6q2P7p7P6p1O1m9L4j4
7840bj3K4l1N7p5P6p8P7o8N5n0K3Kj6K9m8O3o4O4o4P0o2N4k3J1j0qL4m3N1o1O0
$$ plain form
7620 9 -6 0 8 -7 24 -13 21 -22 15 -14 18 -13 4 -7 2 15 -8 21 -17 26 -21 19 -10 11 -17 -4 -5 -17 4 -31 7 -38 13
7653 13 -25 15 -28 5 -10 3 -4 -9 19 -19 23 -29 33 -32 36 -15 26 -4 8 8 -3 17 -31 28 -36 38 -36 28 -30 26 -22 10
7685 10 6 -12 11 -32 23 -39 30 -47 23 -38 11 -18 2 23 -12 29 -34 41 -29 40 -29 39 -20 33 -7 13 12 -10 33 -34 40
7716 40 -44 41 -52 40 -23 14 -13 0 4 -17 27 -46 41 -53 45 -48 23 -35 19 -17 2 9 -25 24 -37 43 -46 46 -43 43 -20
7747 -20 37 -6 2 3 -15 34 -41 46 -42 52 -49 28 -28 20 -9 -8 1 -40 30 -53 34 -55 34 -49 21 -49 18 -18 -16 12 -32 26
7779 26 -45 41 -51 53 -35 37 -27 26 1 -2 20 -19 51 -26 55 -42 55 -41 34 -28 20 -13 -11 12 -31 32 -49 30 -57 48
7809 48 -45 26 -37 3 -19 -11 16 -22 39 -37 48 -39 47 -32 34 -20 11 -1 -13 20 -23 43 -39 38 -39 37 -34 27 -22 12 -2
7840 -2 -15 9 -22 35 -40 36 -42 35 -33 22 -28 -5 -3 -19 10 -38 25 -39 25 -39 31 -31 23 0 11 1 -7 27 -16 35 -26 34
7872C4n5M8n1M6l6K7j1k6L5l0L4l8N1o5N5m1M1l5J4Kj5K0k9M9n7N1l9L8l1K3j2
7903cKJ3rJ9m9L9k5L8m7M9m0L0j8KKj2J2k2M0m1L7m3L0k0K1k7NJ9j2J8j8J3j1
7936hJ3k0K8j5J3j5RQk2K5j6Rj2J7k2J8j5QkJ0Nj5J2k3J7k7J4pRmJ4pk%JPj5Q
7974bmJ4j2J6k3K3llj%Lj7K1j3Mj1Q%lPrOnJ4k0Qj1OokJ3j4LjJ1llkJ0rJ9j8j
8017a0mMMMJ2j7J2j3J6nmpLNNj0LlKMoJ1j5RrPqKOpN%J1j8J8k1J0pJ6mlKkJ3j5
8062dJ3j6K4k4K5j7J3j7OkkPrJj7L3l4J7k5K6pKJ%Kj6K8k2K5l4L2k8J8PllrK2
8100A3k3K9k7K6k8L3l7K9j6J0jj4J9k9M7n6M1m2L9k5J0j0J2Jk3J7k0M3n1N8m0
8131a5M1m9M2l1K2j3oM0m8M9n4O0o3N6m9L9k6J0Ol4N0n4O4p9O6m9M4n4M6j6jJ0
$$ plain form
7872 34 -21 27 -24 22 -14 13 2 -24 11 -19 15 -23 28 -37 18 -23 18 -17 -3 -1 -16 4 -25 24 -33 18 -21 17 -14 9 -3
7903 -3 -1 12 3 22 -27 12 -13 25 -22 27 -13 17 -1 1 3 -9 3 -19 21 -20 17 -26 4 -16 5 -22 -17 2 -10 8 -10 3 -8
7936 -8 5 -15 13 -2 11 -4 5 13 -9 16 0 9 -3 14 -8 10 -5 3 1 11 16 1 13 -10 7 -20 -6 -13 -4 -8 6 -1 -3 -3 -2 5 -10 -2
7974 -2 -6 8 -4 12 -11 12 9 6 5 5 8 -9 12 -1 3 -8 0 0 -3 4 -5 1 -4 10 -10 -2 -13 -7 -13 -15 -2 -16 -13 -14 -3 -6 -9 -11 -1 -10 9 -9 -10
8017 -10 -14 -10 -6 -2 10 -7 5 -8 8 3 -1 -8 -5 0 5 -5 -2 -5 -3 1 -5 6 -9 0 -9 -2 -10 -8 -2 -9 -4 -4 7 -11 7 -14 -4 -11 5 1 -2 0 -2 11 -4
8062 -4 9 -7 17 -7 18 1 14 -3 3 1 -1 6 -3 -2 -19 14 -20 -3 -28 -2 -9 -7 -6 -6 -4 -20 8 -14 11 -23 9 -19 -1 6 3 0 -9 13
8100 13 -10 19 -8 18 -10 23 -14 15 -1 9 8 -6 13 -16 31 -25 16 -26 13 -12 -2 -12 0 1 -22 -5 -25 18 -33 25 -15
8131 -15 26 -23 19 -12 10 -3 -9 31 -17 32 -22 38 -25 31 -18 21 -5 5 11 -23 27 -27 37 -42 24 -25 19 -35 11 -5 -6 4
8163Dl0M0m6N4p0Q0o9O2n0M0k2J0J4l5M6o0P5p5P4p1O5n5L7k1NJ8m4M8
$$ plain form
8163 4 -26 14 -32 22 -48 32 -37 25 -25 15 -7 3 17 -18 28 -32 43 -32 42 -29 36 -19 18 -3 2 20 -24 24
8191B4
$$ Imaginary data points
##PAGE= N=2
##DATA TABLE= (X++(I..I)), XYDATA
0@%%%%%%%%%qJ6j6K4l2M0n6P2q8J07j31J60j92K29k72L19l73M34n02N77o60P53
31D01q56R71j099J238j388J554j736J933k147K382k639K916l218L546l902M290
47B246m712N173n675O227o837P508q253R085j0019J1077j2284J3677j5309J7244
61I148j9581K2467k6122L0916l7505M7178o2976R4774k44097P8320K38240j27383
73C379M855r4821K18235l66103N16090m07001J27490j03355K92643l14897J58876
84C5391J9152k18495K82768q5522j081k87927N22980l76814J74661j46152J28459
95D7420j28035K06268j12462j96292L22091j68640Q2593j70438K78282l73196
105b12409L68701j44166m6657p0317K14002p2819j32993J91647k31567K43050
$$ plain form
0 0 0 0 0 0 0 0 0 0 0 -8 8 -8 16 -16 24 -32 40 -48 59 -72 88 -104 125 -147 172 -201 233 -269 308 -352 401
31 401 -455 516 -583 655 -733 821 -915 1018 -1129 1253 -1386 1530 -1688 1858 -2044 2246
47 2246 -2466 2707 -2968 3259 -3578 3930 -4323 4762 -5257 5820 -6464 7213 -8096 9148
61 9148 -10433 12034 -14088 16828 -20677 26501 -36475 58299 -185798 -107478 130762 3379
73 3379 8234 -86587 131648 -234455 281635 -125366 2124 -101231 191412 -123485 35391
84 35391 54543 -163952 118816 33294 32213 -255714 267266 -109548 65113 -81039 47420
95 47420 -80615 125653 13191 -183101 138990 -29650 52943 -117495 160787 -212409
105 -212409 156292 12126 -34531 -104848 109154 36335 -96658 94989 -136578 106472
115A06472j23179R5150k94335L86178j90909P070l910L7467n2091K9443J33091
126A30447l05137K42286r0214J20860k18333K09219j90929J61904j617j15483
136e6997M749Q2064P1856k34055K18285j60837J31433r1657J22165k05695J50717
147C2028R771n8755K5197m4688N8269n8016J61285k53491J45932j2860P5118j67085
159h7295J09195k4898o866O2725r2497L6655l2632J30745j72900J26652r8729
170d9845P1636k6436N7998j09322J8924J09316q3559J4208n7744J08017q7936
181c4743R9385j26175O4792j56L2745n9582J1032L0962n1489Q4176o9900J9402
193D49n1679J22528q8157J5558k9898M6608M474j7022j7974j9237Q7089o5866
$$ plain form
115 106472 -16707 78443 -215892 170286 -20623 -13553 -17463 20004 -32087 -2644 130447
126 130447 -174690 67596 -22618 98242 -120091 89128 -101801 60103 58486 -56997
136 -56997 -52248 29816 101672 -132383 85902 -74935 56498 -35159 87006 -118689 32028
147 32028 41799 -16956 8241 -36447 21822 -36194 125091 -128400 17532 4672 79790 -87295
159 -87295 21900 -2998 -9864 52861 -39636 -2981 -35613 95132 -77768 48884 -49845
170 -49845 21791 -4645 53353 -55969 -37045 72271 -11288 2920 -54824 53193 -34743
181 -34743 64642 -61533 3259 3103 35848 -23734 -12702 18260 -33229 50947 -18953 449
193 449 -51230 71298 -16859 -1301 -31199 15409 19883 2861 -15113 -34350 52739 -13127
205a3127J8974l8554O3069n1557M8955l6292p486J1237K2816J71m9337L3992j5068
218a2207N4220n9496P122j0884O0322l9009j7301J0345J2486Q445k2996J5980
230G027k8970L6847j5800J6272l5164J5288O760J8177k2104k4193K8900J3715
242A6755m025l9612K6049O877R697k6737N582L796P680j943n673j303o715J7929
256H357O49q920j8924K0415J4388j0218k2897Q731K2704m380j9378j309J6952
269F170J190q876j903J632J045K992L746p940p378Q761J1645n516j9914Q279J6791
284A0724Q78k3927L782J4860L277j3789k711R112l34M44m702M944q611O945L245
299D137J732j5596L831J5124j547j4996l768K0049k171q840q592J5299r1m472
$$ plain form
205 -13127 5847 -32707 30362 -21195 27760 -8532 -16018 -4781 18035 18206 -31131 2861 -12207
218 -12207 42013 -17483 -10361 -21245 39077 68 -17233 -6888 5598 14043 -8953 7027
230 7027 -21943 14904 -896 15376 -19788 -4500 2260 20437 -1667 -25860 3040 16755
242 16755 12730 -26882 -833 6044 15741 -10996 -5414 -1618 6062 4119 -1554 -2857 -9572 8357
256 8357 9006 86 -18838 1577 15965 5747 -17150 -8419 14285 9905 -9473 -10782 6170
269 6170 7360 -1516 -3419 -1787 -742 2250 5996 -1944 -9322 -561 11084 5568 -14346 -6067 10724
284 10724 11602 -12325 -8543 6317 9594 -4195 -6906 2206 1872 2316 -2386 2558 -6053 892 4137
299 4137 5869 -9727 -5896 9228 7681 -7315 -11083 8966 6795 -2045 -10637 4662 4571 99
313I9m875O211r2m028N451o55m403m461J3363j086r881m363J3838L447j2343m325
329h103R999O251j0056m087P381K507n054j815O747m696k112L589N108p707m913
344f961J0298J972m587j1191J4602K32j855j2371J2604K062n726k728L513O282
358F146j3258J0920o057Q848j6753J5115m384L394j1572O330J0133j1795J545
371a388o392K2961k4685J3270j1617J9816j9743R224j791J892J47j0556K0298
384A1436j9098J5749k4305L4780k8069J3658j4048K1547j3055n506J2216j0266
396d961J7191k9784L3014k9051L0717l6457L2876j8649Q817j0132P750R788k7813
409a6694K9435k5731L4148m5408M2566l3290L2005l0854J7512j434l955O588k0393
$$ plain form
313 99 -4776 1435 1343 -2685 2766 2111 -2292 -6753 6610 5524 -4357 -8720 5118 8565 -3778 -8103
329 -8103 1896 8147 -1909 -5996 1385 3892 -1162 -2977 3770 -926 -3038 551 5659 -2048 -6961
344 -6961 3337 5309 722 -10469 4133 4365 2510 -9861 2743 4805 -921 -3649 -136 6146
358 6146 -7112 3808 -2249 6599 -10154 4961 577 3971 -7601 -1271 8862 -2933 -1388
371 -1388 -7780 15181 -9504 3766 -7851 11965 -7778 1446 -345 1547 1694 -8862 11436
384 11436 -7662 8087 -16218 18562 -9507 4151 -9897 11650 -1405 -6911 5305 -4961
396 -4961 12230 -17554 15460 -13591 17126 -19331 13545 -5104 3713 -6419 1331 11119 -16694
409 -16694 12741 -12990 21158 -24250 18316 -14974 17031 -13823 3689 2255 -1700 4888 -15505
422a5505L9067m5674M0401l9633M8183n0577L7737k3162J8238j1939n612K2135
434A3659k7348L3393m8972N9414n3855M5927m7958M8907l5420J4894k051m487
446c897J7177l6716M9750n1839N5071o3864O4234n0820L9374l6531K6275k567
458E647j7069K4313l3490N1431o4589O4445o0445O1270o0772M9138k9479J4402
470D802n725q942L2006m8077N2380n9507P1740p2302O0204n3538N2561l9168J3362
483b04O440j5655K6583m5122O3577p2257P0904o8490O8404o1979M6870l3693K2008
496G386J016k8530L9709m0972N5942p8913Q4694p3123O2879n7994N0477l6941
508a4370J7525N293k5628M1497n3740O0204o5376P8231q7398P2313m5316L6232
$$ plain form
422 -15505 23562 -22112 18289 -21344 26839 -23738 13999 -9163 9075 -2864 -8476 13659
434 13659 -13689 19704 -29268 30146 -23709 22218 -25740 23167 -12253 2641 590 -3897
446 -3897 13280 -23436 26314 -25525 29546 -34318 29916 -20904 18470 -18061 8214 5647
458 5647 -11422 12891 -20599 30832 -33757 30688 -29757 31513 -29259 19879 -9600 4802
470 4802 -923 -9865 22141 -25936 26444 -33063 38677 -33625 26579 -26959 25602 -13566 -204
483 -204 6236 -9419 17164 -27958 35619 -36638 34266 -34224 34180 -27799 19071 -14622 7386
496 7386 8402 -20128 19581 -21391 34551 -44362 40332 -32791 30088 -27906 22571 -14370
508 -14370 3155 8448 -17180 24317 -29423 30781 -34595 43636 -43762 28551 -16765 19467
520A9467l8404K2910P668l0754M4390n5895O1922o4524P2458p9894P3939n5383
532b2100L3599j7782J3065o558k1222N6832o7454N7975n9825P2789p5574O9259
544C3004o0216L9292j1982K07M07j4755M4043o8378P5959o7456N6376o1698P5181
557C9984o5728L3625j0177R26J1307k4010L2780n2973P9140p9644N7021m7723
569b5472N7487n9824M3561j6030j1732K3868k0273K6816n1626O9267o9263O4790
581C1569n4792L8053l5545M5284l0254j0714L4028k9243K7483l9947N5151o8092
593c7019O9587n1172L1939l0890L2426k0565L085J8067m2147M7029l1216L3710
605B2834o2036P2155n0667L1401k5746J9139j3511Q596J1763l8804M5583l7769
$$ plain form
520 19467 -18937 3973 11641 -19113 25277 -30618 31304 -33220 39238 -40656 33283 -22100
532 -22100 11499 -6283 6782 224 -20998 35834 -31620 26355 -33470 39319 -36255 33004
544 33004 -27212 12080 98 305 712 -14043 30000 -38378 37581 -29875 26501 -35197 39984
557 39984 -25744 7881 -2296 -1370 9937 -14073 18707 -34266 44874 -34770 22251 -25472
569 -25472 32015 -27809 15752 -278 -12010 11858 -8415 18401 -33225 36042 -33221 31569
581 31569 -23223 14830 -20715 24569 -5685 -16399 17629 -11614 15869 -24078 31073 -37019
593 -37019 32568 -18604 13335 -17555 14871 -5694 -2609 15458 -26689 20340 -10876 22834
605 22834 -39202 32953 -17714 13687 -12059 7080 -6431 2165 13928 -24876 20707 -17062
617a7062L7145m2173M7915n4894M5879j5675n37j1197J2249J2950l1969L5005
629A7636m0313M1528l0671L0433m4499M1997j9315L283J603m732M732j1353L4097
642B4426m7287L2754k0991L0534l4483K4284k0649J5865N114j7288O384m599K4305
655A8369l6377L2373k8108K2628j6089K1109k5406R171Q119o660O836j7502J7652
668F115j3795K6974l5504J8183n056J4968j8988O209J566m362J2857j4387P750
681B530j2840K2819j8225J2106j5515J0083J541M012j1436m196J8272q383J920
694B688j2683J5210p769J0529j3419L620Q20M893j870n136K443l839J3108q778
708a83j938o012J5774m341m470n203O517N482m360l935k474R267k454J4n566K691
$$ plain form
617 -17062 20083 -22090 25825 -29069 16810 1135 598 -10599 1650 14600 -17369 17636
629 17636 -22677 18851 -11820 18613 -25886 16111 -3204 79 1682 -3050 1682 -9671 24426
642 24426 -22861 9893 -11098 19436 -15047 9237 -11412 4453 9567 -7721 -1337 -5936 18369
655 18369 -18008 14365 -13743 8885 -7204 13905 -11501 -2330 5789 -871 5965 -11537 6115
668 6115 -7680 19294 -16210 1973 -3083 11885 -7103 -894 672 -3690 9167 -5220 2530
681 2530 -10310 12509 -5716 6390 -9125 958 2499 6511 -4925 -9121 9151 768 2688
694 2688 -9995 5215 -2554 7975 -5444 -1824 -1004 3889 2019 -3117 -674 -4513 8595 -183
708 -183 -2121 -8133 7641 3300 -1170 -6373 144 5626 1266 -2669 -5143 4124 1670 1684 -3882 -1191
724a191J069M797l727n756J807P005J161q278k648O456N544n041o859L257N927
739C523O9n084k099L088K415J544n224p62j30P590k346m677l976Q053M281o635
755c70m670J926R337m676k453n061Q666o23K23n489J169K450J973Q55p995K695
771b043J986P697j0644m86M41R559m467n663j96N211M245p967J039k289P837m186
787G4K247o933L702K622K306m878m811O585K337J014j0811N023K756M827r054
802b994j28K467L795j157m293J016m82N780l436p35m695O250K055j513o406J424
818c052P037n67n066l426O667J552j833m461J513K783J159j678k906O26K418K362
834C128k441m543K096M783J048p715M66M101L495m732k972K172K738J771o039
$$ plain form
724 -1191 -122 4675 948 -4808 -3001 4004 5165 -3113 -5761 695 6239 1198 -5661 -2404 3523
739 3523 3592 -1492 -3591 -503 1912 3456 -1768 -2530 -2660 4930 2584 -2093 -6069 1984 6265 -370
755 -370 -5040 -3114 6223 1547 -906 -5967 2699 2076 2299 -3190 -2021 429 2402 3257 -4738 -2043
771 -2043 -57 7640 -3004 -3490 -3049 6510 2043 -3620 -3816 1395 5640 -2327 -1288 -3577 4260 74
787 74 2321 -4612 -910 1712 4018 -860 -5671 914 3251 4265 -6546 -1523 1233 6060 -2994
802 -2994 -3122 -655 3140 1983 -2310 -1294 -1776 4004 568 -167 -4862 1388 3443 1930 -4476 -3052
818 -3052 3985 3418 -1648 -5074 1593 3145 1312 -3149 -1636 1147 2306 628 -2278 -1652 766 3128
834 3128 687 -3856 -1760 3023 4071 -3644 -3178 923 4418 -314 -3286 -1114 1624 3395 -2644
849b644K053j387N283l733K154n698L330L715q85m365k547R145l997K348r304
864f532Q564k033N005r693L594K563q70J103m566M830p271J3225j1489N109p584
879f045J1980o733K038m028p4R139p875K730r113J7695j5450J0751j0488Q874
893C401p085Q319m414n425R094p296J0305j3998J3091j6010K1490j5758M594n180
907d872J0722n312n049R765j2816J5658j4113J4112k0385K3204j7603J1615p542
920b616K845j906K488O917k1097K2583j5298J6112k2674K3781k1405J7947r065
933a388k3N72M68O857j7781K4719k6685K2916j7496K0370k7632K3277q525m44
947g95J887n024R675j4235K3381l2350K9798k0471J8278k2511K2856j5760L291
$$ plain form
849 -2644 -591 -1978 3305 -428 1726 -3972 -642 3073 2188 -2177 -4724 4421 424 2772 -6532
864 -6532 2032 -1 5004 -4689 -1095 1468 598 1701 -2865 1965 -5306 7919 -3570 1539 -6045
879 -6045 5935 -798 1240 -2788 -2862 6277 -1598 1132 -7981 9714 -5736 5015 -5473 3401
893 3401 -3684 4635 221 -5204 3890 -3406 6899 -7099 5992 -10018 11472 -4286 308 -4872
907 -4872 5850 538 -4511 5254 -7562 8096 -6017 8095 -12290 10914 -6689 4926 -2616
920 -2616 229 -1677 811 7728 -13369 9214 -6084 10028 -12646 11135 -10270 7677 -1388
933 -1388 -1411 -839 -371 6486 -11295 13424 -13261 9655 -7841 12529 -15103 8174 -351 -795
947 -795 1092 -3932 5743 -8492 14889 -17461 12337 -8134 10144 -12367 10489 -5271 -1980
960a980Q847j2278R184j2866K4996l2681L1410k7421K2272j6927J7128j8874R622
973D32P904j7583J6356j5428K0840k9788L6487l4356K4003j6180J6083j5740Q948
986A978J889j4096K3845k4595K0153k3839L5271l8813K9370j7968J2385j0610
998e030Q227q05j2599K4515k7738K5636k5322K8440l2895L3625k4667J0071k768
1011a310M391j891j0362K3182k9106K9510k7314K5737k7962L0597k6120J4447
1023C799l044k860M355p143J6681k9448L4459k9373K4525k5895K7613k4297J6847
1036F219o660l817R507j0585J4396k3909L2553l3758K8450k2793K1655k2734J8474
1049F998p154l927R681j3013J7001k1311K6389l1338L1020k4057J7515j6210J5351
$$ plain form
960 -1980 6867 -5411 3773 -9093 15903 -16778 14632 -12789 9483 -7444 9684 -9190 432
973 432 8336 -9247 7109 -8319 12521 -17267 19220 -15136 8867 -7313 8770 -6970 1978
986 1978 3867 -10229 13616 -10979 9174 -14665 20606 -18207 11163 -6805 5580 -5030
998 -5030 3197 2392 -10207 14308 -13430 12206 -13116 15324 -17571 16054 -8613 1458 -1310
1011 -1310 3081 1190 -9172 14010 -15096 14414 -12900 12837 -15125 15472 -10648 3799
1023 3799 755 -2105 2250 -4893 11788 -17660 16799 -12574 11951 -13944 13669 -10628 6219
1036 6219 -441 -4258 5249 -5336 9060 -14849 17704 -16054 12396 -10397 11258 -11476 6998
1049 6998 -156 -4083 5598 -7415 9586 -11725 14664 -16674 14346 -9711 7804 -8406 6945
1062F945q904j798J1125j5640J6861j9175K3985k7640K7163k3706J8752j2997
1074e029Q782o502J451Q354j6786J8837j8318K0476k4119K5165k2485J7541j2288
1087d921P913l902p88O274j2393J8141k0745J9673j9126K1347k1853J7031j0501
1100c850O417l210j498O663j1041J4987j8053J9117j8341J7045j6125J4814j1090
1113d165M963R5k321M866r840J4020j5003J5149j5970J5322j2657J0267q397N070
1127A399l63l621O019p847J0317j3040J4004j2636J1323j1143R553n688K566j064
1141b21j637N714q010Q385r506J1207j1211R627q115O964n348K730L41k393L346
1156A873n129P820q686P424p199Q107p005M232k861K344k31k407L394l630M638
$$ plain form
1062 6945 -1959 -3757 7368 -8272 8589 -10586 13399 -14241 12922 -10784 7968 -5029
1074 -5029 3753 -2749 -1298 7056 -9730 9107 -9211 11265 -12854 12311 -10174 7367 -4921
1087 -4921 2992 -910 -1698 4576 -7817 10324 -10421 9252 -9874 11473 -10380 6651 -3850
1100 -3850 2567 -643 -2141 4522 -6519 8468 -9585 9532 -8809 8236 -7889 6925 -4165
1113 -4165 798 893 -1428 3438 -6402 7618 -7385 7764 -8206 7116 -5541 4726 -3671 1399
1127 1399 1036 -2585 3434 -4413 5904 -7136 6868 -5768 5555 -5588 3965 -1723 843 -221
1141 -221 -1858 3856 -4154 4231 -5275 5932 -5279 4348 -3767 3197 -2151 579 920 -1473 1873
1156 1873 -3256 4564 -4122 3302 -3897 4210 -2795 1437 -1424 920 689 -1718 1676 -1954 2684
1171B684n831O187n421M127l597L759k592J13R11m98J600l580L428k349L186m194
1187b067K898j298J437j722P90L94j062J162q71J146k078J879o46Q42j839Q14
1203b21P38J59j340j3J250p8q89P6L92K19m86L78k79j18J70L05L11j601J136j10
1223aJ371k777J443j90J456j997J93P29l5M00j717K101k101K363k242K285k733
1240a452J912l72O07j118p94K498j514J226l352L981k286K045l135K470r21N38
1256C33j24r05J381j983L178l118K345l234L976k150Q33j995J724J004j842O99
1272A22j591L484l186K401l006L026k075J795j303m2K84j20J799l056J757j403
1288a114L416l419J106j074K418j086q34L28k8J479j983J443j823J948j111J389
$$ plain form
1171 2684 -3147 3040 -2381 1746 -1851 1908 -684 -571 340 -158 1442 -2138 1290 -1059 2127 -2067
1187 -2067 831 -467 970 -752 38 432 -630 532 -339 807 -1271 608 -38 804 -1035 -221
1203 -221 517 676 -664 -677 573 495 -394 -318 74 293 -193 185 -94 -212 -42 263 574 -1027 109 -1
1223 -1 1370 -1407 36 -154 1302 -695 -502 227 192 592 -1125 976 -1125 1238 -1004 1281 -1452
1240 -1452 460 88 695 -423 -1217 1281 -233 993 -2359 1622 -664 1381 -1754 716 -205 333
1256 333 209 -696 685 -1298 1880 -1238 1107 -2127 1849 -301 532 -1463 261 1265 -577 122
1272 122 -1469 2015 -1171 1230 -1776 1250 -825 970 -333 -375 -91 -211 1588 -1468 289 -1114
1288 -1114 2302 -1117 -11 -1085 1333 247 -587 -259 -287 1192 -791 652 -1171 777 -334 1055
1304A055j868K89P44O51o30j615J539L36M85k093O64P20N69j015m99P04M2L86
1322D64m30m49n5O91Q25j609P9j50J996j229o69m87J673N40k087P17n20K209k390
1341h81J872k540K256q26J020j431l11J486r41K141m273L285j865L954n423K976
1357D99j143J855j186q25J248j971M460n403M442m858N675m819M524m677J918
1372b61J395q78K10l551O623o309O373p522O491n086O004n663K054Q54j767L159
1388B126m511N285p909J0640r043N923o415P407m988K265o69k779O178n805N410
1403C115q863J1915j1121R201p521N509m957M993j210m731O986o734Q313j0147
1417e252J0738j2539J3633r656M596m320N108j722l428P358j0336J1083r722J0742
$$ plain form
1304 1055 -813 -524 220 871 241 -1374 165 501 986 -1107 -443 277 846 -169 -668 36 78 464
1322 464 34 -415 -470 221 1046 -563 -484 -634 1362 133 -536 -1023 650 1190 -897 -180 -700 1509 -881
1341 -881 991 -1549 707 -119 901 -530 -841 645 -296 1845 -2428 857 -1008 2946 -2477 499
1357 499 -644 1211 25 -800 448 -1523 2937 -2466 1976 -2882 2793 -2026 2498 -2179 -261
1372 -261 1134 256 466 -3085 3538 -2771 3602 -3920 2571 -2515 3489 -2174 -120 734 -1033 2126
1388 2126 -2385 2900 -5009 5631 -3412 2511 -3904 3503 -1485 780 111 -2668 3510 -2295 3115
1403 3115 -5748 6167 -4954 4247 -3274 2235 -2722 2271 1061 -3670 3316 -3418 4895 -5252
1417 -5252 5486 -7053 6580 -3076 1520 -2800 2308 586 -2842 4516 -5820 5263 -4459 6283
1431F283j4354J4634j0692P047m294J442l88p53O566j3348J3861j0877J1154j3432
1445g151J3903j2733R342l275q91P57j628O621j1810J4710j5603J3514j0579J1854
1459G031j4745J1534l679j180K562m234O363r492J4962j8524J5917j1665J1269
1472F119j2439J1351p601J121N714p663N967q234J4827j8471J7265j4713J1687
1485D930r115R341r113L020N554r388R157r554J1833j5607J9018j7454J1072p014
1499c320P627p116K680K974q536J2749j2529J0300j2513J7613j8053J3067p878
1512b935M761l477K989L63p799J3522j3563J1966j2524J4051j5464J5527j1059
1525c642L757n42J733k44n822J1558j4294J4462j2558J1374j3374J4887j1364
$$ plain form
1431 6283 -8071 6563 -4129 2918 -1376 66 -322 -1075 5491 -7857 6004 -4873 6281 -7151
1445 -7151 6752 -5981 3361 86 -805 -48 -1676 4945 -6865 7845 -7758 5756 -4823 7031
1459 7031 -7714 3820 141 -1039 1523 -2711 3652 -5840 9122 -9402 6515 -5150 6119
1472 6119 -6320 5031 -2570 -1449 4265 -3398 2569 -5665 9162 -9309 7956 -6757 4930
1485 4930 -4185 5156 -3957 -937 4617 -4771 4386 -5168 6665 -8942 10076 -7378 3694 -3320
1499 -3320 4307 -2809 -129 2845 -5691 7058 -5471 4829 -7684 9929 -8124 4943 -2935
1512 -2935 1826 -1651 1338 1701 -6098 7424 -6139 5827 -6697 7354 -8110 7417 -3642
1525 -3642 115 -427 1306 1062 -4760 6798 -7496 6966 -5592 5782 -7592 7295 -4069
1538d069N238q99j431K646l817P832j3972J6078j2699J0058j1025J1788j0084
1551d356O628j527l409M807m273O566j1173J3933j3745J1560q562P455q678P521
1565B747j851l447N062n615P004q552J0814j3216J2387q441O042o290N774k987
1579e69r75N034p273O748o584R229j1614J0794q596O687m533L018k684P21L825
1594C228p061O993o492P309q401R059q565N961k936J947j647k49K767m678O497
1609C732p343O192n407O757p407N223k551J242k69q00J738l396N469o042N301
1624B439n012N040m613M248l491J233Q84r41Q38k545M253m437M317m401L800l118
1640a506L140k679J180J22q60J549j890K069k984L842l160K086k211K333j311
$$ plain form
1538 -4069 1169 270 -1161 1485 -2332 5500 -8472 7606 -5093 4965 -6060 5728 -4356
1551 -4356 2272 745 -2664 2143 -2130 4436 -6737 7196 -6549 5011 -3551 3904 -4774 2747
1565 2747 896 -2551 2511 -3104 3900 -4652 6162 -7054 5333 -3108 2934 -3356 2418 -569
1579 -569 -1544 3490 -3783 2965 -3619 5610 -6004 4790 -3806 2881 -1652 1366 -1318 -597 3228
1594 3228 -3833 3160 -3332 3977 -4424 4635 -3930 2031 -905 1042 -605 -854 1913 -2765 3732
1609 3732 -3611 2581 -2826 3931 -3476 1747 -804 438 169 -631 1107 -2289 3180 -2862 2439
1624 2439 -2573 2467 -2146 2102 -1389 -156 728 -213 625 -1920 2333 -2104 2213 -2188 1612 -1506
1640 -1506 1634 -1045 135 257 -603 946 -944 1125 -1859 1983 -1177 909 -1302 1031 -280
1655b80M89l44l85J422j483J178j611K072j886J579j240P27o15P20j12o41M71
1672F1k86Q89j089M29l80R79p52L1p9M13j96n0n6N5k5J93j44j4k45M01J02l07
1694g0j81J44O19p61L39n49J080r33O23p97Q66n04J66N2l20M58o72J224j504J199
1714D79j185J620j466P95o61P30r1o74P78q31J375j817J820j732J640j475J332
1731F37r97L50J17k81P86j514J669j518J892k272J857j305J255j113M48K02n50
1748c37R08j322J651j913J948j776J731j720J228n30L02j72n27J231j283J300
1764G19j737J957j660J397j341J105o32J66K47n08P17j120J497j412J189j336
1780g52J398q94M46m71L09L09o78O03o87R78j064Q98p28N96n03L74m4k54K03j87
$$ plain form
1655 -280 209 -135 -520 902 -581 597 -1014 1058 -828 751 -489 238 -377 343 231 -410 61
1672 61 -225 664 -425 4 -376 603 -149 -118 -197 216 20 -30 -86 -31 -56 137 -7 -21 -266 135 237 -70
1694 -70 -251 -107 512 -249 90 -459 621 -312 311 -486 380 -124 42 94 -226 232 -440 784 -720 479
1714 479 -706 914 -552 243 -418 312 221 -453 325 -506 869 -948 872 -860 780 -695 637
1731 637 -360 -10 107 -174 612 -902 767 -751 1141 -1131 726 -579 676 -437 11 213 -337
1748 -337 571 -751 900 -1013 935 -841 890 -830 398 -132 170 -2 -529 702 -581 719
1764 719 -1018 939 -721 676 -665 440 -192 -26 221 -287 430 -690 807 -605 584 -752
1780 -752 646 -248 198 -273 36 345 -333 270 -417 561 -503 395 -333 263 -240 134 90 -164 39 -148
1800a48N23o64L12j47L93l48j07K88r8J13l40L61j72L3N5j16K48n36P03n74N31
1821C10p60P22k39lj05j82P94j021R53j161J470j448J230j049Q28n42J30M44r15
1840e44J150j525K094k276K027k000K147j749R95n35J73O01j438J952k343K773
1856A502l078L155k998K576k072J594q00k99J123j691K541l461L728l670L869
1871B019l872L186k302J577o97m13J503k522L416m020M424m725M618m080L587
1886A699k959J668j98p52J659l033M276m847N182n456N296m769M154l216J871
1901E75m55r50K344l456M395n561O436o290N661n359M850l557K001n37j160K858
1917A795m021M939o030O864o999O552n634M507l531K364l67j881L383m422N626
$$ plain form
1800 -148 375 -289 23 -124 269 -79 -186 102 4 117 -223 138 -34 -1 54 -62 186 -350 353 -221 310
1821 310 -450 272 33 30 -75 -257 537 -484 469 -692 778 -670 560 -489 339 -203 -73 371 -544
1840 -544 606 -919 1175 -1101 926 -1074 1073 -676 319 -216 -43 558 -880 1072 -1271 1502
1856 1502 -1576 1579 -1419 1157 -915 679 -121 -420 703 -988 1553 -1908 1820 -1850 2019
1871 2019 -1853 1333 -969 608 -89 -502 1001 -1521 1895 -2125 2299 -2426 2192 -1888 1699
1886 1699 -1260 408 210 -542 1117 -1916 2360 -2487 2695 -2761 2535 -2234 1920 -1296 575
1901 575 120 -830 1514 -1942 2453 -3108 3328 -2962 2699 -2660 2190 -1367 634 97 -1063 1795
1917 1795 -2226 2713 -3317 3547 -3452 3100 -2534 1973 -1558 806 439 -1442 1941 -2481 3145
1932C145o585P003p280P156n975M313l116K014k91j830L828n409O237o569P178
1947C819p806P435o159M752l211J461k5j408L610n889O919p010P291p699P607
1962C687o838N266l081J252j7j554L690n613P049p900P774p145P088p047N570
1977B181l011Q57O62k140L687n373P168q226P919p087O607o088N025l363R32J657
1993A407l119L699m994O973q093P969p311O309n187M448l429J195J506l320M304
2008B357n139O079p260Q232p803O066m711M201l194J263Q67k968M748n480N583
2023B841o411P586p573O264m672L253k175J287L47k892M827n359N551o031O345
2038C188o413O158m770K543j100O09M56k425M216n347N785n471N178n532N549
$$ plain form
1932 3145 -3440 3563 -3717 3439 -2536 1777 -1339 675 384 -1446 2382 -3027 3210 -3359 3819
1947 3819 -3987 3448 -2711 2041 -1170 291 266 -1142 2468 -3421 3498 -3512 3779 -3920 3687
1962 3687 -3151 2115 -966 286 269 -1285 2405 -3208 3841 -4059 3715 -3430 3658 -3389 2181
1977 2181 -830 27 689 -1451 2236 -3137 4031 -4195 3724 -3363 3244 -2844 2181 -1182 -250 1407
1993 1407 -1712 1987 -3007 3966 -4127 3842 -3469 2840 -2347 2101 -1328 -133 1373 -1947 2357
2008 2357 -2782 3297 -3963 4269 -3534 2532 -2179 2022 -1172 91 958 -2010 2738 -2742 2841
2023 2841 -3570 4016 -3557 2707 -1965 1288 -887 400 747 -2145 2682 -2677 2874 -3157 3188
2038 3188 -3225 2933 -1837 706 -394 215 671 -1754 2462 -2885 2900 -2571 2607 -2925 2624
2053B624m284K522j111j16J125j834L073m912N744n115M559m712M629l926K818
2068A084j226m13J202j594K631l959M701m906M662l861L291l376K870j122m73
2083d89J146j726K490l029L635m326M174l213K594k400J868j001K3J208k147K174
2099I81k172K945l543L200k670K307j626R54p76K74R26j761J846j943K199k302
2115a161K452k495J846j004Q21p34M9N95q48J357j842J617j352J728j907J361
2131D83q52O55k82m8J22m82J061j125R03j065J138q04P33q74M22J65n7j19k94
2150c20N87m16M39o21M09k16L83l44O1p7J61R4j16k08J17K29m6k66L0J81Q0r7
2172D4k46K47o5K66m69L52l93N44l62K07l93L04J22j80N7m11P45n61N20q99R21
$$ plain form
2053 2624 -1660 862 -249 -365 760 -1074 1999 -2913 2831 -2284 2275 -2437 2192 -1734 1084
2068 1084 -142 -555 647 -947 1684 -2275 2426 -2480 2182 -1679 1612 -1764 1106 -16 -489
2083 -489 657 -1069 1421 -1608 2027 -2299 1875 -1338 1256 -1144 724 -277 -254 954 -1193 981
2099 981 -1191 1754 -1789 1411 -1259 1048 -578 376 -400 -126 800 -961 885 -1058 1141 -1161
2115 -1161 1291 -1204 642 -362 459 -275 -226 369 -479 878 -964 653 -699 1029 -878 483
2131 483 -369 286 4 -44 78 -404 657 -468 435 -630 508 -296 437 -437 -15 150 93 -26 -320
2150 -320 267 -149 290 -331 78 -138 245 -99 -38 -115 46 140 24 -184 -67 162 116 -150 -120 61 141 44
2172 44 -202 45 -20 246 -223 129 -264 280 -82 125 -268 36 158 -22 35 -376 369 -192 328 -571 350
2193C50n56N24o02L07l0j6K84o47O91p56J065j070Q29r13R88n37J58k33O8N08
2213D12p47P01r63J229j097J001j101R06n62M15j83k78M66n10R04j240J086r82
2231e43J209j133O92n30M99q6l32M29n94R33j028J003j125J080p78O99o64K39
2249c0J20j23L23p83Q79p10Q65j069Q40n87N95m48J16J9j39M33n76N41o73P90
2269C83o04M67n87M39l2l5o7j77M60l80L10m55M34k45K43k18J1R8p8J97k72J30
2291B2j12K68j43j56J32j0J94l81K58k11L07j96l2P3j11L05m53N04o17O42m74
2312a91M53n47L08J08k21K68n72Q19q40R78j176J060p81O88o04L29K1l87P95j026
2332e18J057j281J631j646J411j261J031o13K94o0m86J169j516J599j778J989
$$ plain form
2193 350 -206 318 -284 23 -7 -23 261 -386 305 -451 614 -456 373 -540 448 -89 69 -164 -96 412
2213 412 -335 366 -597 632 -465 536 -565 341 -221 194 11 -267 199 -311 593 -647 439 -543
2231 -543 666 -467 225 -305 194 108 -224 205 -389 544 -484 519 -606 474 -304 395 -269 -30
2249 -30 90 -33 290 -493 386 -324 541 -528 312 -275 320 -128 -12 7 -132 301 -275 266 -407 383
2269 383 -221 246 -341 98 66 31 -36 -213 247 -133 177 -278 156 -89 154 -64 -53 45 -33 164 -108 22
2291 22 -90 178 35 -121 11 1 195 -186 72 -139 168 -28 -60 13 -98 207 -246 258 -359 283 -191
2312 -191 262 -285 23 131 -90 178 -394 425 -415 563 -613 447 -334 354 -250 79 100 -287 508 -518
2332 -518 539 -742 889 -757 654 -607 424 -189 105 45 -441 728 -788 811 -967 1022
2348A022k070K013j699J136o56L58J21q08J398j876K293k408K276k327K443k086
2364h70J313o09J00M25j008J662k382K863k896K770k714K562k221J683q27j75
2380c24Q45j223J829k707L303l446L337l080K741k431J965j060n4R67j633K209
2396A238k794L457l998L990l443K924k598K076j152M7J068k038K672l098L632
2411A983m187M332l918L192k449J795j108P0J291k442L082l508L938m262M383
2426B192m196L511k468J517p96o8J258k509L465l965M147m290M477m360L695k679
2442a069J651o65k76J209k302L489m276M448m402M433m341L856k947J747n67m14
2458d26J311k344L416m227M640m668M376m019L663k937J707l72p14J619k529L422
$$ plain form
2348 1022 -1048 965 -734 402 -254 104 225 -583 815 -1061 1232 -1176 1100 -1227 1216 -870
2364 -870 443 -166 -66 359 -649 1013 -1369 1494 -1402 1368 -1346 1216 -1005 678 -149 -324
2380 -324 521 -702 1127 -1580 1723 -1723 1614 -1466 1275 -1156 809 -251 -305 662 -971 1238
2396 1238 -1556 1901 -2097 1893 -1550 1374 -1224 852 -300 -253 815 -1223 1449 -1649 1983
2411 1983 -2204 2128 -1790 1402 -1047 748 -360 -290 1001 -1441 1641 -1867 2071 -2191 2192
2426 2192 -2004 1507 -961 556 -240 -308 950 -1559 1906 -2059 2088 -2202 2275 -2085 1610 -1069
2442 -1069 582 -83 -359 850 -1452 2037 -2239 2209 -2193 2240 -2101 1755 -1192 555 -12 -426
2458 -426 885 -1459 1957 -2270 2370 -2298 2078 -1941 1722 -1215 492 120 -594 1025 -1504 1918
2474A918m179M658m701M352l839L280k554J586l96q75J956k669L299m030M553
2489B359m588M260l772L110k321J468m42p66J861k693L315l807M178m379M231
2504B014l681K940k233J435m08o74J651k528L244l655L869m011L925l462K764
2519A190j969J124k41o82J642k479L059l420L660l684L434l031K487j702P76K6
2535A90p73J585k326K849l175L329l293L071k680K108j434P43j1p85J482j997
2551a117K470k849K955k867K727k427J888j267O79m0o34J246j767K162k375K489
2567A273k524K369j998J560j114N36P7n60J008j519J893k008K027k028J882j596
2583g22J239p90K99J22n22R37j259J458j626J712j590J370j222J014n96J90R7
$$ plain form
2474 1918 -2261 2397 -2304 2048 -1791 1489 -1065 521 125 -750 1206 -1463 1836 -2194 2359
2489 2359 -2229 2031 -1741 1369 -952 516 74 -692 1169 -1524 1791 -2016 2162 -2217 2014
2504 2014 -1667 1273 -960 475 67 -607 1044 -1484 1760 -1895 1974 -2037 1888 -1574 1190
2519 1190 -779 345 104 -578 1064 -1415 1644 -1776 1884 -1800 1634 -1397 1090 -612 164 190
2535 190 -583 1002 -1324 1525 -1650 1679 -1614 1457 -1223 885 -549 194 183 -602 880 -1117
2551 -1117 1353 -1496 1459 -1408 1319 -1108 780 -487 192 152 -482 764 -1003 1159 -1216 1273
2567 1273 -1251 1118 -880 680 -434 102 179 -381 627 -892 1001 -1007 1020 -1008 874 -722
2583 -722 517 -273 26 148 -374 563 -696 762 -864 848 -742 628 -594 420 -176 14 111
2600A11l95P23r47J107j242J274j175J045r14P06m77K66L8l51M50n34P43q86Q34
2619C76p79P55o22M41l34K21j0j72K53l27M03m09M38m82L82k38K40k24P7J6JN1
2641E7j57J42o8J12j41Q4n2O5n2N5j18J17p0J26j97J25j03J77j53L5j5N0M5j90
2665a26K13k39L49l83L58l79L59k65K23j81K7J26j58K56m52N20m67N25o08M98
2685A96l66L37k32L3J11k19L76m98N46o33O97o17N29n37M11j77M2M3k57M80n33
2706b68N80p13P24o30N92n08L41j88N8J38l20M12n02O71p05O03o03O30m59K60
2726A13j92O2J83l34L81n09N99n65N58n66M50l19K61j43q2J78j93L48m95M50l93
2747b08M45m18K59k01J85l3r2J23j88K81k77K75l08K53j30J09j25QJ16q7Q4j97
$$ plain form
2600 111 -284 439 -508 599 -643 631 -544 501 -413 293 -184 82 120 -231 219 -315 428 -458 376
2619 376 -403 352 -270 171 -163 58 48 -124 129 -198 205 -204 234 -248 134 -104 136 -88 -11 5 6 57
2641 57 -100 42 -26 86 -55 29 -23 42 -10 45 -73 44 -26 100 -97 28 -75 102 -51 -16 -31 19 64 -126
2665 -126 87 -152 197 -186 172 -207 152 -113 110 -71 -44 82 -76 180 -272 248 -219 306 -302 196
2685 196 -170 167 -65 -32 79 -140 236 -262 284 -349 348 -269 260 -277 134 -43 -1 42 -215 265 -268
2706 -268 312 -401 323 -307 285 -223 118 -70 -12 126 -194 218 -284 387 -318 285 -318 312 -147 113
2726 113 -79 -17 166 -168 213 -296 303 -262 296 -270 180 -139 122 -21 -103 75 -118 230 -265 185 -208
2747 -208 237 -181 78 -123 62 29 -63 60 -128 153 -124 151 -157 96 -34 75 -50 -42 74 -13 71 -126
2769a26J74o8P7q1k8J12j07J30j85J49j34J61q3o8R9j05K54l51L15l40M26l40
2791a19J80j57J37L2k08L22m63N66n60N92o76O16m21L16j98m9K42l41N60q59R23
2812D35q49Q93r36Q04o49M45j30j66L40n54Q73j103J218j319J295j108R98r28
2830d41O02r8k44M91q08J107j329J564j707J588j353J201r94O31j99k99Q21j146
2848f13J301j591J945k025J854j642J347r53N83j95m13J071j479J699j923K117
2864A083k228K239j966J416r30O00j50m91J137j666K088k267K279k386K502k263
2880a003J675j067N40l0m80J100j858K401k536K540k589K559k370J966j272M31
2896GJ88o13J189j947K560k864K897k733K521k371K037j288L69L97r90J512k016
$$ plain form
2769 -126 48 -20 57 -24 -52 60 -47 83 -102 47 -87 74 -9 -77 22 -83 171 -180 135 -205 221 -119
2791 -119 61 -96 41 73 -135 187 -276 290 -270 322 -354 262 -159 157 -41 -90 152 -189 371 -488 435
2812 435 -414 479 -457 347 -302 143 13 -153 187 -367 506 -597 621 -698 597 -511 487 -441
2830 -441 161 63 -181 310 -498 609 -720 844 -863 725 -628 573 -421 210 11 -288 533 -613
2848 -613 688 -903 1042 -983 871 -771 576 -377 206 11 -402 669 -810 889 -1034 1083
2864 1083 -1145 1094 -872 544 -386 214 64 -427 710 -956 1132 -1135 1144 -1242 1260 -1003
2880 -1003 672 -395 145 115 -365 735 -1123 1278 -1258 1282 -1307 1252 -1118 848 -424 7
2896 7 195 -418 771 -1176 1384 -1480 1417 -1316 1205 -1166 871 -417 -48 349 -641 871 -1145
2913a145K593l119L252k895K509k277J921j281M50M62j264J749k094K591l115
2928a663L328l142K707k199J749j343O52L63j302J869k238K621k986L251l285
2943a618K902k215J630j177N80K63j204K012k499K697k850L115l224K891k240
2958i37J537q69K49L70j160K074k697K869k882K948k961K756k255J440o10PN09
2975C88j191J960k564K902k970K805k633K534k209J485o20p9O30j142J702k307
$$ plain form
2913 -1145 1448 -1671 1581 -1314 1195 -1082 839 -442 8 470 -794 955 -1139 1452 -1663
2928 -1663 1665 -1477 1230 -969 780 -563 89 452 -850 1019 -1219 1402 -1584 1667 -1618
2943 -1618 1284 -931 699 -478 102 365 -839 1173 -1326 1371 -1479 1636 -1588 1303 -937
2958 -937 600 -269 -20 350 -810 1264 -1433 1436 -1446 1502 -1459 1297 -958 482 -128 -121 388
2975 388 -803 1157 -1407 1495 -1475 1330 -1303 1231 -978 507 -113 -192 438 -704 998 -1309
$$ [...]
8191c5
##END NTUPLES=NMR FID
##END=
