##TITLE=abcd
##JCAMPDX= 6.0         $$ Bruker NMR JCAMP-DX V2.0
##DATA TYPE= NMR SPECTRUM
##DATA CLASS= NTUPLES
##ORIGIN= UXNMR, Bruker Analytische Messtechnik GmbH
##OWNER= root
$$ XWIN-NMR		Version 3.5
$$ Thu Jun 25 16:05:22 2026 Russian Standard Time (UT+4h)  servis@DPX200
##.OBSERVE FREQUENCY= 200.131235884673
##.OBSERVE NUCLEUS= ^1H
##.ACQUISITION MODE= SIMULTANEOUS
##.ACQUISITION SCHEME= undefined
##.AVERAGES= 32
##.DIGITISER RES= 18
##SPECTROMETER/DATA SYSTEM= spect
##.PULSE SEQUENCE= zg
##.SOLVENT NAME= DMSO
##.SHIFT REFERENCE= (INTERNAL, DMSO, 0, 16.4885)
##AUDIT TRAIL= $$ (NUMBER, WHEN, WHO, WHERE, WHAT)
$$ ##TITLE= Audit trail, XWIN-NMR		Version 3.5
$$ ##JCAMPDX= 5.01
$$ ##ORIGIN= Bruker BioSpin GmbH
$$ ##OWNER= servis
$$ F:\spectra/data/av/nmr/H1/1/pdata/1/auditp.txt
$$ ##AUDIT TRAIL=  $$ (NUMBER, WHEN, WHO, WHERE, WHAT)
(   1,<2026-06-25 16:02:45.15 +0400>,<servis>,<DPX200>,
      <created by zg, POWCHK disabled, PULCHK disabled
       configuration hash MD5:
       00 E9 B6 7A A2 85 ED C7 34 08 36 98 17 FE 4E 26
       data hash MD5: 32K
       A5 44 4D 38 39 5E C4 02 79 0E C3 5C 6E 30 EC BD>)
(   2,<2026-06-25 16:03:29.34 +0400>,<servis>,<DPX200>,
      <Start of raw data processing
       efp BC_mod = 2 LB = 0.05 FT_mod = 6 PKNL = 1 PHC0 = -412.19 PHC1 = 3.101563 SI = 16K 
       data hash MD5: 16K
       3D ED D4 DF 79 E8 24 9B 56 49 B3 9F 84 BA 90 3C>)
(   3,<2026-06-25 16:03:58.51 +0400>,<servis>,<DPX200>,
      <pk PHC0 = -5 PHC1 = 0 
       data hash MD5: 16K
       94 E6 74 98 2F 85 5E 8E B6 7B 30 E5 80 E5 1B E4>)
(   4,<2026-06-25 16:04:13.04 +0400>,<servis>,<DPX200>,
      <pk PHC0 = -1.2 PHC1 = 0 
       data hash MD5: 16K
       0D 72 EE 48 FE 13 0B AB 4F 4E 80 F2 81 5E E3 FE>)
$$ ##END=
$$ 
$$ hash MD5
$$ AD 15 28 27 36 F3 56 A8 AD 7C 7E C7 EC 74 BC 41
##$RELAX= 
##$RELAX= 
##$RELAX= 
##$RELAX= 
##$RELAX= 
##$RELAX= 
##$RELAX= 
##$RELAX= 
$$ Bruker specific parameters
$$ --------------------------
##$DU= <F:\spectra>
##$EXPNO= 1
##$NAME= <H1>
##$PROCNO= 1
##$TYPE= <nmr>
##$USER= <av>
##$AMP= (0..31)
100 100 100 100 100 100 100 100 100 100 100 100 100 100 100 100 100 100 
100 100 100 100 100 100 100 100 100 100 100 100 100 100 
##$AQSEQ= 0
##$AQ_mod= 1
##$AUNM= <au_zg>
##$AUTOPOS= <>
##$BF1= 200.13
##$BF2= 200.13
##$BF3= 200.13
##$BF4= 200.13
##$BF5= 500.13
##$BF6= 500.13
##$BF7= 500.13
##$BF8= 500.13
##$BYTORDA= 1
##$CFDGTYP= 0
##$CFRGTYP= 5
##$CHEMSTR= <none>
##$CNST= (0..31)
1 1 145 1 1 1 1 1 1 1 1 1 1 1 1 1 1 1 1 1 1 1 1 1 1 1 1 1 1 1 1 1 
##$CPDPRG= <>
##$CPDPRG1= <>
##$CPDPRG2= <>
##$CPDPRG3= <>
##$CPDPRG4= <mlev>
##$CPDPRG5= <mlev>
##$CPDPRG6= <mlev>
##$CPDPRG7= <mlev>
##$CPDPRG8= <mlev>
##$CPDPRGB= <>
##$CPDPRGT= <>
##$D= (0..31)
0 2 0 0 0 0 0 0 0 0.06 0 0 0 0 0 0 0.0002 0 0 0 0 0 0 0 0 0 0 0 0 0 0 
0 
##$DATE= 1782388964
##$DBL= (0..7)
120 120 120 120 120 120 120 120 
##$DBP= (0..7)
150 150 150 150 150 150 150 150 
##$DBP07= 0
##$DBPNAM0= <>
##$DBPNAM1= <>
##$DBPNAM2= <>
##$DBPNAM3= <>
##$DBPNAM4= <>
$$ [...]
##$SUBNAM4= <"">
##$SUBNAM5= <"">
##$SUBNAM6= <"">
##$SUBNAM7= <"">
##$SUBNAM8= <"">
##$SUBNAM9= <"">
##$SW= 20.6817932712277
##$SWIBOX= (0..15)
0 0 3 0 0 0 0 0 0 0 0 0 0 0 0 0 
##$SW_h= 4139.07284768212
##$TD= 32768
##$TD0= 1
##$TE= 0
##$TE2= 300
##$TE3= 300
##$TEG= 300
##$TL= (0..7)
0 120 120 120 120 120 120 120 
##$TP= (0..7)
150 150 150 150 150 150 150 150 
##$TP07= 0
##$TPNAME0= <>
##$TPNAME1= <>
##$TPNAME2= <>
##$TPNAME3= <>
##$TPNAME4= <>
##$TPNAME5= <>
##$TPNAME6= <>
##$TPNAME7= <>
##$TPOAL= (0..7)
0.5 0.5 0.5 0.5 0.5 0.5 0.5 0.5 
##$TPOFFS= (0..7)
0 0 0 0 0 0 0 0 
##$TUNHIN= 0
##$TUNHOUT= 0
##$TUNXOUT= 0
##$USERA1= <user>
##$USERA2= <user>
##$USERA3= <user>
##$USERA4= <user>
##$USERA5= <user>
##$V9= 5
##$VALIST= <valist>
##$VCLIST= <CCCCCCCCCCCCCCC>
##$VD= 0
##$VDLIST= <DDDDDDDDDDDDDDD>
##$VPLIST= <PPPPPPPPPPPPPPP>
##$VTLIST= <TTTTTTTTTTTTTTT>
##$WBST= 1024
##$WBSW= 30
##$XGAIN= (0..3)
0 0 0 0 
##$XL= 0
##$YL= 0
##$YMAX_a= 640290
##$YMIN_a= -884309
##$ZGOPTNS= <>
##$ZL1= 120
##$ZL2= 120
##$ZL3= 120
##$ZL4= 120
##$ABSF1= 0
##$ABSF2= 0
##$ABSG= 0
##$ABSL= 0
##$ALPHA= 0
##$AQORDER= 0
##$ASSFAC= 0
##$ASSFACI= 0
##$ASSFACX= 0
##$ASSWID= 0
##$AUNMP= <proc_1d>
##$AZFE= 0.1
##$AZFW= 0.1
##$BCFW= 0
##$BC_mod= 2
##$BYTORDP= 0
##$COROFFS= 0
##$CY= 18.4799938201904
##$DATMOD= 1
##$DC= 0
##$DFILT= <>
##$DTYPP= 0
##$F1P= 9.9274215381318
##$F2P= -0.165520771350173
##$FCOR= 1
##$FTSIZE= 16384
##$FT_mod= 6
##$GAMMA= 0
##$GB= 0
##$INTBC= 1
##$INTSCL= 4.127829e-11
##$ISEN= 128
##$LB= 0.05
##$LEV0= 0
##$LPBIN= 0
##$MAXI= 10000
##$MC2= 0
##$MEAN= 0
##$ME_mod= 0
##$MI= 50
##$NCOEF= 0
##$NC_proc= -4
##$NLEV= 6
##$NOISF1= 3.799351
##$NOISF2= 2.8
##$NSP= 0
##$NTH_PI= 0
##$NZP= 0
##$OFFSET= 16.48848
##$PC= 4
##$PHC0= -418.39
##$PHC1= 3.101563
##$PH_mod= 1
##$PKNL= yes
##$PPARMOD= 0
##$PSCAL= 4
##$PSIGN= 0
##$REVERSE= no
##$SF= 200.130005582386
##$SI= 16384
##$SIGF1= 3
##$SIGF2= 2
##$SINO= 400
##$SIOLD= 16384
##$SREGLST= <1H.CDCl3>
##$SSB= 0
##$STSI= 16384
##$STSR= 0
##$SW_p= 4139.07284768211
##$SYMM= 0
##$S_DEV= 0
##$TDeff= 32768
##$TDoff= 0
##$TI= <>
##$TILT= no
##$TM1= 0
##$TM2= 0
##$TOPLEV= 0
##$USERP1= <user>
##$USERP2= <user>
##$USERP3= <user>
##$USERP4= <user>
##$USERP5= <user>
##$WDW= 1
##$XDIM= 16384
##$YMAX_p= 482409539
##$YMIN_p= -356808
$$ End of Bruker specific parameters
$$ ---------------------------------
##NTUPLES= NMR SPECTRUM
##VAR_NAME=  FREQUENCY,     SPECTRUM/REAL,   SPECTRUM/IMAG
##SYMBOL=    X,             R,               I
##VAR_TYPE=  INDEPENDENT,   DEPENDENT,       DEPENDENT
##VAR_FORM=  AFFN,          ASDF,            ASDF
##VAR_DIM=   16384,         16384,           16384
##UNITS=     HZ,            ARBITRARY UNITS, ARBITRARY UNITS
##FACTOR=    0.252644378177508, 1,           1
##FIRST=     3299.83951724647, 0,            0
##LAST=      -839.233330435636, 0,           0
##MIN=       -839.233330435636, -356808,     0
##MAX=       3299.83951724647, 482409539,    0
$$ Real data points
##PAGE= N=1
##DATA TABLE= (X++(R..R)), XYDATA
$$ [...]
$$ plain form
8506 54829 15562 49666 39027 189369 70287 52878 112307 28908 70401 118503 -84273
8495 -84273 94624 76249 34692 39942 55561 72909 62322 2552 24085 -6252 62649 -41477
8483 -41477 51790 114565 -59266 50027 90010 89287 34927 46806 69876 51342 173663 119047
8471 119047 -17550 29216 56812 -19379 64580 6228 128626 139842 -59002 -3184 -32217
8460 -32217 38452 22830 44355 104875 -20409 78451 76031 14159 26262 92366 50900 99655
8448 99655 14884 135243 33116 17426 16941 -32936 38095 -7078 -142 62733 -50809 27465
8436 27465 43205 3617 85012 -48565 -6968 3108 -7869 71766 -36313 21419 24179 78236
8424 78236 -17821 5142 38470 77135 92591 70823 27798 45078 34380 24459 94079 89868
$$ packed form
8506E4829l9267L4104j0639J50342j19082j7409N9429q3399M1493M8102k02776
8495h4273J78897j8375m1557N250J5619J7348j0587n9770K1533l0337O8901j04126
8483d1477R3267O2775j73831J09293L9983p23n4360J1879K3070j8534J22321n4616
8471A19047j36597M6766K7596p6191Q3959n8352J22398J1216j98844N5818k9033
8460c2217P0669j5622K1525O0520j25284R8860k420o1872J2103O6104m1466M8755
8448I9655q4771J20359j02127j5690m85m9877P1031m5173O936O2875j13542P8274
8436B7465J5740l9588Q1395j33577M1597J0076j0977P9635j08079N7732K760N4057
8424G8236r6057K2963L3328L8665J5456k1768m3025J7280j0698r921O9620m211
$$ plain form
8412 89868 91348 76098 184440 75742 122258 37344 59465 20343 96637 27940 -19423 79714
8400 79714 -28059 -94673 -19127 -31362 34030 -4169 22303 -21325 64585 -72443 14482
8389 14482 -24897 48298 -81111 14931 -39299 38464 -19686 -4601 -31675 -1491 -23384 21408
8377 21408 25231 10117 25096 -11532 -32973 -57695 18987 -73085 13467 -28439 -16974 59323
8365 59323 -67795 14067 -95492 -4636 82018 -63269 -5720 -31197 -15152 -8658 -34427
8354 -34427 -43808 -890 -31375 -88673 3541 -68252 37577 -6525 -68181 -32509 72745 -72055
8342 -72055 15670 19931 18399 -27971 -112594 -74852 13488 -70355 13261 -100192 -29476 -63528
8330 -63528 -60845 13410 -15507 -40281 26633 -92472 -29601 -24695 19650 29557 -22956 31294
$$ packed form
8412H9868J480j5250J08342j08698M6516q4914K2121l9122P6294o8697m7363R9137
8400G9714j07773o6614P5546j2235O5392l8199K6472m3628Q5910j37028Q6925
8389A4482l9379P3195j29409R6042n4230P7763n8150J5085k7074L0184k1893M4792
8377B1408L823j5114J4979l6628k1441k4722P6682r2072Q6552m1906J1465P6297
8365E9323j27118Q1862j09559R0856Q6654j45287N7549k5477J6045O494k5769
8354c4427r381M2918l0485n7298R2214p1793J05829m4102o1656L5672J05254j44800
8342g2055Q7725M261j532m6370q4623L7742Q8340q3843Q3616j13453P0716l4052
8330f3528K683P4255k8917k4774O6914j19105O2871M906M4345R907n2513N4250
$$ plain form
8318 31294 -55191 -121302 66477 -125312 67977 54692 23044 107116 -64431 -35148 -1755
8307 -1755 7689 88815 -7357 25793 -17199 -91332 -75703 -48613 -37296 99849 -9340 24523
8295 24523 13998 43754 29135 -42173 -59619 124778 21395 -72207 57625 -26500 55731
8284 55731 17190 -18235 -18198 -11649 -7790 57287 17712 -14603 97680 -35788 14634 -138932
8272 -138932 -11175 12849 -103209 3602 78853 -13806 64243 -5866 -73813 -28207 -49981
8261 -49981 -22725 88683 -90061 -75233 -107099 -109941 -58090 -85418 -5927 -89628 28253
8250 28253 -49061 -15523 47529 -939 -72004 -64414 -60394 44845 -1114 3798 -37296 -71218
8238 -71218 48230 -152229 -112970 32878 -76433 9539 -6785 -60597 79612 -129971 -164986
$$ packed form
8318C1294q6485o6111J87779j91789J93289j3285l1648Q4072j71547K9283L3393
8307a755R444Q1126r6172L3150m2992p4133J5629K7090J1317J37145j09189L3863
8295B4523j0525K9756j4619p1308j7446J84397j03383r3602J29832q4125Q2231
8284E5731l8541l5425L7O549L859O5077l9575l2315J12283j33468N0422j53566
8272a38932J27757K4024j16058J06811P5251r2659P8049p0109o7947M5606k1774
8261d9981K7256J11408j78744J4828l1866k842N1851k7328P9491q3701J17881
8250B8253p7314L3538O3052m8468p1065P590M020J05239m5959M912m1094l3922
8238g1218J19448k00459L9259J45848j09311Q5972j6324n3812J40209k09583l5015
$$ plain form
8227 -164986 -106268 -65913 40492 -52798 10640 2965 -253334 -70079 -65005 36809 29569
8216 29569 -101525 17891 -38201 -48490 64046 -21587 -128192 -74020 -95894 8494 -25049
8205 -25049 70243 -51555 -92539 -86167 -40593 16384 -124781 -82785 21959 -78563 -63958
8194 -63958 -94953 10050 125069 -159350 33638 -10127 -28863 65148 100083 51998 1679
8183 1679 -233680 67896 -12778 57445 28140 -33349 -19897 427 -15870 34169 -2832 14200
8171 14200 -22222 47468 41634 38699 -81083 -5380 -119340 -26462 -22860 -149597 31942 -61972
8159 -61972 -13727 -81601 -101085 -21435 -75049 -105615 -67940 616 -11506 2814 -126972 -52783
8147 -52783 -129919 -50111 -3228 38800 17771 11302 -39696 -59084 -191 -81319 23870 2882
$$ packed form
8227a64986N8718M0355J06405r3290O3438p675k56299J83255N074J01814p240
8216B9569j31094J19416n6092j0289J12536q5633j06605N4172k1874J04388l3543
8205b5049R5292j21798m0984O372M5574N6977j41165M1996J04744j00522J4605
8194f3958l0995J05003J15019k84419J92988m3765j8736R4011L4935m8085n0319
8183A679k35359L01576q0674P0223k9305o1489J3452K0324j6297N0039l7001J7032
8171A4200l6422O9690n834k935j19782P5703j13960R2878L602j26737J81539r3914
8159f1972M8245o7874j9484P9650n3614l0566L7675O8556j2122J4320j29786P4189
8147e2783p7136P9808M6883M2028k1029o469n0998j9388N8893q1128J05189k0988
$$ plain form
8135 2882 6217 -13711 -6422 -54923 -33683 -60046 34636 -57538 5716 -5036 13073 20766 -125262
8122 -125262 -50288 -11989 -12239 -18054 13613 -6977 -30272 -63254 -43975 -75616 -16843 -45707
8110 -45707 -24937 -89186 -95693 -119478 36828 36936 -95280 -21652 -63162 -24395 4186 -12953
8098 -12953 14154 -41607 -75657 31909 -246 -28846 -39283 55566 19748 -37565 49926 23555
8086 23555 -83755 39455 -70825 61913 53431 -5759 73320 -22894 -73445 35286 133782
8075 133782 135639 36483 22626 11201 -80329 64272 -19540 103760 40877 -46838 20521
8064 20521 -45129 39993 106448 100257 -82805 42778 19585 41372 29416 124027 -15503
8053 -15503 -46494 -4386 28366 106727 143870 109103 133248 81578 134586 116874 190973 152042
$$ packed form
8135B882L335j9928P289m8501K1240k6363R4682r2174O3254j0752J8109P693j46028
8122a25262P4974L8299k50n815L1667k0590k3295l2982J9279l1641N8773k8864
8110d5707K0770o4249o507k3785J56306J08j32216P3628m1510L8767K8581j7139
8098a2953K7107n5761l4050J07566l2155k8600j0437R4849l5818n7313Q7491k6371
8086B3555j07310J23210j10280J32738q482n9190P9079r6214n0551J08731R8496
8075A33782J857r9156j3857j1425r1530J44601q3812J23300o2883q7715O7359
8064B0521o5650Q5122O6455o191j83062J25583k3193K1787j1956R4611j39530
8053a5503l0991M2108L2752P8361L7143l4767K4145n1670N3008j7712P4099l8931
$$ plain form
8041 152042 74755 169508 162028 137065 235582 184900 84659 136733 142229 229388 234458 191650
8029 191650 235937 129632 166265 181538 164604 258605 224406 250280 188151 154926 232812
8018 232812 170304 205372 177786 113165 265621 233338 278077 222261 294012 315079 173735
8007 173735 297199 376175 305819 389970 258479 192298 331983 323632 351940 368017 312852
7996 312852 220455 241097 288910 286117 336569 220881 199065 147818 191870 302195 221215
7985 221215 231326 279770 147578 185867 165756 207671 296488 182842 202150 175738 90303
7974 90303 319458 124118 197621 201104 88714 256276 134794 189209 186496 152231 125151
7963 125151 84890 221485 150726 142388 134084 75662 66302 145310 62907 84688 78054 -22496
$$ packed form
8041A52042p7287R4753p480k4963R8517n0682j00241N2074N496Q7159N070m2808
8029A91650M4287j06305L6633J5273j6934R4001l4199K5874o2129l3225P7886
8018B32812o2508L5068k7586o4621J52456l2283M4739n5816P1751K1067j41344
8007A73735J23464P8976p0356Q4151j31491o6181J39685q351K8308J6077n5165
7996C12852r2397K0642M7813k793N0452j15688k1816n1247M4052J10325q0980
7985B21215J0111M8444j32192L8289k0111M1915Q8817j13646J9308k6412q5435
7974I0303K29155j95340P3503L483j12390J67562j21482N4415k713l4265k7080
7963A25151m0261J36595p0759q338q304n8422r360P9008q2403K1781o634j00550
$$ plain form
7951 -22496 102696 84679 139702 161669 37050 -9713 47353 13428 66624 149309 126928
7940 126928 143527 19281 -32611 84798 99417 50979 74904 76597 92118 44031 36624 63900
7928 63900 -13246 26615 -8693 24107 37311 55528 116930 -23797 15637 -70793 -1527 32474
7916 32474 54548 109591 -8161 1590 55782 62636 61119 28848 -70228 54806 40918 4925
7904 4925 45763 69785 -602 -40407 -26600 -8359 -64504 63098 35838 27540 46201 44512
7892 44512 18777 -28209 64550 35095 106786 5833 48095 8037 44454 -21060 -81668 62823
7880 62823 -62479 -5737 -41047 11316 -42497 -40445 -72466 1577 -26932 25410 61498 -47298
7868 -47298 -13722 15224 52424 -12917 48608 -7278 120829 33555 56681 159237 302486
$$ packed form
7951b2496J25192j8017N5023K1967j24619m6763N7066l3925N3196Q2685k2381
7940A26928J6599j24246n1892J17409J4619m8438K3925J693J5521m8087p407K7276
7928F3900p7146L9861l5308L2800J3204J8217O1402j40727L9434q6430O9266L4001
7916C2474K2074N5043j17752R751N4192O854j517l2271r9076J25034j3888l5993
7904D925M0838K4022p0387l9805J3807J8241n6145J27602k7260q298J8661j689
7892D4512k5735m6986R2759k9455P1691j00953M2262m0058L6417o5514o0608J44491
7880F2823j25302N6742l5310N2363n3813K052l2021P4043k8509N2342L6088j08796
7868d7298L3576K8946L7200o5341O1525n5886J28107q7274K3126J02556J43249
$$ plain form
7857 302486 347816 311925 418448 374904 276242 547458 -302147 72791 -18308 70699 -168665
7846 -168665 35389 -39808 26892 59330 -106514 -16246 -135837 15795 -54714 -35565 -1521
7835 -1521 -12075 62512 -34641 47229 34736 -40555 -79384 -15023 32373 1424 48700 -1432
7823 -1432 -17743 2596 -22504 51481 21616 -23352 -57267 23066 -56959 56725 -116687 -16109
7811 -16109 -113049 -54176 32630 -21841 -1628 17725 23851 -90223 -52511 -71170 -33379 15527
7799 15527 -136120 52516 -97760 -16085 -39882 -42480 -78295 -35130 -124041 12782 -44204
7788 -44204 -24618 -51349 -133812 -111211 -105960 -49861 -12128 -69134 -104266 -68020 -130058 -78524
7776 -78524 -111324 -65658 -21991 -78361 -134445 -63685 -50130 -68671 40774 -122644 -91482
$$ packed form
7857C02486M5330l5891J06523m3544r8662K71216q49605L74938r1099Q9007k39364
7846a68665K04054p5197O6700L2438j65844R0268j19591J51632p0509J9149L4044
7835a521j0554P4587r7153Q1870j2493p5291l8829O4361M7396l0949M7276n0132
7823a432j6311K0339k5100P3985k9865m4968l3915Q0333q0025J13684j73412J00578
7811a6109r6940N8873Q6806n4471K0213J9353O126j14074L7712j8659L7791M8906
7799A5527j51647J88636j50276Q1675k3797k598l5815M3165q8911J36823n6986
7788d4204J9586k6731q2463K2601N251N6099L7733n7006l5132L6246o2038N1534
7776g8524l2800M5666M3667n6370n6084P0760J3555j8541J09445j63418L1162
$$ plain form
7765 -91482 -94350 -47422 -7427 -73521 -75004 -19892 -167748 -76134 1877 -56126 -92932 -107926
7753 -107926 -167701 -30793 -86054 -55553 -51610 -91276 -108425 -78971 -138373 -19885 -106759
7742 -106759 -46249 -47610 -131547 -183254 25417 -125193 93858 -47737 29694 -60641 -124870
7731 -124870 45297 -64780 -14367 -64617 -68401 -20654 -112663 -30992 -9544 -73447 -24306
7720 -24306 -28287 -24415 7950 -88206 -11584 -90437 -84683 -77388 -51497 -31817 -22582 -102115 -20825
7707 -20825 7266 -39668 -4041 -17010 -1098 -25290 -68552 11749 -55587 29516 -2869 -10699
7695 -10699 -143937 -78326 -22015 3383 12302 -37138 -52286 -21307 -46401 -12938 11434 -6552
7683 -6552 -61037 -101635 -45152 -30718 -95943 -660 -74645 -101145 -95819 -93685 -59870 -19941
$$ packed form
7765i1482k868M6928L9995o6094j483N5112j47856R1614P8011n8003l6806j4994
7753a07926n9775J36908n5261L0501L943l9666j7149K9454n9402J18488q6874
7742a06759O0510j361q3937n1707K08671j50610K19051j41595P7431r0335o4229
7731a24870J70167j10077N0413n0250l784M7747r2009Q1671K1448o3903M9141
7720b4306l981L872L2365r6156P6622p8853N754P295K5891J9680R235p9533Q1290
7707b0825K8091m6934L5627j2969J5912k4192m3262Q0301o7336Q5103l2385p830
7695a0699j33238O5611N6311K5398Q919m9440j5148L0979k5094L3463K4372j7986
7683f552n4485m0598N6483J4434o5225R5283p3985k6500N326K134L3815L9929
$$ plain form
7671 -19941 -69310 -79000 -87335 -77906 -29959 -64691 -69367 -113892 31770 -81774 -39734 23422
7659 23422 -91166 -35208 -111744 -84222 25959 -36363 -20267 -35777 -35688 -90208 -66236 -50274
7647 -50274 -20838 52252 -81895 -8318 -83848 -51405 -48284 -113794 -50920 -5135 -104746 -93694
7635 -93694 -51805 -105783 -16185 -136170 -29104 -118048 -88713 -102835 -36335 -41998 -29342 -29418
7623 -29418 -128230 -87524 10960 19472 -36711 -80395 -94984 -40013 -44777 -22750 -573 -64273
7611 -64273 -6413 -146826 27766 -26185 -42843 -21746 -130437 -94717 -53631 -61788 5924
7600 5924 -150262 -62525 -164850 -44605 -40356 10910 -95261 -42650 -77730 33898 -19633
7589 -19633 587 -54646 -97057 -58598 -24115 -104193 24902 -34026 -33913 -70614 -24807 -33442
$$ packed form
7671a9941m9369r690q335R429M7947l4732m676m4525J45662j13544M2040O3156
7659B3422j14588N5958p6536K7522J10181o2322J6096j5510Q9n4520K3972J5962
7647e0274K9436P3090j34147P3577p5530L2443L121o5510O2874M5785r9611J1052
7635i3694M1889n3978Q9598j19985J07066q8944K9335j4122O6500n663J2656p6
7623b9418r8812M0706R8484Q512n6183m3684j4589N4971m764K2027K2177o3700
7611f4273N7860j40413J74592n3951j6658K1097j08691L5720M1086q157O7712
7600E924j56186Q7737j02325J20245M249N1266j06171N2611l5080J11628n3531
7589a9633K0220n5233m2411L8459L4483q0078J29095n8928J13l6701M5807q635
$$ plain form
7577 -33442 -15132 -95395 -20929 -109785 -110081 -175417 -85466 -86852 -105274 -113555 -60168 -97598 -7625
7564 -7625 -63571 -9357 -160016 -81790 -128363 -77833 -92821 46094 -92151 -69731 -61061 -2076
7552 -2076 -1508 -22317 -274 -29173 -59448 -52958 -40628 -23373 -97304 -30951 -97957 39099
7540 39099 -78376 -1859 -26051 -112272 -31901 -106649 -98278 31369 -43803 17651 -72662 -6802
7528 -6802 8793 36673 -74838 -31894 -85038 -12488 -9865 -6749 -15500 -33772 -200 52365
7516 52365 -66793 -1833 -17062 62478 15083 -50271 3334 -48539 -78926 -32044 37045 -5575
7504 -5575 -20866 -25867 -27525 -74029 -46711 58051 -65714 13633 -61895 22598 44063 10162
7492 10162 8212 9495 -79321 11516 16979 47524 17122 30699 100968 25378 19330 -23528 38502
$$ packed form
7577c3442J8310q0263P4466q8856k96o5336Q9951j386j8422q281N3387l7430Q9973
7564g625n5946N4214j50659P8226m6573N0530j4988J38915j38245K2420Q670N8985
7552b076N68k0809K2043k8899l0275O490J2330J7255p3931O6353o7006J37056
7540C9099j17475P6517k4192q6221Q0371p4748Q371J29647p5172O1454r0313O5860
7528f802J5595K7880j11511M2944n3144P2550K623L116q751j8272L3572N2565
7516E2365j19158O4960j5229P9540m7395o5354N3605n1873l0387M6882O9089m2620
7504e575j5291n001j658m6504K7318J04762j23765P9347p5528Q4493K1465l3901
7492A0162j950J283q8816R0837N463L0545l0402J3577P0269p5590o048m2858O2030
$$ plain form
7479 38502 32646 29677 118413 -20464 53683 -16422 -8484 -76463 -398 36029 47867 6395
7467 6395 34876 -140239 -102372 -64852 -24610 -128031 -62155 16473 -110999 26275 -105460
7456 -105460 -69121 2009 -77885 -76389 4323 -71592 -24463 10904 -5558 -51092 -44815 -38933
7444 -38933 39772 -41749 -83341 40466 53321 17028 4219 -63280 9993 -52252 54567
7433 54567 25203 -17604 5593 -511 -24136 -10922 -40340 -59415 -13462 -65839 18406 123615
7421 123615 -40411 -77164 -27183 -57048 -28740 1723 -59396 22158 -47032 3986 21073
7410 21073 80354 -77933 -63086 -14119 64497 2776 -12206 -19403 -58873 -62893 25662 -103379
7398 -103379 79459 -82140 -13196 832 -49455 -40069 -6911 -17496 -16084 -74407 -14167 -66440
$$ packed form
7479C8502n856k969Q8736j38877P4147p0105P938o7979P6065L6427J1838m1472
7467F395K8481j75115L7867L7520M0242j03421O5876P8628j27472J37274j31735
7456a05460L6339P1130p9894J496Q0712p5915M7129L5367j6462m5534O277N882
7444c8933P8705q1521m1592J23807J2855l6293j2809o7499P3273o2245J06819
7433E4567k9364m2807K3197o104k3625J3214k9418j9075M5953n2377Q4245J05209
7421A23615j64026l6753M9981k9865K8308L0463o1119Q1554o9190N1018J7087
7410B1073N9281j58287J4847M8967P8616o1721j4982p197l9470m020Q8555j29041
7398a03379J82838j61599O8944J4028n0287R386L3158j0585J412n8323O0240n2273
$$ plain form
7386 -66440 -39878 -47317 -38820 19984 33234 -10883 61434 -10454 5927 -26785 35797 22907
7374 22907 59810 35811 115907 2946 16756 -14266 71705 24066 34332 -2032 62574 9339
7362 9339 -123301 1269 36786 34924 5774 -92615 79883 -49029 -35417 23218 -7429
7351 -7429 15583 -51977 -75289 68318 -30820 17539 46943 7143 14115 35786 103911 32673
7339 32673 23772 76280 46084 57986 -17237 98695 -3089 4584 75174 58610 47103 79398
7327 79398 75397 74699 124464 16838 4552 87296 8337 45565 2563 122898 19177 53350
7315 53350 -8155 113784 29330 51994 81234 17738 137187 -95012 40216 15308 11562
7304 11562 22324 -10433 119004 66356 122953 35035 27488 28625 4719 74802 57330 82820
$$ packed form
7386f6440K6562p439Q497N8804J3250m4117P2317p1888J6381l2712O2582j2890
7374B2907L6903k3999Q0096j12961J3810l1022Q5971m7639J0266l6364O4606n3235
7362I339j32640J24570L5517j862k9150r8389J72498j28912J3612N8635l0647
7351g429K3012o7560k3312J43607r9138M8359K9404l9800O972K1671O8125p1238
7339C2673q901N2508l0196J1902p5223J15932j01784P673P0590j6564j1507L2295
7327G9398m001o98M9765j07626j2286Q2744p8959L7228m3002J20335j03721L4173
7315E3350o1505J21939q4454K2664K9240o3496J19449k32199J35228k4908l746
7304A1562J0762l2757J29437n2648N6597q7918p547J137k3906P0083j7472K5490
$$ plain form
7292 82820 101659 125488 16400 130312 61775 111822 48999 70422 230202 73302 187983
7281 187983 64763 120952 104157 101636 209107 191094 195774 164855 218401 127339 185893 93473
7269 93473 170511 135919 194119 175979 123212 141321 93114 169587 145910 155937 176920 184670
7257 184670 154082 216886 227380 138415 282947 108038 152278 235479 182044 257976 342177
7246 342177 218128 315665 290587 300337 354791 293072 314839 333240 432651 367864 423123 382159
7234 382159 355072 490126 536073 569224 502771 615022 633001 586599 644694 716402 849529
7223 849529 855614 841354 933859 1019324 1110883 1087665 1168493 1169404 1219893 1167855 1268383 1272108
7211 1272108 1343738 1314791 1372541 1521863 1506696 1595894 1826948 1868915 2080645 2143987 2323671
$$ packed form
7292H2820J8839K3829j09088J13912o8537N0047o2823K1423J59780j56900J14681
7281A87983j23220N6189j6795k521J07471j8013M680l0919N3546r1062N8554r2420
7269I3473P7038l4592N8200j8140n2767J8109m8207P6473k3677J0027K0983P750
7257A84670l0588O2804J0494q8965J44532j74909M4240Q3201n3435P5932Q4201
7246C42177j24049R7537k5078R750N4454o1719K1767J8401R9411o4787N5259m0964
7234C82159k7087J35054M5947L3151o6453J12251J7979m6402N8095P1708J33127
7223H49529O085j4260R2505Q5465R1559k3218Q0828R11N0489n2038J00528L725
7211A272108P1630k8947N7750J49322j5167Q9198K31054M1967K11730O3342J79684
$$ plain form
7200 2323671 2569425 2762486 2986038 3205340 3369752 3508918 3570900 3567157 3450225 3294616
7190 3294616 3172787 3019495 2852020 2753517 2553515 2383119 2159151 2092565 1988665 1911083
7180 1911083 1803461 1683516 1570341 1522428 1378051 1564580 1373956 1306444 1195805 1215285
7170 1215285 1204781 1172289 1106659 1146841 1024133 1138899 1068739 1044171 994731 1009494 1115208
7159 1115208 1034771 1014245 1040789 1020743 1081759 933840 1096874 1000782 1109399 1152688 1089938
7148 1089938 1284347 1167070 1165492 1269178 1305824 1297074 1391328 1328475 1286452 1327065 1242295
7137 1242295 1297204 1326206 1306569 1261369 1233592 1183814 1208158 1139384 1059415 1079388 1043591
7126 1043591 1062869 975994 980162 966991 889191 936790 916083 918216 880890 887061 793418 875795
$$ packed form
7200B323671K45754J93061K23552K19302J64412J39166O1982l743j16932j55609
7190C294616j21829j53292j67475r8503k00002j70396k23968o6586j03900p7582
7180A911083j07622j19945j13175m7913j44377J86529j90624o7512j10639J9480
7170A215285j0504l2492o5630M0182j22708J14766p0160k4568m9440J4763J05714
7159A115208q0437k0526K6544k0046O1016j47919J63034r6092J08617M3289o2750
7148A089938J94409j17277j578J03686L6646q750R4254o2853m2023M0613q4770
7137A242295N4909K9002j9637m5200k7777m9778K4344o8774p9969J9973l5797
7126A043591J9278q6875M168j3171p7800M7599k0707K133l7326O171r3643Q2377
$$ plain form
7114 875795 847972 796311 842909 809837 771903 777203 741226 768673 738305 810519 680982 661040
7102 661040 594925 679506 688158 738538 766059 753183 616775 623832 723350 686329 837903 674388
7090 674388 824053 735019 736024 657671 673925 723705 676823 689754 649746 609948 604748 632487
7078 632487 609782 640645 592392 587262 578025 494120 616282 555788 638054 565401 564406 630217
7066 630217 607758 539304 572893 612425 626925 614087 548784 595067 545476 537369 461262 519246
7054 519246 582578 576049 536193 502241 508138 389845 477689 464511 387467 393444 352287 418667
7042 418667 332077 408442 399977 317276 337225 360904 418295 299349 416170 362032 358959 325117
7030 325117 350106 344364 371666 335757 348663 318083 320993 302921 391584 330255 429004 261576
$$ packed form
7114H75795k7823n1661M6598l3072l7934N300l5977K7447l0368P2214j29537j9942
7102F61040o6115Q4581Q652N0380K7521j2876j36408P057R9518l7021J51574j63515
7090F74388J49665q9034J005p8353J6254M9780m6882J2931m0008l9798n200K7739
7078F32487k2705L0863m8253n130r237q3905J22162o0494Q2266p2653r95O5811
7066F30217k2459o8454L3589L9532J4500j2838o5303M6283m9591q107p6107N7984
7054E19246O3332o529l9856l3952N897j18293Q7844j3178p7044N977m1157O6380
7042D18667q6590P6365q465q2701J9949K3679N7391j18946J16821n4138l073l3842
7030C25117K4989n742K7302l5909J2906l0580K910j8072Q8663o1329R8749j67428
$$ plain form
7018 261576 337316 272213 282090 402834 337407 298213 363072 327639 247896 367662 321880
7007 321880 409937 268282 338644 271331 285909 325730 231316 307892 332506 288465 279238 322431
6995 322431 262616 290178 416340 329350 350739 298807 300807 271259 364088 324866 354206 336894
6983 336894 277468 350378 349691 330303 346077 487498 376816 480625 413656 400469 458513
6972 458513 430374 527680 496457 625169 531632 673891 604469 651070 661120 748172 844173
6961 844173 806328 967737 868848 1005082 878062 875598 891755 874581 867228 805500 777355
6950 777355 727199 741932 748054 726764 669515 623301 649488 655762 636396 609141 647383 613377
6938 613377 534199 561802 463011 582633 507130 646582 478097 529060 455571 508488 484246
$$ packed form
7018B61576P5740o5103R877J20744o5427l9194O4859l5433p9743J19766m5782
7007C21880Q8057j41655P0362o7313J4578L9821r4414P6576K4614m4041r227M3193
6995C22431n9815K7562J26162q6990K1389n1932K000k9548R2829l9222K9340j7312
6983C36894n9426P2910o87j9388J5774J41421j10682J03809o6969j3187N8044
6972D58513k8139R7306l1223J28712r3537J42259o9422M6601J0050Q7052R6001
6961H44173l7845J61409r8889J36234j27020k464J6157j7174p353o1728k8145
6950G77355n0156J4733O122k1290n7249m6214K6187O274j9366k7255L8242l4006
6938F13377p9178K7603r8791J19622p5503J39452j68485N0963p3489N2917k4242
$$ plain form
6927 484246 446050 548748 434668 502644 361767 522395 424740 388948 416960 464187 524692
6916 524692 359300 516765 448791 482033 481504 469668 516144 462775 446585 479869 529961 481750
6904 481750 563544 483256 530434 463708 461611 558120 452164 494605 525397 502085 551539 462761
6892 462761 497811 513087 450182 458954 442393 489842 481193 369335 430310 363816 401864 479358
6880 479358 367329 475711 419375 387436 480605 303303 422886 369409 411914 447816 373580
6869 373580 329227 357277 258716 388147 393144 340678 413945 364777 352470 324746 308929 450221
6857 450221 406936 364739 240675 396756 312856 426208 405123 458742 471028 387145 424070
6846 424070 388681 378973 467713 330274 409063 321792 360968 305932 338276 350091 397687 376150
$$ packed form
6927D84246l8196J02698j14080O7976j40877J60628r7655l5792K8012M7227O0505
6916E24692j65392J57465o7974L3242n29j1836M6476n3369j6190L3284N0092m8211
6904D81750Q1794q0288M7178o6726k097R6509j05956M2441L0792k3312M9454q8778
6892D62761L5050J5276o2905Q772j6561M7449q649j11858O0975o6494L8048P7494
6880D79358j12029J08382n6336l1939R3169j77302J19583n3477M2505L5902p4236
6869C73580m4353K8050r8561J29431M997n2466P3267m9168j2307k7724j5817J41292
6857D50221m3285m2197j24064J56081q3900J13352k1085N3619J2286q3883L6925
6846D24070l5389r708Q8740j37439P8789q7271L9176n5036L2344J1815M7596k1537
$$ plain form
6834 376150 330005 391369 364522 304896 352536 426623 252042 261590 343043 222191 348905
6823 348905 350106 351721 347801 338236 244692 345052 352955 333313 349802 338725 308499 349714
6811 349714 372530 307209 332444 282991 337419 315587 384519 302596 302124 241215 250322 362676
6799 362676 427169 368066 297271 328497 293563 345806 377654 369467 307805 266838 316679 376755
6787 376755 354049 342563 304967 299951 361808 339792 424501 385499 314691 299317 259123 395156
6775 395156 399716 290662 310010 268624 375479 280492 402739 411934 328891 400932 314719
6764 314719 360104 402146 397013 418352 445210 380881 340780 399320 310869 433006 326208
6753 326208 343427 380552 360156 394626 344449 344684 338630 362577 346209 306323 330111 331208
$$ packed form
6834C76150m6145O1364k6847n9626M7640P4087j74581R548Q1453j20852J26714
6823C48905J201J615l920r565r3544J00360P903j9642J6489j1077l0226M1215
6811C49714K2816o5321K5235m9453N4428k1832O8932q1923m72o0909R107J12354
6799C62676O4493n9103p0795L1226l4934N2243L1848q187o1662m0967M9841O0076
6787C76755k2706j1486l7596n016O1857k2016Q4709l9002p0808j5374m0194J36033
6775C95156M560j09054J9348m1386J06855r4987J22247R195q3043P2041q6213
6764C14719M5385M2042n133K1339K6858o4329m0101N8540q8451J22137j06798
6753C26208J7219L7125k0396L4470n0177K35o054K3947j6368l9886K3788J097
$$ plain form
6741 331208 332928 389248 362348 306818 411266 329366 361076 368506 339155 411022 408538 336267
6729 336267 411634 189003 436167 316612 318041 322716 260753 364264 282532 256773 351144
6718 351144 276485 355792 375413 353934 303077 357690 279196 397112 268480 338538 367964
6707 367964 316279 359233 362330 353868 359001 365888 414295 453674 377322 287201 429620 303381
6695 303381 414559 343124 374409 411020 342816 331966 361186 419469 372793 470700 360502
6684 360502 403196 420968 418330 443381 360917 439586 409590 481870 480615 575716 530586 542694
6672 542694 596033 619517 686831 630105 553807 601031 596987 688634 560842 594656 682575 619170
6660 619170 689010 803387 718430 878792 906294 952426 956126 1070137 1101264 1244247 1368880
$$ packed form
6741C31208J720N6320k6900n5530J04448q1900L1710P430k9351P1867k484p2271
6729C36267P5367k22631K47164j19555J429M675o1963J03511q1732k5759R4371
6718C51144p4659P9307J9621k1479n0857N4613p8494J17916j28632P0058K9426
6707C67964n1685M2954L097q462N133O887M8407L9379p6352r0121J42419j26239
6695C03381J11178p1435L1285L6611o8204j0850K9220N8283m6676R7907j10198
6684C60502M2694J7772k638K5051q2464P8669k9996P2280j255R5101m5130J2108
6672E42694N3339K3484O7314n6726p6298M7224m044R1647j27792L3814Q7919o3405
6660F19170O9840J14377q4957J60362K7502M6132L700J14011L1127J42983J24633
$$ plain form
6649 1368880 1642736 1804904 1939815 1907815 1857590 1905790 1828785 1637754 1624087 1565356 1320503
6638 1320503 1369099 1431379 1328379 1402118 1262434 1360289 1408986 1343201 1538210 1549521 1641413
6627 1641413 1720551 1941834 2175405 2359337 2703146 2994099 3213186 3247882 3239094 3229632 2963470
6616 2963470 2779026 2632663 2523343 2442508 2295333 2251576 2133885 2042664 2110322 2027129
6606 2027129 1864230 1886746 1883785 1896331 1957439 1924332 2020201 2135638 2152547 2328065 2529728
6595 2529728 2443597 2554248 2535115 2598059 2441488 2565546 2404827 2437071 2289977 2288291 2223116
6584 2223116 2228095 2090891 2116432 2039797 1927174 1845466 1899872 1758904 1701813 1567800 1694612
6573 1694612 1561388 1631099 1462878 1413799 1549267 1402611 1481144 1559259 1556792 1707874 1653317
$$ packed form
6649A368880K73856J62168J34911l2000n0225M8200p7005j91031j3667n8731k44853
6638A320503M8596O2280j03000P3739j39684R7855M8697o5785J95009J1311R1892
6627A641413P9138K21283K33571J83932L43809K90953K19087L4696q788r462k66162
6616B963470j84444j46363j09320q0835j47175m3757j17691r1221O7658q3193
6606B027129j62899K2516k961J2546O1108l3107R5869J15437J6909J75518K01663
6595B529728q6131J10651j9133O2944j56571J24058j60719L2244j47094j686o5175
6584B223116M979j37204K5541p6635j12623q1708N4406j40968n7091j34013J26812
6573A694612j33224O9711j68221m9079J35468j46656P8533P8115k467J51082n4557
$$ plain form
6562 1653317 1648599 1624592 1652743 1523432 1485487 1461794 1465264 1350297 1423910 1228791 1223575
6551 1223575 1277480 1190889 1226568 1216435 1195844 1221971 1092952 1101231 1068201 1033753 1041760 1043277
6539 1043277 1087212 1140122 967807 1033539 952054 930320 914016 934491 930764 929384 776547
6528 776547 876646 857264 805232 806125 823843 775656 769578 748739 830945 789227 775029 749810
6516 749810 725160 786730 776644 740106 738646 732972 767673 761525 655618 651813 710011 698864
6504 698864 724585 708215 857382 704760 816363 733750 740275 859613 720436 723420 761109
6493 761109 771666 757710 773757 645517 799608 667584 680335 863793 771805 961765 815096
6482 815096 881904 811697 827242 764033 853199 912604 919634 847619 808973 893799 793036 714409
$$ packed form
6562A653317m718k4007K8151j29311l7945k3693L470j14967P3613j95119n216
6551A223575N3905q6591L5679j0133k0591K6127j29019Q279l3030l4448Q007J517
6539A043277M3935N2910j72315O5732q1485k1734j6304K0475l727j380j52837
6528G76547J00099j9382n2032Q93J7718m8187o078k0839Q2206m1718j4198k5219
6516G49810k4650O1570j0086l6538j460n674L4701o148j05907l805N8198j1147
6504F98864K5721j6370J49167j52622J11603q2613O525J19338j39177K984L7689
6493G61109J0557j3956J6047j28240J54091j32024J2751J83458r1988J89960j46669
6482H15096O6808p0207J5545o3209Q9166N9405P030p2015l8646Q4826j00763p8627
$$ plain form
6470 714409 789204 705385 783013 756459 781515 768915 735294 705460 725720 688949 681017 773252
6458 773252 840662 829518 747483 760065 692646 706061 779255 801093 722434 740752 732983 764491
6446 764491 808249 852660 776257 729880 704044 707235 773109 786905 767435 715949 609795 682464
6434 682464 658576 656307 676362 623772 661381 560875 589039 592014 569977 617705 637661 575910
6422 575910 707103 706960 606952 690417 651543 748575 684272 657275 756164 692589 735943 624103
6410 624103 661433 742257 732651 622038 673766 661352 702880 666558 681312 680260 646551 611203
6398 611203 505866 636656 609764 638485 631368 554312 672047 572904 636795 611721 622069
6387 622069 589656 645514 580910 685617 613346 676282 643132 680058 601954 728417 656698
$$ packed form
6470G14409P4795q3819P7628k6554K5056j2600l3621k9834K0260l6771p932R2235
6458G73252O7410j1144q2035J2582o7419J3415P3194K1838p8659J8318p769L1508
6446G64491M3758M4411p6403m6377k5836L191O5874J3796j9470n1486j06154P2669
6434F82464k3888k269K0055n2590L7609j00506K8164K975k2037M7728J9956o1751
6422E75910J31193j43j00008Q3465l8874R7032o4303k6997R8889o3575M3354j11840
6410F24103L7330Q0824r606j10613N1728j2414M1528l6322J4754j052l3709l5348
6398F11203j05337J30790k6892K8721p117p7056J17735r9143O3891k5074J0348
6387F22069l2413N5858o4604J04707p2271O2936l3150L6926p8104J26463p1719
$$ plain form
6376 656698 739220 595759 722363 698744 641429 581496 726538 663201 695027 661229 702426
6365 702426 755760 650943 681471 697999 736675 742555 751016 701362 710159 740578 703581 732248
6353 732248 693487 744858 682207 764942 753541 825822 805283 812463 794150 753476 812907 811579
6341 811579 834956 810916 731562 879030 853374 767434 909853 836448 937568 881825 847849
6330 847849 916145 888608 899298 942228 963185 930447 982454 913585 983356 900548 1076996
6319 1076996 1010269 1026526 932491 1086713 935322 1031840 951733 1056025 1085713 1033125 1027077
6308 1027077 1065366 1068074 1082102 1140563 1099135 1142690 1107309 1185339 1089826 1220121 1178636
6297 1178636 1273251 1182122 1244748 1225040 1369855 1297245 1374584 1403797 1350307 1313982 1345705
$$ packed form
6376F56698Q2522j43461J26604k3619n7315n9933J45042o3337L1826l3798M1197
6365G02426N3334j04817L0528J6528L8676N880Q461m9654Q797L0419l6997K8667
6353G32248l8761N1371o2651Q2735j1401P2281k0539P180j8313m0674N9431j328
6341H11579K3377k4040p9354J47468k5656q5940J42419p3405J01120n5743l3976
6330H47849O8296k7537J0690M2930K0957l2738N2007o8869O9771q2808J76448
6319A076996o6727J6257r4035J54222j51391R6518q0107J04292K9688n2588o048
6308A027077L8289K708J4028N8461m1428M3555l5381P8030r5513J30295m1485
6297A178636R4615r1129O2626j9708J44815p2610P7339K9213n3490l6325L1723
$$ plain form
6286 1345705 1361019 1609469 1434445 1495192 1550663 1515658 1599198 1577015 1710723 1806424 1843681
6275 1843681 2006773 2015093 2067315 2130299 2121287 2070830 2063522 1934185 1991480 1964043 1935693 1951089
6263 1951089 1980264 1942960 1912007 1932072 1923463 1892561 1963339 1977778 2027459 1938166 2044786
6252 2044786 2032028 2084717 2106699 2150854 2206315 2244811 2292079 2325362 2294073 2378995 2397097
6241 2397097 2487791 2462143 2550889 2608857 2737807 2796553 2774686 2885675 2948434 2952134 3053180
6230 3053180 3126763 3207552 3171221 3321250 3159099 3364205 3280431 3465566 3484459 3603672
6220 3603672 3620532 3722122 3835503 3887941 4140084 4182053 4311921 4574246 4786220 5055002
6210 5055002 5267788 5551317 5931475 6268913 6834477 7702137 8868532 9949355 10825778
$$ packed form
6286A345705J5314K48450j75024O0747N5471l5005Q3540k2183J33708R5701L7257
6275A843681J63092Q320N2222O2984r012n0457p308j29337N7295k7437k8350J5396
6263A951089K9175l7304l0953K0065q609l0902P0778J4439M9681q9293J06620
6252B044786j2758N2689K1982M4155N5461L8496M7268L3283l1289Q4922J8102
6241B397097R0694k5648Q8746N7968J28950N8746k1867J10989O2759L700J01046
6230C053180P3583Q0789l6331J50029j62151K05106q3774J85135J8893J19213
6220C603672J6860J01590J13381N2438K52143M1969J29868K62325K11974K68782
6210E055002K12786K83529L80158L37438N65564Q67660J166395J080823Q76423
$$ plain form
6201 10825778 11403221 11788858 11636623 11326424 10895899 10198949 9718068 9105903 8551182
6192 8551182 8207721 7919779 7659252 7550037 7601155 7567411 7648996 7851720 7872433 8094931
6182 8094931 8251541 8451867 8669830 8938711 9195191 9541103 9806038 10261752 10562807 10971203
6172 10971203 11529148 11904303 12568969 13286759 14029271 14790252 15604917 16697905 17742122
6163 17742122 18856327 20289622 21926272 23741744 25831595 28227945 30954937 34087792
6155 34087792 37700362 41814252 46721065 52223296 59168994 67433351 77723912 89523895
6147 89523895 102471980 115435292 126366729 134237351 138087362 137491899 132866218 124937359
6139 124937359 114513032 103234614 91422489 80335998 70117559 61115199 53539782
$$ packed form
6201A0825778N77443L85637j52235l10199m30525o96950m80881o12165n54721
6192H551182l43461k87942k60527j09215N1118l3744Q1585K02724K0713K22498
6182H094931J56610K00326K17963K68881K56480L45912K64935M55714L01055M08396
6172A0971203N57945L75155O64666P17790P42512P60981Q14665J092988J044217
6163A7742122J114205J433295J636650J815472K089851K396350K726992L132855
6155C4087792L612570M113890M906813N502231O945698Q264357J0290561J1799983
6147H9523895J2948085J2963312J0931437P870622L850011n95463m625681p928859
6139A24937359j0424327j1278418j1812125j1086491j0218439r002360p575417
$$ plain form
6132 53539782 46991794 41600415 36987555 33117752 29985397 27196426 24892197 22954206
6124 22954206 21398080 20038526 18820286 17708673 16839501 16058754 15128223 14512160 13933688
6115 13933688 13306053 12707255 12320003 11837822 11376189 10919442 10515152 10267253 9835670
6106 9835670 9653672 9342632 9083669 8908763 8598224 8433881 8150503 7874502 7771494 7487488
6096 7487488 7386134 7114300 7064744 6800059 6690087 6496380 6387417 6217613 6097293 5938096
6086 5938096 5785964 5592138 5623170 5504950 5313254 5295939 5010529 5018932 4837637 4778890
6076 4778890 4689511 4585813 4420073 4361818 4096692 4116701 4005120 3904340 3998922 3748842
6066 3748842 3803101 3594622 3490937 3417381 3438935 3345438 3323888 3250607 3179751 3147005 3036818
$$ packed form
6132E3539782o547988n391379m612860l869803l132355k788971k304229j937991
6124B2954206j556126j359554j218240j111613q69172p80747r30531o16063n78472
6115A3933688o27635n98798l87252m82181m61633m56747m04290k47899m31583
6106I835670j81998l11040k58963j74906l10539j64343k83378k76001j03008k84006
6096G487488j01354k71834m9556k64685j09972j93707j08963j69804j20320j59197
6086E938096j52132j93826L1032j18220j91696j7315k85410Q403j81295n8747
6076D778890q9379j03698j65740n8255k65126K0009j11581j00780R4582k50080
6066C748842N4259k08479j03685p3556K1554r3497k1550p3281p0856l2746j10187
$$ plain form
6055 3036818 3024127 2998777 2909433 2822170 2846600 2790357 2733846 2709446 2588589 2646875 2510993
6044 2510993 2594001 2426253 2432922 2487885 2295408 2364559 2275496 2227942 2188408 2160187 2094753
6033 2094753 2100623 2159172 2083605 2050333 1984120 2022893 1901431 2007434 1953918 1931867 1931181 1826338
6021 1826338 1850870 1797307 1796657 1849186 1754765 1714727 1620600 1771569 1747860 1798386 1687840
6010 1687840 1757000 1790565 1720414 1751823 1759334 1870499 1580225 1679894 1658904 1618227 1583494
5999 1583494 1531875 1496886 1401222 1374846 1321338 1412361 1318631 1301755 1267061 1241190 1199122
5988 1199122 1229028 1286741 1161405 1207926 1098984 1214389 1134795 1143835 1111071 1226759 1252191
5977 1252191 1106109 1193686 1173686 1140930 1140125 1183886 1143164 1101082 1073867 1039616 1156769
$$ packed form
6055C036818j2691k5350q9344q7263K4430n6243n6511k4400j20857N8286j35882
6044B510993Q3008j67748O669N4963j92477O9151q9063m7554l9534k8221o5434
6033B094753N870N8549p5567l3272o6213L8773j21462J06003n3516k2051o86j04843
6021A826338K4532n3563o50N2529r4421m0038r4127J50969k3709N0526j10546
6010A687840O9160L3565p0151L1409P511J11165k90274R9669k0990m0677l4733
5999A583494n1619l4989r5664k6376n3508R1023r3730j6876l4694k5871m2068
5988A199122K9906N7713j25336M6521j08942J15405p9594R040l2764J15688K5432
5977A252191j46082Q7577k0000l2756q05M3761m0722m2082k7215l4251J17153
$$ plain form
5966 1156769 1089456 1098316 1101814 1017127 1013638 1066907 1002185 1087118 1037099 1096954 1082573 977955
5954 977955 1034862 1086646 1016366 1115703 1040703 957815 1111878 994216 989305 1044670 998812
5943 998812 1046665 999084 901963 949590 969941 1027061 943219 919747 968623 934019 1026970 993611
5931 993611 982470 1021537 1139130 1013408 1156485 1079546 1053806 1091367 1116920 1200071 1179421
5920 1179421 1116231 988009 1070430 1028996 1121308 1094010 1034885 1019036 927368 1073265 979089
5909 979089 1051053 972662 940124 950318 909947 936447 1036025 998368 938129 1018748 924082 1017733
5897 1017733 986623 936165 971937 925871 911894 867703 932768 918915 807368 925331 870888
5886 870888 887418 918739 933639 860544 812076 902760 862887 903583 933255 771729 866836
$$ packed form
5966A156769o7313Q860L498q4687l489N3269o4722Q4933n0019N9855j4381j04618
5954I77955N6907N1784p0280R9337p5000q2888J54063j17662m911N5365m5858
5943I98812M7853m7581r7121M7627K0351N7120q3842k3472M8876l4604R2951l3359
5931I93611j1141L9067J17593j25722J43077p6939k5740L7561K5553Q3151k0650
5920A179421o3190j28222Q2421m1434R2312k7298n9125j5849r1668J45897r4176
5909I79089P1964p8391l2538J0194m0371K6500R9578l7657o0239Q0619r4666R3651
5897A017733l1110n0458L5772m6066j3977m4191O5065j3853j11547J17963n4443
5886H70888J6530L1321J4900p3095m8468R0684l9873M0696K9672j61526R5107
$$ plain form
5875 866836 827716 826862 995551 863635 842813 904750 844147 886508 785910 1011514 921271
5864 921271 833583 764657 840496 804730 893448 912064 870959 855903 719540 743852 869898
5853 869898 706921 821868 819547 825500 821456 801821 871915 876088 812628 788432 835827 789801
5841 789801 783826 856287 837973 839971 827221 876280 857303 846596 821996 929856 897400 842017
5829 842017 837263 854511 846278 878347 910831 913703 953744 1003753 1129493 1212345 1214353 1334087
5817 1334087 1221671 1239418 1221027 1108807 1088394 924472 937492 875774 832030 827463 767922
5806 767922 737070 718895 710706 717369 769907 699629 721511 651885 702052 725585 647161 802253
5794 802253 711168 757753 734617 651825 685942 712165 728981 626411 698683 623130 653215
$$ packed form
5875H66836l9120q54J68689j31916k0822O1937o0603M2361j00598K25604r0243
5864I21271q7688o8926P5839l5766Q8718J8616m1105j5056j36363K4312J26046
5853H69898j62977J14947k321N953m044j9635P0094M173o3460k4196M7395m6026
5841G89801n975P2461j8314J998j2750M9059j8977j0707k4600J07860l2456n5383
5829H42017m754J7248q233L2069L2484K872M0041N0009J25740Q2852K008J19734
5817A334087j12416J7747j8391j12220k0413j63922J3020o1718m3744m567n9541
5806G67922l0852j8175q189O663N2538p0278K1882o9626N0167K3533p8424J55092
5794H02253r1085M6585k3136q2792L4117K6223J6816j02570P2272p5553L0085
$$ plain form
5783 653215 596011 647713 573508 581755 617265 630355 667317 596461 658863 557511 587412 574146
5771 574146 620826 596869 599478 630779 653133 644904 615981 598285 573550 623232 575983 514339
5759 514339 575271 609570 482301 485949 528765 503110 562929 575843 531380 625595 509666
5748 509666 542357 576316 542223 565017 495623 638200 543524 562314 561270 543017 492479 578909
5736 578909 536990 582145 555546 475667 563626 567922 527634 541075 481104 501454 479822 569038
5724 569038 538252 602564 585471 601683 560802 507961 591923 579525 581776 508422 693475 640043
5712 640043 600399 631593 604371 599540 655914 604605 626155 653001 661786 680517 589341 603032
5700 603032 666058 653520 688498 665172 688075 718293 641312 789108 758898 649772 690970
$$ packed form
5783F53215n7204N1702p4205Q247L5510J3090L6962p0856O2402j01352K9901j3266
5771E74146M6680k3957K609L1301K2354q229k8923j7696k4735M9682m7249o1644
5759E14339O0932L4299j27269L648M2816k5655N9819J2914m4463R4215j15929
5748E09666L2691L3959l4093K2794o9394J42577r4676J8790j044j8253n0538Q6430
5736E78909m1919M5155k6599p9879Q7959M296m0288J3441n9971K0350k1632Q9216
5724E69038l0786O4312j7093J6212m0881n2841Q3962j2398K251p3354J85053n3432
5712F40043l9644L1194k7222m831N6374n1309K1550K6846Q785J8731r1176J3691
5700F03032O3026j2538L4978k3326K2903L0218p6981J47796l0210j09126M1198
$$ plain form
5689 690970 827265 786163 824071 747479 792853 790351 806465 908510 937289 937373 838946 949279
5677 949279 962102 891354 962791 876854 944852 856343 983903 1009181 937613 963244 973605
5666 973605 1085884 987000 984065 956644 923475 1000740 1002627 1055648 1013419 1017138 1030430 977621
5654 977621 1012148 994296 1112545 1025700 1073502 1077385 1120542 1044870 1077950 1194937 1092559
5643 1092559 1215441 1263169 1201117 1128456 1163377 1149979 1158927 1238948 1165132 1257976 1219411
5632 1219411 1141823 1270407 1213853 1210973 1189029 1280018 1244448 1190712 1243595 1206631 1198982 1284664
5620 1284664 1338856 1333534 1323578 1360497 1322697 1409852 1300119 1491389 1428723 1397275 1378923
5609 1378923 1517111 1534043 1524687 1525682 1490206 1585657 1600124 1696702 1722740 1799414 1805544 1859121
$$ packed form
5689F90970J36295m1102L7908p6592M5374k502J6114J02045K8779Q4r8427J10333
5677I49279J2823p0748P1437q5937O7998q8509J27560K5278p1568K5631J0361
5666I73605J12279r8884k935k7421l3169P7265J887N3021m2229L719J3292n2809
5654I77621L4527j7852J18249q6845M7802L883M3157p5672L3080J16987j02378
5643A092559J22882M7728o2052p2661L4921j3398Q948Q0021p3816R2844l8565
5632A219411p7588J28584n6554k880k1944R0989l5570n3736N2883l6964p649Q5682
5620A284664N4192n322r956L6919l7800Q7155j09733J91270o2666l1448j8352
5609A378923J38188J6932r356R95l5476R5451J4467R6578K6038P6674O130N3577
$$ plain form
5597 1859121 1926380 2032072 2133170 2242552 2373894 2599789 2725660 2977360 2976723 3123037
5587 3123037 3399555 3589209 3950925 4068275 4212175 4363385 4523395 4700821 4968077 5293523
5577 5293523 5607745 5634907 5696302 5660020 5751943 5941112 6087467 6294233 6229656 6196230 5949534
5566 5949534 5707749 5781916 5685621 5587663 5528159 5186023 5078500 4710679 4456783 4322037
5556 4322037 4199611 3999706 3778004 3587335 3403956 3234933 3003408 2947280 2757397 2626432
5546 2626432 2546332 2528425 2517106 2490867 2473561 2478772 2399040 2483731 2526203 2539441 2555180 2699512
5534 2699512 2578045 2706864 2625638 2635961 2627837 2652389 2768219 2735778 2800320 2738476 2841504
5523 2841504 2837438 2818416 2964858 2872035 2959481 2866263 2938037 2854503 2831227 2907598 2966344
$$ packed form
5597A859121O7259J05692J01098J09382J31342K25895J25871K51700o37J46314
5587C123037K76518J89654L61716J17350J43900J51210J60010J77426K67256L25446
5577E293523L14222K7162O1395l6282R1923J89169J46355K06766o4577l3426k46696
5566E949534k41785P4167r6295r7958n9504l42136j07523l67821k53896j34746
5556D322037j22426j99905k21702j90669j83379j69023k31525n6128j89883j30965
5546B626432q0100j7907j1319k6239j7306N211p9732Q4691M2472J3238J5739J44332
5534B699512j21467J28819q1226J0323q124K4552J15830l2441O4542o1844J03028
5523B841504m066j9022J46442r2823Q7446r3218P1774q3534k3276P6371N8746
$$ plain form
5512 2966344 2929660 3053335 3081710 3161272 3206757 3247136 3305759 3388858 3352634 3518704 3434367
5501 3434367 3547945 3526675 3625146 3642506 3646996 3689537 3673864 3653418 3682075 3595069 3764905
5490 3764905 3736020 3707494 3693799 3742802 3739810 3794739 3865827 3929793 3962466 3964584 4070528 4003008
5478 4003008 4195185 4152667 4137833 4270193 4165532 4339885 4404183 4477440 4476391 4583089 4564186
5467 4564186 4556700 4639491 4785264 4797366 4964916 4910554 5071695 5184435 5225311 5399165 5514952
5456 5514952 5625417 5742893 5919684 6094570 6138421 6481435 6919561 7620866 8408683 9138809
5446 9138809 9640688 9865394 9880592 9567072 9442828 8927376 8576420 8213233 7788271 7629265
5436 7629265 7473411 7373104 7379457 7296233 7339374 7358016 7362465 7561537 7577843 7635319 7673085
$$ packed form
5512B966344l6684J23675K8375P9562M5485M0379N8623Q3099l6224J66070q4337
5501C434367J13578k1270R8471J7360M490M2541j5673k0446K8657q7006J69836
5490C764905k8885k8526j3695M9003k992N4929P1088O3966L2673K118J05944o7520
5478D003008J92177m2518j4834J32360j04661J74353O4298P3257j049J06698j8903
5467D564186p486Q2791J45773J2102J67550n4362J61141J12740M0876J73854J15787
5456E514952J10465J17476J76791J74886M3851L43014M38126P01305P87817P30126
5446I138809N01879K24706J5198l13520j24244n15452l50956l63187m24962j59006
5436G629265j55854j00307O353q3224M3141J8642M449J99072J6306N7476L7766
$$ plain form
5425 7673085 7801801 7931873 7887954 8032598 8142818 8201317 8302431 8339927 8650865 8620681
5415 8620681 8774479 8822666 8958746 9098199 9152511 9340917 9506337 9576935 9686038 9882706
5405 9882706 9857934 10041710 10193801 10459609 10643760 10760995 10924616 11031756 11221033 11278056
5395 11278056 11446473 11586361 11730103 11856297 12062973 12262292 12459030 12593880 12663486 12896249
5385 12896249 13173521 13255264 13462769 13685847 13883611 14050991 14251322 14482125 14657244 14747722
5375 14747722 15135156 15302048 15595897 15901478 16074041 16447780 16511553 16876370 17144166 17444901
5365 17444901 17778052 18116419 18441282 18775994 19035936 19469286 19868211 20264626 20786801
5356 20786801 21135521 21627674 21920756 22557862 23065310 23634169 24220709 24818187 25428886
$$ packed form
5425G673085J28716J30072m3919J44644J10220N8499J01114L7496L10938l0184
5415H620681J53798M8187J36080J39453N4312J88406J65420P0598J09103J96668
5405I882706k4772J83776J52091K65808J84151J17235J63621J07140J89277N7023
5395A1278056J68417J39888J43742J26194K06676J99319J96738J34850O9606K32763
5385A2896249K77272Q1743K07505K23078J97764J67380K00331K30803J75119R0478
5375A4747722L87434J66892K93849L05581J72563L73739O3773L64817K67796L00735
5365A7444901L33151L38367L24863L34712K59942M33350L98925L96415N22175
5356B0786801L48720M92153K93082O37106N07448N68859N86540N97478O10699
$$ plain form
5347 25428886 26115028 26872649 27749445 28582086 29534129 30505246 31627946 32857047 34243926
5338 34243926 35847691 37616944 39349934 41363116 43482658 46375088 50454358 56930073
5330 56930073 65820598 75382792 81869176 87268182 94757199 105360077 124268541 149910350
5322 149910350 174873886 192108765 204268969 214152577 226719442 249365722 282430600
5315 282430600 317178448 338957450 349707033 356731935 363722971 381827495 413448559
5308 413448559 447399987 469413391 475265210 471906062 464991109 463369795 471451809 481808359
5300 481808359 482409539 471395541 453117079 431363586 412653435 401196896 394200717
5293 394200717 384368840 367061802 344660802 319596873 294207572 271896447 252769866
$$ packed form
5347B5428886O86142P57621Q76796Q32641R52043R71117J122700J229101J386879
5338C4243926J603765J769253J732990K013182K119542K892430M079270O475715
5330E6930073Q890525R562194O486384N399006P489017J0602878J8908464K5641809
5322A49910350K4963536J7234879J2160204R883608J2566865K2646280L3064878
5315B82430600L4747848K1779002J0749583P024902O991036J8104524L1621064
5308D13448559L3951428K2013404N851819l359148o914953j621314Q082014J0356550
5300D81808359O01180j1013998j8278462k1753493j8710151j1456539o996179
5293C94200717r831877j7307038k2401000k5063929k5389301k2311125j9126581
$$ plain form
5286 252769866 235017862 216336946 196432770 176682407 157105356 138286799 120724823
5279 120724823 105070123 91356293 80186495 71335402 64756431 59648464 55628937 52447591
5271 52447591 49816021 47697762 45888023 44198110 42918726 41565155 40502353 39455858
5263 39455858 38447596 37706179 36768141 35830120 35087199 34210484 33492907 32756249 32009107
5254 32009107 31357639 30612788 29927754 29354886 28627797 28009098 27422893 26795239 26320479
5245 26320479 25558206 25174481 24574174 24047485 23579319 22963370 22558676 22069757 21608300
5236 21608300 21176960 20792740 20318341 19852176 19436185 19112982 18740686 18394687 18028851
5227 18028851 17648954 17334655 16985488 16667751 16412971 16095391 15730685 15539307 15153734
$$ packed form
5286B52769866j7752004j8680916j9904176j9750363j9577051j8818557j7561976
5279A20724823j5654700j3713830j1169798q851093o578971n107967m019527l181346
5271E2447591k631570k118259j809739j689913j279384j353571j062802j046495
5263C9455858j008262p41417r38038r38021p42921q76715p17577p36658p47142
5254C2009107o51468p44851o85034n72868p27089o18699n86205o27654m74760
5245B6320479p62273l83725o00307n26689m68166o15949m04694m88919m61457
5236B1608300m31340l84220m74399m66165m15991l23203l72296l45999l65836
5227A8028851l79897l14299l49167l17737k54780l17580l64706j91378l85573
$$ plain form
5218 15153734 14928751 14628980 14347484 14065782 13906566 13640485 13502404 13117154 12961128
5209 12961128 12638249 12521465 12181952 12033134 11813565 11547497 11390292 11209923 10974805
5200 10974805 10816846 10597341 10443970 10181854 10120367 9871106 9803101 9559989 9457141 9052140
5190 9052140 9104973 8838587 8641986 8580595 8412684 8244612 8099437 7958776 7898956 7664130
5180 7664130 7511161 7374185 7324876 7047659 7036377 6835032 6691440 6625784 6503025 6303251
5170 6303251 6295835 6060716 6135329 5956493 5789817 5633367 5644446 5471618 5467852 5179782 5280847
5159 5280847 5152938 5078077 5071255 4925883 4824499 4818659 4687286 4614703 4560501 4489867 4469718
5148 4469718 4340849 4162332 4185430 4043129 4100401 3869046 3890558 3906029 3748758 3655547
$$ packed form
5218A5153734k24983k99771k81496k81702j59216k66081j38081l85250j56026
5209A2961128l22879j16784l39513j48818k19569k66068j57205j80369k35118
5200A0974805j57959k19505j53371k62116o1487k49261o8005k43112j02848m05001
5190I052140N2833k66386j96601o1391j67911j68072j45175j40661n9820k34826
5180G664130j52969j36976m9309k77217j1282k01345j43592o5656j22759j99774
5170F303251p416k35119P4613j78836j66676j56450J1079j72828l766k88070J01065
5159E280847j27909p4861o822j45372j01384n840j31373p2583n4202p0634k0149
5148D469718j28869j78517K3098j42301N7272k31355K1512J5471j57271r3211
$$ plain form
5138 3655547 3621391 3562854 3484336 3345988 3392890 3274165 3192807 3153190 3110711 3115658 3023130
5127 3023130 2934599 2768338 2856603 2788222 2702390 2786570 2584970 2545060 2517838 2439239 2405803
5116 2405803 2384970 2362991 2319076 2290193 2206454 2237943 2068655 2185390 2028201 2017381 2012695
5105 2012695 1908737 1958325 1858161 1862634 1845999 1803498 1754242 1644823 1697898 1671238 1693846
5094 1693846 1594927 1641342 1559830 1439819 1478151 1524689 1538327 1399343 1451540 1428591 1327327
5083 1327327 1317134 1357135 1268283 1286627 1270479 1277482 1298786 1153389 1297528 1199067 1325369
5072 1325369 1219319 1158991 1216935 1171650 1150558 1136597 1185643 1076550 1077576 1052375 1080737
5061 1080737 1116147 1145189 1179445 1114316 1171464 1189596 1240311 1259175 1297093 1343035 1413958
$$ packed form
5138C655547l4156n8537p8518j38348M6902j18725q1358l9617m2479M947r2528
5127C023130q8531j66261Q8265o8381q5832Q4180k01600l9910k7222p8599l3436
5116B405803k0833k1979m3915k8883q3739L1489j69288J16735j57189j0820m686
5105B012695j03958M9588j00164M473j6635m2501m9256j09419N3075k6660K2608
5094A693846r8919M6415q1512j20011L8332M6538J3638j38984N2197k2949j01264
5083A327327j0193M0001q8852J8344j6148P003K1304j45397J44139r8461J26302
5072A325369j06050o0328N7944m5285k1092j3961M9046j09093J026k5201K8362
5061A080737L5410K9042L4256o5129N7148J8132N0715J8864L7918M5942P0923
$$ plain form
5050 1413958 1673980 1748692 1992994 1944552 2029934 2163662 2320886 2661051 2806264 3045623
5040 3045623 3224225 3168747 3345566 3472712 3832700 4030596 4307170 4456766 4394234 4428351
5030 4428351 4424120 4471197 4746973 4762727 4736581 4641125 4362105 4229446 4051334 4102086 3928245
5019 3928245 3814597 3518558 3408229 3087831 3045678 2830971 2664801 2494604 2180823 2019191
5009 2019191 1800025 1595800 1417156 1189858 1026286 882266 822102 723225 725863 678443
4999 678443 586151 617060 517592 536060 481649 484274 487986 399960 480672 377775 410820 311109
4987 311109 345185 400810 350123 346368 389884 330174 329574 329105 388846 373871 352728 329192 337722
4974 337722 275006 296892 321811 373538 298213 348112 298177 281981 228473 343797 264455
$$ packed form
5050A413958K60022P4712K44302m8442Q5382J33728J57224L40165J45213K39359
5040C045623J78602n5478J76819J27146L59988J97896K76574J49596o2532L4117
5030D428351m231M7077K75776J5754k6146r5456k79020j32659j78112N0752j73841
5019C928245j13648k96039j10329l20398m2153k14707j66170j70197l13781j61632
5009B019191k19166k04225j78644k27298j63572j44020o0164r8877K638m7420
4999F78443r2292L0909r9468J8468n4411K625L712q8026Q0712j02897L3045r9711
4987C11109L4076N5625n0687l755M3516n9710o00m69N9741j4975k1143k3536Q530
4974C37722o2716K1886K4919N1727p5325M9899m9935j6196n3508J15324p9342
$$ plain form
4963 264455 235545 292891 303600 254183 190723 223248 188822 229250 208865 87732 142475
4952 142475 148502 149244 131640 211915 93955 205548 131051 152453 205503 108954 57993 6537
4940 6537 110857 124451 96666 115062 115171 77388 138333 51087 194885 103794 87796 94842
4928 94842 65484 147035 -4914 183199 58388 112459 207086 82978 90395 156522 87476
4917 87476 221423 104618 151246 212428 105447 146142 127148 91421 216149 154696 167929
4906 167929 117223 68397 222907 163873 160640 280742 178437 198480 93282 126835 212636
4895 212636 205557 183176 104617 164876 58126 93838 177506 116817 153917 81948 98745 131795
4883 131795 163832 135702 199517 266821 88384 187515 182078 164075 278108 205983 247490
$$ packed form
4963B64455k8910N7346J0709m9417o3460L2525l4426M0428k0385j21133N4743
4952A42475O027P42j7604Q0275j17960J11593p4497K1402N3050r6549n0961n1456
4940F537J04320J3594k7785J8396J09l7783O0945q7246J43798r1091j5998P046
4928I4842k9358Q1551j51949J88113j24811N4071R4627j24108P417O6127o9046
4917H7476J33947j16805M6628O1182j06981M0695j8994l5727J24728o1453J3233
4906A67929n0706m8826J54510n9034l233J20102j02305K0043j05198L3553Q5801
4895B12636p079k2381p8559O0259j06750L5712Q3668o0689L7100p1969J6797L3050
4883A31795L2037k8130O3815O7304j78437R9131n437j8003J14033p2125M1507
$$ plain form
4872 247490 167145 243147 197570 233179 257243 97261 216190 208535 209991 138997 221599 167907
4860 167907 191683 286609 182601 158328 234338 232474 194838 254519 241672 202349 265871 191087
4848 191087 225248 216474 161610 182361 120423 179386 151414 123732 146976 206162 265443 164645
4836 164645 200834 116480 84721 53462 265076 240584 227299 105012 120902 194723 191214
4825 191214 230780 304879 235848 125347 208634 229272 241446 153792 198698 285855 157933
4814 157933 230176 257592 211209 274979 151922 244851 198678 192105 128381 167632 135083 144731
4802 144731 222815 106614 151721 170231 140205 230760 179573 178167 191322 143891 108682 153880
4790 153880 227369 129210 180595 88508 144425 171901 199964 202104 170540 191147 183115 179832
$$ packed form
4872B47490q0345P6002m5577L5609K4064j59982J18929p655J456p0994Q2602n3692
4860A67907K3776R4926j04008k4273P6010j864l7636N9681j2847l9323O3522p4784
4848A91087L4161q774n4864K0751o1938N8963k7972k7682K3244N9186N9281j00798
4836A64645L6189q4354l1759l1259K11614k4492j3285j22287J5890P3821l509
4825A91214L9566P4099o9031j10501Q3287K0638J2174q7654M4906Q7157j27922
4814A57933P2243K7416m6383O3770j23057R2929m6173o573o3724L9251l2549R648
4802A44731P8084j16201M5107J8510l0026R0555n1187j406J3155m7431l5209M5198
4790A53880P3489r8159N1385r2087N5917K7476K8063K140l1564K0607q032l283
$$ plain form
4778 179832 228210 134418 191466 204402 223384 147795 196327 173294 203002 286435 247641 220268
4766 220268 192099 174984 258942 169213 240643 210619 268272 180255 229190 225103 231311 252249
4754 252249 313813 289872 216936 252415 276025 345639 296635 284579 427245 382289 385033 300900
4742 300900 379190 378889 271178 303623 243529 232605 224155 310795 276615 298368 279485 282249
4730 282249 381703 244632 284220 257901 315886 230707 339507 283483 255998 218674 198002
4719 198002 317714 323794 256179 373739 307834 326333 229103 317239 287890 278545 294294 366707
4707 366707 323733 361699 373756 299825 331402 245199 350920 377029 301637 371044 378140 350002
4695 350002 250593 357490 366729 369330 303300 288840 305522 290774 383107 406615 413099 312662
$$ packed form
4778A79832M8378r3792N7048J2936J8982p5589M8532k3033K9708Q3433l8794k7373
4766B20268k8169j7115Q3958q9729P1430l0024N7653q8017M8935m087O208K0938
4754B52249O1564k3941p2936L5479K3610O9614m9004j2056J42666m4956K744q4133
4742C00900P8290l01j07711L2445o0094j0924q450Q6640l4180K1753j8883K764
4730B82249R9454j37071L9588k6319N7985q5179J08800n6024k7485l7324k0672
4719A98002J19712O080o7615J17560o5905J8499r7230Q8136k9349r345J5749P2413
4707C66707m2974L7966J2057p3931L1577q6203J05721K6109p5392O9407P096k8138
4695C50002r9409J06897R239K601o6030j4460J6682j4748R2333K3508O484j00437
$$ plain form
4683 312662 322282 397737 359382 371714 429312 383907 337206 298340 381347 472882 498016 385359
4671 385359 484323 470849 415021 446024 336346 487803 343282 460052 417491 455133 512413
4660 512413 456983 463714 584466 473660 546364 557265 489419 557384 527953 569473 574367 590594
4648 590594 619360 682949 613334 654702 646004 686061 646119 670989 740688 856408 708061
4637 708061 784719 783680 914180 861361 874352 949733 846056 917285 933109 886028 897528
4626 897528 820041 940692 856714 863910 966823 901047 887081 925143 1027190 960975 1017721
4615 1017721 968871 1039402 1040766 1070664 1191371 1250135 1247907 1276103 1340134 1452581 1304534
4604 1304534 1273886 1382572 1427363 1294404 1256744 1354626 1244470 1182081 1113588 1309394 1303228
$$ packed form
4683C12662R620P5455l8355J2332N7598m5405m6701l8866Q3007R1535K5134j12657
4671C85359R8964j3474n5828L1003j09678J51457j44521J16770m2561L7642N7280
4660E12413n5430O731J20752j10806P2704J0901o7846O7965k9431M1520M894J6227
4648E90594K8766O3589o9615M1368q698M0057l9942K4870O9699J15720j48347
4637G08061P6658j039J30500n2819J2991P5381j03677P1229J5824m7081J1500
4626H97528p7487J20651q3978P196J02913o5776j3966L8062J02047o6215N6746
4615A017721m8850P0531J364K9898J20707N8764k228K8196O4031J12447j48047
4604A304534l0648J08686M4791j32959l7660R7882j10156o2389o8493J95806o166
$$ plain form
4593 1303228 1198038 1207824 1201815 1290905 1205704 1315454 1323835 1313601 1413340 1356011 1480347
4582 1480347 1484378 1458162 1537808 1606180 1653554 1574719 1588525 1588759 1443691 1519839 1457026 1520594
4570 1520594 1441034 1381638 1391028 1419294 1409215 1365546 1422716 1503519 1393364 1484909 1433323
4559 1433323 1553342 1472690 1600390 1632405 1672769 1674332 1687778 1637514 1699049 1678400 1690926
4548 1690926 1561497 1604911 1573221 1603036 1601243 1585356 1585016 1558592 1513840 1582966 1599899 1698813
4536 1698813 1579968 1636114 1848896 1767429 1881889 1933162 2033837 2087705 1993423 2228723
4526 2228723 2209007 2417413 2421414 2355909 2352266 2428422 2263812 2400945 2371445 2390249 2326303
4515 2326303 2344608 2355773 2289442 2315438 2268201 2285727 2161876 2388230 2403883 2429725 2543521
$$ packed form
4593A303228j05190R786o009Q9090q5201J09750Q381j0234R9739n7329J24336
4582A480347M031k6216P9646O8372M7374p8835J3806K34j45068P6148o2813O3568
4570A520594p9560n9396R390K8266j0079m3669N7170Q0803j10155R1545n1586
4559A433323J20019q0652J27700L2015M0364J563J3446n0264O1535k0649J2526
4548A690926j29429M3414l1690K9815j793j5887l40k6424m4752O9126J6933R8914
4536A698813j18845N6146K12782q1467J14460N1273J00675N3868r4282K35300
4526B228723j9716K08406M001o5505l643P6156j64610J37133k9500J8804o3946
4515B326303J8305J1165o6331K5996m7237J7526j23851K26354J5653K5842J13796
$$ plain form
4504 2543521 2625797 2733830 2939322 3055810 3453112 3545749 3695000 3664947 3668832 3521207
4494 3521207 3326734 3292925 3196530 3055388 2939829 2865618 2858742 2786563 2682946 2836652 2682875
4483 2682875 2789710 2746488 2925046 3109408 3383194 3720671 3949873 4260650 4435083 4630311
4473 4630311 4732667 4853210 4959654 4970409 4868675 4805250 4483571 4367143 3979403 3693970
4463 3693970 3529605 3364585 3204121 3173781 2952700 2974542 2717135 2886222 2783158 2773742
4453 2773742 2847032 2793855 2854917 2886515 3023246 3063321 3182255 3072037 3205422 3196021 3156655
4442 3156655 3128802 2978818 3050231 2908345 2847195 2751746 2796066 2721153 2726124 2655324 2684150
4431 2684150 2600091 2616512 2584958 2601954 2635911 2642340 2643897 2804310 2740265 2903177 2850075
$$ packed form
4504B543521Q2276J08033K05492J16488L97302R2637J49251l0053L885j47625
4494C521207j94473l3809r6395j41142j15559p4211o876p2179j03617J53706j53777
4483B682875J06835m3222J78558J84362K73786L37477K29202L10777J74433J95228
4473D630311J02356J20543J06444J0755j01734o3425l21679j16428l87740k85433
4463C693970j64365j65020j60464l0340k21081K1842k57407J69087j03064r416
4453B773742P3290n3177O1062L1598J36731M0075J18934j10218J33385r401l9366
4442C156655k7853j49984P1413j41886o1150r5449M4320p4913M971p0800K8826
4431B684150q4059J6421l1554J6996L3957O429J557J60413o4045J62912n3102
$$ plain form
4420 2850075 3017990 3052968 3190765 3277871 3345824 3451148 3575038 3584189 3593696 3669163 3542063
4409 3542063 3558308 3453461 3308073 3202729 2954441 2975233 2816039 2768666 2735263 2734986 2580327
4398 2580327 2444836 2466893 2535408 2478594 2470578 2463616 2397351 2452447 2442910 2395903 2573700 2490388
4386 2490388 2475171 2518310 2613963 2677545 2839395 2980922 3011857 3278404 3341461 3419724 3347558
4375 3347558 3548207 3465598 3489232 3589859 3685828 3748768 3940654 4216268 4748128 5699403
4365 5699403 6530116 7474646 7948154 8016809 7871950 7271069 6809037 6204083 5447052 4903878
4355 4903878 4453793 3990503 3770917 3446405 3320935 3179029 2938017 2905106 2764530 2763420
4345 2763420 2665293 2628925 2551779 2589705 2551005 2490521 2660052 2618044 2772618 2825210 2822592
$$ packed form
4420B850075J67915L4978J37797Q7106O7953J05324J23890R151R507P5467j27100
4409C542063J6245j04847j45388j05344k48288K0792j59194m7373l3403k77j54659
4398B580327j35491K2057O8515n6814q016o962o6265N5096r537m7007J77797q3312
4386B490388j5217M3139R5653O3582J61850J41527L0935K66547O3057P8263p2166
4375C347558K00649q2609K3634J00627R5969O2940J91886K75614N31860R51275
4365E699403Q30713R44530M73508O8655j44859o00881m62032o04954p57031n43174
4355D903878m50085m63290k19586l24512j25470j41906k41012l2911j40576j110
4345B763420r8127l6368p7146L7926l8700o0484J69531m2008J54574N2592k618
$$ plain form
4334 2822592 3063086 3215591 3446513 3670750 3821485 3997346 4053396 3954257 3916819 3803025
4324 3803025 3486740 3541351 3249189 3214406 3218112 3024644 3072104 2931387 3084717 3062081 3121858
4313 3121858 3312508 3568712 3985019 4332952 4555606 4664200 4747478 4555109 4460012 4333932
4303 4333932 4074563 4054376 3938298 4151379 4406464 4696715 4941886 5141153 5234773 5153748
4293 5153748 5090019 4847056 4643346 4558288 4323029 4298925 4282910 4399506 4377999 4555852
4283 4555852 4648465 4998526 5105729 5255620 5409980 5702673 6605214 7845597 9509128
4274 9509128 10626046 10961042 10912386 10381270 9619473 8836044 7994505 7012107 6410976 5761781
4264 5761781 5435292 5182571 4966176 4930195 4794479 4756576 4734163 4816227 4743699 4929666
$$ packed form
4334B822592K40494J52505K30922K24237J50735J75861N6050r9139l7438j13794
4324C803025l16285N4611k92162l4783L706j93468M7460j40717J53330k2636N9777
4313C121858J90650K56204M16307L47933K22654J08594Q3278j92369r5097j26080
4303D333932k59369k0187j16078K13081K55085K90251K45171J99267R3620q1025
4293E153748o3729k42963k03710q5058k35259k4104j6015J16596k1507J77853
4283D555852R2613L50061J07203J49891J54360K92693R02541J240383J663531
4274I509128J116918L34996m8656n31116p61797p83429q41539r82398o01131o49195
4264E761781l26489k52721k16395l5981j35716l7903k2413Q2064p2528J85967
$$ plain form
4254 4929666 4867542 4866434 4997689 4978021 5185160 5051710 5260661 5303737 5313762 5353064 5400045
4243 5400045 5423960 5451586 5413919 5368538 5403299 5397950 5304889 5416070 5205338 5293240 5128045
4232 5128045 5157279 5120335 4954402 4897926 4822389 4839219 4778607 4828529 4819241 4942469 4817744
4221 4817744 4749656 4668231 4520970 4309447 4149421 4031578 3986811 3886465 3798578 3650854
4211 3650854 3508928 3400442 3393009 3204643 3088900 3131263 2949125 2898281 2866035 2872002 2866540
4200 2866540 2933328 3001170 3068052 2988909 2919502 2853589 2755631 2773106 2708820 2760439 2735495
4189 2735495 2596614 2498795 2498818 2402665 2415172 2336136 2237446 2195058 2029451 2180147 2158894
4178 2158894 2016426 2079979 2038738 2025937 1980176 1971511 1909166 1951298 1811620 1792957 1886970
$$ packed form
4254D929666o2124j108J31255j9668K07139j33450K08951M3076J0025L9302M6981
4243E400045K3915K7626l7667m5381L4761n349r3061J11181k10732Q7902j65195
4232E128045K9234l6944j65933n6476p5537J6830o0612M9922r288J23228j24725
4221D817744o8088q1425j47261k11523j60026j17843m4767j00346q7887j47724
4211C650854j41926j08486p433j88366j15743M2363j82138n0844l2246N967n462
4200B866540O6788O7842O6882p9143o9407o5913r7958J7475o4286N1619k4944
4189B735495j38881r7819K3r6153J2507p9036r8690m2388j65607J50696k1253
4178B158894j42468O3553m1241j2801m5761q665o2345M2132j39678j8663R4013
$$ plain form
4167 1886970 1785680 1805244 1749767 1790804 1852589 1690131 1769301 1702204 1689658 1778443 1640407
4156 1640407 1702539 1838015 1653259 1754001 1671505 1676250 1709494 1626745 1672359 1722682 1652262
4145 1652262 1705761 1639391 1619510 1698750 1699512 1729365 1722878 1645982 1715101 1634352 1722533 1740765
4133 1740765 1790522 1700501 1734236 1643287 1761831 1778135 1723437 1802723 1744993 1716950 1753851
4122 1753851 1769155 1802205 1712658 1755925 1748087 1713031 1634921 1762857 1663360 1686017 1702899
4111 1702899 1702344 1739616 1742248 1774474 1725384 1787892 1759411 1835675 1747344 1823084 1875647 1812941
4099 1812941 1896237 1750366 1879208 1895348 2019387 1994107 2034933 1987942 1950428 1909265 1877702
4088 1877702 1950945 1991253 1983885 1937432 1974509 2019624 2060529 1991130 2005674 2111728 2005151
$$ packed form
4167A886970j01290J9564n5477M1037O1785j62458P9170o7097j2546Q8785j38036
4156A640407O2132J35476j84756J00742q2496M745L3244q2749M5614N0323p0420
4145A652262N3499o6370j9881P9240P62K9853o487p6896O9119q0749Q8181J8232
4133A740765M9757r0021L3735r0949J18544J6304n4698P9286n7730k8043L6901
4122A753851J5304L3050q9547M3267p838l5056p8110J27936r9497K2657J6882
4111A702899n55L7272K632L2226m9090O2508k8481P6264q8331P5740N2563o2706
4099A812941Q3296j45871J28842J6140J24039k5280M0826m6991l7514m1163l1563
4088A877702P3243M0308p368m6453L7077M5115M0905o9399J4544J06054j06577
$$ plain form
4077 2005151 2137371 2061186 2175666 2130665 2111801 2196282 2184034 2212826 2300677 2343504 2290964
4066 2290964 2401451 2422884 2420259 2454566 2464049 2568325 2668858 2772115 2833580 2895499 2959127
4055 2959127 3001496 2984080 3011351 3153255 3170310 3145294 3239387 3273029 3275196 3344235 3201348
4044 3201348 3402686 3328433 3318788 3521251 3502517 3593416 3564772 3632240 3714364 3829346 3912996
4033 3912996 4132369 4144274 4218924 4381300 4343177 4527449 4541853 4659224 4660507 4695468 4921469
4022 4921469 4925384 5207762 5257642 5440684 5452751 5605465 5757195 5947844 6276300 6725257
4012 6725257 7564795 8754635 10145750 11346522 12376647 12791663 12863559 12761196 12225875
4003 12225875 11778398 11190843 10696410 10304341 9846174 9689088 9450811 9413318 9363001 9577710
$$ packed form
4077B005151J32220p6185J14480m5001j8864Q4481j2248K8792Q7851M2827n2540
4066B290964J10487K1433k625L4307R483J04276J00533J03257O1465O1919O3628
4055B959127M2369j7416K7271J41904J7055k5016R4093L3642K167O9039j42887
4044C201348K01338p4253r645K02463j8734R0899k8644O7468Q2124J14982Q3650
4033C912996K19373J1905P4650J62376l8123J84272J4404J17371J283L4961K26001
4022D921469L915K82378M9880J83042J2067J52714J51730J90649L28456M48957
4012F725257Q39538J189840J391115J200772J030125M15016P1896j02363n35321
4003A2225875m47477n87555m94433l92069m58167j57086k38277l7493n0317K14709
$$ plain form
3993 9577710 9811135 10041703 10092978 10182783 10222947 10483567 10954656 11654342 12788866 13565779
3983 13565779 14160431 14171933 13978158 13475245 12880907 12329906 11598660 11219552 10814292 10577693
3973 10577693 10330464 10253620 10175837 10141145 10265797 10310766 10394304 10355632 10187275 10071355
3963 10071355 9842040 9639625 9282449 8982304 8639036 8373009 8011569 7617425 7370794
3954 7370794 7054430 6866474 6688414 6527805 6481785 6412203 6312592 6327203 6378226 6434046 6412387
3943 6412387 6243106 6256072 6080375 6167028 5986492 5959683 5873244 5802585 5657470 5527310
3933 5527310 5371951 5194837 5057272 4865663 4678580 4379481 4361911 4141570 4031294 3992206
3923 3992206 3738814 3795475 3599355 3518447 3434917 3354771 3369240 3225642 3183958 3148932 3079631
$$ packed form
3993I577710K33425K30568N1275Q9805M0164K60620M71089O99686J134524P76913
3983A3565779N94652J1502j93775n02913n94338n51001p31246l79108m05260k36599
3973A0577693k47229p6844p7783l4692J24652M4969Q3538l8672j68357j15920
3963A0071355k29315k02415l57176l00145l43268k66027l61440l94144k46631
3954G370794l16364j87956j78060j60609m6020o9582r9611J4611N1023N5820k1659
3943F412387j69281J2966j75697Q6653j80536k6809q6439p0659j45115j30160
3933E527310j55359j77114j37565j91609j87083k99099j7570k20341j10276l9088
3923C992206k53392N6661j96120q0908q3530q0146J4469j43598m1684l5026o9301
$$ plain form
3912 3079631 3006766 2933271 2872641 2872380 2781799 2747076 2619352 2605808 2538849 2458051 2444515 2410520
3900 2410520 2444890 2329281 2300801 2215832 2229447 2176627 2195616 2116147 2084698 2031585 2009205
3889 2009205 1976807 1909975 1921673 1913807 1840917 1913305 1816140 1812829 1751741 1747260 1705529 1724408
3877 1724408 1711877 1573062 1525145 1540608 1569067 1500846 1592155 1523881 1533041 1474125 1420347
3866 1420347 1415721 1450445 1390094 1363000 1407765 1319504 1397932 1274290 1364034 1320392 1292676
3855 1292676 1401301 1217804 1317159 1179096 1292218 1283576 1250098 1240643 1237341 1201408 1145452
3844 1145452 1207406 1156716 1223392 1136355 1167388 1198259 1119090 1152658 1175696 1156224 1016821
3833 1016821 1122478 1155732 1024812 1073627 1089342 1143759 984518 1124797 1095039 1126216 1017721
$$ packed form
3912C079631p2865p3495o0630k61r0581l4723j27724j3544o6959q0798j3536l3995
3900B410520L4370j15609k8480q4969J3615n2820J8989p9469l1449n3113k2380
3889B009205l2398o6832J1698p866p2890P2388r7165l311o1088m481m1731J8879
3877A724408j2531j38815m7917J5463K8459o8221R1309o8274R160n8916n3778
3866A420347m626L4724o0351k7094M4765q8261P8428j23642Q9744m3642k7716
3855A292676J08625j83497R9355j38063J13122q642l3478r455l302l5933n5956
3844A145452O1954n0690O6676q7037L1033L0871p9169L3568K3038j9472j39403
3833A016821J05657L3254j30920M8815J5715N4417j59241J40279k9758L1177j08495
$$ plain form
3822 1017721 999020 1170646 1069193 1046017 991675 1110136 963447 1099966 1113913 1169579
3812 1169579 1113976 1031783 1160558 1091505 1151022 1064732 1285641 1137540 1214456 1263057 1380591
3801 1380591 1329871 1420263 1581930 1575953 1769164 1601275 1727672 1690313 1621832 1644254 1580954
3790 1580954 1639044 1512277 1481860 1467267 1441787 1406378 1441842 1348044 1428277 1380301 1456814
3779 1456814 1395647 1430086 1565569 1625447 1646955 1795984 1942436 2147363 2101531 2312415
3769 2312415 2472344 2492565 2493428 2326964 2323393 2225259 2071549 1943897 1890592 1770442 1627787
3758 1627787 1598059 1551970 1444937 1348452 1379899 1274563 1323319 1245331 1241366 1249348 1260171
3747 1260171 1267369 1251443 1402299 1389371 1429232 1458472 1569415 1604602 1588390 1556533 1523570
$$ packed form
3822A017721j8701J71626j01453k3176n4342J18461j46689J36519J3947N5666
3812A169579n5603q2193J28775o9053N9517q6290K20909j48101P6916M8601J17534
3801A380591n0720R0392J61667n977J93211j67889J26397l7359o8481K2422o3300
3790A580954N8090j26767l0417j4593k5480l5409L5464r3798Q0233m7976P6513
3779A456814o1167L4439J35483N9878K1508J49029J46452K04927m5832K10884
3769B312415J59929K0221Q63j66464l571r8134j53710j27652n3305j20150j42655
3758A627787k9728m6089j07033r6485L1447j05336M8756p7988l965P982J0823
3747A260171P198j5926J50856j2928L9861K9240J10943L5187j6212l1857l2963
$$ plain form
3736 1523570 1565488 1420154 1386969 1372447 1249923 1118248 1087769 1089523 1084254 1006690 884763
3725 884763 905260 876209 837302 819248 827898 794505 864452 713151 779358 667459 731235
3714 731235 704649 720535 653208 602258 603171 621863 584434 548560 508228 518464 458698 540645
3702 540645 441136 512061 508023 438609 445469 396859 430152 435819 462929 456630 362807 422833
3690 422833 323138 444887 345717 439296 420902 502085 399782 413220 280575 357382 354132
3679 354132 407065 284483 364551 315598 343521 199456 340064 306844 254779 208759 241478
3668 241478 228643 285211 200865 213151 202455 208051 264770 274500 269576 179717 167696 258689
3656 258689 154053 288601 165197 175273 140171 160089 302349 221963 292539 204603 109107
$$ packed form
3736A523570M1918j45334l3185j4522j22524j31675l0479J754n269p7564j21927
3725H84763K0497k9051l8907j8054Q650l3393O9947j51301O6207j11899O3776
3714G31235k6586J5886o7327n0950R13J8692l7429l5874m0332J0236n9766Q1947
3702E40645r9509P0925m038o9414O860m8610L3293N667K7110o299r3823O0026
3690D22833r9695J21749r9170R3579j8394Q1183j02303J3438j32645P6807l250
3679C54132N2933j22582Q0068m8953K7923j44065J40608l3220n2065m6020L2719
3668B41478j2835N6568q4346J2286j0696N596N6719R730m924q9859j2021R0993
3656B58689j04636J34548j23404J0076l5102J9918J42260q0386P0576q7936r5496
$$ plain form
3645 109107 186516 137552 204332 222221 171060 160926 204320 226769 246606 125854 220120
3634 220120 105530 192320 82495 181737 193978 139061 196965 97663 68131 181535 133981
3623 133981 139277 131645 57340 58767 35217 69502 176547 34549 212043 61569 76835
3612 76835 110569 117456 93387 108126 43042 40572 53293 58003 113085 147039 13404 64572
3600 64572 59306 109304 40503 89187 169262 35823 53911 70114 65732 65261 -2803 191039
3588 191039 129136 -47113 52519 163566 50938 20688 -40071 53226 60468 68223 46453
3577 46453 59952 56965 28378 41057 99280 36232 48858 126694 1995 36802 54379 75203
3565 75203 46597 -39491 74441 13482 95905 64865 20804 24117 -31202 -80632 96230 39311
$$ packed form
3645A09107P7409m8964O6780J7889n1161j0134M3394K2449J9837j20752R4266
3634B20120j14590Q6790j09825R9242J2241n4917N7904r9302k9532J13404m7554
3623A33981N296p632p4305J427k3550L4285J07045j41998J77494j50474J5266
3612G6835L3734O887k4069J4739o5084k470J2721M710N5082L3954j33635N1168
3600F4572n266M9998o8801M8684Q0075j33439J8088J6203m382m71o8064J93842
3588A91039o1903j76249R9632J11047j12628l0250o0759R3297P242P755k1770
3577D6453J3499k987k8587J2679N8223o3048J2626P7836j24699L4807J7577K0824
3565G5203k8606q6088J13932o0959Q2423l1040m4061L313n5319m9430J76862n6919
$$ plain form
3553 39311 91650 14879 5444 40700 93200 69999 -19924 14799 -52302 21806 -25465 -5885
3541 -5885 6901 58471 37252 -47650 16323 16569 68767 -24970 -24050 48970 41424 16407 -113752
3528 -113752 19021 -35557 58285 79478 -861 16037 -48881 58526 -75516 -15317 12341
3517 12341 73382 99763 -59089 39394 -39005 11351 -23121 38049 -4528 -69833 -82744 -31100
3505 -31100 12700 48082 53285 -82947 77357 -4963 -43017 23978 -2562 92871 -94661
3494 -94661 -87655 -117324 69626 -41381 -54536 -321 -65099 5048 7404 -31096 -38053 -47790
3482 -47790 -78747 -6930 -63083 -19449 -70994 -3600 -12138 -58662 -38792 31662 26434 -4404
3470 -4404 -58171 -79706 -13393 47659 -34783 2108 1506 -60602 -20473 -90700 -30700 -55127
$$ packed form
3553C9311N2339p6771r435L5256N2500k3201q9923L4723o7101P4108m7271J9580
3541e885J2786N1570k1219q4902O3973K46N2198r3737R20P3020p546k5017j30159
3528a13752J32773n4578R3842K1193q0339J6898o4918J07407j34042O0199K7658
3517A2341O1041K6381j58852R8483p8399N0356l4472O1170m2577o5305j2911N1644
3505c1100M3800L5382N203j36232J60304q2320l8054O6995k6540R5433j87532
3494i4661P006k9669J86950j11007j3155N4215o4778P0147K356l8500o957r737
3482d7790l0957P1817n6153M3634n1545O7394q538m6524J9870P0454n228l0838
3470d404n3767k1535O6313O1052q2442L6891o02o2108M0129p0227O0000k4427
$$ plain form
3458 -55127 -47996 8181 -49039 -45527 -4117 -46487 -31748 -45751 -107894 -83299 -137771 32717
3446 32717 -67257 -154232 -91028 -18313 -4761 -89233 -107015 -83753 -29884 -95706 -86370 -11715
3434 -11715 -114705 -51927 -118115 -21138 -95977 -44577 -95093 -78058 -63415 -69749 -61089 -65343
3422 -65343 -59967 5218 -51316 -38632 -67006 34990 -87908 -63622 -120757 24755 -47280
3411 -47280 19961 21233 -47692 -49016 -124479 -40181 12 -28719 70625 -80628 -17602 -131221
3399 -131221 -29910 -160157 -77881 14834 -4231 -59520 -13795 43213 -58698 -7812 -125169
3388 -125169 -18254 -44796 -86437 -20719 -68080 24718 -516 -78331 -50392 -93864 15217
3377 15217 -1582 6304 -53897 -2801 -172847 -45157 -113721 -64227 -18223 -147988 100189
$$ packed form
3458e5127P131N6177n7220L512M1410m2370J4739j4003o2143K4595n4472J70488
3446C2717r9974q6975O3204P2715J3552q4472j7782K3262N3869o5822R336P4655
3434a1715j02990O2778o6188R6977p4839N1400n0516J7035J4643o334Q660m254
3422f5343N376O5185n6534J2684k8374J01996j22898K4286n7135J45512p2035
3411d7280O7241J272o8925j324p5463Q4298M0193k8731R9344j51253O3026j13619
3399a31221J01311j30247Q2276R2715j9065n5289M5725N7008j01911N0886j17357
3388a25169J06915k6542m1641O5718m7361R2798k5234p7815K7939m3472J09081
3377A5217j6799P886o0201N1096j70046J27690o8564M9494M6004j29765K48177
$$ plain form
3366 100189 -129976 -38639 -20571 -60757 -20859 -114032 -34889 -54654 416 -24181 -38550
3355 -38550 -227237 -20666 -47123 -86926 -60813 -155784 -52187 -67853 -78342 -52997 -97807
3344 -97807 -32627 -122214 -48288 -97085 -33077 -61133 -132338 -27756 -128495 -49738 -58689 -12507
3332 -12507 -86782 -89688 -189091 -18921 65108 -75300 -10751 -155469 -17759 -52071 -35914
3321 -35914 29846 26083 -101157 -56387 -120762 -42255 -11147 -35823 81714 9280 39929 -3381
3309 -3381 -5458 21589 -39587 -8894 87617 234320 256915 353908 325346 369261 332945 335644
3297 335644 238057 199773 120558 6988 57878 -66795 -32953 -8503 -55297 -20147 -129387
3286 -129387 -53644 -64688 -40961 -25865 -24213 -52533 -26445 -47554 -30276 -153072 -63873 -70979
$$ packed form
3366A00189k30165R1337J8068m0186L9898r3173P9143j9765N5070k4597j4369
3355c8550j88687K06571k6457l9803K6113r4971J03597j5666j0489K5345m4810
3344i7807O5180q9587P3926m8797O4008k8056p1205J04582j00739P8757q951M6182
3332a2507p4275k906r9403J70170Q4029j40408O4549j44718J37710l4312J6157
3321c5914O5760l763j27240M4770o4375P8507L1108k4676J17537p2434L0649m3310
3309c381k077K7047o1176L0693R6511J46703K2595R6993k8562M3915l6316K699
3297C35644r7587l8284p9215j13570N0890j24673L3842K4450m6794L5150j09240
3286a29387P5743j1044K3727J5096J652k8320K6088k1109J7278j22796Q9199p106
$$ plain form
3274 -70979 -21901 -78392 -22155 -76205 8950 -130435 28493 -120570 -34730 -39996 -68427
3263 -68427 24611 -181726 -40507 -85688 -84473 -156443 -43000 -82015 -81335 -95119 -47873 -49003
3251 -49003 -103699 -46884 -167087 -64487 -152207 -141222 9066 -81316 -139599 -118791 -64768
3240 -64768 -70138 -78566 -86081 -19805 5857 -88092 -81686 -50875 -61805 -71177 -23930 -83565 -90126
3227 -90126 -87832 -107018 -20755 -95291 -44703 -81913 -20425 -150824 -108540 -90863 -31242 -118063
3215 -118063 -35641 -40624 -165843 -43355 -105641 -147341 -55592 -154837 -15446 -171521 -93811
3204 -93811 -105147 -146597 -45928 -746 1840 -21004 -164644 -85097 -87748 -12404 -96524 -81467
3192 -81467 -82667 -116883 -99288 -90866 -8542 -11869 -141879 16803 -112499 -91007 -1024 -184732
$$ packed form
3274g0979M9078n6491N6237n4050Q5155j39385J58928j49063Q5840n266k8431
3263f8427R3038k06337J41219m5181J215p1970J13443l9015O80j3784M7246j130
3251d9003n4696N6815j20203J02600q7720J0985J50288r0382n8283K0808N4023
3240f4768n370q428p515O6276K5662r3949O406L0811j0930r372M7247n9635o561
3227i0126K294j9186Q6263p4536N0588l7210O1488j30399M2284J7677N9621q6821
3215a18063Q2422m983j25219J22488o2286m1700R1749r9245J39391j56075P7710
3204i3811j1336m1450J00669M5182K586k2844j43640P9547k651P5344q4120J5057
3192h1467j200l4216J7595Q422Q2324l327j30010J58682j29302K1492Q9983j83708
$$ plain form
3180 -184732 -205830 -197448 -94387 -48531 -96133 -31097 -165164 -112537 -90978 -92729 -151145 -32959
3168 -32959 -170506 -60558 -96070 -83324 -100053 -158643 -112205 -80742 -47036 -142498 -80050
3157 -80050 -54316 -66270 -63287 -53173 -110556 -92196 -101592 -161822 -49965 -201544 32086 -151938
3145 -151938 -107769 -162617 -52887 -115321 -106246 -48430 -52904 -97012 -47677 -82261 -88548 -134645
3133 -134645 -78376 -165803 -62363 -180761 -105982 -44210 -106804 -170054 -14673 -122740 -93294
3122 -93294 -132960 -53429 -92643 -120201 -51718 -67466 -115963 -100826 -97660 -45328 -162941 -149315
3110 -149315 -39743 -187559 -72688 -110486 -130686 -138163 -51786 -25636 -733 -80841 -90456
3099 -90456 -110139 -29404 -61429 -127768 -48592 -106247 -115961 -113175 -20026 -159709 -99947 -61587
$$ packed form
3180a84732k1098Q382J03061M5856m7602O5036j34067N2627K1559j751n8416J18186
3168c2959j37547J09948l5512J2746j6729n8590M6438L1463L3706r5462O2448
3157h0050K5734j1954K983J0114n7383J8360r396o0230J11857j51579K33630j84024
3145a51938M4169n4848J09730o2434R075N7816m474m4108M9335l4584o287m6097
3133a34645N6269q7427J03440j18398P4779O1772o2594o3250J55381j08067K9446
3122i3294l9666P9531l9214k7558O8483j5748m8497J5137L166N2332j17613J3626
3110a49315J09572j47816J14871l7798k0200p477Q6377K6150K4903q0108r615
3099i0456j9683Q0735l2025o6339P9176n7655r714K786R3149j39683N9762L8360
$$ plain form
3087 -61587 -91145 -40986 -41628 -216993 -90254 -109403 -198576 153 -140738 -57557 -83817
3076 -83817 -110798 -74662 -179062 -39997 -28000 -139960 -179778 -93353 -122771 -70613 -71191 -88799
3064 -88799 -85643 -160096 -45419 -94715 -60385 -10775 -70079 -87600 -134809 -104893 -94977 -83302
3052 -83302 -70626 -103177 15479 -131201 -102462 -36851 -97904 -9535 -101640 -32012 -68677
3041 -68677 -75856 -165766 -89607 -61931 -107089 -39704 -111472 -56477 -41452 -5191 -130651 -70218
3029 -70218 -5339 -92371 -92701 -139797 -151948 -116181 -100699 -31927 -108970 -80273 -79204 -134907
3017 -134907 -142065 -145923 -68437 -6448 -135441 -92992 -98149 -165094 -107937 -112561 -110162 -50587
3005 -50587 -139673 -69437 -189188 -190816 -159030 -114473 -164577 -140143 -189705 -63328 -246679
$$ packed form
3087f1587k9558N0159o42j75365J26739j9149q9173J98729j40891Q3181k6260
3076h3817k6981L6136j04400J39065J1997j11960l9818Q6425k9418N2158n78j7608
3064h8799L156p4453J14677m9296L4330M9610n9304j7521m7209K9916R916J1675
3052h3302J2676l2551J18656j46680K8739O5611o1053Q8369r2105O9628l6665
3041f8677p179q9910P6159K7676m5158O7385p1768N4995J5025L6261j25460O0433
3029g0218O4879q7032l30m7096j2151L5767J5482O8772p7043K8697J069n5703
3017a34907p158l858P7486O1989j28993M2449n157o6945N7157m624K399N9575
3005e0587q9086P0236j19751j628L1786M4557n0104K4434m9562J26377j83351
$$ plain form
2994 -246679 -131074 -107600 -137886 -120649 -30576 -143394 -111525 -191524 -156374 -150812 -160396 -115679
2982 -115679 -79023 -32567 -120969 -83815 -94485 -109204 -90134 -61686 -67352 -152992 -42698 -138423
2970 -138423 -7138 -65348 -95513 -121404 -73855 -115218 -97623 -26963 -132551 -54643 -167843
2959 -167843 -172872 -70888 -132586 -143609 -109118 -94746 -146633 -59545 -91786 -17470 -101483 -106492
2947 -106492 -130555 -108210 -81028 -33452 -88778 -69396 -143204 -125478 -68175 -72669 -116322 -74953
2935 -74953 -63303 -134249 -2220 -123343 -101133 -83908 -118872 -111405 -82845 -77309 -66433 -124886
2923 -124886 -79800 -10143 -119249 -63721 -118258 -84493 -79022 -100134 -6093 -89567 -112532 -28978
2911 -28978 -84184 -67053 -32936 -55821 -55223 -74155 -31305 -81657 -79884 -85449 -39810 -811 -168442
$$ packed form
2994b46679J15605K3474l0286J7237R0073j12818L1869p9999L5150N562r584M4717
2982a15679L6656M6456q8402L7154j0670j4719J9070K8448n666q5640J10294r5725
2970a38423J31285n8210l0165k5891M7549m1363J7595P0660j05588P7908j13200
2959a67843n029J01984o1698j1023L4491J4372n1887Q7088l2241P4316q4013n009
2947a06492k4063K2345K7182M7576n5326J9382p3808J7726N7303m494m3653M1369
2935g4953J1650p0946J32029j21123K2210J7225l4964P467K8560N536J0876n8453
2923a24886M5086O9657j09106N5528n4537L3765N471k1112R4041q3474k2965Q3554
2911b8978n5206J7131L4117k2885N98j8932M2850n0352J773n565M5639L8999j67631
$$ plain form
2898 -168442 -130358 -42597 -51219 -204133 -109595 785 -90399 -76079 -179815 -85726 -208219
2887 -208219 -116340 -56840 -119166 -118600 -138697 -130249 -99550 -147729 -20458 -57229 -149355 -124452
2875 -124452 -67808 -93766 -94102 -150944 -61834 -65502 -120511 -62191 -41440 -122731 -101403 -26697
2863 -26697 -51339 -78689 -66768 -71706 -35110 -84152 -94012 -72053 33298 -72506 -19862 -54789
2851 -54789 -41711 -151016 -99044 -74988 -80840 -17600 -58968 -76321 -77142 -100429 -40662 -41347 -89782
2838 -89782 -102090 -62707 -54527 -132436 -29939 -152000 -87152 -167103 -129328 -125079 -116691 -107286
2826 -107286 -159217 -3819 -222869 -123045 -117581 -137010 -186392 -79553 -140644 -66615 -117601
2815 -117601 -54619 -132203 -143920 -48392 -66095 -98483 -40983 -102377 -39316 -70333 -105178 -88705
$$ packed form
2898a68442L8084Q7761q622j52914R4538J10380r1184J4320j03736R4089j22493
2887b08219R1879N9500o2326N66k0097Q448L0699m8179J27271l6771r2126K4903
2875a24452N6644k5958l36n6842Q9110l668n5009N8320K0751q1291K1328P4706
2863b6697k4642k7350J1921m938L6596m9042r860K1959J05351j05804N2644l4927
2851e4789J3078j09305N1972K4056n852O3240m1368j7353q21k3287N9767o85m8435
2838h9782j2308L9383Q180p7909J02497j22061O4848p9951L7775M249Q388R405
2826a07286n1931J55398k19050R9824N464j9429m9382J06839o1091P4029n0986
2815a17601O2982p7584j1717R5528j7703l2388N7500o1394O3061l1017l4845J6473
$$ plain form
2803 -88705 -86732 -146618 -31163 -52236 -101482 -102970 -107244 -37752 -59950 -175815 -22935 -158467
2791 -158467 -40421 -62913 -124275 -113981 -127656 -181087 -120726 -68068 -21302 -52532 -131691
2780 -131691 -103272 -135545 -127561 -56539 -146312 -58167 -172138 -94930 -94212 -156853 -203916 -98187
2768 -98187 -109268 -163989 -68478 -75958 -123127 -83364 -170053 -128439 -105261 -135785 -60688 -108901
2756 -108901 -90197 -126939 -77656 -87352 -162352 -74677 -86467 -91878 -167118 -30652 -114730 -78526
2744 -78526 -144051 -49408 -167983 -89541 -126955 -83038 -102341 -7349 -72783 -114471 -76577 -107851
2732 -107851 -141092 -67302 -88412 -161798 -121197 -145267 -110720 -129303 -51842 -169714 -146606
2721 -146606 -62927 -41072 -34422 -61417 -142963 -124149 -140605 -153230 -151930 30135 -157706 -80030
$$ packed form
2803h8705J973n9886J15455k1073m9246j488m274O9492k2198j15865J52880j35532
2791a58467J18046k2492o1362J0294j3675n3431O0361N2658M6766l1230p9159
2780a31691K8419l2273P984P1022q9773Q8145j13971P7208P18o2641m7063J05729
2768i8187j1081n4721R5511p480m7169L9763q6689M1614K3178l0524P5097m8213
2756a08901J8704l6742M9283r696p5000Q7675j1790n411p5240J36466q4078L6204
2744g8526o5525R4643j18575P8442l7414M3917j9303R4992o5434m1688L7894l1274
2732a07851l3241P3790k1110p3386M0601k4070L4547j8583P7461j17872K3108
2721a46606Q3679K1855O650k6995q1546J8814j6456j2625J300J82065j87841P7676
$$ plain form
2709 -80030 -124467 -141696 -157204 -113371 -18805 -9633 -63842 -144985 -86580 -114573 -146791 -42104
2697 -42104 -58064 -144533 -153996 -51026 -97924 -121071 -48450 -91519 -123768 -121632 -78103 -89455
2685 -89455 -44362 -79776 -16188 -81824 -131963 -161101 -53173 -159173 -175916 -34526 -67855
2674 -67855 -92728 -183459 -133149 -179053 -89502 -24981 -29184 -76024 -173686 -21758 -164949 -99352
2662 -99352 -117900 -57176 -75830 -110233 -107285 -72382 -99394 -106667 -208608 -110155 -72048 -95322
2650 -95322 -82447 -91223 -155357 -141440 -177698 -198994 -97076 -8002 -54043 -117988 -102069 -100899
2638 -100899 -148906 -87649 -98989 -84554 -124025 -183614 -81702 -66160 -91657 -150592 -84948
2627 -84948 -101369 -111127 -83535 -120441 -75952 -51579 -53800 -168453 -153948 -248241 -50756 -78574
$$ packed form
2709h0030m4437j7229j5508M3833R4566R172n4209q1143N8405k7993l2218J04687
2697d2104j5960q6469r463J02970m6898k3147P2621m3069l2249K136M3529j1352
2685h9455M5093l5414O3588o5636n0139k9138J07928j06000j6743J41390l3329
2674f7855k4873r0731N0310m5904Q9551O4521m203m6840r7662J51928j43191O5597
2662i9352j8548O0724j8654l4403K948L4903k7012p273j01941R8453L8107k3274
2650i5322J2875q776o4134J3917l6258k1296J01918Q9074m6041o3945J5919J170
2638a00899m8007O1257j1340J4435l9471n9589J01912J5542k5497n8935O5644
2627h4948j6421r758K7592l6906M4489K4373k221j14653J4505r4293J97485k7818
$$ plain form
2615 -78574 -77302 -128524 -102488 -127061 -78270 -140554 -84836 -193178 -58792 -145612 -203652 -92155
2603 -92155 -166103 -125053 -174912 -178559 -92958 -88059 -174754 -32092 -79676 -72994 -169057 -101715
2591 -101715 -50149 -216545 -104575 -94050 -50749 -161791 -101831 -160914 -107044 -189233 -119293
2580 -119293 -40088 -97173 -106665 -123582 -113741 -199083 -140755 -98319 -10552 -120849 -93080 -88743
2568 -88743 -97739 -118393 -139312 -75660 -80348 -149865 -82408 -117018 -100809 -35814 -54549 -166116
2556 -166116 -78767 -134032 -66438 -82669 -117916 -53968 -138514 -146397 -135916 -116200 -117207 -151890
2544 -151890 -104921 -54232 -112761 -135873 -93659 -170914 -112374 -107112 -94451 -100226 -32422 -159419
2532 -159419 -48295 -157193 -102774 -83851 -112081 -44938 -84107 -103229 -52141 -160907 -96216
$$ packed form
2615g8574J272n1222K6036k4573M8791o2284N5718j08342J34386q6820n8040J11497
2603i2155p3948M1050m9859l647Q5601M899q6695J42662m7584O682r6063O7342
2591a01715N1566j66396J11970J0525M3301j11042N9960n9083N3870q2189O9940
2580a19293P9205n7085r492j6917R841q5342N8328M2436Q7767j10297K7769M337
2568h8743q996k0654k0919O3652m688o9517O7457l4610J6209O4995j8735j11567
2556a66116Q7349n5265O7594j6231l5247O3948q4546p883J0481J9716j007l4683
2544a51890M6969N0689n8529k3112M2214p7255N8540N262J2661n775O7804j26997
2532a59419J11124j08898N4419J8923k8230O7143l9169j9122N1088j08766O4691
$$ plain form
2521 -96216 -133029 -108529 -133452 -124856 -171422 -65541 -132863 -100054 -92950 -97510 -84599 -188515
2509 -188515 -138759 -92962 -39524 -184704 -165323 -75752 -94532 -70191 -169293 -111377 -108502 -26857
2497 -26857 -85925 -46979 -114400 -161717 -137567 -163230 -73888 -25707 -79505 -115913 -203775 -105601
2485 -105601 -105993 -48167 -80414 9596 -129192 -88483 -336165 -62798 -27270 -160309 -23105
2474 -23105 -172877 -125495 -95134 -172106 -82368 -129465 -70187 -102234 -120922 -225781 -107552
2463 -107552 -73081 -105055 -195600 -42568 -66944 -142524 -196242 -144950 -126071 -82908 -140218
2452 -140218 -61148 -157195 -138561 -168657 -57603 -83314 -112055 -87377 -85618 -125334 -154578 -58724
2440 -58724 -109588 -91072 -162199 -152200 -51788 -166808 -80062 -100516 -115014 -133390 -197692 -150001
$$ packed form
2521i6216l6813K4500k4923Q596m6566J05881o7322L2809P104m560J2911j03916
2509a88515M9756M5797N3438j45180J9381Q9571j8780K4341r9102N7916K875Q1645
2497b6857n9068L8946o7421m7317K4150k5663Q9342M8181n3798l6408q7862R8174
2485a05601l92N7826l2247R0010j38788M0709k47682K73367L5528j33039J37204
2474b3105j49772M7382L0361p6972Q9738m7097N9278l2047j8688j04859J18229
2463a07552L4471l1974r0545J53032k4376p5580n3718N1292J8879M3163n7310
2452a40218P9070r6047J8634l0096J11054k5711k8741K4678J759l9716k9244R5854
2440e8724n0864J8516p1127R999J00412j15020Q6746k0454j4498j8376o4302M7691
$$ plain form
2428 -150001 1350 -129473 -112624 -194044 21210 -110567 -129971 -110764 -113266 -47569 -137146
2417 -137146 -182404 -53361 -5868 -96886 -81073 -167659 -178845 -100032 -61578 -128495 -90084
2406 -90084 -157866 -102402 -168329 -96474 -132090 -101039 -181872 -138611 -55955 -97148 -76504 -165365
2394 -165365 -121021 -176458 -71813 3044 -137286 -141677 -152364 -197219 -120160 -36937 -72338
2383 -72338 10157 -260668 -120805 -88199 -148434 -80454 -90663 -52171 -102240 -163259 -126686
2372 -126686 -66122 -82824 -55038 -72793 -99948 -103319 -89446 -66989 -129968 -172461 -90669 -113349
2360 -113349 -65067 -149132 -77749 -197781 -74207 -145791 -188097 -107612 -145189 -159363 -171308
2349 -171308 -126093 -176962 -138502 -107947 -152922 -124357 -132288 -142881 -100280 -84335 -113559 -173323
$$ packed form
2428a50001J51351j30823J6849q1420K15254j31777j9404J9207k502O5697q9577
2417a37146m5258J29043M7493r1018J5813q6586j1186P8813L8454o6917L8411
2406i0084o7782N5464o5927P1855l5616L1051q0833M3261Q2656m1193K0644q8861
2394a65365M4344n5437J04645P4857j40330m391j0687m4855P7059Q3223l5401
2383g2338Q2495k70825J39863L2606o0235O7980j0209L8492n0069o1019L6573
2372a26686O0564j6702K7786j7755k7155l371J3873K2457o2979m2493Q1792k2680
2360a13349M8282q4065P1383j20032J23574p1584m2306Q0485l7577j4174j1945
2349a71308M5215n0869L8460L0555m4975K8565p931j0593M2601J5945k9224n9764
$$ plain form
2337 -173323 -67491 -142111 -123310 -87969 -84838 -155941 -96112 -162738 -129799 -99700 -69060 -30290
2325 -30290 -171198 -129392 -121764 -87296 -132961 -190408 -86086 -123616 -130962 -86723 -131162 -98806
2313 -98806 -184747 -57731 -123722 -104485 -238978 -71442 -176507 -64683 -110714 -119514 -104119
2302 -104119 -144308 -94534 -89106 -124864 -154509 -75362 -77441 -151777 -143873 -73135 -14985 -74597
2290 -74597 -144150 -13997 -46373 -53219 -93112 -152967 -163247 -114942 -137713 -60410 -115770 -175086
2278 -175086 -70200 -161918 -142760 -192732 -64827 -77370 -108098 -95123 -197126 -53650 -109979
2267 -109979 -103953 -218330 -61314 -133068 -128201 -21313 -33241 -77337 -102029 -105263 -166753 -17928
2255 -17928 -125781 -107494 -110000 -131286 -97650 -93797 -57792 -136922 -62165 -135146 -109204 -90706
$$ packed form
2337a73323J05832p4620J8801L5341L131p1103N9829o6626L2939L0099L0640L8770
2325c0290j40908M1806P628L4468m5665n7447J04322l7530p346M4239m4439L2356
2313i8806q5941J27016o5991J9237j34493J67536j05065J11824m6031q800J5395
2302a04119m0189M9774N428l5758k9645P9147k079p4336P904P0738N8150n9612
2290g4597o9553J30153l2376o846l9893n9855j0280M8305k2771P7303n5360n9316
2278a75086J04886r1718J9158m9972J27905j2543l0728J2975j02003J43476n6329
2267a09979O026j14377J57016p1754M867J06888j1928m4096k4692l234o1490J48825
2255a7928j07853J8287k506k1286L3636L853L6005p9130P4757p2981K5942J8498
$$ plain form
2243 -90706 -66733 -92750 -149021 -218635 -137283 -115323 -145596 -99859 -59916 -171518 -116641 -109066
2231 -109066 -96802 -87058 -69367 -134160 -12574 -162493 6652 -126314 -125621 -173839 -107307
2220 -107307 -18106 -152777 -174887 -28436 -110325 -149081 -68240 -156003 -110149 -104834 -150434
2209 -150434 -127855 -133889 -22758 -111893 -109483 -192621 -154920 -81478 -146531 -113936 -39079 -130973
2197 -130973 -197473 -65124 -156779 -111892 -128809 -162531 2624 -132632 -89587 -193482 -101768
2186 -101768 -220781 -122242 -92023 -117633 -78778 -82214 -115779 -169339 -147806 -30814 -125078
2175 -125078 -62377 -137247 -102649 -100659 -145385 -94270 -62255 -173332 -132870 -66639 -119436 11467
2163 11467 -33504 -36044 -106923 -163119 -133423 -112487 -17084 -77155 -62624 -74413 -190854 -85371
$$ packed form
2243i0706K3973k6017n6271o9614Q1352K1960l0273M5737L9943j11602N4877P575
2231a09066J2264R744J7691o4793J21586j49919J69145j32966O93m8218O6532
2220a07307Q9201j34671k2110J46451q1889l8756Q0841q7763M5854N315m5600
2209a50434K2579o034J11131q9135K410q3138L7701P3442o5053L2595P4857r1894
2197a30973o6500J32349r1655M4887j6917l3722J65155j35256M3045j03895R1714
2186a01768j19013R8539L0219k5610L8855l436l3565n3560K1533J16992r4264
2175a25078O2701p4870L4598J990m4726N1115L2015j11077M0462O6231n2797J30903
2163A1467m4971k540p0879n6196K9696K0936R5403o0071J4531j1789j16441J05483
$$ plain form
2151 -85371 -104336 -172327 -62988 -31392 -144934 -186253 -54578 -126272 -134851 -80811 -167298
2140 -167298 -149891 -113337 -58298 -66287 -39784 -114125 -96571 -4191 -125743 -64800 -95460 -25535
2128 -25535 -151025 -147414 -111368 -65877 -106761 -151888 -130024 -118010 -48225 -89965 -8202 -116548
2116 -116548 -212710 -164432 -181478 -105928 -83231 -108215 -103459 -78950 -151840 -169780 -79939 -161934
2104 -161934 -38911 -190608 -88402 -148734 -178936 -115160 -146687 -145210 -269200 -154439 -87876
$$ packed form
2151h5371j8965o7991J09339L1596j13542m1319J31675p1694q579N4040q6487
2140a67298J7407L6554N5039p989K6503p4341J7554R2380j21552O0943l0660O9925
2128b5535j25490L611L6046M5491m0884m5127K1864J2014O9785m1740Q1763j08346
2116a16548r6162M8278j7046P5550K2697k4984M756K4509p2890j7940Q9841q1995
2104a61934J23023j51697J02206o0332l0202O3776l1527J477j23990J14761O6563
$$ [...]
##END NTUPLES=NMR SPECTRUM
##END=
