##TITLE=abcd
##JCAMPDX= 6.0         $$ Bruker NMR JCAMP-DX V2.0
##DATA TYPE= NMR SPECTRUM
##DATA CLASS= NTUPLES
##ORIGIN= UXNMR, Bruker Analytische Messtechnik GmbH
##OWNER= root
$$ XWIN-NMR		Version 3.5
$$ Thu Jun 25 16:44:55 2026 Russian Standard Time (UT+4h)  servis@DPX200
##.OBSERVE FREQUENCY= 200.131235884673
##.OBSERVE NUCLEUS= ^1H
##.ACQUISITION MODE= SIMULTANEOUS
##.ACQUISITION SCHEME= undefined
##.AVERAGES= 320
##.DIGITISER RES= 18
##SPECTROMETER/DATA SYSTEM= spect
##.PULSE SEQUENCE= zg
##.SOLVENT NAME= DMSO
##.SHIFT REFERENCE= (INTERNAL, DMSO, 0, 16.4885)
##AUDIT TRAIL= $$ (NUMBER, WHEN, WHO, WHERE, WHAT)
$$ ##TITLE= Audit trail, XWIN-NMR		Version 3.5
$$ ##JCAMPDX= 5.01
$$ ##ORIGIN= Bruker BioSpin GmbH
$$ ##OWNER= servis
$$ F:\spectra/data/av/nmr/H1/1/pdata/1/auditp.txt
$$ ##AUDIT TRAIL=  $$ (NUMBER, WHEN, WHO, WHERE, WHAT)
(   1,<2026-06-25 16:44:11.00 +0400>,<servis>,<DPX200>,
      <created by zg, POWCHK disabled, PULCHK disabled
       configuration hash MD5:
       00 E9 B6 7A A2 85 ED C7 34 08 36 98 17 FE 4E 26
       data hash MD5: 32K
       F3 80 CF 89 DD F9 78 1D 74 30 A4 FD 87 A0 57 CD>)
(   2,<2026-06-25 16:44:12.60 +0400>,<servis>,<DPX200>,
      <Start of raw data processing
       efp BC_mod = 2 LB = 0.05 FT_mod = 6 PKNL = 1 PHC0 = -418.39 PHC1 = 3.101563 SI = 16K 
       data hash MD5: 16K
       AF FD B1 47 8B E2 A0 DD 1E D7 C4 D8 C9 64 76 C0>)
$$ ##END=
$$ 
$$ hash MD5
$$ 71 AF B8 47 E7 5A 4E F5 09 C1 9E 9D AA BE 00 58
##$RELAX= 
##$RELAX= 
##$RELAX= 
##$RELAX= 
##$RELAX= 
##$RELAX= 
##$RELAX= 
##$RELAX= 
$$ Bruker specific parameters
$$ --------------------------
##$DU= <F:\spectra>
##$EXPNO= 1
##$NAME= <H1>
##$PROCNO= 1
##$TYPE= <nmr>
##$USER= <av>
##$AMP= (0..31)
100 100 100 100 100 100 100 100 100 100 100 100 100 100 100 100 100 100 
100 100 100 100 100 100 100 100 100 100 100 100 100 100 
##$AQSEQ= 0
##$AQ_mod= 1
##$AUNM= <au_zg>
##$AUTOPOS= <>
##$BF1= 200.13
##$BF2= 200.13
##$BF3= 200.13
##$BF4= 200.13
##$BF5= 500.13
##$BF6= 500.13
##$BF7= 500.13
##$BF8= 500.13
##$BYTORDA= 1
##$CFDGTYP= 0
##$CFRGTYP= 5
##$CHEMSTR= <none>
##$CNST= (0..31)
1 1 145 1 1 1 1 1 1 1 1 1 1 1 1 1 1 1 1 1 1 1 1 1 1 1 1 1 1 1 1 1 
##$CPDPRG= <>
##$CPDPRG1= <>
##$CPDPRG2= <>
##$CPDPRG3= <>
##$CPDPRG4= <mlev>
##$CPDPRG5= <mlev>
##$CPDPRG6= <mlev>
##$CPDPRG7= <mlev>
##$CPDPRG8= <mlev>
##$CPDPRGB= <>
##$CPDPRGT= <>
##$D= (0..31)
0 2 0 0 0 0 0 0 0 0.06 0 0 0 0 0 0 0.0002 0 0 0 0 0 0 0 0 0 0 0 0 0 0 
0 
##$DATE= 1782391450
##$DBL= (0..7)
120 120 120 120 120 120 120 120 
##$DBP= (0..7)
150 150 150 150 150 150 150 150 
##$DBP07= 0
##$DBPNAM0= <>
##$DBPNAM1= <>
##$DBPNAM2= <>
##$DBPNAM3= <>
##$DBPNAM4= <>
##$DBPNAM5= <>
##$DBPNAM6= <>
##$DBPNAM7= <>
##$DBPOAL= (0..7)
0.5 0.5 0.5 0.5 0.5 0.5 0.5 0.5 
##$DBPOFFS= (0..7)
0 0 0 0 0 0 0 0 
##$DE= 6
##$DECBNUC= <off>
##$DECIM= 32
##$DECNUC= <off>
##$DECSTAT= 4
##$DIGMOD= 1
##$DIGTYP= 9
##$DL= (0..7)
0 120 120 120 120 120 120 120 
##$DP= (0..7)
150 150 150 150 150 150 150 150 
##$DP07= 0
##$DPNAME0= <>
$$ [...]
##$SUBNAM4= <"">
##$SUBNAM5= <"">
##$SUBNAM6= <"">
##$SUBNAM7= <"">
##$SUBNAM8= <"">
##$SUBNAM9= <"">
##$SW= 20.6817932712277
##$SWIBOX= (0..15)
0 0 3 0 0 0 0 0 0 0 0 0 0 0 0 0 
##$SW_h= 4139.07284768212
##$TD= 32768
##$TD0= 1
##$TE= 0
##$TE2= 300
##$TE3= 300
##$TEG= 300
##$TL= (0..7)
0 120 120 120 120 120 120 120 
##$TP= (0..7)
150 150 150 150 150 150 150 150 
##$TP07= 0
##$TPNAME0= <>
##$TPNAME1= <>
##$TPNAME2= <>
##$TPNAME3= <>
##$TPNAME4= <>
##$TPNAME5= <>
##$TPNAME6= <>
##$TPNAME7= <>
##$TPOAL= (0..7)
0.5 0.5 0.5 0.5 0.5 0.5 0.5 0.5 
##$TPOFFS= (0..7)
0 0 0 0 0 0 0 0 
##$TUNHIN= 0
##$TUNHOUT= 0
##$TUNXOUT= 0
##$USERA1= <user>
##$USERA2= <user>
##$USERA3= <user>
##$USERA4= <user>
##$USERA5= <user>
##$V9= 5
##$VALIST= <valist>
##$VCLIST= <CCCCCCCCCCCCCCC>
##$VD= 0
##$VDLIST= <DDDDDDDDDDDDDDD>
##$VPLIST= <PPPPPPPPPPPPPPP>
##$VTLIST= <TTTTTTTTTTTTTTT>
##$WBST= 1024
##$WBSW= 30
##$XGAIN= (0..3)
0 0 0 0 
##$XL= 0
##$YL= 0
##$YMAX_a= 6076443
##$YMIN_a= -8539932
##$ZGOPTNS= <>
##$ZL1= 120
##$ZL2= 120
##$ZL3= 120
##$ZL4= 120
##$ABSF1= 0
##$ABSF2= 0
##$ABSG= 0
##$ABSL= 0
##$ALPHA= 0
##$AQORDER= 0
##$ASSFAC= 0
##$ASSFACI= 0
##$ASSFACX= 0
##$ASSWID= 0
##$AUNMP= <proc_1d>
##$AZFE= 0.1
##$AZFW= 0.1
##$BCFW= 0
##$BC_mod= 2
##$BYTORDP= 0
##$COROFFS= 0
##$CY= 18.4799938201904
##$DATMOD= 1
##$DC= 0
##$DFILT= <>
##$DTYPP= 0
##$F1P= 9.9274215381318
##$F2P= -0.165520771350173
##$FCOR= 1
##$FTSIZE= 16384
##$FT_mod= 6
##$GAMMA= 0
##$GB= 0
##$INTBC= 1
##$INTSCL= 4.127829e-11
##$ISEN= 128
##$LB= 0.05
##$LEV0= 0
##$LPBIN= 0
##$MAXI= 10000
##$MC2= 0
##$MEAN= 0
##$ME_mod= 0
##$MI= 50
##$NCOEF= 0
##$NC_proc= 0
##$NLEV= 6
##$NOISF1= 3.799351
##$NOISF2= 2.8
##$NSP= 0
##$NTH_PI= 0
##$NZP= 0
##$OFFSET= 16.48848
##$PC= 4
##$PHC0= -418.39
##$PHC1= 3.101563
##$PH_mod= 1
##$PKNL= yes
##$PPARMOD= 0
##$PSCAL= 4
##$PSIGN= 0
##$REVERSE= no
##$SF= 200.130005582386
##$SI= 16384
##$SIGF1= 3
##$SIGF2= 2
##$SINO= 400
##$SIOLD= 16384
##$SREGLST= <1H.CDCl3>
##$SSB= 0
##$STSI= 16384
##$STSR= 0
##$SW_p= 4139.07284768211
##$SYMM= 0
##$S_DEV= 0
##$TDeff= 32768
##$TDoff= 0
##$TI= <>
##$TILT= no
##$TM1= 0
##$TM2= 0
##$TOPLEV= 0
##$USERP1= <user>
##$USERP2= <user>
##$USERP3= <user>
##$USERP4= <user>
##$USERP5= <user>
##$WDW= 1
##$XDIM= 16384
##$YMAX_p= 280917500
##$YMIN_p= -193934
$$ End of Bruker specific parameters
$$ ---------------------------------
##NTUPLES= NMR SPECTRUM
##VAR_NAME=  FREQUENCY,     SPECTRUM/REAL,   SPECTRUM/IMAG
##SYMBOL=    X,             R,               I
##VAR_TYPE=  INDEPENDENT,   DEPENDENT,       DEPENDENT
##VAR_FORM=  AFFN,          ASDF,            ASDF
##VAR_DIM=   16384,         16384,           16384
##UNITS=     HZ,            ARBITRARY UNITS, ARBITRARY UNITS
##FACTOR=    0.252644378177508, 1,           1
##FIRST=     3299.83951724647, 0,            0
##LAST=      -839.233330435636, 0,           0
##MIN=       -839.233330435636, -193934,     0
##MAX=       3299.83951724647, 280917500,    0
$$ Real data points
##PAGE= N=1
##DATA TABLE= (X++(R..R)), XYDATA
$$ [...]
11045 -13803 -33987 -63246 -21047 -48547 -64314 -66094 -40083 -54018 -47234 -37038 -64703 -53818
11033 -53818 -49474 -39749 -47947 -85153 -88251 -54485 -43440 -70148 -27896 -41646 -75084 -69030 -27646
11020 -27646 -42322 -28277 -36059 -45126 -73545 -35532 -63717 -45317 -77273 -48790 -36893 -77778
11008 -77778 -61158 -53710 -67812 11283 -14736 1152 -48161 -52477 -43796 -12560 -34622 -19642
10996 -19642 -39807 -36744 -47152 -50944 -35784 -38048 -40851 -85736 -79187 -42370 -77263 -24428 -49883
10983 -49883 -20172 -22067 -25391 -47411 -1763 -12003 -41232 -29426 -56483 -36402 -2002 -14709
10971 -14709 12546 -28813 -24890 -99070 -69011 -20434 -33735 -50788 -60674 -38544 -27786 -1775
10959 -1775 -57402 -37216 -22417 -7444 -10209 -25395 -37229 -24122 -71202 -25050 -6663 -38637
10947 -38637 -19391 -31559 21319 15487 -45293 -24135 312 -52140 31185 29064 3621 -2438
10935 -2438 9970 12945 -9000 489 -18986 8888 32230 1361 12375 27029 29641 3793
10923 3793 -49595 5047 55832 22197 -14236 49266 15081 21761 8889 15246 607 42563
10911 42563 10987 12554 48143 22010 22337 -4178 -14315 41560 59538 52559 72032 95615
10899 95615 31189 2846 70094 18369 37565 10899 77892 103783 75848 78088 90694 72563
10887 72563 133230 134143 106101 100035 112362 96004 124825 118779 154802 143283 142628 153737 143770
10874 143770 116722 134667 178019 154402 157860 201181 158595 179558 195151 212406 187905 247578
10862 247578 207973 241359 240167 279225 229694 227879 235109 271123 283436 270664 307823 305696
10850 305696 322339 343690 317369 345224 401613 432723 401411 440083 414456 430114 517304
10839 517304 500563 550265 561108 574302 597042 637692 692567 736504 783389 817431 826713 878933
10827 878933 969033 1027744 1036349 1120858 1188102 1238582 1335208 1403050 1503168 1608521 1646333
10816 1646333 1720476 1743006 1821834 1862278 1913419 1974387 2042061 2098720 2162048 2219954 2289011
10805 2289011 2281771 2363822 2380308 2341515 2341120 2318459 2350139 2395596 2449766 2470606 2532015 2540309
10793 2540309 2522744 2535255 2550290 2473573 2474360 2501527 2460116 2473671 2421887 2467667 2453787 2403069
10781 2403069 2385429 2270463 2259221 2182778 2097769 2043124 2006216 1922047 1861419 1823365 1782282
10770 1782282 1701003 1629449 1590914 1565604 1449037 1394775 1325776 1257452 1233036 1174336 1139015
10759 1139015 1114777 1077849 1033551 965143 947377 947806 866379 888583 823150 808411 750357 710912
10747 710912 700002 672143 655819 668550 571267 612905 588065 552187 548513 511636 492255 451161
10735 451161 428933 414484 419847 406786 412012 374376 384510 359265 379577 329423 322750 330463
10723 330463 334346 264647 336335 304907 281856 292426 241217 242972 236642 202061 137205 183960
10711 183960 192356 140854 167133 128448 129331 205741 183425 164007 142317 149320 149373 143671 148489
10698 148489 140110 124727 120581 129119 143847 114982 101367 109595 111419 119799 53065 92335 125968
10685 125968 109215 72005 77335 93160 92769 75486 122313 63030 50285 82173 83459 23470
10673 23470 77300 41241 5239 58843 21628 40154 58684 43935 68137 79239 53112 31705
10661 31705 40202 23866 57951 80940 25359 57584 70365 82247 48423 72938 36694 22055
10649 22055 25557 37048 28491 24286 24151 17366 -12804 46008 42209 23968 -32259 32687 14471
10636 14471 -20738 32900 33047 14201 -50749 -3757 -315 33584 28045 13136 1668 -38867
10624 -38867 -30861 9976 -34418 -15126 13014 -18044 -6191 7061 -9870 1938 -42128 -27519
10612 -27519 -35306 -44645 -26507 -17531 -29956 -41357 -15151 20846 -25698 1 -21847 -51144
10600 -51144 20 -35259 -18383 -21072 -19048 7636 -28546 -8933 29 -46817 -52792 -45435 -18911
10587 -18911 -29789 -7953 -30591 -42656 -13907 -45531 -17620 -53050 -68001 -78347 -27134 -10621
10575 -10621 -23051 -17534 -32864 -19213 -40381 -41340 -14659 -28174 -10454 -60181 -36842 -58716
10563 -58716 -19253 -19487 -6617 -38666 -45552 -23357 -65157 -51850 10253 -22018 -53007 -15944
10551 -15944 -16597 -13808 -39079 -26052 -53639 -56078 12109 -17776 -63539 -43086 -35073 -7005 -35176
10538 -35176 -38811 -41841 -51614 -46022 -35138 -15946 -39161 -13057 -39473 -59011 -96879 -23657
10526 -23657 -42231 -53392 -63664 -18532 -12471 -41956 -47876 -7533 -28712 -64593 -74101 8447
10514 8447 -44434 -42366 -56747 -101128 -11569 -56485 -22837 -31925 -67778 -15114 -30171 -64717
10502 -64717 -59176 -54294 -15324 -35109 -71532 -61631 -42828 12432 -22442 -81781 -59933 -62718
10490 -62718 -41331 -25241 -75643 -51930 -47728 -72033 -61177 -54862 -47210 -55656 -61141 -43651 -42164
10477 -42164 -59538 -35000 -48005 -2450 -39195 -30134 -54853 -25927 -36447 -44160 -66108 -38041
10465 -38041 -47623 -68165 -26858 -17860 -63460 -79349 -15850 6800 4489 -24148 -51904 -84096
10453 -84096 -79500 -59440 -21526 -30521 -54777 -30319 -91303 -48687 -44988 -42221 -18905 -76534
10441 -76534 -55405 -49102 -53457 -34268 -69712 -72225 -42592 -75536 -43497 -33917 -45728 -34380
10429 -34380 -77058 -38494 -34058 -42795 -52706 -84445 -10651 -63557 -48188 -19777 -15596 -78040
10417 -78040 -69404 -52860 -21252 -56857 -73255 -104170 -80774 -41065 -68677 -47093 -33952 -55850
10405 -55850 -19725 -97477 2510 -72155 -34971 -11961 -44849 -11893 -65156 -47933 -37536 -22411
10393 -22411 -25590 -24832 -67502 -65791 -16073 -56491 -35273 -62253 -48629 -20669 -47724 -59277
10381 -59277 -46211 -49367 -8006 -7347 -60039 -23166 -51408 -58430 -50168 -75582 -72298 -66943 -18184
10368 -18184 -48226 -48615 -66406 -17205 -27823 -19720 -65786 -13116 -47886 -76795 -20610 -85324
10356 -85324 -56719 -75591 -22215 -19595 -56107 -67337 -40191 -81510 -19249 -54317 -83649 -19043
10344 -19043 -38549 -73321 -75161 -59375 -50115 -99080 -62623 -13384 -58609 -78119 -111555 -83876
10332 -83876 -78477 -30215 -84994 -68666 -37197 -36242 -57296 -49359 -102350 -59554 -10009 -42573
10320 -42573 -64807 -35559 -58256 -111320 -48871 -48899 -35458 -34983 -52555 -54789 -49532 -58713 -44242
10307 -44242 -67307 -70730 -96115 -53512 -60152 -37172 -74618 -67768 -56913 -79823 -49594 -29687
10295 -29687 -47962 -79377 -46521 -52226 -41735 -53442 -27923 -54030 -46155 -39492 -26067 -38902
10283 -38902 -49472 -69739 -19913 -5598 -23000 -33041 -45169 -29804 -33017 -60516 -82151 -59699
10271 -59699 -22673 -53355 -15676 -80928 -36859 -66234 -63247 -43758 -13391 -41960 -41928 -47469 -66097
10258 -66097 -31642 -61436 -32612 -96003 -55726 -54142 -65665 -47631 -52452 -34479 -44951 -73972
10246 -73972 -27929 -81484 -28490 -59078 -56061 -36879 -50796 -91887 -54760 -27007 -45418 -46376
10234 -46376 -49859 -4590 -20466 -29825 -52441 -18740 -75893 -54173 -9300 -30063 -60760 -30811
10222 -30811 -43827 -26886 -33909 -38480 -19906 -59967 -18737 -18564 -75617 -61829 -29919 -32870 -46440
10209 -46440 15096 36873 -19024 -55881 -15153 -21867 -38915 -42431 -50920 -39088 -62731 -28502
10197 -28502 -6730 -31019 -38732 -16973 -13950 -48271 -20775 -43124 -24842 -46734 -55252 -45009
10185 -45009 -21196 -21190 -22229 -48647 -29596 -9038 -12558 -14419 -52375 -23971 -8627 -35214 -65831
10172 -65831 -35138 -46309 -58701 -7791 -48559 -32943 -72461 6269 -26511 13277 -10648 9988
10160 9988 -45788 -31934 -3399 -34441 -46765 -33450 -28586 -46354 -56896 -45047 -7906 23618
10148 23618 -54783 -19280 -10392 -37295 -47768 -4721 -50235 -60143 -35990 -19425 -39949 -65617
10136 -65617 22451 -43751 1815 -21738 -32732 -48295 -23059 -46385 -26632 -36433 1607 -46005
10124 -46005 -44124 -20665 -28868 -46514 12365 -60121 -26447 -45033 -12944 -28343 -7955 669
10112 669 -5930 -12798 -20814 5107 -21625 -14659 970 -16131 -36789 -39793 -11037 -11055 -1995 -10622
10098 -10622 -21299 25483 -16883 1518 -498 -29142 1521 -10080 -13315 -46643 -32152 -31269
10086 -31269 -48972 -27244 -31741 -10588 3593 2080 -35292 -11488 523 -58346 -897 -30281
10074 -30281 -49541 -6812 -8570 -10448 1020 -45431 1725 -4804 -15457 -54063 33432 -32541
10062 -32541 -57361 -16948 -22705 -39093 19603 -5798 -11276 -36320 5172 -19612 -34185 -28570
10050 -28570 -27430 43119 24352 -53990 -33539 -36487 7519 -36131 -35294 23923 -45179 -16231
10038 -16231 31798 -5347 -15491 -25909 -1103 -47812 -30578 10534 4192 19750 -1725 3129
10026 3129 -31601 110 9197 32998 2390 -13416 8751 26114 -25499 9818 51412 5148
10014 5148 -987 -13855 15747 -35933 -46573 -352 8267 47102 12312 21750 40914 18949
10002 18949 13161 27933 40501 -5393 19534 34712 21631 23923 12017 30414 40143 27811
9990 27811 10922 36726 39203 29287 40479 49772 59918 52092 34235 15931 -19699 30730 26329
9977 26329 6669 34001 57683 88924 55190 36643 96671 60396 20780 113320 77953 32050
9965 32050 58634 81746 61270 109416 90354 86048 63118 101001 106589 97385 85595 145188
9953 145188 104213 88967 116951 150878 138379 132556 108411 136623 100160 155046 157637 132442
9941 132442 154496 140559 137479 87643 153136 149931 151903 179083 183333 221298 222947 196415 174960
9928 174960 224189 206505 200180 251545 282337 239715 292999 245844 263230 309466 246854 288245
9916 288245 282341 309939 390460 320487 326820 380473 406737 392452 442037 449324 420738 454427
9904 454427 501190 522711 528625 606754 607349 566362 643058 674259 716808 737567 746662 786323
9892 786323 829035 880373 923909 971665 1038933 1099044 1163242 1240489 1300074 1348844 1363325 1422052
9880 1422052 1464827 1484158 1551187 1599427 1700464 1755173 1775759 1864170 1900027 2006820 2084660
9869 2084660 2152555 2219039 2307728 2376515 2393182 2475576 2479946 2540961 2546108 2567859 2585665 2615481
9857 2615481 2611615 2627634 2638077 2649369 2616979 2663424 2623417 2667847 2609319 2624143 2634012 2600890
9845 2600890 2540301 2534178 2525811 2474772 2494749 2415785 2374924 2362291 2350433 2311983 2346624 2279920
9833 2279920 2303784 2282700 2282116 2207445 2202441 2139990 2122227 2052352 2006627 1939787 1858640 1837494
9821 1837494 1798277 1706427 1651636 1670749 1625462 1640063 1557200 1571908 1523752 1507779 1484038
9810 1484038 1482947 1513999 1448638 1419918 1439053 1426691 1434561 1406552 1375295 1343009 1363853 1328425
9798 1328425 1351699 1323148 1269546 1237777 1205864 1196544 1152426 1097172 1042721 1105475 1032484 1008821
9786 1008821 962728 901334 900705 877250 843223 782739 767533 766769 742796 719754 690290 690838 690704
9773 690704 668944 650984 618431 566331 561071 531422 526292 546040 511628 557413 503976 534537
9761 534537 522127 504435 478351 437572 477608 473865 475260 438087 417702 434942 454078 420695
9749 420695 441195 433215 434204 429938 437393 426082 363108 392517 357795 335045 338798 365237 334662
9736 334662 350974 331514 300458 315842 266791 289928 323246 258622 262686 285350 300490 260784
9724 260784 292851 353847 282332 303460 250590 297815 288778 258911 279261 279960 289067 253252
9712 253252 275913 273874 236872 228802 243650 236433 231428 259266 254815 228976 257939 232508 219979
9699 219979 246832 233994 274105 199254 252103 255440 255859 235073 235991 271336 241233 202680 241735
9686 241735 203592 220488 242591 240404 207026 247915 221755 225585 236417 197005 195384 217630
9674 217630 250393 282538 266929 284495 269741 296427 282154 326902 303534 296315 311312 318319
9662 318319 329819 336800 341678 331888 357715 378368 356777 355917 414405 391741 420876 438182 502978
9649 502978 482419 530855 535303 581207 622217 654611 644005 643671 699145 715987 766824 785129
9637 785129 807303 841210 885492 954807 982403 1038389 1087474 1086898 1112877 1141828 1135708 1117337
9625 1117337 1137561 1103156 1111298 1075528 1051604 1057771 1015007 977220 942767 991274 992713 948256
9613 948256 963111 951929 992832 936996 1011543 992649 1004344 1015349 1057907 1064463 1111274 1085212
9601 1085212 1174530 1168378 1189663 1243851 1223440 1278870 1292828 1269940 1256756 1202044 1197360 1165578
9589 1165578 1114142 1049177 979358 984818 926347 870294 855566 811686 794379 713131 713852 662237
9577 662237 684262 673759 608640 655286 586747 559774 552619 557984 549050 524973 492698 530477
9565 530477 520780 479671 525555 510542 475328 505149 476451 490385 517872 475657 496780 452239
9553 452239 427384 450805 447251 384385 402776 397244 399685 375877 396172 408881 389921 343272
9541 343272 365443 402668 361491 366701 351312 382970 409056 354165 345740 333272 350089 353236
9529 353236 305705 306441 329306 338723 323300 313783 307068 307001 324349 349725 352046 386601 396176 381067
9515 381067 336191 367973 373160 389891 329066 409394 391877 356810 338246 367882 388506 345967
9503 345967 368536 379662 344598 322516 343439 350349 371356 318130 378358 344870 338679 361036
9491 361036 319478 335692 362882 373743 344580 379663 392289 362434 349610 395723 394365 384592
9479 384592 403894 377828 429655 450235 457628 443810 443313 426405 459944 456042 441472 480320
9467 480320 446602 451408 452509 487570 482515 470408 418063 471884 505742 477244 494377 554636
9455 554636 521431 522466 526978 556189 541955 595354 590823 631656 656678 700365 679783 746986
9443 746986 721769 732135 748927 788466 829704 891467 847332 855250 934442 909423 971576 933098
9431 933098 914277 988786 935470 912430 930961 924190 899921 825502 846429 817189 828942 830669
9419 830669 838234 810564 809138 783616 734314 794881 816236 797210 833881 835511 843516 825145
9407 825145 807904 797517 777571 767073 745743 755942 841800 844585 828704 838151 870144 887580
9395 887580 890604 858965 900753 920262 913179 927108 944917 953121 974311 958308 936395 953869
9383 953869 902882 896874 917568 942496 1040404 999352 1053244 1082232 1176537 1188748 1196075 1222127
9371 1222127 1271539 1295921 1250590 1238306 1214646 1213357 1251810 1263369 1263950 1255353 1242497 1220380
9359 1220380 1172830 1187489 1161358 1146857 1174493 1253575 1336732 1355374 1329919 1259192 1188757
9348 1188757 1177240 1125813 1096857 1094597 1048437 1031658 996666 972544 1027364 1000772 969489 962675
9336 962675 955902 980397 1028767 1055171 1156018 1210246 1227987 1241593 1225381 1107535 1104702 993019
9324 993019 944452 929981 900975 867425 826361 795844 830284 789450 761323 769626 772760 816000
9312 816000 768832 776750 788422 740275 805279 786673 787527 811467 759190 718864 679354 606197
9300 606197 645531 662428 635698 664613 650736 680184 699719 717788 673007 652794 651777 580902
9288 580902 581135 615500 538793 565004 510919 554727 552331 517525 572400 523586 544293 536592
9276 536592 553315 517633 541332 552211 568626 551198 485739 487376 508530 511400 473245 522900
9264 522900 444963 453305 452777 460921 486846 485563 463596 498855 460324 465872 464335 444978 434496
9251 434496 440545 485209 481130 448380 481118 451894 502314 488095 450352 488759 433327 459051
9239 459051 484950 414210 386921 406531 413238 343517 341587 368805 413928 392121 307860 378336
9227 378336 369274 341934 370224 352307 348929 324261 407833 354711 376555 348538 347431 293751
9215 293751 345877 310773 350152 361174 344946 330270 370583 333119 320914 341772 302175 351913
9203 351913 341103 321226 306058 284676 264402 278060 255717 324499 227055 277796 317661 289603
9191 289603 305475 346672 305734 341600 292959 328502 343372 355903 331561 305514 382645 361664
9179 361664 353662 353748 339793 375225 353552 324135 365746 341491 346100 326912 363792 348781 283659
9166 283659 337088 348077 341391 349725 312653 347906 298411 302502 350500 305424 313637 309519 321704
9153 321704 359570 369128 383609 425652 416637 401273 382559 385464 372935 372993 349746 353896 341257
9140 341257 339231 356170 302556 292977 332983 290512 276689 281060 287623 262661 304993 292696
9128 292696 299442 210900 231340 215651 230524 272715 229998 237077 259898 264385 228191 221786
9116 221786 244207 254693 247423 224385 261963 248325 292634 204762 288323 215642 276301 254247
9104 254247 204593 231466 221810 206335 243197 272382 225153 243230 218750 213951 259038 240469
9092 240469 240397 239898 192625 253900 228787 213542 246981 227648 197527 208723 226425 247415 188731
9079 188731 232641 224973 218181 264475 228193 286752 232318 242052 260023 251643 231952 259893
9067 259893 266420 281969 287846 286379 276019 292294 325190 221170 195846 247929 278002 253860
9055 253860 268527 247909 247562 237833 226537 237334 242237 217653 232412 278182 250836 211763
9043 211763 261014 307486 244924 252766 253969 229024 297547 249870 253752 274209 267340 271945 236999
9030 236999 265759 252293 258542 220993 262711 227621 227724 240041 225784 238945 233424 200731
9018 200731 262869 205604 271522 278312 272794 274230 295994 275622 286737 238909 266213 286435
9006 286435 276667 303101 276176 334173 325824 339674 301327 307989 306555 332476 353669 376906
8994 376906 372676 430182 468022 560532 583113 595239 588048 623426 583372 538978 559502 587616
8982 587616 573190 563635 540602 557536 516569 564212 554201 604140 540277 590719 591884 590357
8970 590357 581131 605245 649493 686352 808013 836992 820380 827246 841370 866132 896915 869124
8958 869124 968508 984103 1052694 1098614 1102177 1139982 1169306 1152286 1163868 1191790 1198208 1229739
8946 1229739 1272094 1307087 1387003 1449906 1493763 1566637 1564543 1575833 1598417 1611847 1547182 1532102
8934 1532102 1491781 1513925 1407369 1348806 1324989 1220741 1273530 1209932 1190014 1138934 1098074
8923 1098074 1134230 1127759 1166582 1125258 1177278 1175100 1210127 1241671 1258242 1320854 1343659 1431262
8911 1431262 1482113 1538371 1513263 1612720 1622752 1645232 1698374 1672392 1586773 1632582 1520621
8900 1520621 1396276 1383215 1276426 1262131 1109668 1109650 1051069 1038710 957469 923490 933982
8889 933982 853902 816431 816922 765977 784509 733713 731324 720481 710038 709852 734092 733013 698820
8876 698820 716474 696783 717450 701577 738063 734851 766669 757721 779726 767383 733224 714068
8864 714068 714507 687954 701057 733045 731970 767860 795056 764051 741434 785588 773537 778515
8852 778515 787962 788863 786042 762822 759097 782842 768810 778839 781222 800580 780373 783696 757900
8839 757900 785446 808364 822942 826274 846660 858398 815607 806115 776810 763577 752978 778469
8827 778469 782044 762809 763361 780191 768062 691983 726066 702475 724110 704514 739323 730939
8815 730939 689886 685507 665849 701587 642726 705206 685069 686348 723056 692893 702098 690641
8803 690641 665991 691432 706154 680687 655944 627072 643607 645291 615970 564938 623612 524065
8791 524065 519351 532258 455512 468966 481188 494369 460186 466082 434994 452955 461236 449093
8779 449093 449059 484779 482881 438969 465083 491002 442740 480296 515226 495347 477607 477835 483262
8766 483262 518683 462069 491753 480210 479753 443723 455891 443825 456211 432991 428428 395721
8754 395721 407290 395662 416405 413019 371111 370978 354304 331242 390366 328852 345163 312722
8742 312722 317799 357362 267223 312021 262102 325182 336624 270472 331633 310812 307352 341816
8730 341816 270860 336146 345255 329931 297010 277804 320805 303526 293223 298964 267566 302491
8718 302491 290965 291696 256125 225360 273758 272005 224624 274616 179368 231736 260967 205468
8706 205468 222912 209910 229857 235676 224629 202876 210335 199071 209419 185501 148489 187362
8694 187362 163912 179757 198481 159185 186206 180259 207164 199372 270774 214253 209089 186132
8682 186132 216096 196160 156923 177617 187855 151167 218544 186751 178752 192405 137408 193538
8670 193538 125070 151478 152537 169706 113522 127468 145624 113213 157460 122191 133727 144645
8658 144645 143322 99289 123565 123622 136381 131157 123219 81129 110475 122469 129201 123962 85064
8645 85064 129680 96345 132497 57872 112763 86737 126014 105889 116387 117086 96698 95732 72022
8632 72022 160660 127224 122368 121371 71014 131219 85151 171553 118422 101108 122423 121106 169958
8619 169958 137532 230694 235878 283439 377091 361549 371817 363466 287364 264990 249125 192598
8607 192598 190042 150406 176225 109328 128430 108298 105931 169071 118099 60500 105410 92817
8595 92817 81654 93069 80418 99937 115367 90747 98375 116840 126150 114030 147782 190059
8583 190059 285311 316680 311397 291644 271834 262381 230107 256535 154677 202974 86598 148292
8571 148292 55752 133476 88558 80271 91600 113148 64848 76722 55445 71540 35789 95580
8559 95580 86219 62255 91406 80654 110765 71696 82842 78225 47711 82201 53593 38378
8547 38378 28378 88020 27895 77012 46543 49941 78308 64635 69664 60349 97469 82138
8535 82138 70344 69454 44449 106680 60807 38503 69601 24310 63769 39892 73892 18549
8523 18549 46226 58539 24246 14086 31539 28148 93066 83079 40357 60683 49018 54403
8511 54403 74227 66614 37890 43483 64414 91862 81860 85417 73670 59535 33005 63729
8499 63729 61783 37693 43070 61440 42534 97052 35742 16554 42827 34783 40227 25256 40056
8486 40056 10054 63041 32860 13185 29403 53998 20757 37606 10942 100823 104591 73396
8474 73396 48275 85100 76883 72935 65826 38059 29703 70801 42896 25542 8537 5966 45039
8461 45039 44446 35130 36202 -9816 -3453 9631 7226 38572 -15072 10371 12107 18202 -5322
8448 -5322 48818 37374 24867 5016 55576 50247 14715 18294 39725 58081 29713 -35709
8436 -35709 43670 50052 30060 60686 19236 24184 41528 28751 -10324 52809 22475 23671
8424 23671 41250 -6888 36044 37420 -10418 30750 56684 60786 60574 102495 75848 81311 126367
8411 126367 19755 61353 55543 21560 51391 58606 50911 32905 11855 22453 28559 37864
8399 37864 49281 16572 22738 11827 -30738 -5386 11387 15290 1352 24360 21696 27941 7906
8386 7906 6480 -11455 25768 32004 13106 54855 -8426 32598 69198 27411 9552 30534
8374 30534 13092 -7342 38754 -14970 4159 -7807 31773 -45665 -64510 24444 27836 14309
8362 14309 -32150 39731 23387 16379 21111 -19042 -20965 12954 15536 1642 2795 -850 94
8349 94 21898 16929 13935 59524 10832 60186 896 28086 17442 25910 47038 41804 38918
8336 38918 47014 -3057 31764 33988 24625 17832 3658 -1012 9652 13248 11753 -12022 7427
8323 7427 26294 14979 22228 14245 43140 45185 58660 -11623 6265 1271 71061 50186 -5111
8310 -5111 30080 2247 13795 8104 -10007 4513 4145 5442 58766 33598 1483 42217 6191
8297 6191 52857 29750 54830 20596 6501 9341 8077 18258 51993 40954 21344 432
8285 432 62584 -16418 -25712 30711 33482 12113 -13623 44308 29724 28757 18126 34379 24375
8272 24375 7482 20068 19677 18806 20745 13958 33394 45623 49552 -34414 -19952 18696 18239 -1013
8258 -1013 23052 50605 -9892 23114 12752 54880 38459 22591 -14275 33057 15580 15909
8246 15909 66468 31335 40025 -3202 3098 27271 24635 60469 30283 14681 14454 -1903 50940
8233 50940 26026 5199 9426 1021 37098 3990 -6729 26346 12030 34785 634 -10354
8221 -10354 14036 -10488 3319 40692 -16134 28506 13161 83058 37664 45675 8998 28417
8209 28417 29593 26001 -9239 -5576 -13981 -8921 60399 2110 -4300 27168 21169 -18532 6391
8196 6391 -29656 -4633 38288 102013 90225 -14472 -9665 13850 -7644 -5929 -6306 14071 2249
8183 2249 31490 19791 -32108 -41376 1557 -8527 -13035 2963 -1448 -1435 16224 19790 -8006
8170 -8006 1691 -29214 -10496 7909 3803 19642 -9264 19956 21228 9174 -46116 -32989 2781
8157 2781 19649 -1676 -4826 6333 -22276 -36214 -24121 -21748 -3825 22543 -3518 -771 -12701
8144 -12701 -23519 5987 -19467 10177 32923 -2142 -1653 14996 -28393 -21122 1438 9528 -22760
8131 -22760 1177 -19295 2420 19446 4040 -21468 -17570 16919 -27261 -35182 -26487 -40737
8119 -40737 -2769 -15060 41719 11853 -19616 8465 -21979 -16504 -10861 20748 -12321 39724
8107 39724 -2923 8861 -1549 34388 -7722 13108 23571 -21362 -21419 15478 28767 38578 7028
8094 7028 -23949 -3557 32745 4510 -17358 -4967 4018 22056 23303 30675 10190 21526 11796
8081 11796 38446 -9607 9783 -11465 38774 13354 -15689 -826 9227 23585 13976 51903
8069 51903 43107 23344 43151 29245 23334 45738 -5185 -20331 40986 40244 43664 73995 -7562
8056 -7562 46814 33643 36098 63233 92694 64053 47904 66989 97513 51985 76439 54968
8044 54968 122320 100280 113362 108803 134050 111726 117169 125065 115294 137893 46171 111354 158629
8031 158629 144965 113797 103850 150427 158488 171535 100188 162480 175311 168958 149324 157391
8019 157391 167297 160225 102513 200676 182254 156831 204666 205774 179510 167757 209568 216630
8007 216630 192028 199319 210175 215972 209406 219455 177804 201010 210706 239784 190778 223043
7995 223043 214156 147493 148964 183395 139100 205116 158687 127785 122874 195102 153898 122076
7983 122076 178573 159887 161302 129383 107560 202684 137210 143482 149598 160206 168415 113438
7971 113438 107913 92116 111159 131858 143244 132778 140431 99363 128778 99395 79893 124994
7959 124994 80165 95217 114398 45018 37092 82826 63226 78950 74527 95386 93008 90002
7947 90002 22820 83710 80894 80876 113440 72390 73768 27616 58970 93468 51948 66869 26792
7934 26792 94744 27259 18881 56276 55161 38858 69189 50725 42616 47365 81827 60748 54791
7921 54791 47728 2321 66288 19181 56299 20993 52223 37367 6221 34133 45025 60996
7909 60996 -21720 10391 13331 -18260 24746 22751 41651 33098 66602 23600 16146 -18 14971
7896 14971 27772 30321 1793 64541 10127 12203 21038 3613 -21481 -5458 43255 14504
7884 14504 20159 -15977 -4181 -4414 -41982 7343 14218 22254 8189 -44965 44651 24741 23414
7871 23414 8971 -9051 29389 7506 31375 48306 5159 84738 48222 45839 13343 64192
7859 64192 112258 123036 222040 229982 184045 231529 159055 193424 146059 112601 45061 80984
7847 80984 49369 29483 27332 34269 -23710 48094 -28820 -57975 -24199 35065 33485 5542
7835 5542 47801 37585 8574 -35319 -23002 9270 37151 11980 43768 -9925 39709 51481
7823 51481 28890 29701 64815 -30051 1931 4144 -9996 37820 -27545 11704 -5959 25159
7811 25159 22768 -21824 26817 -14072 -3935 -2458 -2575 17893 -18799 -1471 -39320 -15257 5241
7798 5241 37851 -38666 -19498 3344 10329 51405 15624 -1896 -18842 44560 13932 14105 21828
7785 21828 35469 -11158 24221 1985 5574 8727 21961 3335 -13605 -20953 11843 -18803
7773 -18803 -39728 -5601 8192 5441 12324 -34081 -51117 -14462 -22380 -65304 -27858 -30423 7617
7760 7617 12450 -44996 -2880 -64270 12218 -22144 3526 16595 -11071 -23390 -43055 -41522
7748 -41522 -14423 -29082 16374 -40729 -24243 -45675 -21396 -1677 4096 5867 3612 14397
7736 14397 -924 -27558 -43576 861 2350 5814 -32946 -26148 32137 -13957 -15762 -21281 34037
7723 34037 -11346 -42095 -7082 9831 -22121 -31951 3721 -15566 -50471 -55576 17494 641
7711 641 -29921 -15917 -21900 -61839 18554 -22662 18181 -31087 15826 -13106 -2389 -12178 34488
7698 34488 3127 30466 4484 -22451 9832 17425 -32022 -26808 3189 -16686 1000 40407
7686 40407 17143 -29757 60468 -1747 -6850 -14047 -18304 17953 47740 -15057 -1093 -37003
7674 -37003 -17932 -27441 -16409 25095 -2249 10888 -44125 1162 -24670 -12949 30393 5173
7662 5173 25560 -29501 -12517 31160 -44714 5373 -14099 15324 -3815 12104 22758 -55047
7650 -55047 -9461 -9678 24095 8456 -18085 7332 3304 -7988 11161 6696 -38858 -6602 13725
7637 13725 9469 1700 -16645 -23083 -9634 -25243 -8556 -11733 -2657 8529 -42060 4595 -6497
7624 -6497 26621 93 17381 6191 -21304 -3823 36969 25144 -21094 993 -31281 4683
7612 4683 -16761 -20924 13549 -28847 15245 -9532 13585 -41913 34624 -41650 15664 6730
7600 6730 11936 5068 -12409 -8675 17524 1844 -3998 18443 -11327 9294 9413 -3011 -5623
7587 -5623 -56449 19367 29769 -23892 -21977 -7899 -8201 -13564 -45219 5015 10859 10207 21646
7574 21646 3550 -31243 29540 -5953 -25160 19313 -29979 5475 -56936 32928 -14261 25484
7562 25484 -14096 -15993 -28179 12875 31645 -26874 28935 -9658 -17530 -12259 -34468 4207
7550 4207 -10041 20964 10179 16474 40192 -25860 -12317 25896 -32742 24562 11226 -14498
7538 -14498 -5826 -26889 36392 -730 10899 2662 -6509 -27466 14817 -12594 -38184 40345
7526 40345 13962 29632 1100 -53187 268 28237 -10919 23693 22403 28460 -17934 29949
7514 29949 26502 34199 26075 30745 3258 19466 -9420 13620 42477 46006 50138 4024 18056
7501 18056 38894 54469 15885 17366 50896 50872 59716 67412 52628 26030 23403 58871 60328
7488 60328 -20994 35036 10916 48711 3301 40399 7300 41881 16001 26231 61037 43172
7476 43172 26446 35574 27269 58419 40810 -8037 33340 17954 25052 38379 61645 39948
7464 39948 -14766 6861 52113 8254 4931 22447 49324 -20461 3115 27866 19692 32346
7452 32346 37909 16826 -25552 -1027 3001 6054 41016 -30790 19284 -15030 54587 -29555
7440 -29555 44877 8731 5592 34053 37060 23721 10883 26193 57625 -2643 34804 37559
7428 37559 43860 57238 -8023 936 9809 38687 5823 19468 32017 -775 42715 27908
7416 27908 4689 3130 32043 58194 45478 35886 29260 5971 -13751 29201 -26312 28917
7404 28917 17094 24765 10834 50513 4718 25396 87322 31154 28866 55964 40824 48879
7392 48879 59938 22628 45195 38233 39956 55984 86710 22723 -11365 79124 56090 61198
7380 61198 30734 48515 25201 31558 38105 51886 40964 31562 39834 13754 18108 19899 17547
7367 17547 64498 28533 26605 10362 62083 39008 22730 44057 65471 44561 24568 97312
7355 97312 40355 24805 24349 73874 53027 67721 46213 61261 63467 105684 41956 53688
7343 53688 54919 68332 46132 81250 50284 32661 34248 52913 56598 73149 55496 56435 31904
7330 31904 79254 89396 69208 86867 42441 75127 99675 83875 87138 62473 56539 79105
7318 79105 81336 48307 68378 70034 70698 64104 84837 30060 71873 61123 68545 112492 71527
7305 71527 119190 94876 122128 97191 93509 108654 108696 83822 123381 53037 132019 94735 55984
7292 55984 40238 81004 104308 125186 109013 83428 98556 125471 170835 149268 131117 145647
7280 145647 149727 173424 169483 115523 143570 162181 148017 102365 127228 153618 140659 133018
7268 133018 184254 144406 160924 192573 111293 145081 198770 161516 145399 115891 190808 178534
7256 178534 169638 141860 178121 164488 174459 188579 193955 181990 193934 213742 239288 219531
7244 219531 230127 230502 240550 215982 206985 247202 288866 318541 311910 320947 319551 347036 303297
7231 303297 331766 349416 377027 396686 452487 459117 494004 503592 572534 590977 657728 681342
7219 681342 667726 710921 764491 814867 811148 846144 846276 841194 878955 883724 962171 991141 993000
7206 993000 1123140 1145678 1226291 1327631 1407173 1534919 1647534 1802245 1952268 2090895
7196 2090895 2155192 2217725 2263769 2253627 2184308 2113006 2045369 1929956 1783268 1722466 1606853
7185 1606853 1491889 1413723 1374028 1267810 1190493 1090352 1075655 1013506 990720 933486 920707
7174 920707 875999 862845 834387 727200 790097 751755 752843 695064 730527 699045 710767 698757
7162 698757 711611 661659 645783 660520 651444 655884 717626 703716 687467 693327 682966 701505
7150 701505 749292 753284 773997 834270 828144 881653 826912 898060 885160 885640 902332 858300
7138 858300 863121 825671 854469 834196 803331 813004 823219 764955 777550 692816 704551 676391
7126 676391 659582 632500 599530 582930 640579 615417 582180 588150 566083 541919 555531 574999
7114 574999 547118 538754 539174 509630 551234 532709 520096 523726 441587 499778 466537 491074
7102 491074 444614 435418 469222 466332 493413 468922 476711 441290 465106 491168 479837 493771
7090 493771 508953 472195 487628 455277 461211 454520 462731 423473 430732 395837 417677 388748
7078 388748 390058 344401 388864 383990 361998 416630 400453 427743 435420 376199 349607 394728
7066 394728 415221 407715 401589 397297 450458 432466 447854 384889 351641 396014 366504 399700
7054 399700 340577 368496 324388 348594 351160 376819 297119 332935 302075 303662 311371 287274
7042 287274 261471 333607 266185 258351 295527 256708 297827 298462 292924 267702 278068 243537
7030 243537 261370 263584 265000 249987 294246 273009 270507 231879 240611 269517 260724 260643 265268
7017 265268 257034 272445 252156 243480 270832 270567 284487 228982 257125 257604 246713 256749 221968
7004 221968 274133 245232 205127 210226 248580 232645 236078 252532 248253 238659 244803 227405 236932
6991 236932 257238 228693 245487 262485 252553 251534 230424 247113 244204 250170 288519 291601 259436
6978 259436 289581 296052 312943 339399 319068 313957 319895 355647 374771 389156 379053 387939
6966 387939 434398 485363 479339 528542 582192 565361 627917 599208 627001 675696 594463 601015
6954 601015 610446 565068 562066 585751 505168 527215 469620 447940 502557 445236 456775 420251
6942 420251 423681 437417 446500 406748 420408 392920 364461 393743 378932 371618 412777 350786
6930 350786 339403 344466 306541 322728 357552 313862 318780 286726 324996 311858 316061 298605
6918 298605 317109 255294 307193 319449 306644 322453 328334 347783 314947 305535 330929 334148
6906 334148 298874 297814 309079 389655 323107 345638 364893 294329 374986 353443 389712 353672
6894 353672 348048 359449 354598 315308 278648 354442 356048 317840 297934 275284 315608 327758
6882 327758 296292 344131 280096 309313 349819 314280 310297 335806 323902 335550 295154 294245
6870 294245 297275 280507 311151 301201 314185 278266 291582 303721 290774 250062 296059 295302
6858 295302 269411 280078 313908 291054 283492 283037 340284 372489 317357 373766 351357 329149
6846 329149 351350 365757 270077 311666 302916 279933 275881 255987 285252 266726 264879 293357
6834 293357 269201 234575 274046 252646 262816 258334 262883 260603 279795 324594 275303 266247
6822 266247 273219 247112 227535 234948 251957 271152 302645 315933 285550 270830 264579 235268
6810 235268 243746 213431 239502 234321 296853 285388 223512 251448 237136 214355 238900 263941
6798 263941 255842 238583 272889 272760 254171 306673 294164 283568 283636 318441 224600 243526 286221
6785 286221 267176 286866 292013 258659 264668 252660 274423 283904 217574 271839 227152 257394
6773 257394 260698 210672 276524 255901 218280 266601 260009 250787 285478 292670 279935 295160
6761 295160 320489 309216 292299 315181 275647 313461 265047 277837 280259 286325 325493 255237
6749 255237 250545 235971 320177 312966 268784 284595 248015 304203 231159 236242 306320 248946
6737 248946 266817 299385 308285 308160 277315 270102 309333 278778 303411 289071 301076 240943
6725 240943 295617 287698 246309 279144 240024 244930 261797 252728 253039 298636 256688 262904 280484
6712 280484 243899 259785 264865 265829 307138 256878 318920 277721 240840 305588 267531 284922
6700 284922 277880 273769 236936 292934 309136 291371 273150 255767 265556 264568 338670 324966 290416
6687 290416 269068 313147 324793 299847 320250 344759 366953 318224 348104 375727 328467 361132
6675 361132 344564 428970 406151 398096 419409 418083 384511 388684 425370 419178 395781 437269
6663 437269 469219 454038 489541 480776 482840 572659 535602 565422 622051 684934 711279 771440
6651 771440 844121 897058 1088651 1142877 1201840 1203647 1273239 1155615 1163864 1073576 1053800 966787
6639 966787 966056 936336 915834 911512 894712 885805 872076 973229 958410 986401 1040736 1072225
6627 1072225 1126962 1218004 1385907 1624539 1776651 1940466 2079920 2076356 2083358 2070401 1959342
6616 1959342 1906074 1749152 1640325 1569049 1522741 1419600 1411201 1378850 1330400 1338198 1288705
6605 1288705 1255355 1235544 1278449 1231600 1290812 1351691 1399207 1481393 1506799 1577429 1627422
6594 1627422 1646753 1622476 1638920 1622422 1630132 1599525 1531820 1521996 1479578 1496831 1450144 1405244
6582 1405244 1351219 1341799 1263954 1241388 1263343 1180693 1109179 1108987 1110947 1082476 1027347 1008366
6570 1008366 1028548 990265 1043096 1065171 1053775 1087298 1122127 1103748 1096789 1084625 1103497 1052736
6558 1052736 1056646 1014899 1026730 942309 907581 915458 903159 901710 813095 820125 804553 795389
6546 795389 772187 732756 809574 753834 749395 711034 719203 685942 682315 686548 699097 663063
6534 663063 666425 654840 633948 593845 628206 586497 585936 579528 570036 560692 553902 548691 527299
6521 527299 540457 535707 568287 574656 518684 519737 514633 528148 540428 513636 509811 517315 518362
6508 518362 519419 499071 539867 531403 500192 517596 493214 513610 523678 524368 569408 545551
6496 545551 526963 565422 516668 546469 533686 549156 557206 506121 508801 553369 571935 576941
6484 576941 602086 599148 537541 559505 538955 569240 591606 592738 623876 553788 591600 568039
6472 568039 585858 545229 595758 548788 600134 526494 525153 531146 544009 550652 563066 525224
6460 525224 598438 571686 554811 559854 606345 570612 614209 542674 554221 567947 567891 560523 594172
6447 594172 533878 575758 611095 595410 567744 554903 516475 560620 552888 550172 487334 521985
6435 521985 517250 492597 498615 472314 500802 467133 467383 471436 487263 479663 540343 519067 473417
6422 473417 480515 505899 485603 507425 533540 523066 506265 469382 511415 538015 527375 554543
6410 554543 518022 518369 494453 487254 468816 486843 468467 426492 481840 463915 471807 454494
6398 454494 514210 470289 475469 501186 469183 448362 414877 513560 439751 495946 480558 472067
6386 472067 488681 455817 503776 478902 508791 467331 536292 508647 482365 492451 462869 509897
6374 509897 500329 476519 479623 514169 492877 492027 482191 501425 480948 508673 482770 537847 492939
6361 492939 516352 529075 573556 548111 545541 540385 561234 589920 548868 623620 564831 569717
6349 569717 561788 549345 550718 589896 598992 601296 610428 560413 569874 591823 567180 604908 600688
6336 600688 625176 620816 584836 611661 627247 581864 615932 632506 640580 634458 632847 672519
6324 672519 734874 677075 694583 700630 720837 679872 729347 734193 711472 712604 742958 732629
6312 732629 710566 757262 768757 746605 770414 767482 785343 786509 843782 809783 832424 817713
6300 817713 875943 843124 864298 883145 878194 865853 906440 928566 937668 961471 902078 936736
6288 936736 990778 958190 1001576 996973 1012666 1008973 1100954 1067504 1101316 1083141 1212965 1235180
6276 1235180 1248522 1376778 1376311 1411760 1402811 1403994 1381261 1392245 1326613 1365414 1314052 1310557
6264 1310557 1324961 1346893 1315810 1359267 1328284 1388123 1362254 1324322 1384202 1353747 1407611
6253 1407611 1419131 1469005 1483398 1509538 1537851 1578050 1614345 1595849 1644807 1667518 1712314
6242 1712314 1702846 1754484 1781266 1774125 1823228 1863096 1926221 1942519 1952715 2021239 2094369 2083677
6230 2083677 2130392 2131008 2167627 2223313 2233492 2244911 2289612 2330990 2373795 2436225 2463852 2549503
6218 2549503 2642360 2677327 2715687 2854107 2914968 3079694 3194292 3363117 3542687 3681832
6208 3681832 3909163 4178055 4626452 5128707 5843021 6497042 7094202 7411984 7629599 7568728
6198 7568728 7390478 7008457 6673772 6290003 5941883 5637898 5455960 5247102 5160373 5121837
6188 5121837 5062926 5140955 5170337 5251993 5327107 5434152 5582781 5724270 5903963 6067739
6178 6067739 6215063 6437289 6639568 6936616 7192499 7539834 7813549 8184335 8595034 9047840
6168 9047840 9576942 10142051 10734720 11432362 12182596 13080563 14051329 15176682 16480017
6159 16480017 17926169 19641235 21579343 23797705 26345898 29263997 32788030 37001575
6151 37001575 42208514 48446227 55758193 63788363 71722507 78653852 83570231 85867262
6143 85867262 85392606 82323694 77285781 70831804 63775871 56511558 49574917 43302338
6135 43302338 37707202 32941711 28892526 25479734 22631816 20261321 18266211 16641474
6127 16641474 15204377 13998929 13014404 12148894 11391813 10689223 10146808 9628610 9175472
6118 9175472 8778551 8377919 8009077 7696607 7428768 7156678 6903969 6663569 6426837 6204114
6108 6204114 6040718 5839734 5635563 5449048 5293246 5213544 5006322 4919045 4740181 4668926
6098 4668926 4508635 4440066 4296882 4229510 4078115 3991236 3923096 3802114 3806227 3710130 3612065
6087 3612065 3513210 3409156 3352114 3295864 3228654 3189055 3120663 3030454 2955103 2937883 2808470
6076 2808470 2748765 2713664 2656540 2585849 2514129 2455273 2412556 2322699 2289416 2239363 2213852
6065 2213852 2161734 2136182 2101095 2058398 1976889 1968482 1912258 1906151 1860241 1858471 1792840 1771625
6053 1771625 1769574 1754645 1711452 1618030 1650527 1625113 1624946 1569009 1602668 1522691 1515218 1479494
6041 1479494 1469522 1503742 1462875 1455115 1431393 1356415 1345554 1349592 1351772 1306254 1309648 1264016
6029 1264016 1292576 1257577 1236242 1255008 1207229 1144179 1159353 1139171 1119847 1162528 1114560
6018 1114560 1110807 1093236 1123129 1040785 1126574 1119938 1053689 1072157 1069002 1136630 1103197 1097192
6006 1097192 1088598 1104769 1073220 1046017 1084539 1010318 1021749 937499 953624 897460 841330 841726
5994 841726 829503 829610 773856 790129 794425 785563 721602 759876 780048 733947 747563 738772 746908
5981 746908 731173 729984 776892 732361 731810 741502 780117 749805 728896 697734 660825 668950 685432
5968 685432 701549 650184 673177 659206 627962 646246 665566 638734 676082 658421 659284 687621
5956 687621 673870 672884 680289 678566 685952 674602 639812 675728 680048 650776 670487 662023 669474
5943 669474 649382 689096 640974 662619 616389 641597 624873 664727 662820 639093 674829 693112
5931 693112 671616 701343 677944 703229 714055 735575 710205 720522 683197 713865 682220 718385
5919 718385 673735 638947 673054 656740 644537 679582 643058 655555 697440 665829 644023 635252
5907 635252 642259 660003 675443 647023 678209 695071 655229 619143 658833 668434 653258 614357
5895 614357 664590 659664 677557 644082 608590 600308 592510 600432 627480 635959 640056 622839 592720
5882 592720 617542 591988 629729 619987 627253 624140 589389 591324 571500 570520 585764 580437 584352
5869 584352 596960 569128 569296 607020 588685 602841 550124 583543 612152 548377 585024 546819
5857 546819 591164 593385 554505 598746 579736 539555 556656 591427 550911 551396 571575 529452
5845 529452 590749 557528 547814 598551 594659 545915 577801 547166 543210 533426 557451 584902
5833 584902 557284 575774 587081 571347 569854 535172 601714 568568 574514 595900 630927 685482
5821 685482 749249 808143 872837 846392 857409 802758 804313 757479 759757 700458 656675 611829
5809 611829 602895 564778 504196 548221 483924 534292 515997 474655 491469 490775 526307 514841
5797 514841 501390 514474 513008 515659 517592 567182 513770 541653 490631 534653 482791 489487
5785 489487 492005 464433 494968 491451 460398 446912 464980 487762 479619 466023 441391 477679
5773 477679 440210 433078 509707 495213 463976 459832 469591 471382 475920 427266 489307 482974 420261
5760 420261 404187 494542 451870 427156 434758 455688 439768 454807 463039 430633 459694 440336
5748 440336 443150 426316 460759 456433 473593 434513 439432 449269 451542 450272 482341 479316 455199
5735 455199 490910 452174 446426 497966 459667 507322 468198 485893 470496 448919 492517 498888
5723 498888 506950 496120 510485 500746 525466 515328 527064 528001 496771 525146 500069 507769 507730
5710 507730 528163 535955 501802 542835 520537 532275 527003 548774 473622 531302 539890 546797
5698 546797 601595 575817 544495 551960 596253 589511 628233 562042 588485 604324 578802 608486
5686 608486 596079 602544 608084 576588 584860 613282 596148 612970 661329 648627 689801 668652
5674 668652 634202 679145 691633 630649 718008 704383 707348 717246 729449 723752 708167 735468
5662 735468 756459 795413 793661 745712 751427 761960 795114 764852 803288 742346 782446 759580
5650 759580 794894 762934 770378 775760 835223 833561 844014 883191 843139 850710 842761 883337 869293
5637 869293 930304 876066 881114 903137 902536 894209 904446 919111 924570 916039 921010 983834 968357
5624 968357 955373 975166 969484 947089 975648 951478 977060 1032538 1047591 1053166 1044872 1062909
5612 1062909 1042644 1054463 1023652 1079012 1113634 1145561 1138954 1097883 1145562 1204089 1210356 1244395
5600 1244395 1305093 1333033 1347934 1380384 1407294 1458299 1550876 1731920 1822839 1903274 1963329
5589 1963329 2055837 2117427 2229641 2449887 2612797 2710700 2793933 2860808 2893134 3036800 3167471
5578 3167471 3457608 3583998 3668725 3651269 3645341 3674272 3761481 3878092 3948392 3953237 3933907
5567 3933907 3854172 3740726 3630684 3635618 3565061 3506113 3405464 3232047 3082383 2951336
5557 2951336 2877432 2767603 2621714 2536205 2403084 2266664 2186623 2067035 1967794 1939541
5547 1939541 1903393 1798345 1765304 1760679 1787701 1766047 1764402 1731033 1757291 1740645 1801508 1850724
5535 1850724 1851307 1862373 1856261 1879492 1908399 1875817 1828557 1925488 1909392 1918817 1961128 1955351
5523 1955351 1965433 1980586 1945476 1971167 1971292 1959703 1984026 1988212 2002282 2044012 2052269 2060299
5511 2060299 2062516 2054164 2124365 2146528 2162058 2239877 2258713 2280349 2339395 2362321 2409713 2395671
5499 2395671 2330217 2424499 2399627 2372252 2421471 2402001 2432253 2439906 2380812 2407956 2485939 2419136
5487 2419136 2487554 2499493 2552048 2552518 2594709 2612204 2668476 2703455 2665170 2757433 2804930 2764035
5475 2764035 2852138 2844072 2848372 2877535 2948350 2968777 2956747 3032148 3038123 3106996 3152517 3180052
5463 3180052 3263513 3297810 3330223 3416548 3457334 3494089 3601981 3637114 3751265 3806877 3908627
5452 3908627 3999561 4180958 4464377 4885340 5383077 5817657 6100053 6215486 6233181 6096910
5442 6096910 5899253 5661380 5377027 5168817 4929184 4807487 4742238 4670778 4621209 4668383
5432 4668383 4614514 4696039 4726979 4751688 4809728 4786970 4937346 4948029 4996499 5072231 5193101
5421 5193101 5228890 5286604 5382525 5422338 5527796 5587855 5627452 5684990 5790176 5847874 5942405
5410 5942405 6105893 6122608 6203319 6244168 6384361 6462796 6520015 6655709 6719673 6813122 6921406
5399 6921406 7000829 7115687 7188100 7278672 7374167 7431115 7543852 7603294 7711583 7843340 7925048
5388 7925048 8026188 8141029 8210941 8338719 8460793 8555879 8654513 8816144 8922631 9014033
5378 9014033 9143213 9314406 9454823 9605175 9664917 9857994 10015288 10221723 10380463 10508559
5368 10508559 10654998 10873579 11090708 11269833 11495959 11701802 11913137 12110997 12424272
5359 12424272 12685930 12900698 13243448 13502862 13822655 14100347 14439868 14759666 15105762
5350 15105762 15564610 15942290 16300776 16729863 17227972 17725858 18261681 18891332 19557103
5341 19557103 20204162 20997885 21820184 22786176 23803744 25015635 26219673 27619691 29340865
5332 29340865 31840008 35802288 41274335 47041819 51267301 54494170 59128242 65531823
5324 65531823 76942339 92381328 107578273 118131196 125454540 131317678 138357428 151353045
5316 151353045 170678239 190956317 204276479 210320469 214408060 217937494 227617784 245293238
5308 245293238 264861464 277587114 280917500 278653876 274076425 271987087 275303128 280181528
5300 280181528 280017997 273146751 262461576 249620673 238353841 231309079 226916493 221000893
5292 221000893 210971077 198209817 183770689 169005539 155950629 144852474 134564408
5285 134564408 123704237 112340690 100988085 89664313 78785358 68761793 59760190
5278 59760190 51923602 45498110 40373070 36567277 33605618 31336475 29528026 28017559
5270 28017559 26771012 25731377 24846728 24073252 23397988 22706422 22115272 21601978 21118603
5261 21118603 20611506 20117106 19649799 19131859 18801546 18346250 17951917 17543309 17143744
5252 17143744 16775601 16363854 16049058 15702849 15360897 15034012 14712394 14402715 14092845
5243 14092845 13781869 13504736 13220684 12925393 12681468 12402832 12166816 11926052 11661070
5234 11661070 11438874 11195492 10951630 10728274 10484461 10335719 10135908 9891895 9733955
5225 9733955 9542105 9376045 9158754 9048162 8833562 8632193 8526750 8381448 8191968 8014969
5215 8014969 7945432 7751046 7621053 7437368 7330522 7225528 7096345 6936950 6856838 6747487
5205 6747487 6577200 6518106 6392939 6238041 6122142 6130459 5969253 5881361 5719526 5663625
5195 5663625 5589382 5424590 5358848 5224156 5159390 5104967 4935776 4887202 4787790 4689369 4621149
5184 4621149 4515587 4492377 4372607 4314311 4262917 4129798 4075691 4000946 3973015 3874551 3802647
5173 3802647 3739583 3669376 3589901 3536641 3441470 3393429 3338542 3285994 3198096 3144640 3055351
5162 3055351 3038972 2945793 2920460 2840371 2789991 2758142 2694960 2638422 2612409 2545995 2464333
5151 2464333 2448858 2372347 2348995 2282568 2231113 2208734 2140241 2152436 2068168 2035934 1981376
5140 1981376 1979369 1893371 1870122 1811379 1826682 1807834 1718210 1728885 1668952 1675001 1652397 1603732
5128 1603732 1557790 1556339 1502659 1501187 1445147 1466901 1444333 1363197 1369851 1305326 1306560 1246981
5116 1246981 1255771 1210276 1197070 1177497 1149438 1134561 1072976 1050358 1058962 1002623 1010326 987177
5104 987177 982157 962764 937765 916539 916507 927910 855043 851616 874773 815930 777965 740133 758741
5091 758741 708126 709609 694286 700972 659506 690686 682442 653007 626235 653751 576582 551442
5079 551442 576200 587747 557523 538199 518997 555141 528833 553353 505805 517443 515087 514268
5067 514268 514182 469706 474087 530898 504930 469339 554045 455124 498862 505000 548502 532476 567578
5054 567578 644758 672187 700649 773207 863919 967449 1068052 1093768 1172814 1197917 1289857
5043 1289857 1441085 1567570 1799615 1851095 1862938 1926059 2019620 2190551 2394260 2510606
5033 2510606 2554195 2588573 2613526 2629017 2675489 2766900 2776318 2692220 2648655 2550256 2431252
5022 2431252 2359173 2299845 2267772 2119157 2069255 1884644 1774556 1665328 1564223 1449975
5012 1449975 1337348 1139125 1055033 908580 737661 622619 499800 406764 354315 287937
5002 287937 290531 219916 198168 217539 172604 150704 125353 113798 160066 127860 66735 100291
4990 100291 90056 95347 69309 94023 49335 19746 40518 30516 50256 49616 24931 46438
4978 46438 31294 -1587 77491 1482 -7220 70281 17037 -6585 3505 -15704 12003 21270
4966 21270 -30107 6020 38476 -824 23645 24775 -51501 -41252 -9595 -17165 -25161 -39288
4954 -39288 -66460 -32164 -59899 -16864 -5320 -68538 -37563 -30792 -10978 -47190 -28821 -3131
4942 -3131 -54247 -65411 -17971 4197 -43042 -16755 -9245 -36290 -3782 -14182 -4749 -61290
4930 -61290 -77625 -54755 -26580 -18481 -53997 -4562 -37218 -26382 8455 4210 -12332 -14609
4918 -14609 -54856 6372 5291 -18365 -53398 8408 -18167 -9518 -67835 -48156 -22231 -37556
4906 -37556 -41269 -21886 -7859 -6130 -14663 9006 -7054 -13367 -30504 4245 12709 -15881 -14903
4893 -14903 -22421 -75178 1445 -11761 -5674 25143 -15800 4724 17396 -8933 26987 80
4881 80 7575 -9145 1867 -26107 -25590 -6012 2265 46195 -1268 -29240 -10133 -6136 1798 34932
4867 34932 -14811 -2422 11674 -1270 -1674 -2458 -3919 1536 42934 40077 -2651 -1178 15413
4854 15413 34313 20095 29619 48841 12600 57405 24685 51733 51010 25765 -5414 15311
4842 15311 14573 -7235 36756 1700 -26376 18455 2811 17428 11647 9056 3976 41565 17686
4829 17686 44482 37865 26849 49293 1627 26033 27198 18539 30021 19700 32880 65887
4817 65887 18639 938 14966 -1830 13531 58652 19141 -10276 -2900 33306 13249 49282
4805 49282 -5286 19081 88605 47181 36671 25349 29782 30953 -4707 44968 16781 3855
4793 3855 21533 8905 42965 -16021 12891 46591 1932 36543 11029 41225 61828 -12709
4781 -12709 68584 78241 49190 28220 86584 13648 16730 32869 56532 42977 57622 69780
4769 69780 47108 17422 50794 81279 60300 45735 14024 76909 27940 34209 5368 49207
4757 49207 64460 40184 126481 97232 75975 85550 132492 68867 63629 97883 109997 144087
4745 144087 138895 149224 197696 101719 135716 143488 108719 148881 98887 96082 130651 103542
4733 103542 91286 62361 60195 52755 111283 135446 95475 107005 109609 121633 154351 125725
4721 125725 98610 124028 178106 115733 103755 120786 99172 97058 119585 114968 111750 66314
4709 66314 138424 142378 87557 152818 148878 153838 127093 171334 124982 161003 151039 169330 150720
4696 150720 164110 178993 156755 126611 110716 137230 136403 139931 112200 102684 165186 132443
4684 132443 161015 158541 124604 138926 188631 158552 195855 153950 172349 175939 193734 190753
4672 190753 197829 225394 190885 239431 229856 175446 232838 190706 242475 224995 255886 240560
4660 240560 228474 255394 290805 275640 277189 304635 296657 300661 272949 289762 300497 331695
4648 331695 320942 295837 307466 322204 352116 368034 357532 333741 353062 381277 427615 422009
4636 422009 402040 434676 486604 538584 493666 525807 532286 484985 513780 528196 455508 504068
4624 504068 519935 516642 504561 534809 482062 516304 520703 533755 530510 585569 605410 628473
4612 628473 657800 648818 725559 676612 785982 761472 745230 777219 779458 783573 743098 797621
4600 797621 770684 733053 713015 760666 731155 728399 735930 696564 705829 723466 748519 782349
4588 782349 763141 791889 796457 815963 850671 850542 901130 932056 941197 906796 922170 952738
4576 952738 939008 945119 935228 897572 870224 900964 862114 856085 826675 831787 865012 824324
4564 824324 877793 853295 828577 831285 870378 858757 901625 901416 933522 988395 1005905 1004745
4552 1004745 1030210 1027885 1011595 979354 1027280 971097 976737 916767 926546 946563 922136 930030
4540 930030 973544 939495 960689 1008503 985326 1036658 1058794 1086702 1064976 1155115 1211896 1244166
4528 1244166 1299962 1358141 1337089 1441305 1440447 1470317 1418665 1464696 1442236 1439956 1462068 1446209
4516 1446209 1471578 1440583 1390163 1385092 1362871 1359810 1401903 1356915 1422949 1454200 1483945 1532471
4504 1532471 1576954 1664704 1811913 1915562 2016549 2115036 2214471 2209641 2228456 2130899 2072622
4493 2072622 2007953 1973547 1859679 1801159 1763017 1706802 1722143 1708449 1663191 1639901 1647744
4482 1647744 1703325 1825917 1880275 2061816 2236794 2473341 2641098 2781020 2884673 2961312
4472 2961312 2999032 3095215 3039564 3043600 2934598 2835829 2653809 2489921 2338997 2209716 2058548
4461 2058548 1974928 1871610 1797349 1756220 1730006 1678982 1640179 1645303 1667347 1686905 1755064
4450 1755064 1753216 1849783 1832197 1868763 1919768 1948026 1922808 1907947 1861387 1880893 1843233 1812385
4438 1812385 1765631 1740015 1676501 1668616 1687104 1645905 1669245 1641323 1619266 1617572 1629108 1614999
4426 1614999 1661892 1632400 1677138 1712559 1717534 1766226 1810074 1820067 1907831 1964499 2033028 2139344
4414 2139344 2185762 2240192 2268608 2261569 2230511 2182189 2066792 2032086 1937744 1880140 1793096
4403 1793096 1747849 1704064 1706726 1636045 1620946 1582573 1520044 1511947 1527278 1503942 1499045 1530214
4391 1530214 1515681 1486286 1513341 1494208 1543307 1581241 1569332 1597787 1663335 1710638 1807305
4380 1807305 1874428 1925439 2021701 2026831 2083361 2136236 2150699 2173019 2202143 2248657 2287014 2406283
4368 2406283 2603903 2962114 3450056 3979997 4513607 4859671 4993166 4863779 4618992 4201413
4358 4201413 3789371 3378815 3074119 2725750 2468536 2308771 2143335 1999692 1893151 1791545
4348 1791545 1718295 1677104 1637689 1591245 1568472 1531612 1557173 1542124 1530292 1591088 1608732
4337 1608732 1663434 1706070 1758816 1839547 1919255 2102710 2230893 2358229 2468608 2444507 2412206
4326 2412206 2346437 2250438 2197475 2070343 2033374 1952606 1906250 1891574 1875267 1876778 1899238
4315 1899238 1873411 1951399 2019336 2204285 2411656 2607702 2845754 2899430 2909583 2871477 2772690
4304 2772690 2703565 2558252 2520293 2490029 2524817 2713413 2888572 3113293 3201504 3221521 3250913
4293 3250913 3104589 3052134 2900615 2791398 2706694 2662735 2684237 2625350 2670540 2748899 2862322
4282 2862322 3022937 3090864 3243889 3371635 3547581 3999616 4823025 5775029 6495859 6777534
4272 6777534 6855585 6472784 6025364 5507957 4920268 4385571 3956738 3596825 3400258 3186387
4262 3186387 3067350 3030603 2941255 2894912 2914438 2942253 2946899 2959371 2925072 3016339 3040360
4251 3040360 3035572 3107836 3148585 3157159 3177228 3236169 3239990 3296350 3319035 3347599 3323811 3318670
4239 3318670 3299655 3315680 3284790 3224619 3235809 3195680 3204699 3140638 3087944 3030066 2983908 2957676
4227 2957676 2934024 2885800 2931129 2995924 3029249 2969272 2870971 2844307 2763374 2673108 2586620
4216 2586620 2484074 2422287 2368739 2288558 2254139 2166982 2085854 2018199 1968478 1872183 1835600
4205 1835600 1814299 1723840 1707797 1694538 1685909 1718493 1835269 1810695 1805682 1756496 1730209 1717689
4193 1717689 1664390 1623235 1630404 1639963 1551135 1609493 1520923 1436395 1427126 1362147 1331228 1289991
4181 1289991 1242833 1283705 1234951 1234845 1196975 1219239 1161618 1144855 1213412 1158185 1118501 1137227
4169 1137227 1099196 1108627 1060845 1084959 1088832 1047913 1094458 1024140 1012989 1048789 1051583 1044353
4157 1044353 1056800 1020992 1065427 999688 1030237 1023465 960335 1008072 1010425 984154 1016299 1000966
4145 1000966 989164 921526 984615 993410 967194 971213 971977 997168 992975 1006195 1026977 961687
4133 961687 1017228 979526 1021252 1017770 1039033 1036652 1039545 1002773 1032756 1042854 1044914 1046090 1011042
4120 1011042 1054828 1040738 1057332 1065361 1035468 1040303 1053991 1063708 1047800 1014551 1073201 1030388
4108 1030388 1047989 1066461 1067421 1044355 1088453 1078675 1104396 1072237 1093841 1111158 1140832 1118721
4096 1118721 1111288 1179258 1162284 1176851 1158036 1218391 1172365 1124893 1194382 1155521 1180342 1169295
4084 1169295 1177049 1204119 1234437 1225239 1224142 1177604 1233697 1256008 1299077 1276231 1283064 1310727
4072 1310727 1354779 1345708 1353437 1355693 1377775 1465221 1401414 1463580 1494300 1474012 1547398 1563463
4060 1563463 1620065 1660465 1707587 1776487 1802463 1849471 1880598 1861649 1919047 1878193 1976976
4049 1976976 1971656 1966093 1997305 1982068 1984299 2029668 2075949 2095667 2096285 2119922 2198963 2223344
4037 2223344 2300060 2278973 2358207 2451597 2490892 2533329 2598384 2693398 2750708 2777552 2809879
4026 2809879 2845025 2888240 2987719 3080629 3171041 3235084 3266802 3378675 3448632 3534284 3596141
4015 3596141 3727795 3899680 4143362 4694061 5334625 6219214 7072626 7635924 8028973 8070190
4005 8070190 7984106 7687401 7366602 7059096 6751524 6461412 6246769 6066448 5945033 5838243
3995 5838243 5864429 5981004 6105050 6227351 6320852 6351572 6406799 6479891 6763199 7235154
3985 7235154 7846390 8413269 8764142 8845186 8739282 8478784 8063987 7643950 7271253 6954459
3975 6954459 6705415 6509890 6420759 6334474 6255403 6281398 6295078 6394847 6368723 6388012 6348630
3964 6348630 6265585 6087880 5945910 5763281 5559706 5360202 5176242 4935731 4762124 4619288
3954 4619288 4381340 4234643 4131696 4020971 3919924 3931770 3922755 3915082 3870078 3864733 3915353
3943 3915353 3844290 3799311 3751979 3713731 3715548 3586545 3592639 3529012 3478364 3371030 3263819
3932 3263819 3178293 3069347 2939708 2842455 2708738 2601351 2535760 2415959 2306654 2313405
3922 2313405 2230911 2220403 2133028 2090868 2042610 1947889 1926128 1926665 1864769 1871987 1824744 1787502
3910 1787502 1710148 1713925 1662896 1598395 1579317 1548635 1526940 1494829 1430471 1444686 1398961 1379292
3898 1379292 1397100 1355155 1339526 1285417 1281780 1305131 1235079 1201093 1205943 1188237 1130869 1126903
3886 1126903 1066959 1096548 1093910 1063108 1081563 1027770 1000199 1010859 987266 946127 973868 931395
3874 931395 929236 938463 908906 897869 827981 835609 815058 823603 865311 806051 805914 780825 776930
3861 776930 778184 774562 736582 778864 725973 753432 747436 756199 729019 708739 723407 727983 652895
3848 652895 662033 690715 672104 644737 690953 684353 644091 627896 664854 643901 682530 659559
3836 659559 678219 632087 631421 615777 625151 611192 649980 570782 624129 599120 592766 591082 604593
3823 604593 621908 565751 611839 577074 606425 598590 569214 600288 570012 608704 578215 597192
3811 597192 607334 614528 604012 633963 632090 661120 668405 692047 727067 721556 792235 834142
3799 834142 862361 924744 922587 984989 1007778 1021180 1041798 983981 970083 913243 920338 892983
3787 892983 841283 817123 805654 781981 799114 773180 803092 804799 812139 871407 906606 951761
3775 951761 979505 1024282 1167050 1175363 1297980 1378411 1441614 1469485 1519498 1494368 1440988
3764 1440988 1370717 1290869 1225970 1163354 1066674 987338 911531 883248 841243 763507 845090
3753 845090 713555 714567 730167 645767 725884 747237 728579 756964 768507 787028 857091 863654
3741 863654 883765 918017 950131 946720 959517 917800 870556 785404 739205 729780 703171 648208
3729 648208 577856 569921 533500 498768 509668 509019 451414 453788 437679 388777 414411 418059 382501
3716 382501 382400 427788 418529 347256 419071 352065 365496 364163 297954 341673 301644 306433 267387
3703 267387 255159 270034 270676 254430 227186 211034 217615 165875 242675 244168 203790 210212 241001
3690 241001 233167 177339 183795 153548 174264 143622 194255 127975 152034 174440 127152 137507
3678 137507 144013 116363 103019 151411 110678 123015 131798 145421 102300 125450 133614 83934
3666 83934 126346 112265 95149 64875 97512 80759 89915 80290 132918 48060 76701 76651 82531
3653 82531 101813 52857 50334 92109 95963 68903 64005 81871 44130 90899 25584 31212 49067
3640 49067 12340 82990 58366 1590 61479 37616 34924 57189 23298 31856 19214 23208
3628 23208 10387 15949 51621 2869 -25850 -23078 -15623 -1161 65816 17920 -25720 -29103 -18705
3615 -18705 22369 -8554 19695 29019 1538 15780 -20901 -4153 43752 5 -10863 4911
3603 4911 -5778 -14394 20522 3093 16531 -2323 -10490 -6447 40135 -57281 18451 -33363 -13831
3590 -13831 -13661 275 32261 6366 -18179 -23560 -9907 -32023 -27675 -6006 -56448 -39940 -65513
3577 -65513 -32716 -37679 -38188 -29627 -41551 -15658 -45599 -35911 -40568 -82030 -52585 -57077 -19119
3564 -19119 -40618 -22664 -32950 -8871 -42048 -46346 408 -28113 -15191 -10804 801 -50515
3552 -50515 -45550 -49943 -28940 -51946 -25550 -57558 -42284 -34235 -43972 -55098 -107922 -34854 -16809
3539 -16809 -77746 -32094 -59079 -10923 -37698 -35985 -49250 -29522 -41452 -27199 -30906 -85981
3527 -85981 -46907 -45491 -64314 -40096 -12694 -59017 -27006 -53727 11474 -27148 -37627 -47575
3515 -47575 -9723 -48205 -70704 -19694 -38384 -27192 -32476 -81967 -70617 -87663 -31249 -91467
3503 -91467 -52728 -57256 -61046 -48783 -70374 -48947 -74230 -62004 -50911 -73518 -41151 -64321
3491 -64321 -27165 -70636 -64218 -46521 -27605 -57897 -77241 -66054 -47515 -71337 -102882 -98291
3479 -98291 -91960 -59449 -80356 -82671 -60431 -47674 -55095 -39704 -22295 -46731 -65712 -64492 -26334
3466 -26334 -26795 -62019 -42860 -52949 -98137 -46586 -24772 -93620 -16851 -41427 -105760 -66866
3454 -66866 -87809 -62193 -71796 -95463 -80304 -47384 -27940 -38025 -7170 -43939 -48525 -92959
3442 -92959 -110280 -73629 -55494 -101465 -111124 -65834 -97867 -33614 -51073 -82891 -91624 -46932
3430 -46932 -95305 -115877 -83991 -69691 -102245 -85286 -77841 -46255 -45589 -45431 -87749 -67755 -93174
3417 -93174 -93813 -105199 -39670 -59052 -71820 -12530 -74423 -109322 -44973 -55954 -42551 -70374
3405 -70374 -45694 -28165 -64803 -85262 -72422 -29672 -74091 -63201 -105561 -84121 -110767 -109486
3393 -109486 -89759 -104660 -107753 -89418 -76252 -88882 -112299 -64565 -101789 -44504 -96375 -67152
3381 -67152 -116937 -84989 -133090 -101398 -90244 -108016 -71753 -103149 -135013 -84443 -25943 -101013
3369 -101013 -64166 -78720 -112143 -72156 -101995 -84688 -84369 -112691 -47826 -74983 -87141 -95105
3357 -95105 -54961 -62673 -101926 -78155 -74641 -139759 -93617 -78045 -79137 -30930 -90705 -54444
3345 -54444 -83158 -24983 -52458 -75786 -66485 -88320 -49679 -53830 -100448 -66299 -60869 -112020
3333 -112020 -88501 -103428 -83637 -90381 -90757 -62221 -97426 -80557 -65162 -92051 -23844 -111682
3321 -111682 -12941 -72215 -29665 -58120 -120526 -44628 -51148 -23006 -60885 -68527 -82624 -49276
3309 -49276 -60388 -36791 -78192 -6753 -1435 66426 104082 182225 163638 211758 134065 160518
3297 160518 42338 90699 21572 900 -16745 -67999 -58231 -64912 -85538 -61540 -65098 -52625
3285 -52625 -56405 -34053 -122750 -102059 -72062 -146475 -69803 -55342 -78072 -79680 -99409 -116017
3273 -116017 -18939 -108675 -71774 -82616 -87628 -86263 -90868 -97662 -72230 -78044 -78101 -111512 -81204
3260 -81204 -97709 -108782 -33969 -119367 -56352 -82120 -87480 -16306 -92691 -111564 -52060 -96461
3248 -96461 -78897 -123711 -111777 -92386 -96523 -110663 -66422 -81810 -73509 -70633 -67952 -119174 -67384
3235 -67384 -91393 -99476 -123250 -97304 -72820 -93131 -77137 -21006 -138950 -88217 -106473 -104124
3223 -104124 -44784 -93830 -90150 -110959 -117527 -94711 -81379 -99782 -125383 -142530 -125999 -96232
3211 -96232 -105679 -62952 -47392 -88317 -72077 -54431 -96514 -80977 -139157 -87497 -105857 -80408
3199 -80408 -61177 -118149 -85642 -76658 -130101 -141118 -60644 -130463 -107787 -90002 -112337 -84974
3187 -84974 -117556 -145382 -94369 -93384 -49520 -101800 -70236 -86893 -59214 -41358 -101572 -96440
3175 -96440 -69874 -71021 -95355 -77002 -71401 -74341 -95109 -70444 -77174 -55448 -99143 -141148 -121195
3162 -121195 -107152 -106194 -103051 -110092 -104867 -78860 -81821 -79485 -88198 -86568 -85885 -121469 -147908 -123982
3148 -123982 -126285 -98620 -108818 -90119 -77751 -92334 -73328 -94807 -72451 -69147 -65021 -102502
3136 -102502 -113709 -92535 -58042 -114925 -104130 -102861 -90751 -59534 -60519 -109852 -105862 -122689
3124 -122689 -72237 -122322 -129734 -104638 -96927 -90920 -73582 -112817 -60295 -77269 -112986 -107195
3112 -107195 -92767 -121103 -69387 -81795 -77301 -66525 -106119 -92658 -128376 -109619 -99839 -144144
3100 -144144 -122337 -145198 -86233 -122755 -110720 -105734 -95192 -88284 -84345 -112154 -115642 -83942
3088 -83942 -92319 -98292 -132269 -84433 -114357 -110285 -93079 -121473 -65122 -76614 -115313 -114421 -97719
3075 -97719 -89624 -87123 -116254 -91964 -92800 -57486 -122001 -107637 -112700 -62662 -93344 -62155 -84899
3062 -84899 -89562 -82941 -84819 -109172 -126251 -95386 -121659 -108057 -90509 -84802 -126030 -89788 -94805
3049 -94805 -133969 -91673 -109662 -68899 -83254 -82008 -99643 -107291 -139349 -81040 -115106 -91345
3037 -91345 -96518 -71921 -164305 -97191 -68642 -93504 -96151 -99779 -147106 -74766 -71644 -80016 -63580
3024 -63580 -92494 -109887 -113488 -129281 -109191 -47818 -50643 -81839 -95252 -79736 -109257 -155871
3012 -155871 -88087 -70883 -123011 -92532 -106216 -100925 -118671 -123730 -84900 -75583 -69614 -127034
3000 -127034 -90142 -118054 -103121 -111634 -129061 -80441 -93911 -63922 -106013 -101311 -123422 -82279
2988 -82279 -90633 -88134 -89506 -63408 -75053 -103033 -114127 -100185 -94541 -76215 -84366 -114102 -68925
2975 -68925 -83934 -71324 -98608 -110889 -121001 -114667 -87320 -110127 -98108 -60923 -90789 -115532
2963 -115532 -63451 -94648 -78716 -66284 -93296 -132490 -127900 -117579 -121279 -102034 -101199 -87077
2951 -87077 -96920 -95181 -87694 -97150 -93048 -118979 -86264 -91534 -95126 -71388 -131913 -101177 -136756
2938 -136756 -94055 -77739 -93775 -97430 -99803 -83777 -89080 -109189 -102164 -78035 -88878 -95158 -119133
2925 -119133 -101298 -116005 -81971 -109837 -67560 -83681 -97079 -59610 -82567 -71717 -55350 -118984
2913 -118984 -80244 -100643 -122332 -113025 -107981 -99328 -76868 -104512 -106359 -94795 -63780 -79526
2901 -79526 -111327 -96385 -48078 -80176 -120246 -95033 -100589 -66884 -113462 -50835 -88964 -81008
2889 -81008 -107115 -82238 -85761 -79039 -72383 -78958 -87570 -89867 -59410 -95949 -68608 -106547 -142084
2876 -142084 -42718 -78183 -59313 -159467 -92575 -47649 -112548 -83337 -72193 -104764 -71674
2865 -71674 -77947 -40765 -80851 -40598 -78469 -31117 -51783 -109644 -91340 -72944 -52042 -105025
2853 -105025 -43553 -103396 -106944 -50698 -61350 -112181 -59837 -48569 -124143 -55623 -86789 -74358
2841 -74358 -117585 -58758 -79910 -42767 -96937 -61657 -103936 -91957 -108194 -67816 -33036 -76896
2829 -76896 -84104 -59139 -84491 -77328 -112149 -104682 -47921 -87980 -118944 -93277 -92328 -98826 -89906
2816 -89906 -131039 -84379 -129133 -136842 -97849 -118094 -85690 -92842 -87706 -119210 -102587 -102941 -74555
2803 -74555 -99336 -42977 -80219 -115498 -63874 -80972 -89048 -103326 -76220 -70690 -95533 -104115
2791 -104115 -72426 -110824 -122639 -88411 -69373 -92771 -70058 -76256 -99619 -65859 -55810 -80619
2779 -80619 -98848 -72415 -67281 -107443 -136879 -118578 -134408 -106698 -99735 -133666 -118771 -111776
2767 -111776 -90844 -110476 -77749 -97059 -57603 -62031 -68610 -96617 -116975 -118566 -120196 -51274
2755 -51274 -42456 -135726 -91086 -81563 -101220 -78911 -85733 -85144 -62010 -112637 -61661 -121559 -138438
2742 -138438 -124371 -83748 -87726 -87399 -102979 -120806 -86351 -64348 -105739 -135724 -107109 -70848
2730 -70848 -121893 -92898 -123005 -80660 -117566 -92697 -125790 -56546 -86370 -103980 -87799 -93878
2718 -93878 -84838 -69048 -120568 -103522 -74321 -114350 -88982 -99014 -53586 -85341 -139205 -87057
2706 -87057 -72077 -113947 -60977 -121207 -89876 -121740 -139336 -131746 -92992 -113189 -58420 -82479
2694 -82479 -69805 -71894 -124787 -85544 -108869 -103660 -111920 -107991 -100953 -99111 -95543 -101783 -105617 -122357
2680 -122357 -109222 -95000 -137203 -97401 -116900 -96881 -99786 -101653 -66568 -88685 -146831 -117106
2668 -117106 -138238 -104149 -106347 -101096 -91320 -110497 -107135 -103475 -88167 -71512 -47057 -125077 -106444
2655 -106444 -84379 -106112 -127819 -90453 -92544 -94472 -114314 -110094 -108011 -141627 -150984 -83005 -122820
2642 -122820 -119323 -112787 -115385 -62391 -100058 -122057 -79212 -85182 -109700 -129412 -115135 -122650 -100652
2629 -100652 -118893 -138048 -93557 -124012 -82368 -100527 -91393 -129306 -127216 -112006 -101214 -115570
2617 -115570 -104040 -92193 -79910 -110260 -137873 -102558 -103735 -107904 -86569 -122522 -125107 -61243
2605 -61243 -94633 -114860 -100419 -102774 -143368 -120722 -179029 -102291 -110673 -105744 -120284 -66716
2593 -66716 -123128 -71392 -82115 -126229 -91244 -81584 -113186 -129232 -122414 -52324 -142079 -151257
2581 -151257 -92544 -110370 -88412 -110592 -105003 -84893 -96062 -63880 -75116 -129760 -102983 -78807
2569 -78807 -122389 -133421 -58087 -81429 -89394 -96658 -83809 -120228 -89237 -127209 -96683 -64562
2557 -64562 -122637 -53894 -154949 -119888 -105501 -99037 -80903 -60035 -85275 -116470 -65312 -68927
2545 -68927 -122136 -79346 -89181 -111698 -100417 -135555 -114974 -97128 -82034 -160678 -102489 -121207
2533 -121207 -105603 -59357 -76158 -95864 -78315 -66577 -110658 -126084 -77558 -86358 -145141 -113082
2521 -113082 -87181 -84832 -109006 -68469 -93654 -125326 -90118 -75278 -127438 -71558 -87779 -49800
2509 -49800 -98240 -66934 -65291 -119435 -110229 -83593 -89041 -123448 -93768 -95182 -119151 -134320 -73598
2496 -73598 -117043 -142662 -92604 -86207 -67037 -69113 -89006 -126710 -104325 -109759 -110866 -73460 -59637
2483 -59637 -97190 -72367 -104893 -110059 -86308 -145195 -118447 -116866 -100770 -79909 -154841 -119654
2471 -119654 -139300 -111094 -78062 -102843 -74224 -102394 -131560 -66640 -75351 -95229 -91389 -93176
2459 -93176 -72654 -92532 -101518 -73815 -84450 -69655 -68971 -78719 -57581 -124093 -107955 -61515 -94793
2446 -94793 -93834 -107183 -95093 -139317 -76113 -97277 -67168 -124438 -110585 -106878 -92055 -112314
2434 -112314 -112813 -87503 -114616 -26414 -122926 -100849 -102919 -93657 -82346 -68293 -121953 -126682 -133166
2421 -133166 -93816 -106283 -60298 -109983 -116548 -119528 -90013 -90197 -119062 -96957 -110716 -106699 -137988
2408 -137988 -69718 -100123 -80414 -52604 -114538 -78945 -134172 -87393 -127865 -91693 -149649 -133954
2396 -133954 -96336 -92223 -74445 -93168 -137335 -88497 -74042 -85198 -47185 -73124 -74511 -96950
2384 -96950 -113666 -120244 -82621 -127070 -89629 -106700 -138214 -61901 -130920 -85773 -90001 -113197
2372 -113197 -77033 -116251 -95140 -107012 -127389 -84012 -78978 -43332 -134550 -109903 -88113 -87479
2360 -87479 -79774 -100611 -74572 -117774 -106026 -73779 -87806 -93771 -102681 -72745 -86966 -109959
2348 -109959 -84956 -124323 -107390 -140081 -68812 -118902 -104054 -106565 -76908 -101567 -103705 -118886
2336 -118886 -103315 -113075 -99596 -106040 -191449 -128994 -90061 -100296 -118365 -134528 -51202 -113873
2324 -113873 -101079 -116276 -128383 -86502 -73960 -107995 -137846 -63465 -120805 -40999 -102152 -49876
2312 -49876 -68989 -102915 -93527 -84145 -104786 -107721 -87720 -97755 -35454 -90233 -108489 -115065 -130541
2299 -130541 -81854 -114355 -134196 -83964 -74447 -134332 -104158 -79186 -97655 -102678 -109175 -73790
2287 -73790 -76757 -63839 -94795 -116855 -108262 -101194 -48601 -96961 -89645 -65936 -104727 -104464 -60492
2274 -60492 -74601 -115874 -116510 -131738 -118451 -124642 -113488 -78297 -57501 -85900 -71298 -56528
2262 -56528 -94926 -91954 -82565 -110761 -81029 -117536 -84150 -102332 -78891 -84140 -86179 -133197 -129166
2249 -129166 -104599 -110076 -111094 -60919 -111431 -110249 -100696 -117957 -46217 -111764 -107794 -105339 -92254
2236 -92254 -116726 -106365 -118822 -89670 -113974 -88902 -33634 -108746 -62189 -132333 -138085 -81926
2224 -81926 -98884 -91227 -127872 -112801 -77224 -65269 -77527 -109535 -93893 -92082 -121522 -117629
2212 -117629 -60387 -60726 -51285 -85489 -77125 -112671 -110344 -106687 -90104 -72201 -96520 -118707 -106194
2199 -106194 -88351 -107435 -100092 -98158 -91952 -66417 -91156 -89724 -92032 -101377 -79988 -53713 -99304
2186 -99304 -92516 -95520 -80313 -106862 -115755 -86220 -140255 -89554 -98378 -92165 -125694 -95844 -83966
2173 -83966 -95682 -101098 -79848 -66096 -92283 -104557 -83657 -70658 -152617 -102141 -85925 -73819
2161 -73819 -59619 -98547 -80976 -68269 -112999 -117976 -102127 -127276 -145916 -49270 -125079 -121588
2149 -121588 -89145 -102686 -125535 -85599 -82444 -97386 -62222 -119360 -134892 -65391 -83518 -65858
2137 -65858 -94136 -107243 -92384 -69493 -80986 -76085 -89853 -123309 -144647 -105499 -79974 -121005
2125 -121005 -86054 -99914 -99296 -82500 -75370 -114968 -89538 -121105 -121382 -93291 -83493 -81377 -53247
2112 -53247 -105469 -103850 -80931 -67596 -55532 -95447 -125201 -84413 -72511 -90957 -73851 -126223
2100 -126223 -106129 -60321 -84388 -164408 -106141 -68502 -118562 -125200 -120379 -82534 -89400 -74434
2088 -74434 -106251 -57031 -106272 -109443 -106863 -115477 -129794 -110459 -68500 -107730 -96868 -102807 -86135
2075 -86135 -59950 -102007 -59576 -53972 -83368 -69062 -63050 -86858 -86337 -79341 -86607 -98799 -90864
2062 -90864 -106953 -81719 -117489 -111657 -110246 -100535 -86648 -125287 -111982 -150230 -73954 -50759
2050 -50759 -103710 -55518 -120173 -98159 -95342 -91967 -72260 -92060 -94241 -72667 -56221 -98196
2038 -98196 -88103 -72455 -73421 -83170 -77834 -82682 -91507 -119597 -96797 -128640 -76572 -77751 -118324
2025 -118324 -156616 -98101 -136749 -122567 -98852 -144662 -108849 -101221 -82043 -77683 -38879 -101401
2013 -101401 -92273 -88821 -95429 -150147 -95941 -60477 -97835 -72492 -137759 -85934 -72023 -120871
2001 -120871 -74928 -92347 -127877 -135124 -66356 -130046 -90609 -91440 -93013 -76587 -84169 -120711 -97945
1988 -97945 -111577 -124355 -86622 -105900 -91872 -76370 -105272 -109984 -107409 -84864 -75163 -87713
1976 -87713 -97332 -70066 -97272 -75790 -55111 -53606 -80893 -118622 -61431 -64970 -82046 -104967
1964 -104967 -95304 -97092 -95991 -64278 -107746 -149227 -153701 -136045 -99812 -83275 -96931 -128541
1952 -128541 -84546 -81115 -91992 -100624 -50233 -98361 -71844 -126571 -115230 -116589 -91074 -95979
1940 -95979 -76403 -92345 -72512 -56681 -109025 -117162 -106227 -50028 -87884 -110065 -141915 -56062
1928 -56062 -107586 -60098 -107170 -103845 -64381 -84331 -107504 -89277 -111526 -116904 -147440 -92943
1916 -92943 -112150 -89172 -61831 -75868 -146192 -101205 -126315 -92054 -93044 -89258 -50978 -74858
1904 -74858 -106942 -80365 -83619 -113570 -127902 -127407 -90631 -79329 -91638 -101646 -70170 -106361
1892 -106361 -84168 -83571 -82967 -58022 -107922 -108654 -83267 -96451 -116930 -137882 -60785 -94089 -95372
1879 -95372 -85751 -129524 -72616 -72029 -126074 -88906 -107577 -74217 -75237 -120035 -88732 -133085 -93558
1866 -93558 -67163 -6992 -88579 -93274 -111471 -69999 -96698 -98806 -52691 -73583 -138804 -87629
1854 -87629 -93163 -117680 -113706 -101797 -89992 -108246 -80158 -128001 -102824 -78818 -112894 -124757
1842 -124757 -108344 -123662 -109907 -130695 -101919 -90324 -141406 -72985 -73162 -80585 -85877 -56004
1830 -56004 -110113 -69412 -113136 -44667 -121789 -138921 -105390 -91128 -101238 -81349 -80144 -108468
1818 -108468 -44955 -120285 -69715 -164076 -74914 -154313 -141205 -82869 -83810 -125661 -83792 -77019
1806 -77019 -95204 -102827 -52855 -107946 -81947 -93279 -107832 -78452 -98340 -60832 -93588 -105977
1794 -105977 -70116 -64515 -59884 -90036 -134235 -113693 -92321 -72262 -83334 -79258 -78726 -128118 -108990
1781 -108990 -89299 -115948 -109577 -103759 -116422 -88463 -103546 -84983 -106717 -132847 -96084 -70190
1769 -70190 -83526 -58769 -132516 -66155 -96408 -69653 -89301 -75179 -68415 -102329 -85611 -104113
1757 -104113 -125786 -48716 -65211 -110450 -142016 -118615 -73438 -98758 -97515 -68408 -72935 -60986
1745 -60986 -108434 -67945 -72272 -81957 -97140 -117525 -84786 -71481 -103732 -95373 -99090 -70832 -113142
1732 -113142 -83121 -77717 -100462 -126979 -116367 -140204 -88146 -129585 -117828 -74350 -78489 -78228
1720 -78228 -89183 -119299 -112318 -115639 -63311 -103953 -61230 -110368 -101805 -80877 -79655 -59960 -51057
1707 -51057 -145911 -105718 -109921 -143609 -61499 -42397 -60714 -77162 -97976 -77251 -72541 -62942
1695 -62942 -71217 -89362 -72580 -80350 -92517 -145810 -95679 -80277 -125497 -135581 -121294 -94841
1683 -94841 -99275 -86234 -74384 -89125 -78432 -93534 -52909 -81014 -131534 -77322 -80677 -112654
1671 -112654 -93887 -102522 -89363 -92276 -74127 -110210 -122263 -104399 -105135 -115305 -83294 -66978
1659 -66978 -89852 -98495 -84754 -104074 -103465 -96133 -79261 -82018 -127414 -110491 -135321 -143252 -115144
1646 -115144 -101769 -114201 -108745 -112730 -77053 -89547 -96456 -130522 -99679 -57917 -107911 -106383
1634 -106383 -116329 -115942 -112742 -61865 -111366 -64223 -119563 -74751 -71569 -93263 -92057 -165204 -123494
1621 -123494 -121527 -47030 -88016 -98810 -118558 -102521 -128265 -82495 -99108 -97280 -102383 -98860
1609 -98860 -57463 -106518 -85444 -50939 -86101 -97660 -76483 -78998 -139404 -137584 -91362 -109293
1597 -109293 -100323 -91709 -65064 -112034 -121163 -119017 -115608 -58761 -85888 -83021 -117716 -107327 -112632
1584 -112632 -104295 -121319 -111268 -58667 -110653 -98456 -117079 -125511 -94445 -91522 -47522 -119855
1572 -119855 -102698 -80175 -50312 -104877 -125782 -128058 -83388 -98860 -56958 -89711 -80720 -108794
1560 -108794 -100893 -92325 -54781 -123043 -81257 -117241 -85691 -123901 -54556 -115879 -53082 -88721
1548 -88721 -113344 -66378 -70235 -92168 -92862 -68583 -93697 -110194 -77748 -58015 -119599 -132137
1536 -132137 -102381 -66635 -79161 -121347 -83680 -65052 -127578 -115337 -49288 -110747 -104504 -99298
1524 -99298 -84344 -90544 -134412 -133174 -109870 -97611 -102415 -85822 -83355 -84700 -48841 -128978 -90903
1511 -90903 -73194 -87406 -99269 -112916 -118528 -138418 -71335 -85435 -78694 -84081 -102093 -72126
1499 -72126 -87262 -117692 -76665 -93992 -115691 -85356 -82329 -115075 -106098 -93061 -87854 -99289
1487 -99289 -113414 -102514 -91918 -113120 -125135 -129231 -76803 -119487 -79658 -97024 -111449 -48440
1475 -48440 -77374 -97593 -120888 -85752 -90785 -57512 -73160 -64687 -108293 -45552 -118600 -89918
1463 -89918 -110208 -97049 -119277 -155458 -31071 -102326 -113359 -96409 -103232 -85390 -64583 -79353
1451 -79353 -108906 -110802 -113837 -113259 -90502 -97196 -86205 -86768 -89221 -71646 -82085 -90045 -124618 -105136
1437 -105136 -95887 -78988 -36904 -124518 -90076 -81882 -102450 -121185 -107620 -138769 -110466 -86639
1425 -86639 -93798 -93038 -103322 -74345 -92193 -73541 -74257 -105720 -97732 -84908 -131653 -85190 -80308
1412 -80308 -48137 -102577 -117495 -85431 -62244 -83373 -79744 -73582 -47916 -89881 -72103 -92955
1400 -92955 -70993 -86749 -105916 -105492 -106681 -82360 -101145 -113587 -79808 -93470 -73788 -60906
1388 -60906 -76038 -91205 -77271 -50682 -89665 -92085 -78872 -117828 -99835 -67738 -87038 -97545
1376 -97545 -74050 -43485 -82010 -65178 -93078 -114194 -75279 -80607 -120201 -147381 -80338 -108677
1364 -108677 -95518 -106655 -88886 -111823 -82158 -95408 -101308 -135884 -109841 -79185 -110181 -84019
1352 -84019 -87016 -145379 -51578 -65320 -94093 -120349 -82904 -120495 -106410 -87264 -112846 -57792
1340 -57792 -84517 -143639 -65054 -112728 -97360 -93946 -86808 -121348 -91922 -119794 -97677 -68455
1328 -68455 -78574 -113369 -65557 -79073 -91564 -115774 -95382 -75216 -131284 -134564 -59758 -126749
1316 -126749 -125170 -139316 -153323 -125883 -68938 -64701 -113871 -91551 -96297 -100356 -93675 -50979 -132149
1303 -132149 -41857 -94028 -90823 -112521 -97909 -90171 -91550 -90152 -111023 -143523 -94721 -96827 -77312
1290 -77312 -101141 -99267 -75369 -84028 -91218 -123367 -150533 -109439 -130629 -116787 -128166 -100284
1278 -100284 -120111 -136578 -103387 -54113 -61025 -76209 -110491 -89640 -130539 -57013 -66923 -80437
1266 -80437 -74567 -110003 -128040 -97057 -105962 -62410 -74717 -96614 -73164 -79598 -135088 -114535
1254 -114535 -94305 -75940 -81495 -99911 -106993 -92692 -113075 -100923 -86701 -114099 -111102 -63364
1242 -63364 -111663 -89759 -105992 -153963 -103809 -81668 -61059 -64645 -75740 -98876 -125581 -89425
1230 -89425 -101447 -106272 -86187 -104746 -105076 -69329 -93272 -93871 -101012 -87907 -94886 -96070 -105959 -153919
1216 -153919 -113038 -85058 -107184 -120983 -70820 -87519 -113566 -107305 -114329 -88404 -75752 -70476
1204 -70476 -72514 -73132 -113329 -111655 -96944 -88019 -117494 -101696 -75674 -73496 -103104 -133167 -55230
1191 -55230 -101044 -94238 -60965 -91911 -93408 -82305 -85753 -68803 -69388 -88258 -67232 -120974 -87990
1178 -87990 -70638 -86914 -124181 -115998 -74278 -95470 -86932 -90394 -142740 -100106 -98641 -94718 -126384
1165 -126384 -110798 -79677 -94080 -98097 -96970 -99489 -111647 -102345 -58020 -90037 -99069 -80756 -58770
1152 -58770 -59985 -153364 -102320 -124201 -95687 -108248 -104423 -95719 -88159 -87796 -50015 -87089 -94025
1139 -94025 -132519 -78293 -100295 -80186 -102925 -97935 -89066 -87791 -51976 -116322 -148230 -94995
1127 -94995 -90067 -122959 -88024 -118169 -88251 -82318 -78130 -74591 -115998 -71510 -96557 -133529 -95123
1114 -95123 -94182 -101560 -81992 -87847 -89960 -93888 -105541 -87874 -90774 -92144 -109541 -138438 -71932
1101 -71932 -106955 -107732 -97948 -84089 -98427 -74451 -57865 -92265 -85956 -92405 -129138 -120354 -60988
1088 -60988 -94879 -147879 -153242 -114295 -99180 -90790 -73388 -86762 -95989 -96191 -56518 -79048 -110365
1075 -110365 -89836 -79354 -94213 -87014 -59444 -90974 -90049 -71826 -72501 -108592 -85626 -106161 -130405
1062 -130405 -109859 -133845 -108434 -60765 -69185 -84234 -64540 -57198 -49862 -99928 -47647 -87869
1050 -87869 -78489 -83877 -107685 -103034 -95578 -87632 -37110 -93511 -75350 -121305 -115829 -93495 -81327
1037 -81327 -80539 -74195 -87517 -99511 -89122 -93610 -91459 -129809 -75698 -76131 -88171 -100425 -103680
1024 -103680 -86531 -110754 -101486 -84671 -87318 -41527 -77069 -101972 -84744 -107338 -86988 -85733
1012 -85733 -41598 -120855 -75147 -110352 -67194 -73748 -75436 -105930 -96515 -84596 -81850 -123593 -100616
999 -100616 -90281 -129246 -116380 -66365 -68351 -70660 -85122 -91923 -104568 -52349 -117472 -89720
987 -89720 -98383 -72862 -88986 -132691 -96131 -120698 -87222 -110248 -107556 -85476 -95684 -64592
975 -64592 -108946 -58026 -89613 -97763 -100336 -106040 -52583 -70565 -112172 -121550 -107318 -103982 -53542
962 -53542 -91153 -78761 -101400 -112662 -42230 -124676 -78674 -125208 -78331 -99892 -128688 -122121
950 -122121 -91701 -97465 -69210 -117319 -101457 -134372 -96389 -101616 -99337 -70094 -111761 -80409
938 -80409 -71667 -70045 -108327 -113937 -82648 -80532 -123756 -120419 -99751 -89575 -85641 -123507 -86490
925 -86490 -155604 -62389 -56466 -140881 -71450 -79053 -100583 -128053 -53712 -105663 -101082 -60188 -74872
912 -74872 -105090 -96108 -119554 -110854 -91901 -57892 -84286 -88027 -112016 -103235 -122810 -75778 -132909
899 -132909 -69976 -44281 -66542 -109575 -153248 -133607 -86634 -120665 -83265 -97039 -99687 -134381
887 -134381 -69051 -113441 -80274 -80565 -51254 -108370 -108924 -119397 -145023 -44591 -80739 -96522
875 -96522 -141352 -113170 -125277 -91586 -55270 -110573 -104477 -92185 -84249 -87046 -87655 -120684 -87323
862 -87323 -65422 -129024 -106783 -127967 -81770 -98463 -61281 -60237 -67939 -102454 -133838 -116018
850 -116018 -68785 -117813 -115109 -29076 -54713 -78027 -102323 -90412 -85404 -95020 -97479 -99773 -109889
837 -109889 -88657 -106791 -68454 -81052 -100113 -93883 -134989 -122569 -104177 -92586 -79149 -55710
825 -55710 -101458 -95682 -95623 -101360 -81094 -107534 -143269 -81485 -66482 -87877 -169911 -85893 -122843
812 -122843 -86017 -100138 -102365 -91457 -81964 -122054 -114649 -110086 -106740 -88932 -114488 -86715 -59068
799 -59068 -100490 -97831 -80106 -99552 -113577 -65452 -135025 -92783 -142838 -95903 -133802 -85321
787 -85321 -104374 -85966 -98500 -139733 -135455 -78816 -96607 -97815 -91847 -59662 -66717 -66416 -90688
774 -90688 -111646 -101086 -118095 -105011 -103607 -82246 -120506 -101788 -114880 -113568 -58422 -89768
762 -89768 -57880 -93898 -91962 -78160 -88415 -45540 -100942 -92317 -68510 -116396 -80256 -88279 -126696
749 -126696 -100356 -80534 -89487 -131949 -131231 -91876 -77687 -56217 -124751 -111397 -75948 -88165
737 -88165 -125359 -106251 -123032 -77596 -33212 -65589 -91513 -75065 -146588 -86194 -73850 -113557
725 -113557 -106761 -101117 -95991 -94018 -128669 -71997 -127926 -93776 -144361 -133692 -76803 -78708 -100147
712 -100147 -81442 -103260 -89878 -70187 -79686 -95476 -114848 -83811 -47265 -71068 -55556 -82527
700 -82527 -124507 -103027 -92187 -118483 -111498 -92517 -100132 -64345 -116811 -88440 -67175 -102752
688 -102752 -134435 -89996 -110996 -126895 -90619 -44915 -111935 -118829 -66852 -105872 -72592 -79117
676 -79117 -124129 -91753 -109899 -60276 -109964 -97198 -66084 -52090 -110864 -67541 -80438 -93163
664 -93163 -71999 -103594 -130717 -117951 -80251 -75364 -92809 -93235 -69957 -97878 -84280 -61538 -65973
651 -65973 -121686 -77466 -70721 -14725 -81823 -66880 -121239 -111680 -68133 -125157 -96647 -121169
639 -121169 -76166 -105349 -82415 -75985 -84946 -88151 -158275 -68644 -76607 -107660 -98598 -68219 -93920
626 -93920 -133785 -111656 -103558 -60402 -108705 -79868 -101235 -100313 -84769 -65089 -90592 -102357 -105613
613 -105613 -71053 -124903 -111187 -93143 -107540 -94761 -67392 -108828 -77267 -58532 -73183 -80691
601 -80691 -79060 -113419 -115787 -108714 -118472 -93543 -72829 -102421 -92475 -72420 -49640 -80128 -77088
588 -77088 -93477 -83231 -119170 -122165 -90693 -73814 -82987 -111375 -85225 -76072 -86068 -91711 -45442
575 -45442 -65812 -54485 -80045 -101034 -91169 -127208 -100996 -70964 -95627 -84142 -83407 -101947 -119830
562 -119830 -114088 -60692 -140522 -98896 -93707 -61925 -114690 -92180 -86264 -120660 -95238 -92336 -76777
549 -76777 -85463 -104293 -153921 -101388 -113568 -81686 -60106 -86138 -85765 -87986 -98607 -69918 -105849
536 -105849 -95865 -119533 -90972 -79017 -96467 -111101 -77594 -54777 -104449 -66355 -70004 -83399
524 -83399 -142580 -97793 -70224 -100074 -88470 -101796 -124211 -93091 -106555 -62929 -104547 -138692
512 -138692 -104432 -73113 -88863 -130146 -70992 -57010 -104259 -96171 -104597 -134921 -133250 -115621
500 -115621 -100177 -79462 -92795 -80138 -109813 -86702 -93822 -119684 -97320 -45612 -49710 -45790
488 -45790 -120530 -122097 -68133 -101635 -78718 -79860 -93923 -78855 -96026 -88110 -119029 -70822 -136903
475 -136903 -62308 -89187 -81396 -104221 -124167 -101998 -70210 -72098 -72385 -90900 -110220 -99821 -52332
462 -52332 -123788 -140968 -69956 -63723 -84101 -132910 -113424 -78899 -117830 -104753 -85513 -69488
450 -69488 -112861 -71983 -110276 -114802 -91400 -73350 -106768 -115180 -74330 -92529 -102769 -100783 -96526
437 -96526 -96605 -108718 -89476 -114801 -75777 -104206 -97776 -104374 -80518 -61066 -110080 -127184 -107003
424 -107003 -133213 -101398 -88336 -70495 -111824 -45806 -89311 -116005 -39137 -79618 -95601 -59936
412 -59936 -112889 -106878 -79287 -125550 -105512 -91971 -125590 -88738 -80272 -105237 -111186 -99318 -77074
399 -77074 -49433 -101533 -93077 -108389 -64649 -115053 -128243 -130875 -87271 -58714 -105120 -89716
387 -89716 -142175 -105326 -60881 -73240 -79008 -131389 -115132 -81383 -139255 -118228 -95901 -71285
375 -71285 -98193 -92751 -113193 -63002 -82626 -102109 -86626 -98369 -56797 -83919 -121364 -110071
363 -110071 -77137 -128567 -53838 -106713 -75066 -113618 -85939 -92618 -133590 -59511 -106926 -102259
351 -102259 -49060 -96004 -99197 -84246 -129094 -108214 -72017 -60432 -80569 -94095 -81789 -88142
339 -88142 -97085 -86956 -38367 -127283 -73124 -91299 -92843 -108150 -95216 -43420 -69315 -82453
327 -82453 -92852 -87601 -64659 -64282 -116712 -76722 -71204 -110218 -93394 -69146 -66623 -99250 -103383
314 -103383 -60195 -71035 -145249 -68347 -100240 -84599 -109939 -94342 -91225 -108658 -103363 -83418
302 -83418 -61029 -128972 -102742 -80479 -94150 -81928 -99005 -69360 -122216 -68875 -100007 -89677
290 -89677 -55853 -81169 -73609 -67081 -53422 -71734 -114678 -104704 -103051 -93190 -88223 -88921 -117916 -92212
276 -92212 -63785 -106771 -117532 -105584 -101538 -116474 -99817 -120304 -91396 -129246 -93148 -94991
264 -94991 -92221 -74712 -82510 -36879 -65325 -83363 -95561 -94847 -106726 -77614 -100555 -90111 -126654
251 -126654 -105080 -97347 -134753 -99697 -120364 -94284 -73017 -92989 -94353 -123052 -100614 -76273
239 -76273 -104991 -72453 -90703 -109856 -77999 -63595 -57761 -89916 -70083 -102630 -84718 -105755
227 -105755 -118865 -103599 -68806 -84368 -131535 -117615 -79468 -82367 -61375 -108180 -91139 -91476
215 -91476 -117742 -84797 -67976 -101065 -139785 -69327 -93894 -78796 -128320 -103132 -74131 -90431
203 -90431 -86897 -47186 -47114 -68945 -142060 -71832 -144955 -93534 -110066 -116639 -105633 -107282 -79073
190 -79073 -89038 -107679 -90163 -120954 -117094 -141138 -59805 -53965 -118255 -87934 -92584 -117657 -109815
177 -109815 -86890 -81289 -102977 -77230 -111611 -103185 -88316 -118043 -92595 -122178 -95817 -99073
165 -99073 -149859 -135837 -132038 -115734 -83623 -109857 -70039 -115265 -97078 -99894 -95141 -75435 -125860
152 -125860 -87470 -95128 -63680 -105440 -148498 -96051 -97993 -83544 -76865 -111645 -97379 -135985
140 -135985 -91157 -81702 -58531 -90876 -101489 -70478 -82942 -113584 -91834 -109168 -93867 -98900
128 -98900 -94007 -113896 -85512 -127068 -106726 -75091 -96035 -103044 -90795 -85756 -106482 -87521 -111745
115 -111745 -118864 -69218 -93656 -123138 -141238 -146246 -63681 -103659 -104405 -120992 -102241 -93895 -114271
102 -114271 -111360 -115051 -117603 -111586 -85862 -105440 -103070 -89105 -106937 -87091 -108269 -120022 -99486
89 -99486 -106927 -85141 -124095 -129471 -95570 -117732 -130451 -88303 -118077 -135083 -122481 -115230 -138522
76 -138522 -91770 -108687 -119523 -105275 -142612 -119189 -85264 -120419 -89190 -85046 -118561 -133884
64 -133884 -128461 -105473 -112869 -115688 -124475 -129149 -116454 -137514 -126747 -136083 -98893 -109351 -125135
51 -125135 -107688 -162707 -158891 -154449 -123686 -105639 -136189 -137204 -148930 -122679 -103309 -114137 -135955
38 -135955 -97861 -134713 -134507 -133925 -147535 -147065 -106126 -132976 -113647 -129303 -147983 -98130 -131926
25 -131926 -132060 -141552 -142218 -125679 -133389 -148222 -135877 -122228 -138374 -132248 -116096 -156457 -143476
12 -143476 -136969 -127308 -122118 -108830 -141642 -120901 -125922 -132340 -148647 -116731 -129193 -142323
0 -142323
$$ Imaginary data points
##PAGE= N=2
##DATA TABLE= (X++(I..I)), XYDATA
16383 -249315 -239462 -238367 -242764 -193121 -221756 -179061 -190249 -183433 -216875 -184541 -182526 -211750
16371 -211750 -169111 -148533 -145059 -160121 -151136 -142788 -152613 -156093 -129245 -129701 -121997 -84206 -105246
16358 -105246 -111507 -110835 -85176 -132925 -51042 -68257 -84048 -82552 -66177 -91361 -57521 -53801
16346 -53801 -51150 -47005 -25756 -29627 -47102 -1731 734 -5206 -1231 -31930 -7171 11041 -4978
16333 -4978 -5772 33022 13992 -4256 29049 38122 39135 40527 32250 60836 65810 74866 78837 67900
16319 67900 77900 101728 114838 108461 121597 96624 127682 87721 87964 140587 135174 122623
16307 122623 134223 157397 113913 156381 159625 170365 184937 177315 173563 197478 174667 206985
16295 206985 178315 219233 223979 219500 216421 203701 232168 219795 200439 222439 211304 215427
16283 215427 226762 213865 268741 255954 287511 264622 284473 277811 286559 251462 287845 283373
16271 283373 289307 260831 300101 293118 295893 319055 323461 306333 319902 296037 325473 347769
16259 347769 338074 384942 345559 361505 354147 327932 372877 363066 361043 395124 375091 383470
16247 383470 341881 370739 346329 390119 391138 388161 435531 399458 371662 395336 421039 413740
16235 413740 476556 407991 427025 408828 389373 404640 458938 410998 399106 423902 435037
16224 435037 441434 434199 444268 416244 418176 439393 464576 477522 446266 448410 423306 436720
16212 436720 481746 482610 469266 473479 468797 468127 458861 467103 455788 454696 442295 469913 462745
16199 462745 476649 501096 483415 514557 518813 447472 487116 529148 496411 500595 522298 495475
16187 495475 532079 497918 507633 513857 491422 507302 527377 535454 488298 547701 521829 487106
16175 487106 507665 545558 529940 557217 548339 530183 539098 526987 557010 547089 511655 560314
16163 560314 512829 549955 531466 531220 530184 510092 512367 528451 510430 534493 530659 540798
16151 540798 559566 565584 515045 488124 554760 587289 584546 511481 568974 543495 567899 559910
16139 559910 573545 580379 547840 596608 606817 586596 556989 571421 564156 523271 519479 563699
16127 563699 549329 547053 625393 564482 603296 591551 523267 545876 537439 545586 572207 555990
16115 555990 551363 560272 589841 626098 579038 527407 558944 555521 575884 576590 660883 571965
16103 571965 591626 571736 604783 586437 607515 608258 572301 586283 554530 597338 639558 617440
16091 617440 590233 599174 565534 628749 596328 572591 567277 586753 593965 619601 603522 592056
16079 592056 596506 590347 590429 576202 591722 577566 602833 579632 603888 603824 605091 584202 611392
16066 611392 566033 583455 596031 621150 593709 597738 582903 588983 607884 623180 590652 597093
16054 597093 617010 596202 600528 573283 608570 599753 607425 580649 587665 603241 551025 635498
16042 635498 545320 597189 578987 603566 567047 570612 588992 558705 564997 576748 583030 577174
16030 577174 596741 650790 606283 581855 568579 628117 596708 604959 577529 628752 594095 625373
16018 625373 645518 636868 603568 558743 612669 623373 628345 613847 601088 594797 637709 618002
16006 618002 646741 597372 638776 615568 608662 613431 596022 599187 575440 616967 636197 612264
15994 612264 599130 582335 584491 606983 622813 604476 589540 615356 575135 615714 580497 631175
15982 631175 585880 557264 616101 628731 607790 585065 622990 562067 557280 597129 614256 617829
15970 617829 604955 629352 569632 629101 608428 604299 640704 634533 591847 621586 600651 607187
15958 607187 616967 602676 626977 592253 597687 604932 589799 626728 599288 577814 596940 659054
15946 659054 574069 625341 589799 639692 645271 642021 628695 637239 617411 598769 609859 628319
$$ [...]
##END NTUPLES=NMR SPECTRUM
##END=
