##TITLE=abcd
##JCAMPDX= 6.0         $$ Bruker NMR JCAMP-DX V2.0
##DATA TYPE= NMR SPECTRUM
##DATA CLASS= NTUPLES
##ORIGIN= UXNMR, Bruker Analytische Messtechnik GmbH
##OWNER= root
$$ XWIN-NMR		Version 3.5
$$ Sat Aug  1 10:42:34 2026 Russian Standard Time (UT+4h)  servis@DPX200
##.OBSERVE FREQUENCY= 200.131235884673
##.OBSERVE NUCLEUS= ^1H
##.ACQUISITION MODE= SIMULTANEOUS
##.ACQUISITION SCHEME= undefined
##.AVERAGES= 8
##.DIGITISER RES= 18
##SPECTROMETER/DATA SYSTEM= spect
##.PULSE SEQUENCE= zg
##.SOLVENT NAME= DMSO
##.SHIFT REFERENCE= (INTERNAL, DMSO, 0, 16.4885)
##AUDIT TRAIL= $$ (NUMBER, WHEN, WHO, WHERE, WHAT)
$$ ##TITLE= Audit trail, XWIN-NMR		Version 3.5
$$ ##JCAMPDX= 5.01
$$ ##ORIGIN= Bruker BioSpin GmbH
$$ ##OWNER= servis
$$ F:\spectra/data/av/nmr/H1/1/pdata/1/auditp.txt
$$ ##AUDIT TRAIL=  $$ (NUMBER, WHEN, WHO, WHERE, WHAT)
(   1,<2026-08-01 10:42:10.82 +0400>,<servis>,<DPX200>,
      <created by zg, POWCHK disabled, PULCHK disabled
       terminated by command 'halt'
       configuration hash MD5:
       00 E9 B6 7A A2 85 ED C7 34 08 36 98 17 FE 4E 26
       data hash MD5: 32K
       7D 05 DC 06 4B D2 41 5F A5 92 0B 30 87 30 24 F3>)
(   2,<2026-08-01 10:42:12.54 +0400>,<servis>,<DPX200>,
      <Start of raw data processing
       efp BC_mod = 2 LB = 0.05 FT_mod = 6 PKNL = 1 PHC0 = -416.9518 PHC1 = 3.101563 SI = 16K 
       data hash MD5: 16K
       0A 57 F2 1B 8C EA BC 70 EB BE 5B F7 15 F9 FF CA>)
$$ ##END=
$$ 
$$ hash MD5
$$ 07 F0 52 93 C0 E1 84 56 50 B7 8F 02 CF AE F2 D7
##$RELAX= 
##$RELAX= 
##$RELAX= 
##$RELAX= 
##$RELAX= 
##$RELAX= 
##$RELAX= 
##$RELAX= 
$$ Bruker specific parameters
$$ --------------------------
##$DU= <F:\spectra>
##$EXPNO= 1
##$NAME= <H1>
##$PROCNO= 1
##$TYPE= <nmr>
##$USER= <av>
##$AMP= (0..31)
100 100 100 100 100 100 100 100 100 100 100 100 100 100 100 100 100 100 
100 100 100 100 100 100 100 100 100 100 100 100 100 100 
##$AQSEQ= 0
##$AQ_mod= 1
##$AUNM= <au_zg>
##$AUTOPOS= <>
##$BF1= 200.13
##$BF2= 200.13
##$BF3= 200.13
##$BF4= 200.13
##$BF5= 500.13
##$BF6= 500.13
##$BF7= 500.13
##$BF8= 500.13
##$BYTORDA= 1
##$CFDGTYP= 0
##$CFRGTYP= 5
##$CHEMSTR= <none>
##$CNST= (0..31)
1 1 145 1 1 1 1 1 1 1 1 1 1 1 1 1 1 1 1 1 1 1 1 1 1 1 1 1 1 1 1 1 
##$CPDPRG= <>
##$CPDPRG1= <>
##$CPDPRG2= <>
##$CPDPRG3= <>
##$CPDPRG4= <mlev>
##$CPDPRG5= <mlev>
##$CPDPRG6= <mlev>
##$CPDPRG7= <mlev>
##$CPDPRG8= <mlev>
##$CPDPRGB= <>
##$CPDPRGT= <>
##$D= (0..31)
0 2 0 0 0 0 0 0 0 0.06 0 0 0 0 0 0 0.0002 0 0 0 0 0 0 0 0 0 0 0 0 0 0 
0 
##$DATE= 1785566530
##$DBL= (0..7)
120 120 120 120 120 120 120 120 
##$DBP= (0..7)
150 150 150 150 150 150 150 150 
##$DBP07= 0
##$DBPNAM0= <>
##$DBPNAM1= <>
##$DBPNAM2= <>
##$DBPNAM3= <>
##$DBPNAM4= <>
##$DBPNAM5= <>
##$DBPNAM6= <>
##$DBPNAM7= <>
##$DBPOAL= (0..7)
0.5 0.5 0.5 0.5 0.5 0.5 0.5 0.5 
##$DBPOFFS= (0..7)
0 0 0 0 0 0 0 0 
##$DE= 6
##$DECBNUC= <off>
##$DECIM= 32
##$DECNUC= <off>
##$DECSTAT= 4
##$DIGMOD= 1
##$DIGTYP= 9
##$DL= (0..7)
0 120 120 120 120 120 120 120 
##$DP= (0..7)
$$ [...]
##$SUBNAM4= <"">
##$SUBNAM5= <"">
##$SUBNAM6= <"">
##$SUBNAM7= <"">
##$SUBNAM8= <"">
##$SUBNAM9= <"">
##$SW= 20.6817932712277
##$SWIBOX= (0..15)
0 0 3 0 0 0 0 0 0 0 0 0 0 0 0 0 
##$SW_h= 4139.07284768212
##$TD= 32768
##$TD0= 1
##$TE= 0
##$TE2= 300
##$TE3= 300
##$TEG= 300
##$TL= (0..7)
0 120 120 120 120 120 120 120 
##$TP= (0..7)
150 150 150 150 150 150 150 150 
##$TP07= 0
##$TPNAME0= <>
##$TPNAME1= <>
##$TPNAME2= <>
##$TPNAME3= <>
##$TPNAME4= <>
##$TPNAME5= <>
##$TPNAME6= <>
##$TPNAME7= <>
##$TPOAL= (0..7)
0.5 0.5 0.5 0.5 0.5 0.5 0.5 0.5 
##$TPOFFS= (0..7)
0 0 0 0 0 0 0 0 
##$TUNHIN= 0
##$TUNHOUT= 0
##$TUNXOUT= 0
##$USERA1= <user>
##$USERA2= <user>
##$USERA3= <user>
##$USERA4= <user>
##$USERA5= <user>
##$V9= 5
##$VALIST= <valist>
##$VCLIST= <CCCCCCCCCCCCCCC>
##$VD= 0
##$VDLIST= <DDDDDDDDDDDDDDD>
##$VPLIST= <PPPPPPPPPPPPPPP>
##$VTLIST= <TTTTTTTTTTTTTTT>
##$WBST= 1024
##$WBSW= 30
##$XGAIN= (0..3)
0 0 0 0 
##$XL= 0
##$YL= 0
##$YMAX_a= 212196
##$YMIN_a= -213836
##$ZGOPTNS= <>
##$ZL1= 120
##$ZL2= 120
##$ZL3= 120
##$ZL4= 120
##$ABSF1= 0
##$ABSF2= 0
##$ABSG= 0
##$ABSL= 0
##$ALPHA= 0
##$AQORDER= 0
##$ASSFAC= 0
##$ASSFACI= 0
##$ASSFACX= 0
##$ASSWID= 0
##$AUNMP= <proc_1d>
##$AZFE= 0.1
##$AZFW= 0.1
##$BCFW= 0
##$BC_mod= 2
##$BYTORDP= 0
##$COROFFS= 0
##$CY= 18.4799938201904
##$DATMOD= 1
##$DC= 0
##$DFILT= <>
##$DTYPP= 0
##$F1P= 9.9274215381318
##$F2P= -0.165520771350173
##$FCOR= 1
##$FTSIZE= 16384
##$FT_mod= 6
##$GAMMA= 0
##$GB= 0
##$INTBC= 1
##$INTSCL= 4.127829e-11
##$ISEN= 128
##$LB= 0.05
##$LEV0= 0
##$LPBIN= 0
##$MAXI= 10000
##$MC2= 0
##$MEAN= 0
##$ME_mod= 0
##$MI= 50
##$NCOEF= 0
##$NC_proc= -6
##$NLEV= 6
##$NOISF1= 3.799351
##$NOISF2= 2.8
##$NSP= 0
##$NTH_PI= 0
##$NZP= 0
##$OFFSET= 16.48848
##$PC= 4
##$PHC0= -416.9518
##$PHC1= 3.101563
##$PH_mod= 1
##$PKNL= yes
##$PPARMOD= 0
##$PSCAL= 4
##$PSIGN= 0
##$REVERSE= no
##$SF= 200.130005582386
##$SI= 16384
##$SIGF1= 3
##$SIGF2= 2
##$SINO= 400
##$SIOLD= 16384
##$SREGLST= <1H.CDCl3>
##$SSB= 0
##$STSI= 16384
##$STSR= 0
##$SW_p= 4139.07284768211
##$SYMM= 0
##$S_DEV= 0
##$TDeff= 32768
##$TDoff= 0
##$TI= <>
##$TILT= no
##$TM1= 0
##$TM2= 0
##$TOPLEV= 0
##$USERP1= <user>
##$USERP2= <user>
##$USERP3= <user>
##$USERP4= <user>
##$USERP5= <user>
##$WDW= 1
##$XDIM= 16384
##$YMAX_p= 302132130
##$YMIN_p= -1086270
$$ End of Bruker specific parameters
$$ ---------------------------------
##NTUPLES= NMR SPECTRUM
##VAR_NAME=  FREQUENCY,     SPECTRUM/REAL,   SPECTRUM/IMAG
##SYMBOL=    X,             R,               I
##VAR_TYPE=  INDEPENDENT,   DEPENDENT,       DEPENDENT
##VAR_FORM=  AFFN,          ASDF,            ASDF
##VAR_DIM=   16384,         16384,           16384
##UNITS=     HZ,            ARBITRARY UNITS, ARBITRARY UNITS
##FACTOR=    0.252644378177508, 1,           1
##FIRST=     3299.83951724647, 0,            0
##LAST=      -839.233330435636, 0,           0
##MIN=       -839.233330435636, -1086270,    0
##MAX=       3299.83951724647, 302132130,    0
$$ Real data points
##PAGE= N=1
##DATA TABLE= (X++(R..R)), XYDATA
$$ [...]
8094f5154R2439J6916j38134J29753r0545N1539Q5355j6315o7997N0603R2125
$$ -65154 27285 44201 -93933 35820 -54725 -3186 82169 65854 -2143 48460 140585
8083A40585o9539P6403K8688l8069r2811j4950P2364N4672j19766J5302J6883
$$ 140585 71046 147449 176137 138068 45257 30307 102671 157343 37577 52879 69762
8072F9762n8882p5976J39981m2502J12389j39806O5932L5758k40660J96864P0565
$$ 69762 10880 -65096 74885 32383 144772 4966 70898 106656 -134004 62860 133425
8061A33425j52066M9937J10412M4996M8919L1264J55320O5507l1391j5028p6793
$$ 133425 -18641 31296 141708 186704 235623 266887 422207 487714 456323 441295 364502
8050C64502j93464M4871p3119k4316L1996r8138R3254p5487K6678L3895p1526
$$ 364502 171038 215909 142790 118474 150470 52332 145586 70099 96777 130672 59146
8039E9146m5510l3724J51693m9865K2785j8808J57449o8175J5021P6713O2730
$$ 59146 13636 -20088 131605 81740 104525 85717 243166 174991 190012 266725 329455
8028C29455Q6797J1732l4246O1146j17129m9915n0764j0464j6498n4661p0624
$$ 329455 416252 427984 393738 454884 337755 287840 237076 226612 210114 155453 84829
8017H4829n5089j742N2138o6049L6877r118L1467J25861J6786j02697n3947j6497
$$ 84829 29740 27998 80136 14087 50964 41846 73313 199174 215960 113263 59316 42819
8005D2819J8243j1555J2970P8641o0811J06534n3723o4101L5516l6857J3320l6465
$$ 42819 61062 49507 62477 141118 80307 186841 133118 69017 104533 67676 80996 44531
7993D4531K8810k6780L1072j31504M7547n256l8969K7438M0262j01919K1951J6991
$$ 44531 73341 46561 77633 -53871 -6324 -11580 -50549 -23111 17151 -84768 -62817 -45826
7981d5826M6749r9056k9683J35039m5926k7133K9678L0590J6659q1746Q8440o9326
$$ -45826 923 -98133 -127816 7223 -38703 -65836 -36158 -5568 11091 -70655 17785 -51541
7969e1541J4239Q8701q3718L1691j049l1074m4200P7991j2650n5060L1682n7922
$$ -51541 -37302 51399 -32319 -628 -1677 -32751 -76951 1040 -11610 -66670 -34988 -92910
7957i2910J20331J1745q7264L245M7424p6060Q0396p8864K2575L9285R0305j37981
$$ -92910 27421 39166 -48098 -44853 2571 -73489 6907 -71957 -49382 -10097 80208 -57773
7945e7773M6250n2022Q7581P792p3921M6039k0379k0993K7330l8508Q7971n2153
$$ -57773 -11523 -63545 24036 31828 -42093 3946 -16433 -37426 -10096 -48604 39367 -12786
7933a2786J21366j56490L6218J9740m9937l725L5221N9826n0128K9099j30490
$$ -12786 108580 -47910 -11692 8048 -41889 -45614 -10393 49433 -695 28404 -102086
7922a02086P8900o2319L1103J7692k9670N5138k601n7829N4007l4611m8630J5739
$$ -102086 -23186 -85505 -54402 -36710 -66380 -11242 -13843 -71672 -17665 -52276 -100906 -85167
7910h5167k5030M6178P285N8918r8391J71239j47371p9386O4133P0303l8525q668
$$ -85167 -110197 -64019 -56734 2184 -96207 75032 -72339 -151725 -87592 -17289 -55814 -64482
7898f4482N8929J9390j6695j11298O9529L522k2338J31676q3979l732r5963l3278
$$ -64482 -5553 13837 -2858 -114156 -44627 -41105 -63443 68233 -15746 -19478 -115441 -148719
7886a48719P4645j0799N2864k2248P7952k3622j423l9156n9349Q2463l5413K4854
$$ -148719 -74074 -84873 -32009 -54257 23695 73 -1350 -40506 -99855 -17392 -52805 -27951
7874b7951J15987j74722P1550l5165j1803j0653P213L3122o751J1388o4611Q6287
$$ -27951 88036 -86686 -15136 -50301 -62104 -72757 -65544 -32422 -39173 -27785 -92396 -6109
7862f109o2005o6582M0926K5624L381m9531l1440r40534J215586M873o5628k5989
$$ -6109 -68114 -134696 -93770 -68146 -64765 -114296 -145736 -1086270 129316 134189 68561 42572
7850D2572K6955l6841O4273j78434L8137M517O809O3962o3687j7360Q928l7860
$$ 42572 69527 32686 96959 -81475 -43338 -38821 -32012 31950 -31737 -49097 -40169 -78029
7838g8029M3075R798j8869l143R9762n7930J6535M781n1326K6264o0998q320J19415
$$ -78029 -34954 -25156 -44025 -47168 52594 -5336 11199 15980 -35346 -9082 -70080 -78400 41015
7825D1015Q287r8636K5916N681r24o5840q612Q7635m2097P28M3562r2804O9703
$$ 41015 49302 -49334 -23418 -17737 -18661 -84501 -93113 -5478 -47575 -46847 -3285 -96089 -26386
7812b6386J529k6845K0125Q143m8172N9980K9997l9615m7374J52635j54881M0067
$$ -26386 -24857 -51702 -31577 -23434 -71606 -11626 18371 -21244 -68618 84017 -70864 -30797
7800c0797o8543m106K5570J17364P181p3387r0675Q8814N6712Q968j8489q2959
$$ -30797 -99340 -103446 -77876 39488 46669 -26718 -117393 -28579 28133 37101 18612 -64347
7788f4347L8127M5493n5025j4063M6077n8729P6567N898n4681M4648j48475J59328
$$ -64347 -26220 19273 -35752 -49815 -3738 -62467 14100 19998 -34683 9965 -138510 20818
7776B0818m4460l6124L7759L9847o7182M8035O329m0093P4100o4913K5738O774
$$ 20818 -23642 -59766 -22007 17840 -49342 -1307 5022 -35071 39029 -25884 -146 6628
7764F628m4397M6293n5531R6550l5391Q3570p2476p4232J6823m4457M9679j1234
$$ 6628 -37769 8524 -47007 49543 14152 97722 25246 -48986 -32163 -76620 -26941 -38175
7752c8175N5978J232K2655p6226P8297m2892q9693n4896L9347M9012p609R6985
$$ -38175 17803 19035 41690 -34536 43761 869 -88824 -143720 -104373 -55361 -62970 34015
7740C4015j04128J24670r1694N0980r0401J13125Q661q685N2880J9987j48657
$$ 34015 -70113 54557 -37137 13843 -76558 36567 45228 36543 89423 109410 -39247
7729c9247K6070r5738J31857m9514R9318q2989p3760P6502k1111J2776J8371l9422
$$ -39247 -13177 -108915 22942 -26572 72746 -10243 -84003 -7501 -28612 -15836 2535 -36887
7717c6887j5159J5455Q5376k2509o3396R1048p8694r0140N37J96185p2776k7521
$$ -36887 -52046 -36591 48785 26276 -37120 53928 -24766 -114906 -114369 81816 9040 -18481
7705a8481n2954R8204m0302J2841P3928q6364J18072p4894J2795p8206l0963J3055
$$ -18481 -71435 26769 -13533 -692 73236 -13128 104944 30050 42845 -35361 -66324 -53269
7693e3269J24379p5101K6395j9280L5907o0414N435K5852r626l4046J02370N9499
$$ -53269 71110 -3991 22404 3124 39031 -21383 -15948 9904 278 -33768 68602 128101
7681A28101j28253Q4634l5879L1567M5355m2907J44026r2637M2131R386Q8502
$$ 128101 -152 84482 48603 80170 125525 82618 226644 134007 176138 185524 274026
7670B74026J5678J8553L56524J19755q2246o3783k1133j26372j70681k8654l6676
$$ 274026 289704 308257 664781 784536 702290 638507 617374 491002 320321 291667 254991
7659B54991j41797L1057m3002q346Q922p2518j2394o2474J26945o9805n2100N7032
$$ 254991 113194 144251 101249 92903 101825 29307 16913 -45561 81384 11579 -40521 16511
7647A6511p7034P8836j24858J34736j00545L4690J00427l864j3441r4581L1878
$$ 16511 -60523 18313 -106545 28191 -72354 -37664 62763 58899 45458 -49123 -17245
7636a7245N2456M1319j08379O557O5444k7975n3336j7734j388K4812J07992j17405
$$ -17245 35211 76530 -31849 -25292 40152 12177 -41159 -58893 -60281 -35469 72523 -44882
7624d4882P2970K9628j17114J61976j25463j6212L2461j592J5942L4257K9346
$$ -44882 28088 57716 -59398 102578 -22885 -39097 -6636 -8228 7714 41971 71317
7613G1317K182j12267m068J5584P2909J899q3873P0690m4278L5237l5275q6334
$$ 71317 73499 -38768 -42836 -27252 45657 47556 -36317 34373 -9905 25332 -9943 -96277
7601i6277P9615j8752K0117L39819k00753j46096J8956l1572J21215j1856l6237
$$ -96277 -16662 -35414 -15297 324522 123769 -22327 -3371 -34943 86272 74416 38179
7590C8179n7951r9718J51325p0313m5079l9576R1352l2229M6931J09335o2475
$$ 38179 -19772 -119490 31835 -38478 -83557 -123133 -31781 -64010 -17079 92256 29781
7579B9781l8006l9236J7957q1915Q7462Q3545j03994P4017k6772l3365m890N1956
$$ 29781 -8225 -47461 -29504 -111419 -23957 59588 -44406 29611 2839 -30526 -35416 16540
7567A6540K6966k2486l3498l7511m2826N7237K1101n1606j8398N5728J18372p7447
$$ 16540 43506 21020 -12478 -49989 -92815 -35578 -14477 -66083 -84481 -28753 89619 12172
7555A2172j319k6152n0037R5961K3647k5358j05476N3416m8345J68934r7970j2965
$$ 12172 10853 -15299 -65336 30625 54272 28914 -76562 -23146 -71491 97443 -527 -13492
7543a3492j8039J3931j4169P6145P3791j14891q1422M5440L579Q0110j26484J23656
$$ -13492 -31531 -17600 -31769 44376 118167 3276 -78146 -32706 -29127 50983 -75501 48155
7531D8155m2866l8010n0277J29632j7903j6916k6738O674Q262L1053M957m1199
$$ 48155 5289 -32721 -82998 46634 28731 11815 -14923 -8249 13 31066 36023 -5176
7519e176J4158l0324R1122j40060J30690M764K8790r2935l6533p002P9817m3873
$$ -5176 8982 -21342 69780 -70280 60410 65174 93964 1029 -35504 -42506 37311 -6562
7507f562K569M4604R793m0898j11167J21373J9339O2427j30087P8253M7385j13254
$$ -6562 -3993 40611 50404 9506 -101661 19712 39051 101478 -28609 49644 97029 -16225
7495a6225J08755j51187J12586L4055l1088K470k2774n8661k9956R4065k7463
$$ -16225 92530 -58657 53929 87984 56896 59366 36592 -22069 -52025 42040 14577
7484A4577m9522O3157m575N7798j05605O0805J7241j4466o3264r8113R1658N0734
$$ 14577 -34945 28212 23637 81435 -24170 36635 53876 39410 -23854 -121967 -30309 20425
7472B0425k2178j6407j6872J12409j25000M6306q920N2438o619l8116j24754Q7269
$$ 20425 -1753 -18160 -35032 77377 -47623 -1317 -10237 42201 35582 -2534 -127288 -40019
7460d0019P825K458r9174J17639q3737J02337m3764K9680j14585R8095P032Q7802
$$ -40019 -32194 -29736 -128910 -11271 -95008 7329 -36435 -6755 -121340 -23245 -16213 71589
7448G1589j76817P5469J7097P0704p7689N9921J1108j43508O5186P7576m0679
$$ 71589 -105228 -29759 -12662 58042 -19647 40274 51382 -92126 -26940 50636 9957
7437I957k2227l9760l6720P0656N5328p4161m2279N6330N1109L6825m8401J9284
$$ 9957 -12270 -52030 -88750 -18094 37234 -36927 -79206 -22876 28233 65058 16657 35941
7425C5941q337j16714K4521L0140O8608p8831J305N6495K7442o7260n8253O5914
$$ 35941 27604 -89110 -64589 -34449 34159 -44672 -43367 13128 40570 -26690 -84943 -19029
7413a9029k3657O2282p4344o23M4858J2115K6778K8790J8415J2624J2154j08436
$$ -19029 -42686 19596 -54748 -55371 -10513 1602 28380 57170 75585 88209 100363 -8073
7401h073P208K0112k8498P5500q0085N6812r2646j5975R6869r6927Q6726K4827
$$ -8073 -865 19247 -9251 66249 -13836 42976 -49670 -65645 31224 -65703 21023 45850
7389D5850m760j27028J13415j4716m8982n111k8472K3537J09244m9006M9665j70519
$$ 45850 41090 -85938 27477 12761 -36221 -41332 -69804 -46267 62977 13971 63636 -106883
7377a06883P0476R4296n6891p0467K8496M2492K8904o5000M7225j50979J47607
$$ -106883 -36407 57889 998 -69469 -40973 1519 30423 -34577 12648 -138331 9276
7366I276q8478P3725Q53J4586l8765O3513r1690K5607L7946j6706l9943J19068
$$ 9276 -79202 -5477 -4624 9962 -28803 34710 -56980 -31373 6573 -10133 -50076 68992
7354F8992j29701o032P1718n9464n5391J05266j2170O8352m8030O3590l0258m4923
$$ 68992 -60709 -66741 4977 -54487 -109878 -4612 -16782 51570 3540 67130 36872 -8051
7342h051q2364N6166M0110K5861O433n2108O391L0955n0982j7173R195q106M1391
$$ -8051 -90415 -34249 5861 31722 38155 -13953 -7562 23393 -27589 -44762 -35567 -43673 -2282
7329b282m9750J9750O8066o8647M7339m2137K2803j19934J29307p1307R2711L5978
$$ -2282 -52032 -32282 35784 -32863 14476 -27661 -4858 -124792 4515 -66792 25919 61897
7317F1897J5259j02794K3022M400K4090j13735J71923r0060N3002l507O510K7733
$$ 61897 77156 -25638 -2616 1784 25874 -87861 84062 -5998 47004 43497 50007 77740
7305G7740j39410J96443j72182P3937k1986J5269r233k2883O076L0375m555o4482
$$ 77740 -61670 134773 -37409 36528 14542 29811 20578 -2305 3771 34146 29591 -34891
7293c4891o21J6823j1389J03100n2161M6548l0006J6663p0178K3986p3647P1682
$$ -34891 -35512 -18689 -30078 73022 20861 67409 37403 54066 -16112 7874 -65773 5909
7281E909L1311N5720j42721R7941j5238o6687N5939l8631L2082n4467K4516M8222
$$ 5909 37220 92940 -49781 48160 32922 -33765 22174 -16457 15625 -38842 -14326 33896
7269C3896k5882k3263l623L5946J7831N8298j44411K8609k4215M2171r219M0190
$$ 33896 8014 -15249 -18872 17074 34905 93203 -51208 -22599 -46814 -4643 -13862 26328
7257B6328j4520J3816j786K3561J0024m4821n7500L2238l226O6398Q8923p2963
$$ 26328 11808 25624 23838 47399 57423 12602 -44898 -12660 -15886 50512 139435 66472
7245F6472r5333O4852K2041p0911o9183P1516n6477K7497M8324k2639M6635L164
$$ 66472 -28861 35991 58032 -12879 -82062 -10546 -67023 -39526 8798 -13841 32794 35958
7233C5958k0855L04J918l5100R6268q3859J8350J732K9890m3839P7834j42095
$$ 35958 15103 15407 17325 -17775 78493 -5366 12984 14716 44606 767 78601 -63494
7221f3494J00252j977j3730J6462L9469j03313P2873p265k3740N8140r0643M191
$$ -63494 36758 34781 21051 37513 76982 -26331 46542 39277 15537 73677 -16966 -12775
7209a2775M4213o7149J96467k36246J14349m398m3405m3923J46055q8561k0324
$$ -12775 31438 -35711 160756 -75490 38859 34461 -8944 -52867 93188 4627 -15697
7198a5697N9576J5625n2178O7833j4244o0908q8191J34729k7889o6114J71063
$$ -15697 43879 59504 7326 75159 60915 7 -88184 46545 18656 -47458 123605
7187A23605r0400L7684p955q0020Oq8896O5326M5872J4602k3725L187R7687p7545
$$ 123605 33205 70889 62934 -17086 -17080 -105976 -40650 5222 19824 -3901 -714 96973 19428
7174A9428k114j8414O4976k1464R8581j04639o8329K0687M2874q9445L0936l8541
$$ 19428 17314 -1100 63876 42412 140993 36354 -31975 -11288 31586 -57859 -26923 -65464
7162f5464J65595o7590R0930j57301p723N0416J03451p8677J7843k0434J6582
$$ -65464 100131 32541 123471 -33830 -41553 8863 112314 33637 51480 31046 47628
7151D7628Q084l4944L9278J3250o631K6664j67932J19389M115R274p6773N6509
$$ 47628 55712 20768 60046 73296 66665 93329 -74603 44786 48901 58175 -18598 37911
7139C7911k5724J9892J10525r6868j5996Q016K6575l2442k6022P0994p3971J10410
$$ 37911 12187 32079 142604 45736 29740 37756 64331 31889 5867 76861 2890 113300
7127A13300n2021l0391O1063j27332J11595m3534O305O3154j3264j1908l36j55148
$$ 113300 61279 30888 91951 -35381 76214 32680 38985 102139 88875 76967 76631 -78517
7115g8517J68636j09136P9402P1058p3055l5239j45997J35667p5951M8661M7219
$$ -78517 90119 -19017 60385 131443 58388 23149 -122848 12819 -63132 -14471 32748
7104C2748k4557N2020l9647j2461n754K0275K2697K000K94P9945j71350O7438
$$ 32748 8191 60211 20564 8103 2349 22624 45321 47321 47615 127560 -43790 23648
7092B3648r1733L5798M1830J33251p9112n7170L5561p2203N3671M3382k2949l6814
$$ 23648 -68085 -32287 9543 142794 63682 6512 42073 -30130 23541 66923 43974 7160
7080G160Q118J0781l784M3044j10617J7286l4636L2522J79901j56754l6947K8660
$$ 7160 15278 26059 22275 65319 -45298 -28012 -62648 -30126 149775 -6979 -43926 -15266
7068a5266L1470k6166j168N9146l9464N5389n019K8984j9225q1469J9552j9557
$$ -15266 16204 -9962 -11130 48016 8552 63941 58922 87906 68681 -12788 6764 -12793
7056a2793P4558m6302o002M0385J5246R683k4135k9311Q5457l4596n3974N2897
$$ -12793 61765 15463 9461 49846 65092 74775 50640 21329 106786 72190 18216 71113
7044G1113r3483M2358K6928o9382j4726N5905l5038O4172o4296M4208N1338p1181
$$ 71113 -22370 19988 46916 -22466 -37192 18713 -16325 47847 -16449 27759 79097 7916
7032G916P9520k4028k2987m9721J11731l2617J5859k2147j02740O0416K5967j7155
$$ 7916 87436 63408 40421 -9300 102431 69814 85673 63526 -39214 21202 47169 30014
7020C0014M6813p2884p059P011M420N2402j0302p1597Q1588N7189k0924m3222
$$ 30014 76827 3943 -3116 3895 8315 60717 50415 -21182 60406 117595 96671 53449
7008E3449M4429j29896L5994K0423P1734m0589L2140j08509K1302O0123n8633
$$ 53449 97878 -32018 3976 24399 96133 55544 87684 -20825 477 60600 1967
6997A967N3009L980j09834J69943o1537Q577K542j0270L8822n1734o0346L7588
$$ 1967 54976 58956 -50878 119065 57528 66105 68647 58377 97199 45465 -14881 22707
6985B2707L1211n7083j439P6014j00189P4995j1091L4460r8229R5779p5980O5192
$$ 22707 53918 -3165 -4604 71410 -28779 46216 35125 69585 -28644 67135 -8845 56347
6973E6347l0296n680m5659Q6141N861n3824k5149p5465J04309R1648j1627o8751
$$ 56347 26051 20371 -25288 60853 66714 12890 -12259 -87724 16585 108233 96606 27855
6961B7855m1856M1442m7649M1236M8534l7199l1297Q8205l3314L7729n7524O8880
$$ 27855 -14001 27441 -20208 21028 69562 32363 1066 89271 55957 93686 36162 105042
6949A05042q2217j24N06N5347j5957r853j2906n942k4970R1527k42k4253m2827
$$ 105042 22825 22701 23207 78554 62597 52744 39838 33896 8926 100453 100211 75958 33131
6936C3131L9511O0350j51606O9647m8731K4533P2111k4930N0653m6798q216p260
$$ 33131 72642 132992 -18614 51033 2302 26835 98946 74016 124669 77871 69655 62395
6924F2395m4016M7830q0240K5455J26298j38702M3663o0412R9281j41292J21573
$$ 62395 18379 66209 -14031 11424 137722 -980 42683 -17729 81552 -59740 61833
6913F1833R1622j69458P7916j8580Q9664n6257p3683P4026j4630k6401K0066p214
$$ 61833 153455 -16003 61913 43333 132997 76740 3057 77083 62453 36052 56118 48904
6901D8904M8326j3315l3865K7883j6904n825M6848j28697O3565M8572J0800j9221
$$ 48904 97230 83915 50050 77933 61029 55204 102052 -26645 36920 85492 96292 77071
6889G7071l084K2691j14281R1335j313n7731M9595j7742M0670n2979J7953O5063
$$ 77071 73987 96678 -17603 73732 72419 14688 64283 46541 87211 34232 52185 117248
6877A17248K4830m5946n6850j6065O0755n5885J32969j03697k0044l6410J49378
$$ 117248 142078 96132 39282 23217 83972 28087 161056 57359 37315 905 150283
6866A50283r5708K6156J358Q5271j77824M647R6861m6707K0864J2721p3065P1265
$$ 150283 54575 80731 82089 167360 -10464 -5817 91044 44337 65201 77922 4857 76122
6854G6122Q1241j00465L0254n4985N1556K0022l9336r0298J57307n0429n5039
$$ 76122 157363 56898 87152 32167 83723 103745 64409 -25889 131418 80989 25950
6843B5950N6324K9548n3016o0981J75001j04371O2394J2599Q4535j06806l8182
$$ 25950 82274 111822 58806 -2175 172826 68455 130849 143448 227983 121177 82995
6832H2995P4398k9827M3584j28175J2838j1656P5592j00179J01227j5906O3950
$$ 82995 157393 127566 171150 42975 55813 44157 119749 19570 120797 104891 168841
6821A68841j32943P7928R696q1161J2007M8903P4662j3312o5062r0883P7292N7466
$$ 168841 35898 113826 123522 42361 54368 103271 177933 164621 99559 8676 85968 143434
6809A43434L1758L1828p5551J7350K5841m8742J715K433n3250J5885M4861l1062
$$ 143434 175192 207020 131469 148819 174660 125918 127633 130066 76816 92701 137562 106500
6797A06500q1921J32900K1210q4179k4160Q427j2311o037K1199M6896m5151K8821
$$ 106500 24579 157479 178689 94510 70350 78777 66466 60429 81628 128524 83373 112194
6785A12194p504O9841q6338j35712J64045k1722Q116m0699n1052L4377k1359K9835
$$ 112194 104690 174531 88193 -47519 116526 94804 102920 62221 11169 45546 24187 54022
6773E4022J12817j03371n0386J12431O1157o1891p6737O8503Q0550k01129J67135
$$ 54022 166839 63468 13082 125513 186670 124779 48042 116545 197095 -4034 163101
6762A63101K9553n6663l6044l7656L3870M4793n3708K8702M3055j15790K5559
$$ 163101 192654 135991 99947 62291 96161 140954 87246 115948 159003 43213 68772
6751F8772L7477k6743n6630J20757k2476n1244K2769N1677l0479K0025l4677P38
$$ 68772 106249 79506 22876 143633 121157 69913 92682 144359 113880 133905 99228 99966
6739I9966o0274k8967J83934j02643l1450J68351j05402j3320k3879j3403L8982
$$ 99966 39692 10725 194659 92016 60566 228917 123515 110195 86316 72913 111895
6728A11895l0341k1429j4881K5460Q3451j09005n209K8334J9073M500l1300Q326
$$ 111895 81554 60125 45244 70704 154155 45150 39941 68275 87348 91848 60548 68874
6716F8874K9192L103R0225r1718K7905l5758M993N939O0988k3702p9989N6841
$$ 68874 98066 101169 191394 99676 127581 91823 96816 102755 163743 140041 60052 116893
6704A16893r7126J46005p4603n3332M5151J3249N5259o9664l3722O3970N542L3990
$$ 116893 19767 165772 91169 37837 82988 96237 151496 81832 48110 112080 117622 151612
6692A51612N0505l8028P5504j50140J27589j35470N3911l4794P2923m7921M7354
$$ 151612 202117 164089 239593 89453 217042 81572 135483 100689 173612 125691 173045
6681A73045k7385J2363M5876q1992j3048n2152L0034J1100M9660l6441r3920J25320
$$ 173045 145660 158023 203899 121907 108859 56707 86741 97841 147501 111060 17140 142460
6669A42460r531j14168P6531L0581j433J19862j26317n439K8781R1488k7463k3838
$$ 142460 132929 18761 95292 125873 124440 244302 117985 112546 141327 232815 205352 181514
6657A81514j0744k668j40199R7532R963k3068M9140m5303m007L504j2809J20610
$$ 181514 170770 168102 27903 125435 135398 112330 161470 116167 112160 115664 102855 223465
6645B23465r3348M9447q6483O2762L0487q9685J28259m3626N3532k9446O1833
$$ 223465 130117 179564 93081 155843 186330 96645 224904 181278 234810 205364 267197
6634B67197j64148O1633O0358o6759q286P7523l5436p7396k3909P3626o1068K9426
$$ 267197 103049 164682 225040 158281 149995 227518 192082 114686 90777 164403 103335 132761
6622A32761O808k126n6840O9389N4077p3856L7400L9179Q865Q279J2703l6966
$$ 132761 139569 137443 80603 149992 204069 130213 167613 206792 215657 223936 236639 199673
6610A99673J1075r2062K4380o0043N7837L0212k9625J3071j20096J09148j23077
$$ 199673 210748 118686 143066 83023 140860 171072 141447 154518 34422 143570 20493
6599B0493J77961r6835J10339j60084N9918L0544J7220J8227K1247r7974L6513
$$ 20493 198454 101619 211958 51874 111792 142336 159556 177783 199030 101056 137569
6588A37569M8431j211J8255L7222o8638r4030M3844L1486L7812q4671j7379N8252
$$ 137569 186000 184789 203044 240266 171628 77598 121442 152928 190740 106069 88690 146942
6576A46942p749l4014L6930p20N1591k3821j35268J19671r255j7292K953M8732
$$ 146942 139193 105179 142109 141389 192980 169159 33891 153562 144307 127015 129968 178700
6564A78700k409p2668O1756J32211j23147N3797j02379J7842K6276K9887j8321
$$ 178700 176291 103623 165379 297590 174443 228240 125861 143703 169979 199866 181545
6553A81545J4966n0788p4328R5031K6420p1827L8383K1250J4321n6076L463L8986
$$ 181545 196511 145723 71395 166426 192846 121019 159402 180652 194973 138897 142360 181346
6541A81346j5094N1917j37228P6193Q7004p6557R9435o5391N8930K927r0403P6345
$$ 181346 166252 218169 80941 157134 244138 167581 267016 201625 260555 263482 173079 249424
6529B49424k6447L0597J0804O738N096M0611l2580J6207o1822J13795p3505J4564
$$ 249424 222977 253574 264378 271116 276212 316823 284243 300450 238628 352423 278918 293482
6517B93482J45993k23514O6007J07922j95703L661Q7812o1273r3496J05717m4414
$$ 293482 439475 215961 281968 389890 194187 197848 285660 224387 130891 236608 192194
6506A92194R7954l6162J4345p1472p547J14428l9380K9678q4027P6513J6652J6397
$$ 192194 290148 253986 268331 196859 189312 303740 264360 294038 210011 286524 303176 319573
6494C19573j7764Q8340R2552j66527P3504j010l0051j38040J42929l6473q0371
$$ 319573 301809 390149 482701 316174 389678 388668 358617 220577 363506 327033 246662
6483B46662O5587p6892J06789j41304P0718L1791o638J23854m8923j61057Q1008
$$ 246662 312249 235357 342146 200842 271560 303351 296713 420567 371644 210587 291595
6472B91595p3904P6201p8572j11415J41718O1520k9100k8408K7127N802J8986
$$ 291595 217691 293892 215320 103905 245623 307143 278043 249635 276762 282564 301550
6461C01550j1204K6274O2018j67625N8350o6037M5444R340M0844M9359n7919J02974
$$ 301550 290346 316620 378638 211013 269363 203326 248770 258110 298954 348313 290394 393368
6449C93368q8156k2300l3303N9960K3779j5087k2470J2081O6022p3243K7256L9444
$$ 393368 305212 282912 249609 309569 333348 318261 295791 307872 373894 300651 327907 367351
6437C67351n1696L4895j07257N3059m9805J03339k6169m4089m788l6543J17630
$$ 367351 315655 350550 243293 296352 246547 349886 323717 279628 274840 238297 355927
6426C55927l4407L4631m7776l582M9369o9240K9817j8203m729J23735j10794N5971
$$ 355927 321520 356151 308375 304793 354162 284922 314739 296536 291807 415542 304748 360719
6414C60719q4046j3978M4252j2249l5199P3223L3060L2099m8113K203n6497O4359
$$ 360719 276673 262695 306947 294698 259499 332722 365782 397881 349768 351971 295474 359833
6402C59833k1881J2058K1354o7022M6568j6604J2004p1101J6624O8777L5197o4473
$$ 359833 337952 350010 371364 304342 350910 334306 346310 275209 291833 360610 395807 331334
6390C31334j3411J09846n8944K5028j6528r5773R5391p01K8355j3838L914R0468
$$ 331334 317923 427769 368825 393853 377325 281552 376943 376242 404597 390759 394673 485141
6378D85141q6861M9713l3374n19j3807M4584n9840J28676o1210N3048K5182l1192
$$ 485141 398280 447993 414619 414100 400293 444877 385037 513713 452503 505551 530733 499541
6366D99541p2561J3519Q7276n1123M4342M0497q1921l9530Q8383O2235l9922l0962
$$ 499541 426980 440499 527775 476652 520994 561491 479570 440040 528423 590658 550736 519774
6354E19774L455p2295O0639Q0726J2304m4811J68137j57674J73582o9257Q6394
$$ 519774 523229 450934 511573 592299 604603 559792 727929 570255 743837 674580 760974
6343G60974N9766Q0926M0559M500R2153n3519O6468J64554J0533o4315J27926
$$ 760974 820740 901666 942225 946725 1038878 985359 1051827 1216381 1226914 1162599 1290525
6332A290525J23758O5576Q7662J34423P1360J25195K48709K66808J63098K39530
$$ 1290525 1414283 1479859 1567521 1701944 1773304 1898499 2147208 2414016 2577114 2816644
6322B816644L46831M39230M66013Q15983J117325J734175K566260L202748K527987
$$ 2816644 3163475 3602705 4068718 4884701 6002026 7736201 10302461 13505209 16033196
6313A6033196J410326m20578r84220j786931k305271k310448k193309j785745
$$ 16033196 17443522 17022944 16038724 14251793 11946522 9636074 7442765 5657020
6305E657020j204409q82053o60700l59272m20663l40873j03969k22014j36166
$$ 5657020 4452611 3570558 2909858 2550586 2129923 1789050 1685081 1463067 1326901
6296A326901r7148k2876o5450j17568M5884n6798j66620J0947j4669p051m3485
$$ 1326901 1229753 1206877 1141427 1023859 1069743 1012945 846325 857272 842603 835552 792067
6285G92067J0088K9480J6081j6529l7598j4780L5035o9946N3371j1285k8517n9647
$$ 792067 802155 831635 847716 831187 793589 778809 813844 743898 797269 785984 757467 697820
6273F97820j06383L7977n3209K3708n9127Q1104q0640O1132k8727r9231Q9386
$$ 697820 591437 629414 576205 599913 540786 621890 541250 602382 573655 474424 563810
6262E63810o6118r025j14853J03629j9038o903N4315j21720M8506j035r3325O0348
$$ 563810 497692 488667 373814 477443 458405 451502 505817 384097 432603 431568 338243 398591
6250C98591J0489l6413j8074k0877J05337K0423j34583O0945P8704j58240M475
$$ 398591 409080 372667 354593 333716 439053 459476 324893 385838 464542 306302 310777
6239C10777Q0337n3849J7361M9271p840o8054N8139K7039j07928J2980J34801
$$ 310777 391114 337265 354626 403897 396057 328003 386142 413181 305253 318233 453034
6228D53034j17042l5283O669j9080K6954n8125J48690j07568L8633J3409j16335
$$ 453034 335992 300709 307378 288298 315252 257127 405817 298249 336882 350291 233956
6217B33956N2295K0893M9956l3614n1881Q103l8819R7148m3392n3132P685L3849
$$ 233956 286251 307144 357100 323486 271605 279708 240889 338037 294645 241513 249198 283047
6205B83047k3925L6021r4534N6977O7346p081q7983Q853r478L524R0293r4242
$$ 283047 259122 295143 200609 257586 324932 317851 229868 238721 229243 232767 323060 228818
6193B28818M08P7622p4917N2083n5221P8293L6985j44139K8260O5404J2188p3522
$$ 228818 229226 306848 231931 284014 228793 307086 344071 199932 228192 293596 305784 232262
6181B32262N7480k5665J116J091M9917K5977m7584J3538Q8811p5372n7904O2185
$$ 232262 289742 264077 265193 266284 316201 342178 294594 308132 396943 321571 263667 325852
6169C25852q2250Q1255q1448N7981n9921O4258n9644L5922P1971l588M0602j08433
$$ 325852 243602 324857 243409 301390 241469 305727 246083 282005 353976 350388 390990 282557
6157B82557n1539N3677J1601J7733j7661o491J9031K4994n2704L9689m52p156
$$ 282557 231018 284695 296296 314029 296368 289877 308908 333902 281198 320887 320435 313279
6145C13279o1823N0379K1409N254n8533k7390K4811m476j9391K6745M0534k904
$$ 313279 251456 301835 323244 328498 269965 242575 267386 262910 243519 270264 310798 307894
6133C07894j0926J3193j29728O7591M1583j25731J39720n2680L6197O639N6155
$$ 307894 296968 310161 180433 248024 289607 163876 303596 250916 287113 293752 349907
6122C49907j02259M5467L1842j7614p4451R7772m1167R636J15111r3842M7366
$$ 349907 247648 293115 324957 307343 232892 330664 289497 299133 414244 320402 367768
6111C67768j9581J7294j13008L4996R4187j59954O8399j9105K1913M6866m1665
$$ 367768 348187 365481 252473 287469 381656 221702 290101 270996 292909 339775 298110
6100B98110O2490j00330J9199K8535O8831m0094N7138q2387l930P1665K5337j09005
$$ 298110 360600 260270 279469 308004 376835 336741 393879 311492 307562 379227 404564 295559
6088B95559k4452j5581J36440j81266J41464n7940N3726K8549m1577j3921l5246
$$ 295559 271107 255526 391966 210700 352164 294224 347950 376499 334922 321001 285755
6077B85755K2895m8903O2741j10208J83284n7634o5330j8406L2741q9578J38497
$$ 285755 308650 259747 322488 212280 395564 337930 272600 254194 286935 197357 335854
6066C35854L5398J0012j04483P9331O1907j70765M5596J8478J23724j50571P1286
$$ 335854 371252 381264 276781 356112 418019 247254 292850 311328 435052 284481 355767
6055C55767r7595P246J02294r7960l2463Q235R9299l64N7367r4975k4719m612
$$ 355767 258172 265418 367712 269752 237289 245524 344823 344459 401826 306851 282132 277520
6043B77520L8034j8673o3000P2932K1947L2685l9167q6186N4098K5770N7575J46544
$$ 277520 315554 296881 233881 306813 328760 361445 322278 236092 290190 315960 373535 520079
6031E20079q5715m5410L3497j15100J42279j27729j414J47661o9958L3319j0481
$$ 520079 434364 388954 422451 307351 449630 321901 320487 468148 398190 431509 421028
6020D21028j68786J27162p6186J35032m5748J3425J134j3869M3671n8594R9432
$$ 421028 252242 379404 303218 438250 392502 405927 407061 393192 436863 378269 477701
6009D77701m0109L7532J3048n4177l3912L7035K7124L440N9754j36825L3133j0750
$$ 477701 437592 475124 488172 433995 400083 437118 464242 467682 527436 390611 423744 412994
5997D12994o7543P1516o0024J19534L059n3693N4724j18379J44793O182N726m5593
$$ 412994 345451 416967 356943 476477 479536 425843 480567 362188 506981 513163 518889 473296
5985D73296o5057N8133M007j5429L7630k8577K0066O6531q1588k5228K8045j7091
$$ 473296 408239 466372 470379 454950 492580 464003 484069 550600 469012 443784 471829 454738
5973D54738j7617m019M2807l4977r5009M7134M3407o1830Q5620O55j7257l3373
$$ 454738 437121 433102 475909 440932 345923 393057 436464 374634 460254 460909 443652 410279
5961D10279Q9142p9867M7624P904n8559J09623j4263n6708J0197N8773k2376O0936
$$ 410279 499421 419554 467178 475082 416523 526146 511883 455175 465372 524145 501769 562705
5949E62705M3821j46515L4402O1915j10148J5121m509R49J32323Q2425j79044
$$ 562705 606526 460011 494413 556328 446180 461301 456792 457741 590064 672489 493445
5938D93445p4233o8499P5764k1318O8587p677k46O282L4019o8469k4034O9580
$$ 493445 419212 350713 426477 405159 473746 466069 465823 472105 506124 437655 413621 483201
5926D83201Q851j408j11311R9634P2523m1045p944k4341o4915O1857Q829m0082
$$ 483201 492052 490644 379333 478967 551490 510445 502501 478160 413245 475102 483931 443849
5914D43849M6073l3330m1639P7664m8897J0273k6449J16886j1113J6278j40601
$$ 443849 489922 456592 414953 492617 443720 453993 427544 544430 533317 549595 408994
5903D08994P4156m8009J0265j02784Q6335P6022K5285P2812m5913M708P4463r4090
$$ 408994 483150 435141 445406 342622 428957 504979 530264 603076 557163 561871 636334 542244
5891E42244L3691j01799R6721o762K0437L3563o3970o9117J21475n8996p8533
$$ 542244 575935 474136 570857 564095 584532 618095 554125 485008 606483 547487 468954
5880D68954Q4063J4796Q8190p4770r9245N7723L5480m0039K6166J21313j31267
$$ 468954 553017 567813 656003 581233 481988 539711 575191 535152 561318 682631 551364
5869E51364J16396j05840P1085j4502l4519m1757P1963O787N769o0522J02612
$$ 551364 667760 561920 633005 618503 583984 542227 614190 620977 626746 566224 668836
5858F68836n9393J528J16708n5021k0577l8303R2417q3819Q5891j1401q875l3615
$$ 668836 609443 610971 727679 672658 652081 613778 706195 622376 708267 696866 687991 654376
5846F54376m8161J12250k3087J5220L1895n8240L0155K4356N6244N897l1384P6581
$$ 654376 606215 718465 695378 710598 742493 684253 714408 738764 795008 800905 769521 846102
5834H46102j02761J6861J09282j8928L2806r9556J12849n2981L3611k054K3701
$$ 846102 743341 760202 869484 850556 883362 783806 896655 843674 877285 875231 898932
5823H98932O1308m414j12401O4025L6803p097L6646Q9176m3622o5557O1006O39
$$ 898932 960240 955826 843425 907450 944253 937156 973802 1062978 1019356 953799 1014805 1015444
5811A015444l1829J8570K7419l10n912M2511n0250J02165Q0383k6331q9184J67055
$$ 1015444 983615 1002185 1029604 1029294 1023382 1065893 1015643 1117808 1198191 1171860 1082676 1249731
5799A249731K8229j67391R4947P9358O96k8950j7381M2054n3268J1184J52542
$$ 1249731 1277960 1110569 1205516 1284874 1285570 1256620 1239239 1281293 1228025 1239209 1391751
5788A391751k07603O3746N1731J05830n5614R7859L6968J8393l7481P3003M5179
$$ 1391751 1184148 1247894 1299625 1405455 1349841 1447700 1484668 1503061 1465580 1538583 1583762
5777A583762M4527J5284k3804O2098K3879M7016K8809j0502J03383Q9600j7490
$$ 1583762 1628289 1643573 1619769 1681867 1705746 1752762 1781571 1771069 1874452 1964052 1946562
5766A946562K7141J7170J5327R0647l1730l6320J8764P6985p9116K15794k3819
$$ 1946562 1973703 1990873 2006200 2096847 2065117 2028797 2047561 2124546 2045430 2261224 2237405
5755B237405R1402N0240O2684R2639l7351J32567P2929M7999P2292J4263J66602
$$ 2237405 2328807 2379047 2441731 2534370 2497019 2629586 2702515 2750514 2822806 2837069 3003671
5744C003671N0482J46906K84186L9752J28248Q9035J94265K07517K38342K35834
$$ 3003671 3054153 3201059 3485245 3524997 3653245 3742280 3936545 4144062 4382404 4618238
5734D618238K01289L51816K26827M48944J56133L50913N12583M14793N57389M65070
$$ 4618238 4819527 5171343 5398170 5847114 6003247 6354160 6866743 7281536 7838925 8303995
5724H303995O11177O09866P15730Q80761P42914J207491J022690J335534J557624
$$ 8303995 8915172 9525038 10240768 11121529 11864443 13071934 14094624 15430158 16987782
5715A6987782J452161J960318J998916K122806K179910K128615J904461J648610
$$ 16987782 18439943 20400261 22399177 24521983 26701893 28830508 30734969 32383579
5707C2383579R93787K92719j58911j098154j482490j975944k218213k311189k221426
$$ 32383579 33377366 33670085 33511174 32413020 30930530 28954586 26736373 24425184 22203758
5698B2203758k220388j886288j813908j593858j417047j101065j233176r48306
$$ 22203758 19983370 18097082 16283174 14689316 13272269 12171204 10938028 9989722
5690I989722o87967p75536n85387o28849m16279m55925m28479j87844l94140k22652
$$ 9989722 9301755 8526219 7940832 7311983 6895704 6439779 6011300 5823456 5429316 5206664
5680E206664k54203j66147j70951k00181k08676j28436n8032k10980j26446j21368
$$ 5206664 4952461 4786314 4615363 4415182 4206506 4078070 4020038 3809058 3682612 3561244
5670C561244p1551o6885j09892j14766j61871j5584p2874j66288J37674j26248
$$ 3561244 3489693 3422808 3312916 3198150 3036279 3020695 2947821 2781533 2919207 2792959
5660B792959q4238P5769L2105J1657m5615j32407j06480m5217q4403j47154o5436
$$ 2792959 2708721 2784490 2816595 2828252 2782637 2650230 2543750 2498533 2414130 2266976 2201540
5649B201540j09244k16385J8938j14375L8158J2005j01045j23206k2103l5065
$$ 2201540 2092296 1875911 1894849 1780474 1818632 1830637 1729592 1606386 1584283 1549218
5639A549218l8693n2308M7123o2541n2736M789l7252K1841j09735O6879K3143
$$ 1549218 1510525 1458217 1505340 1442799 1390063 1394852 1357600 1379441 1269706 1336585 1359728
5628A359728k4342r6013m0670l8241K5668r3440N7242o576m1519P5589J2454j28911
$$ 1359728 1335386 1239373 1198703 1160462 1186130 1092690 1149932 1143356 1101837 1177426 1189880 1060969
5616A060969n3951L6156o4259Q5464n2769p3327Q8973j9222L5160j84735R0969
$$ 1060969 1007018 1043174 978915 1064379 1011610 938283 1027256 1008034 1043194 858459 949428
5605I49428j1771L4448p2443M669K7261m2934p5639O5123n7699K8474L8990q9388
$$ 949428 937657 972105 899662 904331 931592 888658 813019 878142 820443 848917 887907 798519
5593G98519O4924o5749L4341K8352j77291J11146J28933o9424K3100N3526j08981
$$ 798519 863443 797694 832035 860387 683096 794242 923175 853751 876851 930377 821396
5582H21396k5095P9865o3840P2235r2475J16439j1578q4721J44261r7474J18238
$$ 821396 796301 876166 812326 884561 792086 908525 896947 812226 956487 859013 977251
5571I77251l0971m8905k0704P9861j949m3652l2473q2950L4791J11505k9232O6559
$$ 977251 946280 897375 876671 956532 954583 910931 878458 795508 830299 941804 912572 979131
5559I79131j05093P7145j44068R2362r6856K9554J6534J98164o8061K7523r8962
$$ 979131 874038 951183 807115 899477 802621 832175 848709 1046873 978812 1006335 907373
5548I07373N3460k5949M4653L0276o4165K6334J3856J32352j25804J30286m1738
$$ 907373 960833 934884 979537 1009813 945648 971982 985838 1118190 992386 1122672 1080934
5537A080934N5092J71517Q422O4132L1269K6686n9776m1296K7536L3890R6353
$$ 1080934 1136026 1307543 1315965 1380097 1411366 1438052 1378276 1336980 1364516 1398406 1494759
5526A494759p3873k0550j31J4261L4292P9405J96017N085Q3482K69507J38059
$$ 1494759 1420886 1400336 1400205 1414466 1448758 1528163 1724180 1729265 1812747 2082254 2220313
5515B220313J12599J74507K48820K75665M46832O26725Q74616J385002K005303
$$ 2220313 2332912 2507419 2756239 3031904 3478736 4105461 4980077 6365079 8370382
5506H370382K424137J483413N85662k85929j093004j487842j539389j653887j452964
$$ 8370382 10794519 12277932 12863594 12577665 11484661 9996819 8457430 6803543 5350579
5497E350579j175738q27054m71465l96674k90017k09026k66841j15424j59704
$$ 5350579 4174841 3347787 2876322 2479648 2189631 1980605 1713764 1598340 1438636
5488A438636j51883M2032r1520n6514J4378j42280P2240j08489l2861K8650M8909
$$ 1438636 1286753 1328785 1237265 1180751 1195129 1052849 1125089 1016600 983739 1012389 1061298
5477A061298k8495J2240n621R793j8230m3697R34M7403K3834p8125k1343J1058
$$ 1061298 1032803 1045043 1039422 1049215 1030985 987288 988222 1035625 1059459 981334 959991 971049
5465I71049J1662q0029q1543l2931q088K8250R9491j9986r2620k4078L0290K499
$$ 971049 982711 902682 821139 788208 780120 808370 907861 887875 795255 771177 801467 803966
5453H03966l9375k0433M2640j6621J7965m1147q5626J36665j54510O5240k2300
$$ 803966 764591 744158 786798 770177 788142 746995 661369 798034 643524 708764 686464
5442F86464J7623Q308L867k2636l6747l7230K9578J2414M1564o3958R7581j04251
$$ 686464 704087 712395 716262 693626 656879 619649 649227 661641 703205 639247 736828 632577
5430F32577O2946q3167R1746m9707p03L7926K3487o2100n1511M8495l5841N2955
$$ 632577 695523 612356 704102 654395 653692 691618 715105 653005 601494 649989 614148 667103
5418F67103N226m4056r0193P8010J9803l1374L4522J21612o2116L3250q0042N6540
$$ 667103 672329 628273 538080 616090 635893 604519 639041 760653 698537 731787 651745 708285
5406G08285M7536j38485R1973p285K4638l9654O4247m7763P0467m9216m2260N7313
$$ 708285 755821 617336 709309 702024 726662 687008 751255 703492 773959 724743 682483 739796
5394G39796j37409P8102o3845J61300p5265p886M4033P91Q8561j43333J31995
$$ 739796 602387 680489 616644 777944 702679 694793 738826 739617 828178 684845 816840
5383H16840Q377L279l3887M8549m7938P3970O7132p5884N0932j9386J9009j7898
$$ 816840 825217 828496 794609 843158 795220 869190 936322 860438 911370 891984 910993 893095
5371H93095k3516P850J00329k3362O6867j08232Q5809o6410Q241Q576N2825J0831
$$ 893095 869579 877429 977758 954396 1021263 913031 998840 932430 940671 949247 1002072 1012903
5359A012903O2503R0617r8369O9676Q7758q7324l314k2715J45512K7069M2417
$$ 1012903 1075406 1166023 1067654 1137330 1225088 1137764 1134450 1111735 1257247 1284316 1326733
5348A326733M717P3904j8876R1439l4476J40114Q2241J09965Q1338R1483J94054
$$ 1326733 1331450 1405354 1386478 1477917 1443441 1583555 1665796 1775761 1857099 1948582 2142636
5337B142636J67594K84674N51852N64289N13623K30235j0679p0201k47157m14850
$$ 2142636 2310230 2594904 3146756 3711045 4224668 4454903 4444224 4374023 4126866 3712016
5327C712016j14260l84987j38947j72347O5500K8343K65650J42055L48184L50926
$$ 3712016 3597756 3212769 3073822 2901475 2966975 2995318 3260968 3403023 3751207 4102133
5317D102133J83403L07514J37726L66314K91333M88971L85516L32810K67985K26928
$$ 4102133 4285536 4593050 4730776 5097090 5388423 5877394 6262910 6595720 6863705 7090633
5307G090633J51289J60499L47352L08160J22124J22397K5236j09596l51306j80235
$$ 7090633 7241922 7402421 7749773 8057933 8180057 8302454 8327690 8218094 7866788 7686553
5297G686553k54301j40125k45338l25227l30844m33606l61002l87070l20493k68187
$$ 7686553 7432252 7292127 7046789 6721562 6390718 5957112 5596110 5209040 4888547 4620360
5287D620360l04607l80547k79466l49872l80983p4110k79216l09911n7073j69197
$$ 4620360 4315753 3935206 3655740 3305868 2924885 2850775 2571559 2261648 2204575 2035378
5277B035378M56j24549M8029n0622q9295J5790J9620M8345k00572J22525R777
$$ 2035378 2035834 1911285 1959314 1908692 1819397 1835187 1854807 1903152 1702580 1825105 1834882
5266A834882k2705R5464l9802j10126M1652K9388n1260j3802M245m7516Q4228
$$ 1834882 1812177 1907641 1867839 1757713 1799365 1828753 1777493 1763691 1767936 1720420 1804648
5255A804648o8302M0693J685J11536p3435L0666o7419J2783M3857L6411k1473
$$ 1804648 1736346 1777039 1778724 1890260 1816825 1847491 1780072 1792855 1836712 1873123 1851650
5244A851650l2912N5796j159K1424m8507L2719j29M4758P1111p8672N9284K602
$$ 1851650 1818738 1874534 1873375 1894799 1846292 1879011 1878882 1923640 1994751 1916079 1975363 1977965
5232A977965j25325J03051k6160P4290o5222o8976M3320P4036o1093J897K493
$$ 1977965 1852640 1955691 1929531 2003821 1938599 1869623 1912943 1986979 1925886 1927783 1930276
5221A930276j18039J0318o3600p6750K432Q2386k5963M5586l9827o2424j03112
$$ 1930276 1812237 1822555 1758955 1682205 1684637 1767023 1741060 1786646 1746819 1684395 1581283
5210A581283J12539m4186J35071r8200l1173j9219K5736r8989O4716j3400j921
$$ 1581283 1693822 1649636 1784707 1686507 1655334 1636115 1661851 1562862 1627578 1614178 1612257
5199A612257L3546r634k0385K12L7716R3884l5577n3904J68272o7897j4529J9177
$$ 1612257 1645803 1636169 1615784 1615996 1653712 1747596 1712019 1658115 1826387 1758490 1743961 1763138
5187A763138m2456L2203Q3426l1622J4295Q299O6942n5967O7060n3738J26918
$$ 1763138 1720682 1752885 1836311 1804689 1818984 1827283 1894225 1838258 1905318 1851580 1978498
5176A978498L596R5433J4124M2945o399O3331J07463K1777J06138J70248L157
$$ 1978498 1982094 2077527 2091651 2134596 2128197 2191528 2298991 2320768 2426906 2597154 2600311
5165B600311K41989j08647K19657O3220K2150R7521K433J03592R8925l9995p9691
$$ 2600311 2842300 2733653 2953310 3016530 3038680 3136201 3138634 3242226 3341151 3301156 3221465
5154C221465O2143q2956J17086L243o4943m1017J22372j78883j4191j42767j4736
$$ 3221465 3283608 3200652 3317738 3320981 3256038 3215021 3337393 3158510 3144319 3001552 2986816
5143B986816r4336j80971K1764j48330o7525K4487j07686n9190L6505Q718K5744
$$ 2986816 2892480 2711509 2733273 2584943 2517418 2541905 2434219 2375029 2411534 2420252 2445996
5132B445996K4557j22528J44981K050k4486M8510j0007M2381M3099L591J3362
$$ 2445996 2470553 2348025 2493006 2495056 2470570 2519080 2509073 2551454 2594553 2598144 2611506
5121B611506L1326q1080J28416k1858j0453J26315J278Q0984j1977J11419o9623
$$ 2611506 2642832 2561752 2690168 2668310 2657857 2784172 2785450 2866434 2854457 2965876 2896253
5110B896253o975N9344M5549L8115r653J05639q7042M2818J03286l4081j6122
$$ 2896253 2889278 2948622 2994171 3032286 3022633 3128272 3041230 3084048 3187334 3153253 3137131
5099C137131J32174R3424l6712J54974m7632J22781O2288Q9860k9485J05402R8805
$$ 3137131 3269305 3362729 3326017 3480991 3433359 3556140 3618428 3708288 3678803 3784205 3883010
5088C883010N2836J24509O3545K4428M4448K19193k2561O9682J59220k9293J05247
$$ 3883010 3935846 4060355 4123900 4148328 4192776 4411969 4389408 4459090 4618310 4589017 4694264
5077D694264K3914L8878J13431R092l7884J72082J06224k0495N1594J53758k4484
$$ 4694264 4718178 4757056 4870487 4879579 4841695 5013777 5120001 5099506 5151100 5304858 5280374
5066E280374J46470j7840K6017J38198J99329q5258J37998Q4128K10319N4645
$$ 5280374 5426844 5409004 5435021 5573219 5772548 5687290 5825288 5909416 6119735 6174380
5056F174380L8562K24198J50652P4640l0804K40611Q8815J61387K11027J68562
$$ 6174380 6212942 6437140 6587792 6662432 6631628 6872239 6961054 7122441 7333468 7502030
5046G502030K19187J32956J90826J86774K46792L75858K15113L51691M20100J94769
$$ 7502030 7721217 7854173 8044999 8231773 8478565 8854423 9069536 9421227 9841327 10036096
5036A0036096L36839M44664M40928N41736M52977N68515O20679N88650P20099
$$ 10036096 10372935 10817599 11258527 11800263 12253240 12821755 13442434 14031084 14751183
5027A4751183Q22291J012432J036184J146240J356263J660480J768371K051789
$$ 14751183 15573474 16585906 17622090 18768330 20124593 21785073 23553444 25605233
5019B5605233K405949K786192L254407L566578L469313L745424L386330K857869
$$ 25605233 28011182 30797374 34051781 37618359 41087672 44833096 48219426 51077295
5011E1077295K549080J875160J180536P49371o3597m65831r18886r56017j009577
$$ 51077295 53626375 55501535 56682071 57431442 57367845 56902014 55983128 55027111 54017534
5002E4017534p68018o80576k08929l9714M96353P15231J106761J385016J627194
$$ 54017534 53249516 52568940 52360011 52320297 52816650 53531881 54638642 56023658 57650852
4993E7650852J941611K169774K438537K503106K677290K699822K597577K556201
$$ 57650852 59592463 61762237 64200774 66703880 69381170 72080992 74678569 77234770
4985G7234770K429057K366071K140235K062010J907724K077552J935265J800742
$$ 77234770 79663827 82029898 84170133 86232143 88139867 90217419 92152684 93953426
4977I3953426J706386J666869J298326R20062O75809K12485j45228l93874o68058
$$ 93953426 95659812 97326681 98625007 99545069 100220878 100433363 100288135 99894261 99226203
4968I9226203q69045r51391j014243j204361j292304j512077j635260j904704
$$ 99226203 98357158 97405767 96391524 95187163 93894859 92382782 90747522 88842818
4960H8842818k286906k333012k458098k610029k679526k687295k632604k651604
$$ 88842818 86555912 84222900 81764802 79154773 76475247 73787952 71155348 68503744
4952F8503744k515937k499957k436409k344725k341187k234554k148804k202176
$$ 68503744 65987807 63487850 61051441 58706716 56365529 54130975 51982171 49779995
4944D9779995j833978j716438j507664j338845j080091r05620p03161m30075k16761
$$ 49779995 47946017 46229579 44721915 43383070 42302979 41397359 40694198 40264123 40047362
4935D0047362j48847K12186L31716N46019P73264J017863J280159J719442J939988
$$ 40047362 39898515 40110701 40442417 40988436 41761700 42779563 44059722 45779164 47719152
4926D7719152K380312K765325L337772L763403M622276N036141O052797P106539
$$ 47719152 50099464 52864789 56202561 59965964 64588240 69624381 75677178 82783717
4918H2783717Q429375J0093659J2081000J4771754J7494222K0607901K3370992
$$ 82783717 91213092 101306751 113387751 128159505 145653727 166261628 189632620
4911A89632620K5059236K4930535K2581056J8341954J2856801P065141J664787
$$ 189632620 214691856 239622391 262203447 280545401 293402202 300467343 302132130
4904C02132130k854216n699472p059140p134757o283319n447644m568927m919754
$$ 302132130 299277914 293578442 286519302 279384545 273101226 267653582 263084655 258164901
4896B58164901n971333q299307j1248021j4368838j6874932j8717250j9539154
$$ 258164901 252193568 243894261 232646240 218277402 201402470 182685220 163146066
4889A63146066j9113402j8025097j6288150j4236700j2151799j0090262q555587
$$ 163146066 144032664 126007567 109719417 95482717 83330918 73240656 64685069
4882F4685069p020062n833845m712267l914769l356351k690606k203261j989177
$$ 64685069 57665007 51831162 47118895 43204126 39847775 37157169 34953908 32964731
4874C2964731j674352j539052j255356j110458r43283q75594q44329p34828p51789
$$ 32964731 31290379 29751327 28495971 27385513 26442230 25566636 24722307 23987479 23235690
4865B3235690n29974p01829o17776o25683n84493n37688n34591m38648n34020
$$ 23235690 22705716 22003887 21386111 20760428 20175935 19638247 19103656 18665008 18130988
4856A8130988n47113m83717n66678n22422n12223l69453l98689n17482l72111
$$ 18130988 17583875 17100158 16533480 16011058 15498835 15129382 14730693 14213211 13841100
4847A3841100m91466k59970l72572l91969k16649k92830j85986l32761j83932
$$ 13841100 13349634 13089664 12717092 12325123 12108474 11815644 11629658 11296897 11112965
4838A1112965l48330k20891j65713l00451j67467k01407m8531p0352k7185Q069
$$ 11112965 10764635 10543744 10378031 10077580 9910113 9708706 9660175 9589823 9562638 9570707
4828I570707j14607k26852k65699j00500l45045j74282j93103k03284l31751r1493
$$ 9570707 9456100 9229248 8963549 8863049 8518004 8343722 8150619 7947335 7615584 7524091
4818G524091k06548j17915j87271j39101L4194j11930r0073q4838j73990j06618
$$ 7524091 7317543 7199628 7012357 6873256 6907450 6795520 6705447 6620609 6446619 6340001
4808F340001o3396j20915R606j88217j89041m3277o7465M3642j53329j43890L5826
$$ 6340001 6276605 6155690 6165296 5977079 5788038 5744761 5677296 5720938 5567609 5423719 5459545
4797E459545r1957J9460j41977M0873J8372l1807q374K0338K7204K0753J17324
$$ 5459545 5367588 5387048 5245071 5285944 5304316 5272509 5264135 5284473 5311677 5332430 5449754
4786E449754j31778N8531j8825M4358l5653J40756K5110j5762P7478O1026M3402
$$ 5449754 5317976 5376507 5357682 5402040 5366387 5507143 5532253 5516491 5593969 5654995 5698397
4775E698397J07468J9515O6477J0632O5999M5683j86575L32082r7352J96334M8739
$$ 5698397 5805865 5825380 5891857 5902489 5968488 6014171 5827596 6159678 6062326 6258660 6307399
4764F307399P9102L8924M8186k5092Q7976R5802N9432j2545J68356j2404Q6874
$$ 6307399 6386501 6425425 6473611 6448519 6536495 6632297 6691729 6679184 6847540 6835136 6922010
4753F922010r2903K39604l7124J64484J42610J43109J85543K70516M78463M28844
$$ 6922010 6829107 7068711 7031587 7196071 7338681 7481790 7667333 7937849 8416312 8845156
4743H845156J58033Q4132J1088j82972p8605j72917j26457j47791M4408O2695
$$ 8845156 9003189 9087321 9098409 8915437 8836832 8663915 8537458 8389667 8434075 8496770
4733H496770J1719J33029J0217J96095K90827J05517J86697K02076L08301K04338
$$ 8496770 8508489 8641518 8651735 8847830 9138657 9244174 9430871 9632947 9941248 10145586
4723A0145586L21882K90950L87434M34446M80105O96751O73858P36467M22059
$$ 10145586 10467468 10758418 11145852 11580298 12060403 12757154 13431012 14167479 14589538
4714A4589538M13591L31211J46362J31032J33933J88717J44641K44126L33125
$$ 14589538 15003129 15334340 15480702 15611734 15745667 15934384 16079025 16323151 16656276
4705A6656276K89159N06178M36895N75929L83422N60204N46195N89019N53777
$$ 16656276 16945435 17451613 17888508 18464437 18847859 19408063 19954258 20543277 21097054
4696B1097054N48691O44169P84374R16619R45501R70167J218945J388994J337382
$$ 21097054 21645745 22289914 23074288 23990907 24936408 25906575 27125520 28514514 29851896
4687B9851896J716567J723530J809260J887701K198777K136268K334794K507302
$$ 29851896 31568463 33291993 35101253 36988954 39187731 41323999 43658793 46166095
4679D6166095K538778K706932K917760L109718L539074L819954M279859M995652
$$ 46166095 48704873 51411805 54329565 57439283 60978357 64798311 69078170 74073822
4671G4073822N894435O443687P967641R276977J0548270J1785481J2131850J2110570
$$ 74073822 79968257 86411944 94379585 103656562 114204832 125990313 138122163 150232733
4663A50232733J1449189R928063Q475584P369525O466858O142758O409027P228534
$$ 150232733 161681922 171609985 180085569 187455094 193921952 200064710 206473737 213702271
4655B13702271Q084642Q794131Q706365P948187O301501L640542K85605l305529
$$ 213702271 221786913 230581044 239287409 247235596 253537097 257177639 257463244 254157715
4647B54157715o280458r063640j0559026j1105015j1004759j0143408r100848
$$ 254157715 247877257 238813617 228254591 217149576 206144817 196001409 186900561
4640A86900561q225717q082940q304875r051071j0119038j1089886j1542835j1594061
$$ 186900561 178674844 170591904 162287029 153235958 143116920 132027034 120484199 108890138
4632A08890138j1557867j0710874r747246q628374p605156o516828n276293m599409
$$ 108890138 97332271 86621397 76874151 68245777 60640621 54123793 48847500 44248091
4624D4248091l875154l211633k649784k227814j903500j653696j279816j223102
$$ 44248091 40372937 37161304 34511520 32283706 30380206 28726510 27446694 26223592
4616B6223592q80388r61831p74924o50532o37491o92403m79167o45832n81390
$$ 26223592 25343204 24381373 23606449 22955917 22318426 21626023 21146856 20501024 19919634
4607A9919634m44057n18854m87582m89919l30919m46887n00875l17190l45983
$$ 19919634 19475577 18956723 18469141 17979222 17648303 17201416 16700541 16383351 16037368
4598A6037368l80379m42239m58433m62041o05025m10205o17808n51303l94604
$$ 16037368 15656989 15214750 14756317 14294276 13689251 13279046 12661238 12109935 11715331
4589A1715331m51634l65355m57385k50582m53519l09064m07638k54002k55889
$$ 11715331 11263697 10898342 10440957 10190375 9736856 9427792 9020154 8766152 8510263
4580H510263l89571l30315l71260k14228l60792j67390k66602j22292k89769r1367
$$ 8510263 8120692 7790377 7419117 7204889 6844097 6676707 6410105 6287813 5998044 5906677
4570E906677j76818k35706p140j02403k26528q3518m9020k89832j17114p8448
$$ 5906677 5729859 5494153 5487013 5384610 5158082 5074564 5025544 4735712 4618598 4540150
4560D540150k21331j17036k2128j55049j84358j92276n0159l5847k58101O5816
$$ 4540150 4318819 4201783 4179655 4024606 3840248 3647972 3597813 3561966 3303865 3369681
4550C369681j87600r9311j42965n8539p9835l4492j28455o3249j82194O40n8540
$$ 3369681 3182081 3082770 2939805 2881266 2801431 2766939 2638484 2575235 2393041 2393681 2335141
4539B335141k2761r8143r1157j3959m2196K0576q3066o7857O7700k14577K9827
$$ 2335141 2312380 2214237 2123080 2109121 2066925 2087501 2004435 1936578 2004278 1789701 1819528
4528A819528m1046l8286J94637k18962k265n8834N9553j7085q302q0166M7948
$$ 1819528 1778482 1740196 1934833 1715871 1713606 1654772 1714325 1697240 1688938 1608772 1656720
4517A656720K633r0531L3153L8868j34477O5691j36228l9614l0859L0687p358
$$ 1656720 1659353 1568822 1601975 1640843 1506366 1572057 1435829 1396215 1365356 1396043 1388685
4506A388685m2403n0590l1153L0225j08795P0195m3748n4851L1132l7236j27645
$$ 1388685 1346282 1295692 1264539 1294764 1185969 1256164 1212416 1157565 1188697 1151461 1023816
4495A023816K3081P2774j26740p2280m229l8377l312m420k4280l7304P38n4016
$$ 1023816 1046897 1119671 992931 920651 916422 878045 874733 870313 846033 808729 809467 755451
4483G55451j49031N4199k7576p9493m3277N4914j8888q4815q722L0960M0747q1307
$$ 755451 606420 660619 633043 553550 510273 565187 546299 461484 452762 483722 524469 443162
4471D43162K9528O5198j19967j7495J05376j40294M5338P8522j11126J14976m8715
$$ 443162 472690 537888 417921 400426 505802 365508 410846 489368 378242 493218 444503
4460D44503M6058N0618m5544m9572J00912m8417l5837J0661K2414j19368l2776
$$ 444503 490561 541179 495635 446063 546975 498558 462721 473382 495796 376428 343652
4449C43652O133m293r8223J5943L9460q510m4676m9999M075N090j18105Q1577
$$ 343652 349785 345492 247269 263212 302672 294162 249486 199487 203562 208652 90547 172124
4437A72124k0232l3997R0625m4609k0087k2522Q2176K1913R314P4801R3778j4170
$$ 172124 151892 117895 208520 163911 143824 121302 203478 225391 234705 309506 403284 389114
4425C89114k3991o2274o054J8065n9641R8729J4642O2853N614m308L4915P3298
$$ 389114 365123 302849 296795 314860 255219 353948 368590 431443 437057 432749 467664 540962
4413E40962M995K00299L3542p964O5079L3260O833m7468J42335l2178O7542K16031
$$ 540962 545957 746256 779798 771834 836913 870173 877006 829538 971873 939695 1007237 1223268
4401A223268K4397n9387J8205N0322q9765k0395K6637O649j14566R7215k6995
$$ 1223268 1247665 1188278 1206483 1256805 1167040 1146645 1173282 1179931 1065365 1162580 1135585
4390A135585r8087p7450n0606o0685j51267q1449l2514j54387J14749j90232j030
$$ 1135585 1037498 960048 909442 848757 697490 616041 583527 429140 543889 353657 352627
4379C52627p2967Q9065j70571p7366L9906l4267L2678m7583J17404o6280q7660
$$ 352627 279660 368725 198154 120788 160694 126427 159105 111522 228926 162646 74986
4368G4986J94119k9805J56574Q2753J74660J0212j06107J20282j15172m4829j63655
$$ 74986 269105 239300 395874 478627 653287 663499 557392 677674 562502 517673 354018
4357C54018r0456O4767k12521L4430K9359N364m0048O0498j2497p5625k7099M9518
$$ 354018 263562 328329 115808 150238 179597 184961 144913 205411 192914 117289 90190 139708
4345A39708O557N2919R295M8453R5359j21308J18415J77314L4631P0172J40161
$$ 139708 146265 199184 208479 256932 352291 230983 349398 526712 561343 631515 771676
4334G71676M8433j3597o9413j2203j14177q0579m9362j01705J1786j12853N0632
$$ 771676 820109 806512 737099 724896 610719 530140 480778 379073 390859 278006 328638
4323C28638k8038j17860J53046L7744q0101J49087j24516R9996k6286N2148j0151
$$ 328638 300600 182740 335786 373530 293429 442516 318000 417996 391710 443858 433707
4312D33707K06572n6718Q9845K16091M371J56450K9101K07677R940N035k790o46
$$ 433707 640279 583561 673406 889497 893868 1050318 1079419 1287096 1297036 1302071 1299281 1298635
4300A298635j17224o8872j70006j71079n0975k32965o2754L2711j62008P4532
$$ 1298635 1181411 1112539 942533 771454 720479 487514 424760 457471 295463 369995
4290C69995j19048O51r4948M7045j57317J01083j34391l4415J28891n1601K0029
$$ 369995 250947 251598 156650 203695 46378 147461 13070 -21345 107546 55945 75974
4279G5974j03710M1663o3235J8590n3533j167J84061j07497r9634J5888R9605
$$ 75974 -27736 13927 -49308 -30718 -84251 -85418 98643 -8854 -108488 -92600 7005
4268G005j00222J48174r102r2522R0874j10775k0908M1604J6243j04081R2066
$$ 7005 -93217 54957 45855 -46667 44207 -66568 -87476 -45872 -29629 -133710 -41644
4257d1644r2926M1276K1151k1424O5513k3749j43989J53334j4098q3258J8356
$$ -41644 -134570 -93294 -72143 -93567 -28054 -51803 -195792 -42458 -56556 -139814 -121458
4246a21458j2911L0301M21r4610L4646L5348j2998M9380R4722o3171N0676Q1333
$$ -121458 -134369 -104068 -103647 -198257 -163611 -128263 -141261 -91881 2841 -60330 -9654 71679
4234G1679l8993k90q2386N3862r6269o6083Q8560r9034N1635k5065o1933N5396
$$ 71679 32686 32396 -49990 3872 -92397 -158480 -69920 -168954 -117319 -142384 -204317 -148921
4222a48921m4997n5899O0060M1705k1412P2293o1914r1471l1981R713J43778q1468
$$ -148921 -193918 -249817 -189757 -148052 -169464 -97171 -159085 -250556 -282537 -272824 -129046 -210514
4210b10514R0739m2470O6099J1341j0954Q9456R11j4566j43642J4687M0978j33739
$$ -210514 -119775 -162245 -96146 -84805 -95759 -6303 -5392 -19958 -163600 -148913 -107935 -241674
4198b41674q502l2900q7006Q9977m5163J51411j25978j24352J20763R1185r3107
$$ -241674 -250176 -283076 -370082 -280105 -325268 -173857 -299835 -424187 -303424 -212239 -305346
4187c05346j21671J58643j601J5234n242J1979P5152q2100O2113o2997N1910L9804
$$ -305346 -427017 -268374 -269975 -254741 -259983 -248004 -172852 -254952 -192839 -255836 -203926 -164122
4175a64122r1789k6899O5768m168p5578Q1890j5392M021o5931k5810P8150L349
$$ -164122 -255911 -282810 -217042 -221210 -296788 -214898 -230290 -226269 -292200 -318010 -239860 -236511
4163b36511j0801M6652J0406j06918O1680k2710J9546l8980k4641m95L0265O374
$$ -236511 -247312 -200660 -190254 -297172 -235492 -258202 -238656 -277636 -302277 -302772 -272507 -266133
4151b66133J940J1811k5437m1051O1192q9367J02431L6481j48675P4999K4227
$$ -266133 -264193 -252382 -277819 -318870 -257678 -347045 -244614 -208133 -356808 -281809 -257582
4140b57582J8118o5000M8360l6986O0974n2780M6275n3825n6931J13473j49686
$$ -257582 -239464 -304464 -256104 -293090 -232116 -284896 -238621 -292446 -349377 -235904 -385590
4129c85590O6544p241R1631N1723o5971k9330N9302R9381j23326l4272J28107
$$ -385590 -319046 -326287 -234656 -182933 -248904 -278234 -218932 -119551 -242877 -277149 -149042
4118a49042k1904j21387j40484K18503J1405l1530n9285m9824J67871k1255p2699
$$ -149042 -170946 -292333 -432817 -214314 -202909 -234439 -293724 -343548 -175677 -196932 -269631
4107b69631m5080P5840k3800M1516O2449r9104j0048O3995L260l131j4812Q1j1457
$$ -269631 -314711 -238871 -262671 -221155 -158706 -257810 -267858 -203863 -200603 -203734 -218546 -218465 -229922
4094b29922J39027r5866J5400J6319N5495Q025j32984N1220J66220j95892k2978
$$ -229922 -90895 -186761 -171361 -155042 -99547 -91522 -224506 -173286 -7066 -202958 -225936
4083b25936M3071j06945J02561M3028j11349J78635r9970O7757q1184R584k1698
$$ -225936 -182865 -289810 -187249 -144221 -255570 -76935 -176905 -109148 -190332 -180748 -202446
4072b02446p3626J07138N2120r5700Q6697J02957m0160p4725J18418K1124L6272
$$ -202446 -276072 -168934 -116814 -212514 -125817 -22860 -63020 -137745 -19327 1797 38069
4061C8069J9444O5393j1307p5541L699j4571J16933r9187M8168l4846l8202J8834
$$ 38069 57513 122906 111599 36058 39757 25186 142119 42932 91100 56254 18052 36886
4049C6886k5870L8072L6378j35315Q2606j7277o7377N6909l2184o2810J42949
$$ 36886 11016 49088 85466 -49849 32757 15480 -51897 5012 -27172 -89982 52967
4038E2967q8812J81714p6630P7894J9068j12396M6839j32603o090Q0677j3977
$$ 52967 -35845 145869 69239 147133 166201 53805 100644 -31959 -38049 42628 28651
4027B8651J5561P7922q8039j31692Q7734j5928M9851q3612N5369m953p208M5847
$$ 28651 44212 122134 34095 -97597 -9863 -25791 24060 -59552 -4183 -9136 -16344 29503
4015B9503p1348l1667M2250k8124j5659j5643m1935N9931o9678K2803M0593k9054
$$ 29503 -41845 -73512 -31262 -59386 -75045 -90688 -132623 -72692 -142370 -119567 -78974 -108028
4003a08028M1842j73976J33038r0727J62935r2573k2398N0694n7771J7861l6138
$$ -108028 -66186 -240162 -107124 -197851 -34916 -127489 -149887 -99193 -156964 -139103 -175241
3992a75241o959M4695O1465O2322j46856P5550n001n7438N4888o833k6304j13887
$$ -175241 -182200 -137505 -76040 -13718 -160574 -85024 -90025 -147463 -92575 -99408 -125712 -239599
3980b39599K0530J23217l6344q169r3220n1986K5989O0775n7504L4660K1735q560
$$ -239599 -219069 -95852 -132196 -140365 -233585 -285571 -259582 -198807 -256311 -221651 -199916 -208476
3968b08476l4729Q3364m2113j13491J08935P958N7930j67474Q9782l6214m8841
$$ -208476 -243205 -159841 -201954 -315445 -206510 -198552 -140622 -308096 -218314 -254528 -303369
3957c03369J807M403r078P3439n4642O5223r3116M6842k842l9170P9006j44372
$$ -303369 -301562 -297159 -306237 -232798 -287440 -222217 -315333 -268491 -271333 -310503 -231497 -375869
3945c75869J978N5818R1124n7023p2049J14292k566j15049J45911j10624K3781
$$ -375869 -373891 -318073 -226949 -283972 -356021 -241729 -244295 -359344 -213433 -324057 -300276
3934c00276r3913J11347q3557J1183l2406O9248N8109n6091p490m6235n2843J47216
$$ -300276 -394189 -282842 -366399 -355216 -387622 -318374 -260265 -316356 -323846 -370081 -422924 -275708
3922b75708l4118O3027j4983r4796J5553n3729L8057j3952J6261o4697L4110J1167
$$ -275708 -309826 -246799 -261782 -356578 -341025 -394754 -356697 -370649 -354388 -419085 -384975 -373808
3910c73808K8063K2042L2502l5597Q072n0334J36545j39628J17320q5928o738
$$ -373808 -345745 -323703 -291201 -326798 -318726 -369060 -232515 -372143 -254823 -340751 -347489
3899c47489J13320j96929O6199L9643m35j4115M5515M705o9721P7437m9500M6122
$$ -347489 -234169 -431098 -364899 -325256 -325691 -339806 -294291 -289586 -359307 -281870 -331370 -285248
3887b85248m6498k0545P1536m9176J2813Q5127n6806k2329K9621j7159j452k9750
$$ -285248 -331746 -352291 -280755 -329931 -317118 -231991 -288797 -311126 -281505 -298664 -300116 -329866
3875c29866k4363J3582N2945r4450J07862j82643J07723p6851J9736R8936L2300
$$ -329866 -354229 -340647 -287702 -382152 -274290 -456933 -349210 -426061 -406325 -307389 -275089
3864b75089o7736j2020m0977O6293o7450O1390n3383o1147J43515m5852P6076
$$ -275089 -342825 -354845 -395822 -329529 -396979 -335589 -388972 -450119 -306604 -352456 -276380
3853b76380j4860Q0080j51464k8938J50712l5411l1878m0239K9480k7862M0301
$$ -276380 -291240 -211160 -362624 -391562 -240850 -276261 -308139 -348378 -318898 -346760 -306459
3842c06459O2009m8681j8943n6828M0053P1316q5991m0207J6637p5738R3934J24582
$$ -306459 -244450 -293131 -312074 -368902 -328849 -257533 -343524 -383731 -367094 -442832 -348898 -224316
3830b24316o2436o9021L9939p6479P8502q8837R401J15654n1499j0913n8253J10289
$$ -224316 -286752 -355773 -315834 -392313 -313811 -402648 -393247 -277593 -329092 -340005 -398258 -287969
3818b87969j6024n9800m2546Q6593o026P841J677K210J8303p0612J1001M5485
$$ -287969 -303993 -363793 -406339 -319746 -325772 -317931 -316254 -314044 -295741 -366353 -355352 -309867
3806c09867r3864L9366J8504M1130k8627N5221l484n7090N5998J8582o4759Q908
$$ -309867 -403731 -364365 -345861 -304731 -333358 -278137 -281621 -338711 -282713 -264131 -328890 -319982
3794c19982k8320j3484J1287M8824n1385R0873n4239P7183r0132N8237j2862l0547
$$ -319982 -348302 -361786 -350499 -301675 -353060 -262187 -316426 -239243 -329375 -271138 -284000 -314547
3782c14547O1643M8896j53371L8959M2669j7727j08434J25603j03624O3914j5821
$$ -314547 -252904 -204008 -357379 -318420 -275751 -293478 -401912 -276309 -379933 -316019 -331840
3771c31840l5701P1712k9730p905K1735j24240K8705J21470m0719L9493p226j9293
$$ -331840 -367541 -295829 -325559 -333464 -311729 -435969 -407264 -285794 -326513 -287020 -294246 -313539
3759c13539N8944k0295m6003L3448q7135K0624J19472n089j22137m368K4125K4822
$$ -313539 -254595 -274890 -320893 -287445 -374580 -353956 -234484 -239573 -361710 -366078 -341953 -317131
3747c17131m5620J52000j10021J398O1502p0038J8966o865N8289j569o524k2455
$$ -317131 -362751 -210751 -320772 -319374 -257872 -327910 -308944 -315809 -257520 -259089 -265613 -288068
3735b88068Q6426r2039j06896J18572J6101j12574J34574j7677p8302N793M9688
$$ -288068 -201642 -293681 -400577 -282005 -265904 -378478 -243904 -261581 -339883 -334090 -284402
3724b84402K3015l4294J6013K6995P9O2739j35096K7616r7524J80722l1642Q965
$$ -284402 -261387 -295681 -279668 -252673 -252594 -189855 -324951 -297335 -394859 -214137 -245779 -236814
3712b36814q1469p883J27138j19306k4434J23585j25577M2888j003n4489M7468
$$ -236814 -318283 -326166 -199028 -318334 -342768 -219183 -344760 -301872 -302875 -357364 -309896
3701c09896j07600J22073l4804M9806M4492q4798R1714p708m5583l4534L0634
$$ -309896 -417496 -295423 -330227 -280421 -235929 -320727 -229013 -236721 -282304 -316838 -286204
3690b86204O4674L2283r8874O5213j63822J28457l2039l1681L2890q185Q4515
$$ -286204 -221530 -189247 -288121 -222908 -386730 -258273 -290312 -321993 -289103 -297288 -212773
3679b12773J6324m1533m5442j4166N3664j11452N4365M409k7854j9313P0160m1757
$$ -212773 -196449 -237982 -283424 -297590 -243926 -355378 -301013 -296604 -324458 -343771 -273611 -315368
3667c15368J00260j04506L9860J4109J1468k7636k0038j5712N9270n508j07320
$$ -315368 -215108 -319614 -279754 -265645 -254177 -281813 -301851 -317563 -258293 -263801 -371121
3656c71121J54885o5578o1048m0609J10441m7520j361j3550J8378J44689p9792
$$ -371121 -216236 -281814 -342862 -383471 -273030 -320550 -321911 -335461 -317083 -172394 -252186
3645b52186n1475m0541O4078k7239M3121J9776j7308N6912j12896l7642k6167
$$ -252186 -303661 -344202 -280124 -307363 -264242 -244466 -261774 -204862 -317758 -355400 -381567
3634c81567J23038j22523J05420n0510N2361N8919j28584P4843m1006K2406J3755
$$ -381567 -258529 -381052 -275632 -326142 -273781 -214862 -343446 -268603 -309609 -287203 -273448
3623b73448j2234K0422R7572q4948n9019O5434l5689j8484N4568k2189N5504l5992
$$ -273448 -285682 -265260 -167688 -252636 -311655 -246221 -281910 -300394 -245826 -268015 -212511 -248503
3611b48503j7979J843o4352R8770l6137o488Q2794m3509j5687o8109L3221L9062
$$ -248503 -266482 -264639 -328991 -230221 -266358 -272846 -190052 -233561 -249248 -317357 -284136 -245074
3599b45074K1691r6782O1300k7108J8796N636m3959J716k9334J17637n6856r224
$$ -245074 -223383 -320165 -258865 -285973 -267177 -261541 -305500 -303784 -333118 -215481 -272337 -281561
3587b81561P8447R848j2428P3432j14629K9901o9958P7407J4959j7663j6503m5589
$$ -281561 -203114 -193266 -205694 -132262 -246891 -216990 -286948 -209541 -194582 -212245 -228748 -274337
3575b74337p0477J00435J27465m6269m4237N4047j51994O2644k1863J66131q1524
$$ -274337 -344814 -244379 -116914 -163183 -207420 -153373 -305367 -242723 -264586 -98455 -179979
3564a79979K5840k8539r1223R2648k7157P4431q7243J81731q9456O3261K5672
$$ -179979 -154139 -182678 -273901 -181253 -208410 -133979 -221222 -39491 -128947 -65686 -40014
3553d0014N8092J9525L5235j904J081Q763r9707p9790P6187j74613Q4458J0738
$$ -40014 18078 37603 72838 70934 72015 80778 -18929 -98719 -22532 -197145 -112687 -101949
3541a01949q1910O258m8951K2474q793n0883J4214O2684L2846K6106j50209L6453
$$ -101949 -183859 -177601 -226552 -204078 -212871 -263754 -249540 -186856 -154010 -127904 -278113 -241660
3529b41660N1228j03959L4027P6996k4722o5486P904j0551J26240p046j72099
$$ -241660 -190432 -294391 -260364 -183368 -208090 -273576 -265672 -276223 -149983 -157029 -329128
3518c29128O3246n0245J6214L2926R2530q4705M3956M6044o7424K6402q010M0684
$$ -329128 -265882 -316127 -299913 -266987 -174457 -259162 -215206 -169162 -236586 -210184 -218194 -177510
3506a77510n9545O5348k6919o7676L4965P2422q2109O6200o6709O5647k8019Q2263
$$ -177510 -237055 -171707 -198626 -266302 -231337 -158915 -241024 -174824 -241533 -175886 -203905 -121642
3494a21642q0477k9389L6729M5640L0549o9402J5066O6649l6973m8238j4014J12129
$$ -121642 -202119 -231508 -194779 -149139 -118590 -187992 -172926 -106277 -143250 -191488 -205502 -93373
3482i3373p3273M991p6480M9441N1920n3972M0129M6204j22260O5487k5011J04029
$$ -93373 -166646 -161655 -238135 -188694 -136774 -190746 -150617 -104413 -226673 -161186 -186197 -82168
3470h2168l811k2025J9581r0902J20577j1175J0579n4450p4019J13073r5659K9412
$$ -82168 -85979 -108004 -88423 -179325 -58748 -69923 -59344 -113794 -187813 -74740 -170399 -140987
3458a40987J01193M248o0082J1466L069m9729K919M0195q1917J14226j9263O8253
$$ -140987 -39794 -35546 -95628 -84162 -81093 -130822 -127903 -87708 -169625 -55399 -74662 -6409
3446f409L086r7961M9412R366P9539j07745J33933n0146o9473O6811P6438n1451
$$ -6409 -3323 -101284 -51872 -42506 37033 -70712 63221 13075 -56398 10413 86851 35400
3434C5400l5176J10656q5852J92197j0330m550r4851k5950P4113p6376K4920N1935
$$ 35400 224 110880 25028 217225 206895 202345 107494 81544 155657 79281 104201 156136
3422A56136l9294O3556o7312J0185L6589N7395n7203l2966J14969j1355q7605
$$ 156136 116842 180398 113086 123271 159860 217255 160052 127086 242055 230700 143095
3411A43095J38599K7819m8651J4319q2745J33898n7124K7322o0777m4149o0521
$$ 143095 281694 309513 260862 275181 192436 326334 269210 296532 235755 191606 131085
3400A31085l9333O5348J13421L0491o900K13685j16564R1003k7669j00118l9301
$$ 131085 91752 157100 270521 301012 294112 507797 391233 482236 454567 354449 315148
3389C15148J04654P1209K633k1880J38587l3411k1848M4464N7626L6535R377q0261
$$ 315148 419802 491011 493644 471764 610351 576940 555092 599556 657182 693717 703094 622833
3377F22833J2213J07398n7512j27042J39336J00897q7863j7255N9969L4324J04441
$$ 622833 635046 742444 684932 557890 697226 798123 710260 693005 752974 787298 891739
3366H91739o1940J66017J9939L4447L6577K0319j0300o277M0653O130O3188n4669
$$ 891739 829799 995816 1015755 1050202 1086779 1107098 1096798 1090521 1131174 1137304 1200492 1145823
3354A145823J97188k338O7310J01594Q5593Q9017K32160J85143J36122J83832
$$ 1145823 1343011 1340673 1407983 1509577 1595170 1684187 1916347 2101490 2237612 2421444
3344B421444L54588L4820K24793J79154K66281L21778K72909L94345L92547O33329
$$ 2421444 2776032 2810852 3035645 3214799 3481080 3802858 4075767 4470112 4862659 5495988
3334E495988N51069P80735Q39048O04981O81393P98425Q17532J092131J383010
$$ 5495988 6047057 6827792 7666840 8271821 8953214 9751639 10569171 11661302 13044312
3325A3044312K067629K762139M305878O713575R377008J1513114Q158214L474232
$$ 13044312 15111941 17874080 22179958 28893533 38270541 49783655 57941869 61416101
3317F1416101j957630m355251p051818p446153q044398p419452o075455m068540
$$ 61416101 59458471 55103220 48051402 40605249 32560851 25141399 19065944 14997404
3309A4997404k755919j860786j274820j074594q39727r92334p00837n27672n08118
$$ 14997404 12241485 10380699 9105879 8031285 7191558 6199224 5498387 4970715 4462597
3300D462597m59165l43395m20616k92089k51647j71005j34939j90962K7024j24137
$$ 4462597 4003432 3660037 3239421 2947332 2695685 2524680 2389741 2198779 2225803 2101666
3290B101666O9551r8600j7050J779l7636q1223k7292R246k85302N3581M2947j34501
$$ 2101666 2171217 2072617 2055567 2057346 2019710 1938487 1911195 1920441 1635139 1688720 1731667 1597166
3278A597166j69405J7305k16407J42322r7136j04008q8970n7026N1457m8427n6590
$$ 1597166 1427761 1445066 1228659 1370981 1273845 1169837 1080867 1023841 1075298 1026871 970281
3267I70281p3820J4442o9190l5467m2745q7824p7034O502m410p2396O117j2389
$$ 970281 896461 910903 841713 806246 763501 675677 598643 605145 600735 528339 534456 522067
3255E22067n5434P8095j19533L7121m3641n1727J8503J8060j6017j26241l3313
$$ 522067 466633 544728 425195 462316 418675 366948 385451 403511 387494 261253 227940
3244B27940Q8297q8337K9029J2790m828k7526m2707j4119K6477l4641J5245l3084
$$ 227940 316237 227900 256929 269719 264891 237365 194658 180539 207016 172375 187620 154536
3232A54536M3148n760L7107j90629P3032J3985r0463J47747r6417r5047J8421
$$ 154536 197684 191924 229031 38402 111434 125419 34956 182703 86286 -8761 9660
3221I660R6895m2407m1171l2821O350J853K3881k3666K015K9290j1598o4982m3322
$$ 9660 106555 64148 22977 -9844 -3494 -1641 22240 -1426 589 29879 18281 -46701 -90023
3208i0023n8002M3349J25270j03050M6239q0675q3623J46535j22180O6930L4159
$$ -90023 -148025 -104676 20594 -82456 -36217 -116892 -200515 -53980 -176160 -109230 -75071
3197g5071J7543n7570J5066m2004k9930M9738K3146m3680O0514m4555M6357j39280
$$ -75071 -57528 -115098 -100032 -142036 -171966 -122228 -99082 -142762 -82248 -126803 -80446 -219726
3185b19726P7950k787L2036j1425N422Q503n2463j7907Q5069n3371j38554J76077
$$ -219726 -141776 -144563 -112527 -123952 -118530 -110027 -162490 -180397 -95328 -148699 -287253 -111176
3173a11176l9997o9567J28040m4154o5057L9287L2793r489n9636J033K4553m3815
$$ -111176 -151173 -220740 -92700 -136854 -201911 -162624 -129831 -139320 -198956 -197923 -173370 -217185
3161b17185Q35J8296O2379n5460J4568k1909O7098N1605p5371N3797j22153P776
$$ -217185 -216350 -198054 -135675 -191135 -176567 -198476 -131378 -79773 -155144 -101347 -223500 -215724
3149b15724j5982J3773j6838J75J8567k7264M3163j13936M8988N4297j5331m3523
$$ -215724 -231706 -217933 -234771 -234596 -216029 -243293 -200130 -314066 -265078 -210781 -226112 -269635
3137b69635P8077p5860P725J9030m4303k6136P7821P4133n5409L2911R4309p5507
$$ -269635 -191558 -267418 -259693 -240663 -284966 -311102 -233281 -159148 -214557 -181646 -87337 -162844
3125a62844n6995M3160n0364j8333N8469k2779j5744Q1717m3359j11249M7508
$$ -162844 -219839 -176679 -227043 -245376 -186907 -209686 -225430 -143713 -187072 -298321 -250813
3114b50813P2614p259j9289J1920j23776M146J29059n4286M3209j0627k1818m4470
$$ -250813 -178199 -185458 -204747 -192827 -316603 -312457 -183398 -237684 -194475 -205102 -226920 -271390
3102b71390P767P5808J6026m8341j10384Q9287l9989O0333p3481N8702l1660k0066
$$ -271390 -263623 -187815 -171789 -220130 -330514 -241227 -281216 -220883 -294364 -235662 -267322 -287388
3090b87388J43086p0809K7825J1649q091J58479j1850O7314l8480M3589k4893
$$ -287388 -144302 -215111 -187286 -175637 -183728 -25249 -37099 30215 -8265 35324 10431
3079A0431N792j25288J3567j11276n8531K6453N7317p3183P2204j13943L2086
$$ 10431 16223 -109065 -95498 -206774 -265305 -238852 -181535 -254718 -182514 -296457 -264371
3068b64371L2802M4096k3614p962j4098o3701M8296M2600n2866r957K3413J9300
$$ -264371 -231569 -187473 -211087 -219049 -233147 -296848 -248552 -205952 -258818 -268775 -245362 -226062
3056b26062l2054j9323n7231N0167J4795j01739Q1173m2346k7905J0118K1556
$$ -226062 -258116 -277439 -334670 -284503 -269708 -371447 -290274 -332620 -360525 -350407 -328851
3045c28851K335l5800M0963k341J00546j21459M5186k1103l8380J30970q1876
$$ -328851 -326516 -362316 -321353 -323694 -223148 -344607 -299421 -320524 -358904 -227934 -309810
3034c09810k6718P0660j58937J12348n2992N5772R9351j34181m8388K8556M1349
$$ -309810 -336528 -265868 -424805 -312457 -365449 -309677 -210326 -344507 -392895 -364339 -322990
3023c22990l6055K9544N7954N7180n2105n3843J06991j38915J9845R7010q1759
$$ -322990 -359045 -329501 -271547 -214367 -266472 -320315 -213324 -352239 -332394 -235384 -317143
3012c17143j042O2643J1685n0096K1672n2726N1993r573O9266q8918P8123j31909
$$ -317143 -318185 -255542 -243857 -293953 -272281 -325007 -273014 -282587 -213321 -302239 -224116 -356025
3000c56025N0168K2925P200r5177O0852J6808L2584j17626N3215M7152K5710r2633
$$ -356025 -305857 -282932 -275732 -370909 -310057 -293249 -260665 -378291 -325076 -277924 -252214 -344847
2988c44847J7858M5523l655l0246m935k5911Q6018q9654K1479P8848j17151L0025
$$ -344847 -326989 -281466 -285121 -315367 -320302 -346213 -260195 -349849 -328370 -249522 -366673 -336648
2976c36648j3056Q1091j04149P9081M3075o8582N7106m5343l8146N2070j7763
$$ -336648 -349704 -268613 -372762 -293681 -250606 -319188 -262082 -307425 -345571 -293501 -311264
2965c11264m2764M0328M7491J5622r120P7571j69748O4788j29069J39601J1079
$$ -311264 -354028 -313700 -266209 -250587 -259707 -182136 -351884 -287096 -416165 -276564 -265485
2954b65485k7128J19801j59828K8238p9131J50469o5297J27814r0731M0048j9814
$$ -265485 -292613 -172812 -332640 -304402 -383533 -233064 -298361 -170547 -261278 -221230 -241044
2943b41044o6997J9278K3236j6915o3201k2340Q3265K6343j0039k0237l5561j4383
$$ -241044 -308041 -288763 -265527 -282442 -345643 -367983 -284718 -258375 -268414 -288651 -324212 -338595
2931c38595j0461J62479n2367r2714Q1139m0944o0759J01675m9099N2006o7029
$$ -338595 -349056 -186577 -238944 -331658 -250519 -291463 -352222 -250547 -299646 -247640 -314669
2920c14669Q0720m6503l7167M3327k9954M811K5671K6002l3679j6452m111Q0688
$$ -314669 -233949 -280452 -317619 -274292 -304246 -299435 -273764 -247762 -281441 -297893 -302004 -221316
2908b21316m4009o2428k7465O3645J2877k0294k5871K7919m648l6733j8063k3095
$$ -221316 -265325 -327753 -355218 -291573 -278696 -298990 -324861 -296942 -301590 -338323 -356386 -379481
2896c79481J45032p8824M7456j6432n387J8198j36608J07191K4330l2277j6034
$$ -379481 -234449 -313273 -265817 -282249 -287636 -269438 -406046 -298855 -274525 -306802 -322836
2885c22836N9310l7859K61k5208M3426J2489j21794J86079p7106l2171L3120q1559
$$ -322836 -263526 -301385 -301124 -326332 -282906 -270417 -392211 -206132 -283238 -315409 -282289 -363848
2873c63848K228Q2180K7497j123O590n1198p3908j6853Q9312O5615J1767j07813
$$ -363848 -361620 -279440 -251943 -253066 -246476 -297674 -371582 -388435 -299123 -233508 -221741 -329554
2861c29554N8220k3697K2431O7202j23824O61j3012J33344k4713q013j3556n5562
$$ -329554 -271334 -295031 -272600 -205398 -329222 -328561 -341573 -208229 -232942 -240955 -254511 -310073
2849c10073o3109J20430n208q5154J4741O1305J694L211p4950R5105o871N9753
$$ -310073 -373182 -252752 -257960 -343114 -328373 -267068 -265374 -262163 -337113 -242008 -248879 -189126
2837a89126p7128L902L7662j58153L0618J21721l2440l8322L594O60r71j4109
$$ -189126 -266254 -262352 -224690 -382843 -352225 -230504 -262944 -301266 -297672 -297012 -297983 -312092
2825c12092J7936m1079J50032j69990J41335l6652R003k8893K6106Q494Q78K4146
$$ -312092 -294156 -335235 -185203 -355193 -213858 -250510 -241507 -270400 -244294 -235800 -234922 -210776
2813b10776o831p2597o2987J5974K3685M3264k5660J15839l9421p8j4771R188
$$ -210776 -217607 -290204 -353191 -337217 -313532 -270268 -295928 -180089 -219510 -219588 -234359 -225171
2801b25171j13473N5322M3790l527J02235j22801K6787o2199L6908J032l0986
$$ -225171 -338644 -283322 -239532 -243059 -140824 -263625 -236838 -299037 -262129 -261097 -292083
2790b92083M1198j0703N2771p4068j3361M0772N5882j19176J00666l0902J2856
$$ -292083 -250885 -261588 -208817 -282885 -296246 -255474 -199592 -318768 -218102 -249004 -236148
2779b36148j3113j60135K17359q5708M1019l9082l5194M6269M1087o8129J10989
$$ -236148 -249261 -409396 -192037 -277745 -236726 -275808 -311002 -264733 -223646 -291775 -180786
2768a80786r6202j8634P837K6582k6855J02242o2263J2156q3326K4832L5110l8430
$$ -180786 -276988 -295622 -287785 -261203 -288058 -185816 -248079 -235923 -319249 -294417 -259307 -297737
2756b97737k0460J71550j52066O8233j0447j2613m6208L8856m4981n0728Q8050
$$ -297737 -318197 -146647 -298713 -230480 -240927 -253540 -299748 -260892 -305873 -356601 -268551
2745b68551K9994k8150j8400J1984K1569l54m5431J3452o0865J51653o7755m9467
$$ -268551 -238557 -266707 -285107 -273123 -251554 -251908 -297339 -283887 -344752 -193099 -260854 -310321
2733c10321o8403P4523K3767N9661m4997N6553o1703j6504K9838q1669J7044Q7275
$$ -310321 -378724 -304201 -280434 -220773 -265770 -209217 -270920 -287424 -257586 -339255 -322211 -234936
2721b34936m8092o951J12482j05497j5712N0676n627j866Q1153l4122J1381J3449
$$ -234936 -283028 -289979 -177497 -282994 -298706 -248030 -253657 -255523 -174370 -208492 -197111 -183662
2709a83662j32008L2000J34577j24407M4159K95k9787K398n2019K7121o2016L7668
$$ -183662 -315670 -283670 -149093 -273500 -229341 -229046 -258833 -256435 -308454 -281333 -343349 -305681
2697c05681J1639L5309R2811q1628L4763k1779l9699j03173P4921J14134j19261
$$ -305681 -294042 -258733 -165922 -247550 -212787 -234566 -274265 -377438 -302517 -188383 -307644
2686c07644j2711J27258J1650k9521r5401J1121q397Q3501k4823N5210p4072L2795
$$ -307644 -320355 -193097 -181447 -210968 -306369 -295248 -303645 -220144 -244967 -189757 -263829 -231034
2674b31034J9637l9955J785n137L7229j6293m0579M3124r2900J11853q9274L205
$$ -231034 -211397 -251352 -249567 -254704 -217475 -233768 -274347 -231223 -324123 -212270 -301544 -298339
2662b98339Q9012O46J7206r1648J10245q4260L6594l4813l2912R8127o1125j8429
$$ -298339 -209327 -208681 -191475 -283123 -172878 -257138 -220544 -255357 -288269 -190142 -251267 -269696
2650b69696J5529P4175k5556j03487l3085K9727p3136K28337j08693l4009L9014
$$ -269696 -254167 -179992 -205548 -309035 -342120 -312393 -385529 -157192 -265885 -299894 -260880
2639b60880O3055k1124r6459P6572n1753P2321j23459J28565m8973K665P3148
$$ -260880 -197825 -218949 -315408 -238836 -290589 -218268 -341727 -213162 -262135 -259470 -186322
2628a86322k9299P949P8827p1269r3138N5292n6026Q7116n8395O3334n3815P4810
$$ -186322 -215621 -207672 -128845 -200114 -293252 -237960 -293986 -206870 -265265 -201931 -255746 -180936
2616a80936n8697p2470J7403R237J25398q5172O668r6232Q7037q2355P8710L5199
$$ -180936 -239633 -312103 -294700 -285463 -160065 -245237 -238569 -334801 -247764 -330119 -251409 -216210
2604b16210q1750Q5877n8965K3203l9018j5199M9703j09261M3568M8383j0092
$$ -216210 -297960 -212083 -271048 -247845 -286863 -302062 -252359 -361620 -318052 -269669 -279761
2593b79761N5308n8434P7175q0318J15160j17538Q2618k9836k1946J6733J2930
$$ -279761 -224453 -282887 -205712 -286030 -170870 -288408 -205790 -235626 -257572 -240839 -227909
2582b27909l291l5825J1571k1801j140N8868n1104P2955o4816k610J7360o3303
$$ -227909 -231200 -267025 -255454 -277255 -278395 -219527 -270631 -197676 -262492 -265102 -247742 -311045
2570c11045M6806K613P507m9838Q4033j16179O2216K3382M8855J5627j3262r6339
$$ -311045 -264239 -261626 -254119 -303957 -219924 -336103 -273887 -250505 -201650 -186023 -199285 -295624
2558b95624Q5185q6690K7994k420O8535o0059O144k3819N2343R1597j21858j2767
$$ -295624 -210439 -297129 -269135 -271555 -203020 -263079 -256935 -280754 -228411 -136814 -258672 -271439
2546b71439O576k0293O6178j6701n7137K4031l6012l6361J03383K4317N2742q7002
$$ -271439 -264863 -285156 -218978 -235679 -292816 -268785 -304797 -341158 -237775 -213458 -160716 -247718
2534b47718J8474l9277k9658L3464k3614R4150q3764N6457j4856r454J7520o3098
$$ -247718 -229244 -268521 -298179 -264715 -288329 -194179 -277943 -221486 -236342 -245796 -228276 -291374
2522b91374M4845l9156J06467o4628R1446j91479J32286k6238k5688k9580Q3455
$$ -291374 -246529 -285685 -179218 -243846 -152400 -343879 -211593 -237831 -263519 -293099 -209644
2511b09644J2838n1196j7710P8214o6549P7584r8672n5476P8822k1056J53191
$$ -209644 -196806 -248002 -265712 -187498 -254047 -176463 -275135 -330611 -251789 -272845 -119654
2500a19654j45337L7619p9681Q4170j1269p0189N4449j7260J6286K6218o1084
$$ -119654 -264991 -227372 -307053 -222883 -234152 -304341 -249892 -267152 -250866 -224648 -285732
2489b85732N1827p4141R3469m1894J25296j65834Q3734K1134j32062Q6999m5809
$$ -285732 -233905 -308046 -214577 -256471 -131175 -297009 -213275 -192141 -324203 -237204 -283013
2478b83013J3474M4810k3351q0167P2554k158j04811Q4321p66P7175O0314j13009
$$ -283013 -269539 -224729 -248080 -328247 -255693 -257851 -362662 -278341 -279107 -201932 -141618 -254627
2466b54627N2284p2928j14J5726J1473o6392Q8855Q464l7723Q339r3011R5420
$$ -254627 -202343 -275271 -275385 -259659 -248186 -314578 -225723 -217259 -254982 -246643 -339654 -244234
2454b44234m7991j173P5212K646K721J6744k2225j3829L5k2067K4685J3006R168
$$ -244234 -292225 -293398 -218186 -215540 -212819 -196075 -218300 -232129 -232094 -254161 -229476 -216470 -207302
2441b07302l0514K1169l6551N828j0348O3618l320l6294m8491m0637l5987J50495
$$ -207302 -237816 -216647 -253198 -247370 -257718 -194100 -197420 -233714 -282205 -322842 -358829 -208334
2429b08334L4250n6858M2325K6578k5185k8002j8000O9850j26713J2184l3289
$$ -208334 -174084 -230942 -188617 -162039 -187224 -215226 -233226 -163376 -290089 -277905 -311194
2418c11194R1290j2655k6417J2598p288l827q34Q1714o7198k215P514o4285l1913
$$ -311194 -219904 -232559 -258976 -246378 -253666 -257493 -258327 -176613 -243811 -246026 -238512 -302797 -334710
2405c34710J49225l9751m2854J15733q7268M5853l3363q2772M4042n7423n579
$$ -334710 -185485 -225236 -268090 -152357 -239625 -193772 -227135 -309907 -265865 -323288 -328867
2394c28867Q0513k8487l5383j7690N3911M5452n944M8706n3431L4442q430l5632
$$ -328867 -248354 -276841 -312224 -329914 -276003 -230551 -236495 -187789 -241220 -206778 -215208 -250840
2382b50840n8129N8045p6029J0888J16040m6782q6603J08688j7149L0842j17418
$$ -250840 -308969 -250924 -326953 -316065 -200025 -246807 -333410 -224722 -241871 -211029 -328447
2371c28447R4535m6923L2308r180K207o3620J20575p608M3358j17869N0398J5285
$$ -328447 -233912 -280835 -248527 -257707 -255500 -319120 -198545 -206153 -162795 -280664 -230266 -214981
2359b14981M0531l1457r5617Q6860K8494m1214r1242j4141P3729L1915j4585L4431
$$ -214981 -174450 -205907 -301524 -214664 -186170 -227384 -318626 -332767 -259038 -227123 -241708 -207277
2347b07277p7882J20252O2583j30447j8588N9765K9680j04422j4886k9781L8936
$$ -207277 -285159 -164907 -102324 -232771 -251359 -191594 -161914 -266336 -281222 -311003 -272067
2336b72067K2764k6733L5322l3604J5519R278j6862L669L9055N3010q2416j0047
$$ -272067 -249303 -276036 -240714 -274318 -258799 -249521 -266383 -262714 -223659 -170649 -253065 -263112
2324b63112L0925Q73M4954q8376R0831j33146Q0806l8263N6647j59442Q2874N1458
$$ -263112 -232187 -231314 -186360 -274736 -183905 -317051 -236245 -274508 -217861 -377303 -294429 -242971
2312b42971O451R6920q1293k6095O144r4107k1143J09569l184J25192r7782N3927
$$ -242971 -236520 -139600 -220893 -246988 -240844 -334951 -356094 -246525 -249709 -124517 -222299 -168372
2300a68372o1102p1299J9468O65J6798J7211n7946O0289q4927O4064M5884p050
$$ -168372 -229474 -300773 -281305 -280640 -263842 -246631 -304577 -244288 -329215 -265151 -219267 -226317
2288b26317P4020j09929J34895r7889j38065J22465P1466j8302j02661J01168
$$ -226317 -152297 -262226 -127331 -225220 -363285 -240820 -169354 -187656 -290317 -189149
2278a89149n5670n3692R2562l6861j9988o1557j0467J62102o1206L5497j8159
$$ -189149 -244819 -298511 -205949 -242810 -262798 -324355 -334822 -172720 -233926 -198429 -216588
2267b16588N7632j23050k9907P5638l6972Q3419p9059N8284r572j3877l4203j2648
$$ -216588 -158956 -282006 -311913 -236275 -273247 -189828 -268887 -210603 -220175 -234052 -268255 -280903
2255b80903K6232N3670n4279j20832N1103l8265Q1358o664Q2784q2358P8274m7226
$$ -280903 -254671 -201001 -255280 -376112 -325009 -363274 -281916 -288580 -205796 -288154 -209880 -257106
2243b57106J06425q9879R992l2546J8532J0770M7J3954o9265L3824k9996R3032
$$ -257106 -150681 -240560 -230568 -263114 -244582 -233812 -233765 -219811 -289076 -255252 -285248 -192216
2231a92216k3645J0596L2484r9783n6899O7059P8089m3877j0915j06284J44019
$$ -192216 -215861 -205265 -172781 -272564 -329463 -262404 -184315 -228192 -239107 -345391 -201372
2220b01372r7486R4077j5527n9977J23472m1475M3284j24745m9805O7524R782
$$ -201372 -298858 -204781 -220308 -280285 -156813 -198288 -155004 -279749 -329554 -262030 -252248
2209b52248L6797J8566j37933N8302Q926P3666m1200R0262j54099P1691J0003
$$ -252248 -215451 -196885 -334818 -276516 -267590 -193924 -235124 -144862 -298961 -227270 -217267
2198b17267q5773P3470j952l8520L1001Q428P8315k6003m7582r7191O6329L8631
$$ -217267 -303040 -229570 -231522 -270042 -239041 -230613 -152298 -178301 -225883 -323074 -256745 -218114
2186b18114K1231n194m118k951j9859J7049L162k427J8491L4892r1113N2276o8963
$$ -218114 -196883 -202077 -206195 -209146 -229005 -211956 -208794 -211221 -192730 -157838 -248951 -196675 -265638
2173b65638Q9531j3955n4884L6360M690p1351M5856p1642j3511J17770m4721N371
$$ -265638 -176107 -190062 -244946 -208586 -203896 -275247 -229391 -301033 -314544 -196774 -241495 -236124
2161b36124J2332k0074J7325l1717R9345n819l5759J4267j7470l2608K0115n4059
$$ -236124 -223792 -243866 -226541 -258258 -158913 -164732 -200491 -186224 -203694 -236302 -216187 -270246
2149b70246p458O5397J3019m3454K7717j7516M6500o1446p7833L0139R9236n8404
$$ -270246 -277704 -212307 -199288 -242742 -215025 -232541 -186041 -247487 -325320 -295181 -195945 -254349
2137b54349O1861m2648Q2624n3008J1769p0619M3576L5587L285l3274j7547L5518
$$ -254349 -192488 -235136 -152512 -205520 -193751 -264370 -220794 -185207 -181922 -215196 -232743 -197225
2125a97225o2661O8149p188M714l4482n3458N1555q607R4202j12008J9939l2044
$$ -197225 -259886 -191737 -198925 -194211 -228693 -282151 -230596 -239203 -145001 -257009 -237070 -269114
2113b69114O1722o227R6535k9283j77679K6623Q943O8063l5404N9485K6463L0426
$$ -269114 -207392 -213619 -117084 -146367 -324046 -297423 -288480 -220417 -255821 -196336 -169873 -139447
2101a39447k3685j04551N4046j8875L8274q1261J89576p7786j54204K4929J04620
$$ -139447 -163132 -267683 -213637 -232512 -194238 -275499 -85923 -163709 -317913 -292984 -188364
2090a88364K2314n3218n70j9724Q6607q6388L09l7421j248P2186m7688M3710N7899
$$ -188364 -166050 -219268 -219838 -239562 -152955 -239343 -239034 -276455 -277703 -205517 -253205 -209495 -151596
2077a51596j66330J11155l1898j7035J14734l2394q6342r686R2943J6069l061
$$ -151596 -317926 -206771 -238669 -255704 -140970 -173364 -259706 -269392 -176449 -160380 -163441
2066a63441j9272m2827j02978J4491R1442K5786j11762M2234K9341m938p6999
$$ -163441 -182713 -225540 -328518 -314027 -222585 -196799 -308561 -266327 -236986 -241924 -318923
2055c18923J02374J2059N9793m4435L2864r8217n424O682K2830m51J9786k7894
$$ -318923 -216549 -204490 -144697 -189132 -156268 -254485 -259909 -253227 -230397 -230848 -211062 -238956
2043b38956N5997p1264R5451n8515k6928Q5803m2430L5392n8753k9101K6989j0475
$$ -238956 -182959 -254223 -158772 -217287 -244215 -158412 -200842 -165450 -224203 -253304 -226315 -236790
2031b36790n8940M7875k9146J08599j38387J677Q0857j2558l1862J8255Q5130
$$ -236790 -295730 -247855 -277001 -168402 -306789 -305112 -224255 -236813 -268675 -250420 -165290
2020a65290m9520m3329J3781M3521J010k3449j6166K9536N3867L1964p611M6145
$$ -165290 -214810 -258139 -244358 -200837 -199827 -223276 -239442 -209906 -156039 -124075 -131686 -85541
2008h5541j35454n0412J34423j07308K1419m2661K3216L9122j4452p9552R6094
$$ -85541 -220995 -271407 -136984 -244292 -222873 -265534 -242318 -203196 -217648 -297200 -201106
1997b01106p2382p3183J41003n0758J5194o7465J87403r5644M599n6153J07869
$$ -201106 -273488 -346671 -205668 -256426 -241232 -308697 -121294 -216938 -212339 -268492 -160623
1986a60623N9448j44739J2917M5829j06278P7697Q6491j4442j17643O3678j3450
$$ -160623 -101175 -245914 -232997 -187168 -293446 -215749 -129258 -143700 -261343 -197665 -211115
1975b11115k0621k0630p3018O9044M4169N3754j06592l3264N8597J9876L6736
$$ -211115 -231736 -252366 -325384 -256340 -212171 -158417 -265009 -298273 -239676 -219800 -183064
1964a83064o5419O2046l3967r5823J06873N7229j6799r3476J28287r1095M201
$$ -183064 -248483 -186437 -220404 -316227 -209354 -152125 -168924 -262400 -134113 -225208 -221007
1953b21007j16242O9129P3653O7571r2869l1256P5900q4486M3599n3595J50987
$$ -221007 -337249 -268120 -194467 -126896 -219765 -251021 -175121 -259607 -216008 -269603 -118616
1942a18616j55446N373q2093O2291J50645j04181n4449M7683K618l9711r78L6701
$$ -118616 -274062 -268689 -350782 -288491 -137846 -242027 -296476 -248793 -246175 -285886 -286864 -250163
1930b50163J1932k0295K29Q685L34L2146k325j1545N0331p9713J7276l9552J8724
$$ -250163 -238231 -258526 -258297 -249612 -249278 -217132 -219457 -231002 -180671 -260384 -243108 -282660 -263936
1917b63936N0800m562J3243P020j06458J78367q9944n241N5789j31822M1089O7654
$$ -263936 -213136 -217698 -204455 -197435 -303893 -125526 -215470 -220711 -164922 -296744 -255655 -188001
1905a88001K5263m2473P2245p0508q914J702k6529Q9917j2629j00481M7536k0368
$$ -188001 -162738 -205211 -132966 -203474 -212388 -210686 -237215 -147298 -159927 -260408 -212872 -233240
1893b33240M5754j06184J04583n7685M5138p3627L566L6207n5129O6714N9875
$$ -233240 -187486 -293670 -189087 -246772 -201634 -275261 -271695 -235488 -290617 -223903 -164028
1882a64028l2677l6858k0300J7847k6534N6353m7053j4776N0647j0772r961m4334
$$ -164028 -196705 -233563 -253863 -236016 -262550 -206197 -253250 -268026 -217379 -228151 -238112 -282446
1870b82446J6485K9898L6944n0154O3200o1442O3210n3538J15628r4836j21485
$$ -282446 -265961 -236063 -199119 -249273 -186073 -247515 -184305 -237843 -122215 -217051 -338536
1859c38536P9449o7428J32217j5792J0841n376K526l1065q9826N1830R0710p8559
$$ -338536 -259087 -326515 -194298 -210090 -199249 -204625 -202099 -233164 -322990 -271160 -180450 -259009
1847b59009k782N1074J13741j29530M368m1600K1682n8836P4874J4635l8434M3215
$$ -259009 -261791 -210717 -96976 -226506 -222138 -263738 -242056 -300892 -226018 -211383 -249817 -206602
1835b06602m9378J65100j20647L9665q1087M0954q0287N7325k8467P2613k139
$$ -206602 -255980 -90880 -211527 -171862 -252949 -211995 -292282 -234957 -263424 -190811 -192950
1824a92950n4167J5136k0914P5209n9323Q1265n5327l0989j6637J5210k1808J71927
$$ -192950 -247117 -231981 -252895 -177686 -237009 -155744 -211071 -242060 -258697 -243487 -265295 -93368
1812i3368j39387L1008L0484o4132Q1234q103o5905J1616j2479k7054k9063Q4346
$$ -93368 -232755 -201747 -171263 -235395 -154161 -162264 -228169 -216553 -229032 -256086 -285149 -200803
1800b00803l5678J3383k2929r0833J04591L6650l6785j8340P2271k0596L7127
$$ -200803 -236481 -223098 -246027 -336860 -232269 -195619 -232404 -250744 -178473 -199069 -161942
1789a61942m9060m5571J39709o097q3479O5605q5913J2233N3047j33409R3818
$$ -161942 -211002 -256573 -116864 -122961 -206440 -140835 -226748 -214515 -161468 -294877 -201059
1778b01059N537j1312K3481j4510m8643P7671m0030n7628N0096Q7022p1002r2857
$$ -201059 -195522 -206834 -183353 -197863 -246506 -168835 -208865 -266493 -216397 -129375 -200377 -293234
1766b93234O0615Q309J04196q0534O6197r1859J04574r2845J07817j25225J3951
$$ -293234 -232619 -224310 -120114 -200648 -134451 -226310 -121736 -214581 -106764 -231989 -218038
1755b18038K7076M7248q2236M7524K1574j22459O5348p1062P0351M3409p3605
$$ -218038 -190962 -143714 -225950 -178426 -156852 -279311 -213963 -285025 -214674 -171265 -244870
1744b44870j1697L3239J2669J8182m2764P9666o9676Q4025j6504p3993K8695l8715
$$ -244870 -256567 -223328 -210659 -192477 -235241 -155575 -225251 -141226 -157730 -231723 -203028 -241743
1732b41743K5459j3849Q148n0603N2692K3748L1823j23571M4443l8449J14497
$$ -241743 -216284 -230133 -221985 -272588 -219896 -196148 -164325 -287896 -243453 -281902 -167405
$$ [...]
##END NTUPLES=NMR SPECTRUM
##END=
