##TITLE=abcd
##JCAMPDX= 6.0         $$ Bruker NMR JCAMP-DX V2.0
##DATA TYPE= NMR SPECTRUM
##DATA CLASS= NTUPLES
##ORIGIN= UXNMR, Bruker Analytische Messtechnik GmbH
##OWNER= root
$$ XWIN-NMR		Version 3.5
$$ Sat Aug  1 10:48:54 2026 Russian Standard Time (UT+4h)  servis@DPX200
##.OBSERVE FREQUENCY= 200.131235884673
##.OBSERVE NUCLEUS= ^1H
##.ACQUISITION MODE= SIMULTANEOUS
##.ACQUISITION SCHEME= undefined
##.AVERAGES= 8
##.DIGITISER RES= 18
##SPECTROMETER/DATA SYSTEM= spect
##.PULSE SEQUENCE= zg
##.SOLVENT NAME= DMSO
##.SHIFT REFERENCE= (INTERNAL, DMSO, 0, 16.4885)
##AUDIT TRAIL= $$ (NUMBER, WHEN, WHO, WHERE, WHAT)
$$ ##TITLE= Audit trail, XWIN-NMR		Version 3.5
$$ ##JCAMPDX= 5.01
$$ ##ORIGIN= Bruker BioSpin GmbH
$$ ##OWNER= servis
$$ F:\spectra/data/av/nmr/H1/1/pdata/1/auditp.txt
$$ ##AUDIT TRAIL=  $$ (NUMBER, WHEN, WHO, WHERE, WHAT)
(   1,<2026-08-01 10:48:22.51 +0400>,<servis>,<DPX200>,
      <created by zg, POWCHK disabled, PULCHK disabled
       terminated by command 'halt'
       configuration hash MD5:
       00 E9 B6 7A A2 85 ED C7 34 08 36 98 17 FE 4E 26
       data hash MD5: 32K
       2F BB 2E F3 76 E6 84 A7 B7 87 60 A4 BD 6E F9 3C>)
(   2,<2026-08-01 10:48:27.87 +0400>,<servis>,<DPX200>,
      <Start of raw data processing
       efp BC_mod = 2 LB = 0.05 FT_mod = 6 PKNL = 1 PHC0 = -416.9518 PHC1 = 3.101563 SI = 16K 
       data hash MD5: 16K
       85 54 63 A3 26 31 89 ED 90 4E 7C 4D DF 50 B8 66>)
$$ ##END=
$$ 
$$ hash MD5
$$ 15 17 52 43 8B FB 9B 3F 35 03 63 FB A7 8B EA 35
##$RELAX= 
##$RELAX= 
##$RELAX= 
##$RELAX= 
##$RELAX= 
##$RELAX= 
##$RELAX= 
##$RELAX= 
$$ Bruker specific parameters
$$ --------------------------
##$DU= <F:\spectra>
##$EXPNO= 1
##$NAME= <H1>
##$PROCNO= 1
##$TYPE= <nmr>
##$USER= <av>
##$AMP= (0..31)
100 100 100 100 100 100 100 100 100 100 100 100 100 100 100 100 100 100 
100 100 100 100 100 100 100 100 100 100 100 100 100 100 
##$AQSEQ= 0
##$AQ_mod= 1
##$AUNM= <au_zg>
##$AUTOPOS= <>
##$BF1= 200.13
##$BF2= 200.13
##$BF3= 200.13
##$BF4= 200.13
##$BF5= 500.13
##$BF6= 500.13
##$BF7= 500.13
##$BF8= 500.13
##$BYTORDA= 1
##$CFDGTYP= 0
##$CFRGTYP= 5
##$CHEMSTR= <none>
##$CNST= (0..31)
1 1 145 1 1 1 1 1 1 1 1 1 1 1 1 1 1 1 1 1 1 1 1 1 1 1 1 1 1 1 1 1 
##$CPDPRG= <>
##$CPDPRG1= <>
##$CPDPRG2= <>
##$CPDPRG3= <>
##$CPDPRG4= <mlev>
##$CPDPRG5= <mlev>
##$CPDPRG6= <mlev>
##$CPDPRG7= <mlev>
##$CPDPRG8= <mlev>
##$CPDPRGB= <>
##$CPDPRGT= <>
##$D= (0..31)
0 2 0 0 0 0 0 0 0 0.06 0 0 0 0 0 0 0.0002 0 0 0 0 0 0 0 0 0 0 0 0 0 0 
0 
##$DATE= 1785566902
##$DBL= (0..7)
120 120 120 120 120 120 120 120 
##$DBP= (0..7)
150 150 150 150 150 150 150 150 
##$DBP07= 0
##$DBPNAM0= <>
##$DBPNAM1= <>
##$DBPNAM2= <>
##$DBPNAM3= <>
##$DBPNAM4= <>
##$DBPNAM5= <>
##$DBPNAM6= <>
##$DBPNAM7= <>
##$DBPOAL= (0..7)
0.5 0.5 0.5 0.5 0.5 0.5 0.5 0.5 
##$DBPOFFS= (0..7)
0 0 0 0 0 0 0 0 
##$DE= 6
##$DECBNUC= <off>
##$DECIM= 32
##$DECNUC= <off>
##$DECSTAT= 4
##$DIGMOD= 1
##$DIGTYP= 9
##$DL= (0..7)
0 120 120 120 120 120 120 120 
##$DP= (0..7)
$$ [...]
##$SUBNAM4= <"">
##$SUBNAM5= <"">
##$SUBNAM6= <"">
##$SUBNAM7= <"">
##$SUBNAM8= <"">
##$SUBNAM9= <"">
##$SW= 20.6817932712277
##$SWIBOX= (0..15)
0 0 3 0 0 0 0 0 0 0 0 0 0 0 0 0 
##$SW_h= 4139.07284768212
##$TD= 32768
##$TD0= 1
##$TE= 0
##$TE2= 300
##$TE3= 300
##$TEG= 300
##$TL= (0..7)
0 120 120 120 120 120 120 120 
##$TP= (0..7)
150 150 150 150 150 150 150 150 
##$TP07= 0
##$TPNAME0= <>
##$TPNAME1= <>
##$TPNAME2= <>
##$TPNAME3= <>
##$TPNAME4= <>
##$TPNAME5= <>
##$TPNAME6= <>
##$TPNAME7= <>
##$TPOAL= (0..7)
0.5 0.5 0.5 0.5 0.5 0.5 0.5 0.5 
##$TPOFFS= (0..7)
0 0 0 0 0 0 0 0 
##$TUNHIN= 0
##$TUNHOUT= 0
##$TUNXOUT= 0
##$USERA1= <user>
##$USERA2= <user>
##$USERA3= <user>
##$USERA4= <user>
##$USERA5= <user>
##$V9= 5
##$VALIST= <valist>
##$VCLIST= <CCCCCCCCCCCCCCC>
##$VD= 0
##$VDLIST= <DDDDDDDDDDDDDDD>
##$VPLIST= <PPPPPPPPPPPPPPP>
##$VTLIST= <TTTTTTTTTTTTTTT>
##$WBST= 1024
##$WBSW= 30
##$XGAIN= (0..3)
0 0 0 0 
##$XL= 0
##$YL= 0
##$YMAX_a= 387097
##$YMIN_a= -591868
##$ZGOPTNS= <>
##$ZL1= 120
##$ZL2= 120
##$ZL3= 120
##$ZL4= 120
##$ABSF1= 0
##$ABSF2= 0
##$ABSG= 0
##$ABSL= 0
##$ALPHA= 0
##$AQORDER= 0
##$ASSFAC= 0
##$ASSFACI= 0
##$ASSFACX= 0
##$ASSWID= 0
##$AUNMP= <proc_1d>
##$AZFE= 0.1
##$AZFW= 0.1
##$BCFW= 0
##$BC_mod= 2
##$BYTORDP= 0
##$COROFFS= 0
##$CY= 18.4799938201904
##$DATMOD= 1
##$DC= 0
##$DFILT= <>
##$DTYPP= 0
##$F1P= 9.9274215381318
##$F2P= -0.165520771350173
##$FCOR= 1
##$FTSIZE= 16384
##$FT_mod= 6
##$GAMMA= 0
##$GB= 0
##$INTBC= 1
##$INTSCL= 4.127829e-11
##$ISEN= 128
##$LB= 0.05
##$LEV0= 0
##$LPBIN= 0
##$MAXI= 10000
##$MC2= 0
##$MEAN= 0
##$ME_mod= 0
##$MI= 50
##$NCOEF= 0
##$NC_proc= -5
##$NLEV= 6
##$NOISF1= 3.799351
##$NOISF2= 2.8
##$NSP= 0
##$NTH_PI= 0
##$NZP= 0
##$OFFSET= 16.48848
##$PC= 4
##$PHC0= -416.9518
##$PHC1= 3.101563
##$PH_mod= 1
##$PKNL= yes
##$PPARMOD= 0
##$PSCAL= 4
##$PSIGN= 0
##$REVERSE= no
##$SF= 200.130005582386
##$SI= 16384
##$SIGF1= 3
##$SIGF2= 2
##$SINO= 400
##$SIOLD= 16384
##$SREGLST= <1H.CDCl3>
##$SSB= 0
##$STSI= 16384
##$STSR= 0
##$SW_p= 4139.07284768211
##$SYMM= 0
##$S_DEV= 0
##$TDeff= 32768
##$TDoff= 0
##$TI= <>
##$TILT= no
##$TM1= 0
##$TM2= 0
##$TOPLEV= 0
##$USERP1= <user>
##$USERP2= <user>
##$USERP3= <user>
##$USERP4= <user>
##$USERP5= <user>
##$WDW= 1
##$XDIM= 16384
##$YMAX_p= 326521704
##$YMIN_p= -561459
$$ End of Bruker specific parameters
$$ ---------------------------------
##NTUPLES= NMR SPECTRUM
##VAR_NAME=  FREQUENCY,     SPECTRUM/REAL,   SPECTRUM/IMAG
##SYMBOL=    X,             R,               I
##VAR_TYPE=  INDEPENDENT,   DEPENDENT,       DEPENDENT
##VAR_FORM=  AFFN,          ASDF,            ASDF
##VAR_DIM=   16384,         16384,           16384
##UNITS=     HZ,            ARBITRARY UNITS, ARBITRARY UNITS
##FACTOR=    0.252644378177508, 1,           1
##FIRST=     3299.83951724647, 0,            0
##LAST=      -839.233330435636, 0,           0
##MIN=       -839.233330435636, -561459,     0
##MAX=       3299.83951724647, 326521704,    0
$$ Real data points
##PAGE= N=1
##DATA TABLE= (X++(R..R)), XYDATA
$$ [...]
11904 -208320 -172527 -178715 -183936 -193409 -234868 -182169 -144231 -243171 -252742 -182046 -200416 -194974
11892 -194974 -194311 -176224 -212715 -236636 -208211 -230106 -204567 -228958 -231257 -203522 -200501 -199809 -223778
11879 -223778 -207995 -210626 -250112 -242503 -205407 -251171 -198490 -194596 -173658 -205192 -194453 -229538
11867 -229538 -187490 -205782 -206519 -199918 -193232 -211086 -196438 -213238 -173440 -169101 -185754 -190476 -171624
11854 -171624 -177208 -185688 -220965 -171068 -206145 -188743 -224748 -205971 -222572 -192673 -245676 -200752
11842 -200752 -182915 -214166 -188408 -218512 -194218 -204024 -210526 -228088 -237917 -211177 -207258 -166166
11830 -166166 -163152 -248082 -203537 -192532 -179502 -193114 -164371 -176268 -208367 -188798 -192096 -191065
11818 -191065 -198705 -182790 -261723 -190115 -208509 -153660 -214410 -177984 -183342 -168472 -207773 -201337
11806 -201337 -187796 -200620 -174662 -223892 -166394 -168324 -200820 -189169 -164848 -176128 -110142 -182712
11794 -182712 -212552 -184841 -165990 -169407 -124126 -114350 -125713 -193665 -158217 -159604 -147065 -155646
11782 -155646 -200952 -168879 -159510 -223612 -181990 -198007 -214799 -195768 -171499 -186325 -207052 -198155
11770 -198155 -203876 -172551 -178922 -216388 -142641 -175870 -197660 -173762 -199557 -233389 -248284 -210923
11758 -210923 -211680 -192859 -176417 -169472 -184208 -220283 -177552 -175551 -211689 -198238 -207708 -171235
11746 -171235 -228053 -191269 -189070 -172843 -190939 -181138 -224557 -144145 -213744 -168685 -226794 -230604
11734 -230604 -150100 -166273 -233658 -176835 -177924 -230229 -207759 -229444 -202082 -245192 -221717 -207612
11722 -207612 -191603 -159575 -199646 -228035 -203122 -235681 -195886 -180081 -232171 -159615 -202463
11711 -202463 -234624 -200537 -203926 -180756 -238089 -210510 -191801 -224201 -154345 -215434 -209837 -217558
11699 -217558 -171942 -190516 -210241 -224609 -223966 -301198 -163538 -223301 -206287 -195803 -198615 -170882
11687 -170882 -153412 -220695 -237933 -180439 -190891 -257890 -227302 -244269 -197978 -163959 -206094
11676 -206094 -235022 -166768 -216070 -230754 -198847 -180270 -183737 -187480 -175702 -194955 -144364 -210432
11664 -210432 -174050 -191542 -227940 -232655 -179619 -186235 -225969 -252390 -195963 -196353 -186085 -238535
11652 -238535 -222952 -173073 -206506 -192748 -201215 -163577 -210414 -218406 -178791 -219478 -195850 -166679
11640 -166679 -189113 -176211 -212632 -199757 -197597 -180623 -215776 -194875 -195661 -203175 -215483 -210970
11628 -210970 -190280 -215301 -243505 -209825 -169509 -190096 -148136 -182031 -205751 -184614 -233448
11617 -233448 -206031 -199196 -199445 -204988 -168419 -191366 -175481 -188567 -246437 -179806 -225221 -189001
11605 -189001 -158205 -179880 -154302 -215752 -196380 -126778 -188254 -228515 -212638 -199847 -201668 -179818
11593 -179818 -173308 -189691 -197062 -193621 -214004 -198088 -190848 -202063 -191837 -226696 -197749 -207215
11581 -207215 -150697 -205127 -231605 -155549 -229715 -229702 -189348 -203203 -223079 -242336 -218952 -184551
11569 -184551 -211404 -191125 -191551 -219417 -204342 -178130 -193008 -187595 -210459 -214929 -189576 -240240
11557 -240240 -187356 -226826 -240595 -215124 -209677 -221871 -189879 -165305 -187718 -204439 -209841 -205081
11545 -205081 -201428 -220167 -180278 -189559 -217891 -217287 -158035 -179163 -205225 -177609 -218049 -211091
11533 -211091 -202613 -168061 -181579 -193836 -225793 -146459 -190086 -225370 -205320 -165414 -191842 -206099
11521 -206099 -220196 -244916 -185988 -196425 -144583 -165756 -171005 -147695 -197924 -178947 -180416 -199357
11509 -199357 -211368 -206421 -163799 -208843 -212107 -205351 -178676 -189391 -231668 -184514 -184747 -215855
11497 -215855 -209401 -206517 -189926 -203344 -225440 -180152 -208499 -235070 -183768 -193531 -203136 -208196
11485 -208196 -213179 -230794 -184301 -161420 -196024 -208916 -204557 -173735 -182879 -158961 -240291 -201435
11473 -201435 -248881 -141949 -191585 -211508 -167541 -241815 -227862 -165961 -230099 -186281 -177302
11462 -177302 -195625 -202378 -207682 -194755 -227942 -213124 -179314 -197737 -193814 -194622 -177565 -230343
11450 -230343 -154963 -177437 -194571 -209088 -178660 -182666 -175664 -198042 -217063 -175700 -204837 -163309
11438 -163309 -181699 -200629 -207425 -218511 -187692 -173117 -198420 -198629 -223365 -169923 -205906 -226975
11426 -226975 -250762 -145962 -198773 -167031 -209702 -197541 -170104 -189066 -144066 -211151 -167463
11415 -167463 -197300 -169452 -237869 -183410 -177665 -157558 -220418 -162897 -178805 -194884 -252952 -234387
11403 -234387 -210314 -174460 -224527 -219442 -220568 -170519 -188644 -236446 -159633 -159964 -157082 -182598
11391 -182598 -176272 -161831 -178905 -193148 -160843 -208762 -194959 -181879 -212793 -156655 -173551 -240391
11379 -240391 -224296 -212409 -198273 -190162 -197358 -274110 -226589 -168027 -225314 -215311 -167079 -215182
11367 -215182 -241911 -255872 -178364 -195396 -179392 -180826 -200936 -184318 -163644 -200361 -160072 -173161
11355 -173161 -178699 -232540 -213082 -245680 -204347 -138487 -197092 -189129 -175890 -203230 -223873 -196132
11343 -196132 -234894 -205654 -189312 -175719 -170671 -172956 -223580 -168353 -179192 -205887 -185015 -181680
11331 -181680 -170764 -226526 -223742 -222537 -128065 -211627 -220234 -217684 -208845 -228149 -184451 -192199 -224975
11318 -224975 -219902 -158932 -194064 -206841 -223055 -208392 -158446 -180251 -184853 -252489 -207239 -194374
11306 -194374 -212884 -175147 -226382 -205635 -225005 -206917 -174410 -186014 -162871 -138657 -167022
11295 -167022 -160361 -214055 -198637 -172433 -211944 -208859 -132284 -155344 -184567 -221251 -172435 -185551
11283 -185551 -187151 -173438 -192921 -200181 -211970 -191977 -166381 -155954 -178451 -190350 -183058 -206501
11271 -206501 -192675 -198233 -171843 -176212 -212868 -211295 -211641 -194544 -208691 -193765 -140155 -208222
11259 -208222 -221394 -223892 -173993 -161930 -230431 -221538 -157719 -172510 -162107 -161801 -201560 -129618
11247 -129618 -180726 -187571 -227995 -203153 -148398 -190425 -170451 -170484 -161290 -156371 -191172 -202777 -136027
11234 -136027 -191519 -173003 -198874 -199550 -192103 -195620 -178180 -144321 -200239 -198278 -227303 -187286
11222 -187286 -203546 -213806 -201751 -241886 -154412 -120645 -211132 -140035 -167501 -202259 -227320
11211 -227320 -154225 -130689 -210979 -173546 -178671 -201503 -161678 -198018 -194995 -180447 -151865 -186363
11199 -186363 -210084 -217778 -162650 -179465 -212222 -235588 -182061 -212834 -194378 -126294 -167866 -180250
11187 -180250 -221724 -212079 -217268 -144988 -206354 -152957 -191378 -216031 -183238 -159981 -185253 -186065
11175 -186065 -218893 -177509 -202362 -211076 -174702 -218397 -169698 -180331 -127677 -178888 -201204 -194116
11163 -194116 -186705 -226164 -160143 -199052 -257974 -199864 -182358 -183160 -138836 -234122 -197049 -177142
11151 -177142 -197205 -168431 -173083 -153356 -152632 -207048 -166261 -177155 -171048 -203323 -203693 -224822 -226985
11138 -226985 -173152 -190768 -263964 -236041 -213540 -207730 -177524 -209707 -230991 -201921 -208756 -158228
11126 -158228 -182900 -213024 -200703 -210863 -194670 -210014 -213326 -186128 -219692 -234152 -176383 -195342
11114 -195342 -177577 -178095 -149605 -182572 -193601 -172651 -183447 -195851 -188402 -247451 -232100 -138698
11102 -138698 -192309 -222554 -182251 -191989 -202214 -158346 -173832 -168145 -168769 -242308 -167962 -208734
11090 -208734 -177320 -218573 -185133 -179355 -120225 -207769 -192674 -175747 -157895 -171043 -200586 -164997
11078 -164997 -161185 -176328 -220925 -161190 -171078 -200187 -192669 -179217 -143807 -207614 -197392 -177623
11066 -177623 -224895 -211490 -178917 -210272 -180390 -145318 -229639 -165908 -176087 -194496 -200714 -146833
11054 -146833 -210115 -186807 -144770 -216933 -197153 -142706 -228312 -238600 -188701 -208232 -242597
11043 -242597 -209513 -214651 -149054 -145798 -190600 -178742 -182003 -142969 -188857 -161329 -192762 -195452
11031 -195452 -183241 -165467 -161820 -205955 -159819 -166103 -156102 -197416 -189404 -177680 -239449 -235635
11019 -235635 -196664 -143302 -215242 -198447 -207009 -169875 -148783 -212487 -164012 -159716 -167280 -176770
11007 -176770 -189150 -220670 -176775 -204912 -153864 -211932 -155522 -191147 -153978 -191965 -161456
10996 -161456 -167058 -160564 -188835 -186662 -178672 -204965 -158731 -192484 -187088 -212711 -163786 -212932
10984 -212932 -191816 -189261 -162010 -136612 -165249 -179173 -177684 -188236 -175712 -163655 -188849 -262480
10972 -262480 -220836 -216630 -192040 -165869 -224417 -192759 -144846 -170685 -174193 -165487 -189526 -240726
10960 -240726 -174761 -186799 -143794 -220422 -163494 -202111 -201094 -209581 -177025 -186407 -154677 -187294
10948 -187294 -182066 -162693 -233756 -206309 -160837 -170915 -184284 -171943 -168714 -228416 -154054 -157723
10936 -157723 -175756 -195728 -201482 -214725 -219691 -200023 -160636 -204803 -154205 -163914 -202494 -215313
10924 -215313 -161684 -200004 -190943 -191588 -194484 -171632 -165441 -207750 -152161 -112157 -188700 -177993
10912 -177993 -176818 -190557 -195868 -181417 -204138 -142474 -190198 -176506 -171929 -197959 -196644 -183624
10900 -183624 -175077 -157432 -211458 -163720 -175807 -190494 -260804 -187279 -210367 -207085 -160688 -187990
10888 -187990 -187329 -179326 -221298 -181067 -134966 -202820 -160084 -184419 -166858 -182063 -159796 -157020
10876 -157020 -179741 -225762 -157049 -169379 -204228 -200994 -188717 -174490 -219516 -191587 -165081 -175380
10864 -175380 -190786 -176536 -201917 -169554 -191253 -240749 -225122 -186385 -174342 -196553 -202015 -180653
10852 -180653 -183699 -224645 -189789 -186880 -179188 -211758 -229978 -200370 -208943 -181803 -209878 -185931
10840 -185931 -256801 -201356 -197140 -210057 -158511 -205637 -190225 -203534 -192244 -191058 -151450 -172887
10828 -172887 -192145 -182039 -145411 -211283 -139247 -207846 -187149 -189010 -169907 -137020 -184037 -237244
10816 -237244 -215174 -189510 -197625 -186179 -208127 -178673 -184572 -176751 -160439 -156621 -178811 -204959
10804 -204959 -149168 -166888 -156225 -204972 -193542 -189076 -125463 -167611 -219075 -155770 -144434 -218456
10792 -218456 -193379 -137371 -173304 -162601 -163311 -132871 -190833 -222792 -200899 -170574 -164972 -193337
10780 -193337 -158514 -181857 -202315 -184787 -212724 -193738 -193105 -146611 -200173 -190835 -187631 -158041
10768 -158041 -178124 -148706 -138635 -174081 -166980 -183090 -177157 -140288 -208094 -202886 -242762 -197636
10756 -197636 -148763 -202489 -186569 -201948 -173326 -158755 -184016 -172858 -140499 -155289 -189838
10745 -189838 -143287 -161319 -224541 -222252 -228637 -200419 -164523 -208764 -186601 -171435 -126405 -210078
10733 -210078 -220962 -135732 -161135 -193186 -159691 -183300 -185644 -194053 -160732 -211678 -180176 -180149
10721 -180149 -202039 -236193 -180380 -174258 -176266 -234934 -155072 -195674 -173138 -212699 -149510 -187496
10709 -187496 -196004 -131939 -155727 -196549 -152820 -137538 -174160 -188636 -191947 -183402 -168849 -193380
10697 -193380 -150928 -196204 -186146 -194686 -190145 -179223 -233896 -220666 -136439 -201897 -167866 -211836
10685 -211836 -174832 -188949 -188224 -175749 -167459 -167160 -162710 -166633 -159213 -229352 -160490 -210995 -167332
10672 -167332 -216300 -197819 -167281 -208135 -189637 -142177 -143091 -156130 -191791 -157433 -149682 -125026
10660 -125026 -181880 -174791 -193272 -143318 -156306 -233931 -162656 -172217 -186128 -166752 -177537 -215740
10648 -215740 -229592 -172145 -137259 -148336 -132384 -187012 -179107 -203120 -172052 -240428 -170006 -139520
10636 -139520 -136850 -146886 -154926 -198248 -161538 -172632 -148860 -149808 -179396 -183182 -202388 -182347
10624 -182347 -195575 -159078 -145760 -152132 -167778 -153252 -189008 -149236 -200078 -162288 -206498 -192212
10612 -192212 -164231 -160485 -181198 -175168 -144129 -186165 -156645 -177363 -155665 -168998 -129620 -160918
10600 -160918 -181553 -145653 -187782 -169373 -131016 -252458 -196726 -163605 -172400 -167983 -181394 -132763
10588 -132763 -159520 -162737 -206243 -158444 -135136 -193672 -180429 -188797 -163119 -189343 -223059 -182892
10576 -182892 -103661 -165437 -220954 -175398 -129557 -113451 -116765 -192427 -168594 -184017 -195479 -185698
10564 -185698 -174765 -193358 -186532 -144408 -198959 -226031 -152503 -149763 -155391 -199805 -178334 -184240
10552 -184240 -174106 -172751 -133384 -207170 -187180 -198023 -217740 -155157 -195265 -169675 -214500 -139943
10540 -139943 -155390 -186615 -191043 -103648 -114945 -168929 -146211 -166917 -175932 -190988 -161784 -155309
10528 -155309 -167877 -203558 -175594 -181766 -109023 -143916 -157337 -155816 -216690 -165203 -188476 -167628
10516 -167628 -185647 -197326 -156838 -193288 -152676 -193986 -186746 -167433 -179662 -174148 -121238 -194969
10504 -194969 -155158 -157283 -197369 -172084 -174827 -152593 -178347 -191209 -132666 -201317 -166434 -226309
10492 -226309 -205883 -210757 -159862 -177050 -150456 -141854 -152590 -198182 -215659 -174070 -155982 -142227
10480 -142227 -168763 -185377 -169952 -184635 -149410 -173481 -171982 -141390 -170854 -214228 -166049 -159837
10468 -159837 -159667 -209493 -193097 -118783 -213408 -221471 -146558 -206157 -164951 -176648 -162813 -167802
10456 -167802 -174239 -199905 -154694 -210165 -182167 -228644 -176628 -131815 -172389 -192237 -125192 -183532
10444 -183532 -186290 -185353 -160497 -179727 -183571 -146230 -176831 -175728 -190049 -209520 -139678 -200981
10432 -200981 -141425 -202354 -142812 -146323 -222755 -169636 -177935 -154185 -154249 -148977 -200659 -165812 -121290
10419 -121290 -167029 -167305 -156499 -176694 -178261 -253800 -174334 -165936 -128288 -155738 -142751 -152282
10407 -152282 -164100 -153479 -159541 -192916 -172084 -156497 -186089 -168136 -201509 -192371 -173264 -188210
10395 -188210 -178459 -195485 -137283 -137060 -154107 -177501 -179738 -183755 -189652 -159178 -153874 -205974 -157460
10382 -157460 -179697 -157595 -203857 -163409 -185464 -157501 -185143 -162125 -174087 -190770 -200403 -202074
10370 -202074 -159920 -173957 -163758 -218631 -182090 -154380 -166140 -156054 -162005 -145006 -145027 -193023
10358 -193023 -130056 -190933 -165824 -183765 -181708 -189727 -197605 -174024 -174265 -140430 -134002 -183175 -135476
10345 -135476 -173332 -135778 -131421 -176830 -175575 -144193 -160283 -112627 -181465 -142641 -145665 -147329
10333 -147329 -201111 -155050 -208314 -154116 -176719 -186594 -171105 -203075 -110346 -171305 -161760 -161132
10321 -161132 -171040 -152784 -179200 -161931 -142209 -149728 -166514 -172302 -157202 -186442 -149917 -129225
10309 -129225 -178015 -170440 -152508 -159668 -168057 -180249 -165886 -137363 -217519 -194920 -169371 -171285
10297 -171285 -180214 -186174 -185218 -138983 -176434 -196453 -181698 -136479 -168330 -177898 -216196 -134940
10285 -134940 -146391 -153801 -197728 -151218 -126279 -153975 -154991 -148870 -179539 -146321 -168103 -151096
10273 -151096 -188662 -131775 -161133 -175135 -173510 -190716 -176379 -129745 -129342 -179811 -156105 -135279
10261 -135279 -209358 -167209 -136880 -154559 -183392 -171008 -172546 -177939 -204902 -148454 -140654 -182559
10249 -182559 -149144 -178719 -203921 -163241 -191620 -189430 -228455 -183707 -182385 -230332 -148930 -177556
10237 -177556 -228668 -142593 -193208 -173298 -144908 -211002 -192924 -180279 -131777 -196895 -207482
10226 -207482 -181494 -185596 -117971 -177717 -162217 -140478 -121929 -177607 -151360 -165086 -141741 -147542
10214 -147542 -151281 -120238 -159594 -200267 -159181 -178248 -161571 -180625 -181430 -198982 -176340 -174278
10202 -174278 -102547 -149255 -124721 -140868 -181071 -138651 -179816 -144506 -133852 -149757 -146378 -188648
10190 -188648 -164776 -107883 -164812 -157486 -173705 -142987 -209794 -145504 -176623 -148090 -170863 -168580
10178 -168580 -170699 -130740 -150853 -170836 -107594 -152039 -190983 -207240 -153043 -170503 -104139 -162051
10166 -162051 -127851 -152948 -150752 -142467 -175045 -185370 -152377 -196789 -199985 -182951 -135078 -145266
10154 -145266 -188493 -145984 -101603 -154309 -137606 -198857 -183819 -149288 -154984 -158989 -142976 -148095
10142 -148095 -155583 -164780 -184656 -172502 -155632 -195702 -204309 -181933 -139564 -164672 -147060 -155914
10130 -155914 -127486 -216024 -125566 -150934 -160200 -159206 -196818 -160246 -157960 -174101 -141978 -146468
10118 -146468 -127791 -127186 -192924 -140367 -127333 -145053 -126740 -160588 -172441 -165804 -150287 -114988
10106 -114988 -176838 -163803 -151269 -153600 -159597 -105577 -169854 -149910 -185792 -175155 -161392 -148688
10094 -148688 -175388 -139256 -151764 -155179 -118569 -150392 -145220 -131423 -137641 -162976 -176203 -136122
10082 -136122 -148989 -159463 -178230 -114841 -152892 -197393 -180670 -106547 -147639 -147151 -134221 -127492
10070 -127492 -119136 -109241 -158120 -157009 -190438 -141625 -103323 -147333 -161990 -138724 -150450 -145661
10058 -145661 -139640 -114686 -147001 -153225 -121678 -152292 -135438 -195248 -176218 -218628 -125425 -154246
10046 -154246 -150960 -126586 -133571 -175189 -162083 -176072 -193267 -137225 -173062 -155949 -130078 -109912
10034 -109912 -156882 -128895 -166015 -156520 -167090 -161420 -177765 -181622 -199209 -147187 -172675 -148373
10022 -148373 -112628 -191674 -155101 -168208 -155345 -175198 -124414 -178211 -159200 -169904 -190155
10011 -190155 -167411 -162327 -128923 -138040 -119466 -126521 -142873 -121369 -143704 -127307 -153786 -139401
9999 -139401 -142435 -155357 -130088 -92741 -160711 -164605 -105390 -172246 -160228 -151125 -236794 -125631
9987 -125631 -167582 -152592 -140539 -160087 -124449 -129349 -135737 -174144 -112737 -175050 -170951 -179624
9975 -179624 -113684 -200969 -166220 -196720 -118282 -119656 -134685 -183279 -223097 -116336 -135355 -151970
9963 -151970 -125901 -133226 -167401 -172567 -167634 -156596 -107859 -188308 -139605 -134638 -149305 -155604 -158501
9950 -158501 -127448 -140786 -174669 -136711 -95587 -139879 -119425 -143216 -139004 -136189 -158544 -123159
9938 -123159 -144524 -185213 -117724 -140567 -188865 -136472 -159341 -133701 -149475 -148351 -118297 -102367
9926 -102367 -147134 -136030 -112763 -157909 -105689 -150044 -105321 -131734 -127902 -179776 -181430 -128136
9914 -128136 -145483 -130757 -158719 -186166 -131975 -180501 -114219 -151824 -144765 -169856 -171449 -152695
9902 -152695 -99790 -143735 -180743 -161631 -142777 -173173 -141168 -122119 -121826 -149228 -112174 -137721
9890 -137721 -121268 -149889 -140131 -159462 -152436 -119744 -178136 -121098 -169111 -99323 -171063 -153415
9878 -153415 -119514 -125683 -173660 -116703 -159741 -190464 -112045 -168871 -134709 -136847 -158067 -184812
9866 -184812 -127421 -134414 -86932 -172911 -123776 -139145 -107432 -118490 -122783 -142579 -160264 -106842
9854 -106842 -77468 -134985 -122960 -92573 -105705 -106306 -167410 -137690 -173445 -130986 -73904 -136129
9842 -136129 -152543 -95949 -119169 -159564 -139524 -89181 -153894 -155988 -112036 -173448 -120227 -126931
9830 -126931 -99323 -164428 -157538 -116226 -114756 -137541 -128652 -99728 -119545 -95887 -106001 -132260
9818 -132260 -154024 -147443 -60923 -86818 -155195 -132453 -141596 -122581 -140780 -112368 -65341 -112451
9806 -112451 -84250 -128245 -96072 -133960 -125100 -79027 -150139 -140852 -99008 -96772 -114254 -94840
9794 -94840 -89906 -107091 -115774 -157193 -93374 -98393 -130821 -124708 -141326 -111880 -97858 -100993 -134881
9781 -134881 -107577 -141361 -112653 -96289 -101605 -108610 -151364 -117845 -127611 -121165 -151671 -109454
9769 -109454 -89571 -142067 -124997 -162099 -107361 -127331 -146560 -104185 -197027 -123646 -123627 -164887
9757 -164887 -128403 -83434 -100335 -150734 -127455 -127757 -65656 -95392 -99604 -148247 -105620 -136658
9745 -136658 -116349 -82352 -60213 -105883 -103623 -103661 -95196 -137621 -127095 -135567 -102959 -138494 -106847
9732 -106847 -96739 -85235 -83611 -88035 -158911 -108586 -131398 -109356 -96278 -113101 -85356 -95410
9720 -95410 -108623 -147008 -110550 -94624 -92465 -107775 -102305 -131006 -98061 -123285 -87982 -85528
9708 -85528 -109893 -131376 -118248 -116675 -130368 -145303 -147482 -131627 -114998 -95648 -137379 -103334
9696 -103334 -124618 -80103 -171537 -95675 -111819 -101727 -126197 -134821 -65857 -86386 -46868 -77250
9684 -77250 -84520 -124546 -110010 -93262 -93670 -112905 -40858 -93398 -149873 -78316 -88492 -153842
9672 -153842 -131887 -76953 -69839 -89513 -97386 -80333 -46965 -41259 -19199 -77540 -70152 -46153
9660 -46153 -46688 -72584 -79134 -49092 -74784 -101667 -96484 -53399 -10357 -89187 -85353 -21584 -80369
9647 -80369 -65206 -118869 -128170 -65330 -125570 -64357 -87487 -91559 -105604 -105331 -66789 -103553 -81753
9634 -81753 -114120 -88254 -133099 -84849 -89835 -114337 -84495 -100912 -74034 -55184 -85866 -80577
9622 -80577 -110108 -99288 -77217 -54803 -61974 -62365 -49854 -80519 -84566 -29252 -101988 -54569 -74663
9609 -74663 -82468 -38763 -41752 -18922 -27865 -57841 -72736 4289 -31395 -30604 78859 47203 88350
9596 88350 116116 153124 256533 324789 400406 406203 436920 403249 335170 259561 234930 120618
9584 120618 100463 19015 24291 -4856 -3654 39648 -4198 -14933 -7782 20515 -66456 -61645
9572 -61645 -27370 -34253 -41724 -9385 -33193 18136 -38030 -29169 -58767 -5962 13975 -20086
9560 -20086 -31308 -18323 -77655 -26555 -28230 -50464 -83938 -112460 -99223 -98157 -70683 -90690
9548 -90690 -95827 -57786 -63983 -57997 -89843 -150774 -80548 -44126 -88980 -64451 -28418 -82477
9536 -82477 -89156 -38077 -102248 -56233 -81468 -55851 -43850 -88160 -69711 -31605 -72744 -77322
9524 -77322 -71018 -47809 -55005 -48338 -63735 -79928 -97216 -85745 -45614 -20027 -88462 -43295
9512 -43295 -71852 -82414 -14049 -8288 -51317 -59645 -80453 -104060 -57344 -25237 -72356 -63155
9500 -63155 -106703 -97570 -93723 -110487 -102079 -47544 -62869 -89090 -89085 -77237 -86313 -46759 -102840
9487 -102840 -92198 -86042 -41572 -59375 -98664 -86618 -82463 -18601 -87280 -64931 -80693 -84485
9475 -84485 -89110 -85630 -39662 -64109 -96818 -54706 -54959 -55554 -81320 -136583 -114022 -61947 -110940
9462 -110940 -135413 -83247 -59466 -126910 -97131 -115656 -100520 -99783 -103932 -97051 -69449 -72474 -72948
9449 -72948 -112887 -87326 -140752 -69484 -127507 -143333 -111251 -113407 -123667 -71928 -123243 -113492
9437 -113492 -36587 -111724 -82224 -68970 -41979 -77804 -117952 -125027 -61259 -117653 -117826 -93589
9425 -93589 -93129 -40714 -117000 -92377 -65116 -65049 -65599 -66755 -69862 -113470 -91825 -72334 -84481 -114566
9411 -114566 -71256 -87411 -75686 -124342 -82355 -90066 -102039 -44505 -71166 -94485 -80812 -42376
9399 -42376 -91037 -66724 -119019 -87091 -58720 -119195 -79864 -103472 -80676 -98904 -87028 -93839
9387 -93839 -93520 -88845 -51374 -76319 -85314 -89839 -101759 -90555 -61890 -118750 -93084 -46938 -60705
9374 -60705 -65068 -67621 -115631 -90584 -71569 -101080 -73764 -63862 -70518 -79135 -123615 -90070 -7382
9361 -7382 -98154 -91151 -77223 -72863 -84899 -90464 -68592 -68639 -96947 -70788 -40295 -98785 -92014
9348 -92014 -37502 -31400 -81724 -96401 -109478 -48088 -108323 -64288 -62357 -46729 -62431 -98444
9336 -98444 -96259 -62837 -76396 -63596 -37535 -108616 -84986 -52884 -60974 -19414 -24932 -28669 -66561
9323 -66561 -3400 -23754 -1065 -56200 -21985 -94471 -101316 -67766 -28561 -66779 -71454 -98244
9311 -98244 -75604 -31714 -64342 3048 -84025 -36607 -13559 -48778 -29571 -17871 -10154 -26040
9299 -26040 -55293 -24517 -30229 5555 -53316 -53565 -27842 -29255 -20117 -54030 11971 -14073 -21493
9286 -21493 -49068 -29362 -32916 -33507 -19316 -28789 -27912 -18915 -30362 -41355 -3751 -32063 -6745
9273 -6745 -26444 -4903 -34117 -39407 -49977 -12404 -13896 32327 -20444 -18984 -46914 -36986 -70514
9260 -70514 -22484 -21215 -26644 -5006 -18350 -10804 -28105 -45194 -24487 -26410 -25624 -44748 -61284
9247 -61284 -19951 40374 -11837 -9459 -18862 1135 -22927 -9662 -8167 32951 9761 17497 -45537
9234 -45537 17298 9543 -38242 -5376 -26095 13821 3809 -32166 -25864 -15465 12378 24476
9222 24476 57537 22577 35704 -48307 -34582 -5989 456 -20799 -2841 -42489 8082 36701
9210 36701 18087 -6934 45768 11119 331 25224 1216 45714 40973 48169 8211 52909
9198 52909 34825 -7480 -13318 12405 23391 78691 19709 -19288 52164 21279 52163 1877
9186 1877 77011 34407 68091 41625 -12710 85960 12687 68570 68694 70244 77499 81717 58195
9173 58195 70964 54344 76533 83194 120097 61024 90650 96355 93457 95059 72469 100566 66178
9160 66178 100576 121084 116223 148812 141427 121706 114374 135509 165061 176259 114268 135102
9148 135102 144075 166228 126409 115138 156271 150177 178684 139520 111777 97146 145118 143023
9136 143023 123379 153701 149672 172698 161136 143052 186555 119196 156528 127432 158309 139249
9124 139249 145522 184528 214571 160345 159493 147983 169181 171305 181748 134740 213516 111421
9112 111421 158261 153471 186038 186952 177602 198843 165471 179471 220039 189765 228322 211594
9100 211594 174312 232676 230856 234905 222046 243239 260729 264814 263608 279562 266711 251603
9088 251603 288338 260227 283246 300695 292584 316270 231569 325192 284522 272142 306962 314195
9076 314195 344757 318575 338616 313057 295065 359941 280205 339599 324036 323640 328845 331871
9064 331871 331721 291175 365275 340967 369258 370573 378368 348148 344116 361720 311995 346529 337094
9051 337094 399036 352131 401151 377647 428130 452178 449805 406746 419761 431813 439493 431115
9039 431115 447566 455825 440151 436300 481394 487306 453651 471821 489301 562151 519074 555260
9027 555260 530455 563353 494037 521681 551328 598834 590648 587357 617041 605994 593357 577796
9015 577796 642410 645864 663132 634668 693610 628067 716286 692036 659073 729274 719111 741421
9003 741421 754747 768265 770180 813736 825427 818383 814370 837880 817946 840426 850219 873610
8991 873610 941075 902527 914472 968728 986635 953681 998618 1000715 1068741 1022696 1056092 1069945
8979 1069945 1049736 1097229 1116748 1108662 1175241 1180302 1268328 1239933 1281880 1294955 1350959 1344585
8967 1344585 1370967 1434570 1414964 1407802 1425252 1480918 1508336 1561794 1597519 1586908 1595264 1665559
8955 1665559 1634872 1707583 1734741 1782494 1790762 1797803 1935697 1918544 1975403 2009321 2016207 2065496
8943 2065496 2125650 2163503 2179232 2209506 2321824 2321421 2357391 2439159 2469856 2556624 2533818 2575820
8931 2575820 2645236 2716211 2794804 2807859 2852737 2930995 2961602 3064542 3115708 3145471 3227728
8920 3227728 3284139 3243223 3401579 3446476 3503179 3560364 3607405 3690805 3677670 3781001 3831607
8909 3831607 3845893 3910730 3976331 4025956 4027705 4147844 4144745 4235745 4256943 4306442 4280382 4319922
8897 4319922 4346879 4353791 4415193 4405353 4503653 4474293 4462208 4510854 4491450 4465176 4449157 4493696
8885 4493696 4472235 4415989 4397090 4312627 4358211 4317164 4344469 4266525 4214421 4171070 4116498
8874 4116498 4128185 4072183 3998296 3971054 3875183 3827655 3777223 3739903 3688034 3606640 3557526
8863 3557526 3487255 3448071 3358907 3347560 3288010 3182489 3116381 3048458 3045200 2983217 2973933 2846246
8851 2846246 2784613 2765016 2699279 2638964 2574463 2556813 2539147 2414493 2399973 2391798 2312647
8840 2312647 2269973 2217398 2147714 2116023 2128560 2075441 2044989 1956433 1934144 1897248 1847629
8829 1847629 1804307 1835269 1749764 1700831 1647447 1658783 1598089 1575554 1553417 1538381 1478607
8818 1478607 1447556 1408322 1398769 1406535 1342153 1314276 1305907 1224782 1205783 1237163 1199620 1211762
8806 1211762 1176084 1145108 1118933 1100860 1091565 1087340 1050243 1020094 1020194 1002284 1002400 961416 965345
8793 965345 936974 883391 856400 835784 844998 843358 838397 840876 790936 843771 766251 789653
8781 789653 774076 721392 713572 723389 701049 701734 724989 699377 665272 707841 657627 633202
8769 633202 620442 596135 594211 617689 611494 607751 553179 623347 562173 572189 542055 551356
8757 551356 551929 547062 583361 497330 573802 607016 607859 529540 583905 565703 579871 603801 584165
8744 584165 599869 564810 628380 686462 792103 814939 905813 1066047 1298075 1521618 1729395
8733 1729395 1800626 1748544 1578323 1459924 1226656 1096187 859185 795000 636076 598802
8723 598802 489873 500763 421422 414645 368256 362249 284810 353198 321294 328285 345667 298334
8711 298334 346822 273077 278183 268430 267475 296050 307754 266307 235740 201594 201966 244519 219674
8698 219674 230004 259605 202110 230037 212098 189854 219833 215355 223120 197342 204726 187389
8686 187389 199269 139066 167080 187072 175015 159917 174966 178981 143037 182541 148745 161975
8674 161975 163064 165877 143050 148412 180290 109288 150715 157217 174051 97548 173792 127017
8662 127017 107203 127589 92400 112222 90757 141331 151655 136659 103295 98664 95881 96419
8650 96419 44508 83171 73965 63328 87316 74209 93637 70912 144674 39436 75997 66200
8638 66200 81024 89471 73379 45030 103622 80219 97609 80146 66081 26100 58385 61805
8626 61805 85669 91161 90365 41784 59536 9502 4991 -885 15763 68686 58830 101918 73629
8613 73629 68165 17353 52301 35470 27358 71044 52340 19935 14922 75203 32188 14871
8601 14871 9178 24170 -1719 18354 5042 50386 3117 31922 34804 -17674 41486 -12246
8589 -12246 56868 43298 -11816 3628 -36017 -14299 -18167 15968 49344 28372 17966 6294
8577 6294 -54781 41017 -25882 35479 5737 209 -3136 23814 1511 11909 -22483 -30060 4345
8564 4345 9335 -18501 -10431 -36632 -8105 -37274 5630 4682 42331 -43316 23858 29822 18163
8551 18163 -48731 -3510 838 -17078 22391 -47582 19573 -38401 -8645 9648 33914 -42856
8539 -42856 11246 -35060 -5399 -17292 -7037 4945 19382 46974 89285 -561459 -57564
8528 -57564 -106997 -32901 -24876 -43382 -9567 -18086 -62149 -30669 -23280 -23736 -24789 -52876 -9661
8515 -9661 -25502 -33132 -49114 -33851 -55350 -67103 1291 -32796 -46683 -27583 8987 -66645
8503 -66645 -42787 -47164 -25585 7356 -35003 5892 -25427 -24313 -74667 6038 -12014 -54940
8491 -54940 -77937 -36449 -32474 -47949 -30184 -39497 -68656 -23695 -34664 -57220 -32634 -20590
8479 -20590 -56698 -17255 -57724 -17245 -49507 -18906 -35457 -73927 16673 -67587 -53597 -76348
8467 -76348 -40050 -49500 -40577 -43548 -18247 -72710 -54649 -31765 -44097 -76091 -44641 -19689
8455 -19689 -28470 -40619 -55462 -33953 -49392 -30637 -74639 -64522 -31653 -88914 -70036 -48809
8443 -48809 -92561 -59129 -53970 -21761 -68562 -70935 -64283 -12798 -45557 -61821 -49689 -8725
8431 -8725 -24648 -16132 -28150 -60746 -78375 -78936 -62854 3532 -40195 -24666 -25026 -37343 -166
8418 -166 -40836 -13112 -52275 -20930 24730 -49720 -1041 -25895 32789 -47312 -28293 -37059
8406 -37059 -67411 -51400 15713 -50890 -21529 -51981 -5388 -45144 8634 -44920 -30324 -89121
8394 -89121 -16339 -8504 -38057 -50383 -12021 -25988 -77291 -29024 -70992 -78002 -37322 -24431
8382 -24431 -39949 -28207 -79770 -70036 -3668 -49314 -35366 -46403 -97477 -91832 -75404 -37663
8370 -37663 -96674 -49363 -71512 -38393 -60056 -88547 -54237 -14988 -51175 -92455 -41696 -45943
8358 -45943 -29821 -80747 -57115 -100880 -31265 -84114 -2335 -52088 -41760 -2679 -34509 -63749
8346 -63749 -4199 -63980 -75173 -47812 -26233 -74249 -57893 -45960 -79675 -16509 -67204 -50962
8334 -50962 -46439 -48959 -26959 -86994 -35524 -8181 -43608 -80518 -53464 -30865 -15544 -70885
8322 -70885 -41975 -22697 -27876 -36842 -59400 -37539 -11121 -65299 -17299 -28401 -32137 -12252
8310 -12252 -48182 -75976 -24024 -88994 -57473 -27201 -77098 -67633 -34540 -11916 -85437 -41946
8298 -41946 -7145 -32472 -54864 4477 -67448 -133504 -62344 -57052 -59891 -47239 -41028 -38832 -34191
8285 -34191 -55762 -37794 -103406 -84225 -22410 -74763 -59666 -55214 -57556 -52892 -43584 -88297 -50803
8272 -50803 -34590 -26221 -87795 -56493 -14008 -59816 -52414 -26074 4964 -18809 -94717 -54578
8260 -54578 -105245 -34845 -24725 -32408 -32496 -48954 -55856 -42235 -30047 -18454 -46254 -32507 -55831
8247 -55831 -58130 -105307 -49369 -103550 -77146 -12000 -51195 -15385 -8284 -66360 -15147 -54432
8235 -54432 -57187 -56272 -65808 -42115 -37298 -35319 -26914 -22570 8881 -53876 -58427 -31015 -22965 -83408
8221 -83408 -7610 -65375 -96806 -45408 -46237 -22237 -16247 -15369 -49273 -62520 -108450 -44977 -45677
8208 -45677 -32742 -33298 -59161 -2238 -4380 -46369 -61164 29603 -73426 -41787 -19531 -69756
8196 -69756 -35943 -45702 -96961 -52655 127488 11364 -29801 -136305 -17316 -8556 -37114
8185 -37114 -36329 -45839 -46348 -93350 -74265 -108815 -4164 -39243 -24029 -27527 -61270 -90847 -43429
8172 -43429 -31478 -34421 -54536 -43982 -47920 -53282 -62788 -71969 -111714 -22032 -44155 -18012 -51479
8159 -51479 -76059 -59708 -47918 -46649 -84518 -39509 -48656 -18929 -11198 -29433 -24647 -80313 -83425
8146 -83425 -31836 -102836 -58039 -22729 -68675 -40599 -28999 -33008 -70114 -31516 1143 -31043
8134 -31043 -59860 -58629 -45490 -58856 -44481 -42382 -50848 -81528 -57372 -59667 -29004 306 -54814
8121 -54814 -23805 -28064 -44053 -46602 -37466 -30150 -70088 -37069 -67491 -21975 -69815 -17917 -59908
8108 -59908 -93578 -77222 -53983 -86708 -40544 -24073 -20464 -66213 -28335 -4039 -31110 -22265
8096 -22265 -80860 -33332 -38577 -70225 -65330 -31340 -88003 -46767 -68392 -40024 -72845 -50172
8084 -50172 -65323 -42619 -42002 -58415 -34354 -35397 -60249 -61552 -27542 -53082 -42956 3226 -8774
8071 -8774 -9321 57605 11002 37658 6180 8347 44032 16433 28418 -188 -27473 29278 -5675
8058 -5675 6611 -51977 -16718 -15485 -7044 6448 31888 26770 4248 -2325 24906 49935 47837
8045 47837 50849 81871 100049 160991 161652 91368 102966 92204 89412 75975 30334 21070 48645
8032 48645 -17529 58892 -25756 4986 -27020 -3004 9838 1506 42703 48618 12550 51321
8020 51321 75096 47179 71326 79047 104125 140226 171931 113933 115254 80513 60355 29928
8008 29928 56641 -6703 23747 21090 -8441 -10519 17557 -12504 27685 -8861 -806 -5020 10712
7995 10712 6136 -31133 18847 18443 -7029 -74258 869 2046 38882 4718 27689 2244 27885
7982 27885 10036 -22926 -2109 -33647 -50041 5670 4401 -524 -44442 -60129 -25309 -32197
7970 -32197 -18999 -29928 -44135 -56585 -6237 -10551 30487 -28320 -31518 -66899 16135 -18017
7958 -18017 -642 -12101 -47054 -28081 -41448 -43647 -34696 -13213 -13362 -32808 -7632 13680 7395
7945 7395 -20942 -25480 -33098 6922 -27834 -15318 -28807 -40418 -7700 -9734 -7070 -4655 -60718
7932 -60718 6048 34300 -64440 -25276 -27053 -44332 -47206 -54115 -24386 -47900 -32121 -52222
7920 -52222 -35451 -41766 -9232 -53359 -45336 -51202 -27773 -8363 -21214 -42247 -40297 -20795 -35217
7907 -35217 -37448 -39879 -38479 -42247 -8141 -38739 -8657 -5334 -27497 -36384 -23917 35620 24172
7894 24172 -10095 -1145 -23447 -36602 39123 17067 -3318 -9840 -48535 -32494 -12625 -18589
7882 -18589 28838 -6048 10187 -19658 -50509 16453 -9884 -9699 2379 -49762 2879 -5612
7870 -5612 -71054 -58048 -26544 13977 -4945 316 -36710 -23465 -2729 -22393 -25344 -28542 -29618
7857 -29618 -54299 -21220 -99241 344612 126597 62691 10326 13660 24534 -27678 -32010 9371
7845 9371 -13877 -80605 -12175 -8260 6244 -44710 4678 -5641 -23391 41602 -1200 -24379
7833 -24379 69047 -8122 -28766 -18256 32535 -22522 -37985 -53710 -20368 -8734 -28447 -33772
7821 -33772 -27301 -6499 25727 -15114 -60603 -22094 -9419 25242 -14968 -18397 11628 -34178
7809 -34178 -14829 61771 1755 -18883 -36307 -2958 -34499 -30472 15409 -9787 4249 114
7797 114 -28888 -54534 15173 -6640 -5896 -28598 -10099 -29692 -53414 6159 24143 23093 -743
7784 -743 -10722 4957 -33292 33711 -33412 -37558 -11464 -10833 -7294 -1753 -193 -20769 6010 6102
7770 6102 -44491 -17070 -13082 -32178 1560 6194 5860 -55579 -24334 -45320 -37031 -31131 -7980
7757 -7980 -10154 -32896 -6380 -55749 -27720 -24058 -10504 -29521 -35854 -24252 1666 2144 -19698
7744 -19698 -16141 -20799 11551 -19618 -27204 -10736 -28378 -12926 47031 36139 -33004 -2453
7732 -2453 -67834 -68947 -12898 -15540 -961 -29335 -9079 -3561 -7194 86 -38270 -22684 -20646
7719 -20646 -7539 -20771 8484 49601 -139 -28737 -30966 -16043 -46335 -41913 1794 -35189
7707 -35189 -23380 -26039 7665 -10069 7325 32017 -10562 18933 -24680 -21680 -49787 37030
7695 37030 40447 8966 20509 -24493 24329 6189 10965 18224 16801 38993 41160 13863 7305
7682 7305 47285 7655 42055 -10753 49086 38717 17502 32612 28578 10621 -12865 13895
7670 13895 28082 30399 52177 45378 59031 106535 90756 41330 36102 71211 -8868 17051
7658 17051 20804 56434 59809 48400 -14314 -24985 -19478 -13093 13280 -6759 5529 -6314 18804
7645 18804 -6932 -18542 -11149 8905 12793 26030 -10813 -5284 -68397 19446 -5746 2119 34206
7632 34206 -30785 10960 39280 -39551 9912 29272 43236 -4566 8452 2387 -6888 10812
7620 10812 -20208 38639 30986 -38312 30359 -3341 54927 6686 28580 -11362 39907 -12686
7608 -12686 17226 62952 48785 -6417 -26931 46697 4742 11065 55352 50643 32063 27853
7596 27853 29911 75152 70124 52227 40535 -12834 25554 100805 11585 31450 79407 29181
7584 29181 25765 82162 65455 52889 84294 -3289 29102 -17196 51991 11408 31635 43434
7572 43434 -8335 56474 5637 43769 51228 3859 44899 2192 77568 2187 28441 -8199
7560 -8199 40786 56530 52994 14309 36305 13289 17894 335 14654 65030 50271 23929
7548 23929 -6799 44782 3768 22200 -1712 47096 24134 32407 16384 38316 21077 25326
7536 25326 61331 -7499 44402 19711 86577 73174 35298 95468 78720 75334 30405 65929
7524 65929 81346 42744 53188 6819 85576 70888 76422 48137 47898 67276 98469 58123
7512 58123 19430 42393 79539 124538 67088 48162 62544 35274 97540 32382 -2729 35210
7500 35210 42401 54363 59128 38728 89482 66984 70276 88649 74928 85407 71081 55629
7488 55629 49088 71239 36149 86658 17003 81192 15476 64104 97943 29742 22120 58976
7476 58976 37502 87854 54984 37057 13884 -3068 10044 50384 28306 32295 78052 49629
7464 49629 28437 36253 15530 16534 50151 53583 22458 40232 43355 -8624 71509 52274 12648
7451 12648 103976 36432 49843 82569 57797 67412 36780 29063 64884 93337 47524 76234
7439 76234 81310 47162 41669 82220 -15121 53323 52693 61985 33311 13156 71837 66112 76732
7426 76732 93049 59018 37547 57527 72533 41332 40947 56745 75313 75745 55481 56096 84172
7413 84172 53932 39377 -1500 42908 40578 60836 49358 32282 83314 53665 67954 23556
7401 23556 47687 -4230 17406 19037 51139 57613 -17143 52562 34968 58485 43162 25975
7389 25975 9176 91856 63771 89504 -8867 49504 31122 -45772 46781 56057 33541 37458
7377 37458 7778 20422 32106 41583 31104 51355 50806 40114 23245 59753 78719 66840
7365 66840 -1683 45509 36651 69166 90872 22605 39518 52575 98851 87803 67116 107455
7353 107455 69551 50815 91974 85184 80874 63864 94473 90408 68434 74631 58759 67259 63236
7340 63236 98899 61075 -216 92578 52097 57387 67868 71904 47396 39519 -8765 46965
7328 46965 75212 61921 59381 90390 63741 94434 106192 63844 33583 57359 71728 84968
7316 84968 -6585 80447 85047 35611 127611 95489 72455 53937 76146 68298 127303 88197
7304 88197 114516 82469 93005 39047 88502 63413 97029 127396 117984 104782 56018 71521
7292 71521 156222 109662 104430 145272 108721 54673 63188 90490 94660 96689 84513 69642 17471
7279 17471 61677 63010 84668 64624 84628 61088 93293 3847 90047 49316 59533 94359
7267 94359 72345 50231 77210 57574 56821 49287 96236 90992 84811 97909 57115 62912 101584
7254 101584 100931 49065 101153 63429 124636 143616 61489 128464 125388 81579 128097 150717
7242 150717 121868 105822 142787 128316 132024 99814 76869 169626 154773 120086 155471 158644
7230 158644 130970 150046 132813 122803 116045 147073 118632 159047 154295 151522 96217 126131
7218 126131 146096 160523 121439 116746 107902 133036 126092 139925 121043 61359 151370 149987
7206 149987 109692 128456 125692 110419 114947 117981 119326 132922 121311 110548 52555 69313
7194 69313 88003 89976 93416 103223 96230 84545 103040 89223 95995 93138 34768 76779 54579
7181 54579 135611 64534 78773 143082 142010 123750 163443 126866 114100 187254 190084 204698
7169 204698 228515 195855 192399 239565 199194 218603 210669 210804 286440 224451 227283 234957 224429
7156 224429 311089 256285 262746 258496 286496 246804 258586 274256 315932 275797 280036 270163
7144 270163 333933 297890 290454 332017 299554 297937 290935 276688 268899 266321 313119 176764
7132 176764 210073 224345 238762 177630 239204 228120 172184 157624 207265 189519 230351 180116
7120 180116 196995 179121 196043 202880 200512 158599 207661 207561 188376 187622 187276 250860 148751
7107 148751 197280 195726 172088 246674 212034 212007 228920 219320 172247 234634 204918 247256 172020
7094 172020 214365 183115 223887 186327 260600 190983 227673 218662 265528 198262 223600 236954
7082 236954 229825 203546 233439 249691 235957 223610 229095 296575 203093 219986 259316 249232
7070 249232 214216 210123 204572 234239 238218 173092 168667 159456 190491 199329 214153 216793 157943
7057 157943 254926 228035 233204 238132 236680 238449 203483 263642 255718 226672 216543 239332 232283
7044 232283 238684 268513 189130 212566 226517 253936 271147 237498 259390 247939 256658 219353
7032 219353 231479 237521 246671 287886 306304 320797 262258 262682 291189 271715 280892 304623 266478
7019 266478 263721 239849 272120 226665 235623 216750 212752 234542 232252 211121 222345 202830
7007 202830 259477 263096 259371 249736 254817 277929 279838 250784 273151 293996 306339 301942 295328
6994 295328 317722 294826 314088 275701 278678 298403 347043 277086 294855 343503 316440 276524
6982 276524 287509 289417 310452 286414 267053 262292 252825 296187 263758 290999 301115 310423
6970 310423 240941 315131 291507 311810 327114 282310 310749 314230 330730 268612 319289 315539
6958 315539 274242 333126 317662 314084 308083 346340 372153 332515 349867 342498 342166 300222 289532
6945 289532 306695 291915 323750 320545 339940 291518 249875 277349 295988 287961 281989 300974
6933 300974 258183 244912 311868 270832 319196 247247 259696 307197 288487 323417 302707 307332
6921 307332 247552 305325 299483 283338 332563 272395 319367 279583 311896 280633 358456 332092
6909 332092 303143 346549 317112 333454 338816 357866 395343 354970 404069 375233 374043 391936
6897 391936 373387 427590 414611 423828 436829 419133 410440 391616 407610 382240 402472 428500
6885 428500 419077 415726 418108 457654 399906 409056 427274 473939 496373 459577 454582 475103 464446
6872 464446 473747 377568 420737 439428 474161 434524 481157 517292 513397 469095 465834 492849
6860 492849 536630 546779 461004 507741 539017 513932 488323 538533 513466 518419 530735 520016
6848 520016 500695 506986 510448 566401 522913 538060 535218 560120 521921 611443 557788 617816
6836 617816 576690 604196 613588 629047 620771 650183 727977 721709 734565 769978 799642 755772
6824 755772 811517 830473 851471 838931 866236 883712 895356 916646 949782 941836 967212 1003808
6812 1003808 980352 1033371 1077736 1125068 1107380 1107761 1178925 1180675 1249782 1332002 1328879 1429082
6800 1429082 1545449 1621595 1772268 1859311 2038041 2247706 2467316 2743888 3170880 3406093
6790 3406093 3614904 3755875 3791114 3886704 3931082 3887458 3907869 3812988 3660353 3499837 3370106
6779 3370106 3224822 3151442 3045451 2978062 2971287 3003616 3094998 3205429 3377678 3638309 3964510
6768 3964510 4302674 4772442 5415168 6301799 7295370 8207644 8878845 9287822 9377980 9412511
6758 9412511 9467635 9401139 9241912 8881571 8329930 7664100 7006084 6273949 5698643 5196778
6748 5196778 4768370 4368394 4175946 4082032 4090875 4151979 4270002 4469087 4743656 5192348
6738 5192348 5783318 6524700 7504413 8455040 9177109 9605421 9709469 9730927 9707303 9632769
6728 9632769 9455445 9018141 8466054 7700859 6956898 6191667 5447787 4784686 4291827 3810490
6718 3810490 3451712 3218429 3027545 2898222 2820034 2816019 2798891 2833449 3026734 3217562
6708 3217562 3507106 3712369 3938202 4078369 4131777 4126335 4151461 4137198 4048422 3927455 3673488
6697 3673488 3476994 3241153 2951309 2711763 2544376 2378202 2221115 2085429 2040972 2021793
6687 2021793 2020595 2046512 2105150 2231598 2443703 2681535 2796271 2913597 3003003 3047824 2972249
6676 2972249 3007752 2947061 2840570 2686040 2527412 2257776 2079296 1926307 1709327 1572237
6666 1572237 1416821 1314160 1251693 1239437 1194600 1156204 1169267 1164485 1235676 1182518 1218520
6655 1218520 1202574 1283771 1339524 1406506 1453827 1492528 1548489 1484992 1454249 1445571 1380607 1362325
6643 1362325 1268101 1252862 1225586 1205266 1160536 1153754 1141061 1144734 1176402 1177747 1243113 1244415
6631 1244415 1251619 1230372 1300982 1310054 1347107 1379529 1488613 1626794 1727799 1843462 1945162
6620 1945162 1882876 1826518 1761423 1640649 1473231 1376487 1281497 1188413 1131090 1083220 1119884
6609 1119884 1135490 1102617 1116677 1198575 1216505 1271021 1323225 1439348 1454798 1484142 1631475
6598 1631475 1780949 1819572 1944876 2134765 2259814 2370048 2402135 2338090 2324276 2212144
6588 2212144 2028052 1988314 1851286 1774568 1713487 1656942 1644958 1711546 1655066 1640461 1676762
6577 1676762 1693087 1748804 1689068 1632622 1674172 1663198 1719222 1674384 1695108 1702444 1750968 1807596
6565 1807596 1828975 1899732 1843167 1837356 1864735 1873241 1845126 1876625 1766201 1797893 1735791 1731135
6553 1731135 1806761 1757122 1799341 1821069 1808031 1828146 1883915 1905609 1929718 1942785 1941434 2070326
6541 2070326 2131576 2207059 2245573 2330308 2375961 2454449 2587556 2652353 2749331 2844108 2926854
6530 2926854 2995461 3094504 3177902 3239387 3309135 3363307 3350613 3318475 3308625 3324444 3213626
6519 3213626 3166214 3081853 2981517 2982157 2910529 2870840 2799964 2775091 2768151 2764661 2814243 2841526
6507 2841526 2915504 2917584 2977483 3057794 3094771 3255005 3300771 3417891 3466305 3591966 3571246
6496 3571246 3620106 3675156 3791339 3848720 3892672 3930244 4005036 3996291 4039987 4098972 4093545 4243638
6484 4243638 4285862 4353698 4439406 4609534 4729512 4787306 4921843 5015504 5118274 5213159 5354070
6473 5354070 5432875 5512171 5543126 5712878 5845365 5944656 6005914 6071206 6158412 6276262 6443669
6462 6443669 6517133 6637367 6692866 6821626 6985092 7113628 7295149 7488645 7666099 7823407
6452 7823407 7979423 8103522 8310141 8382514 8470915 8586928 8701895 8877068 9000758 9245018
6442 9245018 9430661 9747842 10058895 10437151 10818939 11137985 11553343 11954432 12394096 12709161
6432 12709161 13076246 13437944 13900296 14390209 14954504 15506730 16010639 16502798 16963898
6423 16963898 17399147 17920344 18512077 19046376 19590588 20127773 20662461 21307888 22076270
6414 22076270 22993104 24024787 25288344 26675337 28348677 30312372 32600758 35286047
6406 35286047 38364377 41802908 45568087 49821485 54465831 59711000 66342968 74478560
6398 74478560 84142369 95510240 109281370 126390161 150138118 183677719 224370086
6391 224370086 264459941 296195224 313191566 319595720 323930045 326521704 322864463 312820235
6383 312820235 292983414 265368008 234538942 203339677 172019972 144030719 119775940
6376 119775940 99296957 82895751 69792729 59914387 52482020 46494784 41652442 37845640
6368 37845640 34729071 32027266 29780357 27785789 26124881 24550302 23126130 21817184
6360 21817184 20723996 19564777 18507275 17425946 16339869 15290745 14412175 13603959
6352 13603959 12895937 12335624 11779606 11297783 10813062 10384780 10102582 9821668 9582401
6343 9582401 9337558 9134477 8974673 8759321 8522073 8280832 8067832 7943500 7777696 7579784
6333 7579784 7439942 7325202 7162655 7005320 6894909 6713771 6574628 6427254 6240022 6182714
6323 6182714 6071972 6030511 5994552 5956758 5895691 5934125 5965250 6072995 6201805 6334156 6530879
6312 6530879 6772869 7293830 8190853 9302760 10401223 11105811 11112675 10386678 9812247 8856716
6302 8856716 7822586 6967451 6137332 5534555 5019324 4603665 4369206 4197544 4071463
6293 4071463 4067967 4015272 3976903 3911199 3951198 4010679 3972810 4008927 3973105 3967637 3993851 3912624
6281 3912624 3934440 3930839 3906778 3946863 3962919 4038044 4050154 4081753 4148366 4168305 4217133 4216268
6269 4216268 4248795 4348323 4454464 4489674 4546344 4601881 4750237 4870505 5016186 5169563
6259 5169563 5410016 5625068 5836229 6098850 6495802 6921131 7463202 8015137 8636727 9267646
6249 9267646 10091300 11267602 12712605 14455001 16566271 19278224 22780268 27905568
6241 27905568 35307909 43687277 51034438 55431696 55759393 52621223 48294033 42027790
6233 42027790 35329480 29139712 23730180 19138156 15541046 12754908 10744710 9284732
6225 9284732 8120450 7257474 6476062 5867401 5331761 4918919 4525019 4272199 4067758
6216 4067758 3870944 3672063 3520543 3411551 3247597 3097246 2971220 2845593 2703885 2558215
6206 2558215 2391215 2249461 2087152 1933324 1821818 1720370 1587784 1560849 1447042 1407328
6196 1407328 1334187 1288738 1300823 1210442 1125740 1138655 1110535 1088147 1056084 1069567 1120761
6185 1120761 1081494 1052704 1023195 998910 966717 917175 887690 879344 846608 819659 782164 802297
6173 802297 779354 835532 816967 860569 866210 889955 934945 896194 969404 997969 988448 940490
6161 940490 975896 967276 907896 869470 863282 844634 876292 808559 792404 785105 654278 676797
6149 676797 610486 577796 594197 564230 576220 550869 547298 592786 583124 544404 552687 574210
6137 574210 565698 541767 513403 559481 485011 471901 489775 488804 449653 433531 364921 444511
6125 444511 364776 370065 388106 363155 378465 396958 406203 443939 482382 542518 583736 657124
6113 657124 665564 677558 690376 710134 721178 771437 718525 742817 731662 711570 778927 800475
6101 800475 785674 872899 1014530 1175820 1361986 1521520 1658013 1722153 1752271 1852902
6091 1852902 1783598 1809712 1717556 1636649 1533485 1368934 1227029 1112188 1026175 856329
6081 856329 806521 668951 674799 588390 529254 470998 482043 541157 462773 484043 527433 494970
6069 494970 428615 472798 447834 483577 478438 417276 462436 438451 453874 426994 390279 444819
6057 444819 388684 353399 382908 287516 311141 269304 221580 215532 197940 247737 188564 208362
6045 208362 174311 217418 198058 227932 190992 300662 266537 237966 276950 226532 286950
6034 286950 278230 299831 274401 295716 257755 278073 264784 300754 292478 320510 317133 353220
6022 353220 333137 332834 357881 345392 375566 415565 388590 459899 382006 388234 398954 378509
6010 378509 439424 342131 374842 381334 363400 414412 333098 343246 362175 375551 382077 355919
5998 355919 331635 375150 377503 309517 363354 320367 372030 370581 343327 350841 400263 343594
5986 343594 338599 383823 402841 407157 383010 366160 400409 412052 411853 379413 417011 462715
5974 462715 452143 510280 473032 530779 511001 525482 512078 558623 504658 506963 529574 523071
5962 523071 548570 540916 524780 513668 506569 551104 561369 538341 563556 573065 563232 600911
5950 600911 654179 722676 742135 784479 807677 783092 747038 759706 702887 732927 728262 728182
5938 728182 700252 720466 727804 723245 719279 671635 759886 684412 718345 710521 721945 686570
5926 686570 693454 712943 709954 716516 716541 792825 734838 767555 718968 694330 778209 723430 726980
5913 726980 771829 734223 720310 752195 739709 780642 849613 820116 836235 856662 866033 860261
5901 860261 845200 826131 851135 884663 875647 885637 863259 938395 939143 926299 930047 940998 954630
5888 954630 975845 995881 951721 1008799 1030022 1022464 1054732 1059480 1047427 1018684 1045150 1067242
5876 1067242 1063519 1116156 1110319 1149401 1153018 1194192 1155080 1210106 1283551 1239236 1317649 1317684 1355229
5863 1355229 1373407 1293399 1418660 1407454 1413627 1413006 1391887 1430295 1443755 1463015 1470549 1486394
5851 1486394 1509735 1586082 1532141 1585328 1634946 1673160 1604369 1715429 1719031 1732376 1788690
5840 1788690 1780380 1788039 1835226 1819710 1858780 1855659 1857274 1912041 1888178 1932675 1963138 2015127
5828 2015127 2048524 2060615 2102294 2065097 2130480 2149807 2177492 2245625 2288578 2306757 2328489
5817 2328489 2348920 2375203 2427594 2480626 2488881 2572592 2592202 2630306 2637150 2710282 2762194 2761194
5805 2761194 2830106 2897422 2933963 2948014 2995101 3071116 3117469 3111958 3155886 3176551 3301289
5794 3301289 3297990 3339533 3422033 3486625 3511413 3513326 3644491 3670788 3727817 3771456 3800519 3863867
5782 3863867 3974555 4021609 4015175 4110035 4204372 4286449 4304273 4397929 4441003 4459578 4526526
5771 4526526 4580831 4658261 4730211 4786645 4822322 4837382 4942415 4977830 5014021 5070268 5196104
5760 5196104 5157924 5201137 5247764 5307100 5353935 5373619 5325898 5382739 5408627 5407662 5438519 5434001
5748 5434001 5444943 5435204 5431147 5480364 5451466 5462355 5428476 5403169 5391787 5410922 5358644 5346629
5736 5346629 5347267 5323026 5328410 5256038 5222524 5181334 5179366 5126393 5068860 5037017 5026759 5044453
5724 5044453 4978578 4936197 4902539 4872495 4848631 4765093 4791688 4707304 4686013 4602343 4575043
5713 4575043 4580240 4529901 4498903 4419580 4396382 4363565 4286887 4252666 4172671 4154243 4037063
5702 4037063 4021767 3916015 3954487 3947075 3889343 3846361 3804529 3762612 3695806 3702372 3699384 3598513
5690 3598513 3520912 3567293 3499354 3501398 3468787 3496450 3436384 3448809 3398415 3390843 3350996 3309344
5678 3309344 3366110 3258590 3299127 3276205 3281449 3248395 3188562 3150726 3209894 3170542 3156125
5667 3156125 3108257 3068191 3073910 3043974 2990586 3034906 3002862 2972960 2971148 2965639 2933184 2893541
5655 2893541 2918081 2978316 2933234 2944013 2925235 2977412 3003864 2972102 3019202 2988446 2994957 2978510
5643 2978510 2999273 2948914 2875659 2860077 2844150 2867768 2867420 2805910 2884529 2876504 2903411 2928869
5631 2928869 2917968 2895031 2956891 2946031 2965167 3006139 2996291 3013935 3030794 3054454 3064746 3080973
5619 3080973 3143052 3105658 3139794 3156168 3212434 3230028 3281262 3273363 3308889 3285690 3355817 3384431
5607 3384431 3413780 3451354 3471474 3510889 3542608 3579431 3592722 3640135 3707676 3747938 3800584
5596 3800584 3778731 3822175 3824890 3922940 3903323 3899078 4040122 4009151 4099474 4124257 4167163 4196943
5584 4196943 4265936 4305255 4314792 4359153 4436047 4502015 4527066 4612676 4651865 4689763 4794972
5573 4794972 4871421 4867948 4986420 5003306 5064834 5120042 5207507 5298905 5364090 5440867 5507179
5562 5507179 5600850 5666694 5766614 5835894 5884042 5996902 6092576 6197614 6265122 6379910 6521010
5551 6521010 6602789 6717598 6840215 6950631 7045670 7210839 7291694 7448794 7584348 7724193
5541 7724193 7810813 7973597 8197308 8323098 8481599 8669105 8916020 9081659 9344220 9544245
5531 9544245 9749503 9973431 10175788 10385295 10592431 10800197 11086693 11320846 11610523 11825585
5521 11825585 12166321 12521975 12831740 13237078 13633800 14043816 14456423 15043302 15556376
5512 15556376 16157232 16782521 17462035 18195896 18939178 19838257 20714727 21759892 22815814
5503 22815814 24019555 25407637 27067634 29107734 31245266 33310919 34942549 36353542
5495 36353542 37593330 38867008 39981598 41259295 42730349 44268800 46021735 47894898
5487 47894898 49946063 52047608 54141894 56252927 58283955 60188543 62133791 63916863
5479 63916863 65733830 67456444 69172522 70924282 72699122 74647786 76643773 78827554
5471 78827554 81185771 83664231 86357207 89077436 91957208 94809932 97861284 100777754
5463 100777754 103630672 106218060 108448829 110365054 112016514 113385537 114384924 115046858
5455 115046858 115413907 115453745 115359648 115121036 114805023 114565642 114469101 114505404 114746448 115116866
5445 115116866 115751099 116401917 117195011 118004724 118748439 119432950 119914800 120123824 120110638
5436 120110638 119896183 119369877 118704147 117953589 117158957 116433811 115631690 115140399 114742439
5427 114742439 114592840 114493993 114642320 114913524 115326703 115749145 116094627 116224358 116102740
5418 116102740 115673410 114849544 113646273 112005252 109908416 107514309 104599716 101487898
5410 101487898 98179936 94778531 91301838 87905556 84671942 81637154 78823557 76250565
5402 76250565 74003057 72004878 70225245 68615026 67111167 65656852 64151100 62663699
5394 62663699 61075656 59388643 57628355 55721825 53721868 51662272 49525766 47379900
5386 47379900 45144477 43099638 41058627 38949620 37075356 35239786 33493886 31889022
5378 31889022 30340475 28967485 27752141 26653132 25750275 24958847 24299900 23840921 23430836
5369 23430836 23159542 22920384 22666921 22514106 22423329 22315183 22134999 22002399 21934584 21675100
5359 21675100 21414702 20950825 20576986 20055320 19558677 18982481 18460944 17906752 17420903
5350 17420903 16894951 16397570 15951334 15560496 15237639 14865818 14549744 14327921 14005958
5341 14005958 13760417 13478765 13159887 12828248 12469963 12147433 11794617 11558401 11250437
5332 11250437 10863595 10443070 9941612 9500899 8917509 8441366 7888871 7581257 7238621
5323 7238621 6948747 6671398 6505317 6422903 6379126 6328820 6315925 6220766 6239751 6236201 6272509
5312 6272509 6323878 6422136 6484871 6525258 6522915 6511356 6527348 6575114 6612657 6666948 6689548 6583264
5300 6583264 6456545 6321937 6221775 6048712 5957931 5851378 5721732 5513473 5333735 5186350
5290 5186350 5019720 4863120 4744038 4639746 4491707 4418325 4285981 4172461 4097996 4027292
5280 4027292 3978906 3992624 4071634 4071345 4122196 4196885 4381894 4558706 4694895 4928419 5149706
5269 5149706 5366743 5701432 5937159 6313394 6665884 6985278 7365701 7702016 7997912 8339758
5259 8339758 8590681 8750770 8993660 9195904 9325813 9495741 9625542 9829485 10011352 10233743
5249 10233743 10473502 10761288 11067138 11335121 11644334 11953004 12250990 12577041 12843906
5240 12843906 13133715 13310000 13333056 13288873 13106318 12863774 12601848 12221502 11787530 11396726
5230 11396726 10837058 10368815 9931121 9502275 9192701 8905121 8544527 8396780 8241051
5221 8241051 8160017 8086227 8013281 7925369 7867805 7726717 7548935 7368768 7073416 6822405
5211 6822405 6505549 6228642 5963205 5628287 5296476 4957213 4633005 4324642 4034341 3776795
5201 3776795 3477158 3249901 3035187 2887452 2759648 2654961 2503338 2347616 2261968 2197798
5191 2197798 2121897 2036552 1972118 1961639 1886832 1817052 1796799 1704681 1731023 1606624 1611473
5180 1611473 1597376 1485619 1455321 1454214 1421335 1355078 1329306 1285541 1273916 1317226 1269386
5169 1269386 1220267 1223190 1233859 1153783 1213719 1169190 1143087 1102514 1129229 1148011 1132216 1117542
5157 1117542 1041737 1057480 1028922 1066649 1000334 922837 926137 883301 845039 876218 801848 798628
5145 798628 840215 859923 791065 766267 757325 802909 781396 760574 685476 767312 714512 712155
5133 712155 685046 627042 642898 634175 573370 598645 627998 553911 548724 524860 518171 504216
5121 504216 525885 502925 479017 454398 505162 456811 473963 471440 430967 443317 408335 456852
5109 456852 452886 426698 460141 456596 475499 439938 433362 449019 433057 457132 445156 460330
5097 460330 416036 482646 430295 473060 456562 473259 515113 442624 480069 507542 452211 471803
5085 471803 479168 513993 518496 504369 506363 536105 546736 526746 572849 599687 573940 546784
5073 546784 571946 539062 580466 576018 529629 512192 519854 545516 547818 528387 560620 569148
5061 569148 563340 572632 603713 603563 580253 601526 602491 658845 664938 689586 677593 650312 686422
5048 686422 701030 747611 754833 764568 731174 768306 809763 843742 812655 808943 857236 886053
5036 886053 888633 869687 895437 920156 1003134 1033059 1007424 1083758 1080341 1054264 1090749 1129547
5024 1129547 1123415 1160234 1149205 1186339 1227598 1148176 1221552 1232408 1234911 1272580 1315511 1307282
5012 1307282 1304968 1287786 1321930 1324725 1407840 1439738 1424999 1431162 1469594 1489318 1509292 1532579
5000 1532579 1525597 1552200 1518532 1577824 1586724 1605198 1647264 1607036 1618068 1670362 1654903 1744888
4988 1744888 1699425 1681065 1742578 1707233 1723860 1748384 1761259 1743291 1776695 1794226 1810674
4977 1810674 1774043 1810079 1773547 1793764 1783617 1800959 1808599 1804568 1800893 1789146 1788137 1795460
4965 1795460 1772104 1834205 1783831 1789254 1825953 1738099 1786701 1823559 1797819 1837196 1809503 1847133
4953 1847133 1883333 1863565 1860993 1886825 1933200 1931676 1966164 1934434 1986297 1970006 1979990 1978826
4941 1978826 2028293 1970794 2017017 1961728 2038471 1979963 2061776 2037959 2053764 2108557 2122981
4930 2122981 2175170 2122624 2168094 2179984 2227311 2224530 2224262 2299723 2304381 2289619 2308494 2336292
4918 2336292 2376538 2393960 2439002 2426894 2473741 2470508 2506727 2487981 2506869 2537932 2583262 2633186
4906 2633186 2636536 2630421 2681313 2705823 2728376 2785304 2786544 2861462 2869988 2916850 2937678 3019104
4894 3019104 3079482 3099195 3145846 3178160 3219939 3259887 3317983 3335174 3460887 3478828 3516701
4883 3516701 3601140 3612332 3649523 3747351 3790008 3793099 3897298 3939648 3986361 4045205 4130800
4872 4130800 4122294 4246545 4241928 4292066 4373296 4410119 4505433 4545463 4569212 4627902 4767876
4861 4767876 4772833 4874626 4924099 4988839 5043442 5104900 5151081 5234760 5322916 5363063 5448579
4850 5448579 5494180 5640049 5702658 5767364 5896553 5935866 6062281 6175924 6236748 6368859
4840 6368859 6485003 6548576 6705900 6824788 7004527 7086431 7193299 7438041 7624329 7800624
4830 7800624 7985973 8235811 8307681 8474782 8573865 8712400 8873804 9046551 9162292 9291586
4820 9291586 9545699 9697680 9901954 10180731 10452117 10698742 10964950 11252464 11590228 11918365
4810 11918365 12235793 12679058 13007003 13584269 14047499 14536673 15114303 15696264 16301968
4801 16301968 17035773 17672642 18392607 19121394 19819404 20564370 21212977 22074557 22826469
4792 22826469 23615135 24399111 25186729 26019611 26853467 27784879 28637419 29564869 30475178
4783 30475178 31277494 32113145 32959371 33791646 34616357 35422641 36368158 37334758 38423715
4774 38423715 39612060 40909473 42437100 43991874 45746136 47653257 49665686 51875984
4766 51875984 54216532 56832862 59600581 62536472 65708843 68896685 72112753 75282112
4758 75282112 78375664 81353788 84196686 87061558 89975205 92911728 95952639 99266183
4750 99266183 102758925 106516195 110685128 115212916 120273991 125527479 131136999 136755947
4742 136755947 142184151 147092605 151526221 155306780 158645359 161463382 163984127 166146542
4734 166146542 168106521 169840068 171354894 172452106 173123284 173370179 173221814 172612072 171577329
4725 171577329 170205867 168503418 166540931 164426865 162117949 159822331 157537786 154870332
4717 154870332 151796032 148047214 143710771 138758516 133463075 128006153 122545251 117422504
4709 117422504 112591158 108145443 104132068 100573735 97192546 94136767 91126646 88337150
4701 88337150 85586359 82897078 80250636 77634354 75037276 72531993 69982564 67571981
4693 67571981 65193283 63095742 61073968 59295397 57657133 56240906 55053074 53980656
4685 53980656 53002771 52025521 51031748 50053041 49016359 48002684 47022153 46073613 45172909
4676 45172909 44401696 43579488 42845991 42145046 41400597 40601327 39777605 39047133 38142143
4667 38142143 37393047 36634202 35830734 35090299 34428229 33630609 32819383 31901727 30878987
4658 30878987 29719114 28504657 27178115 25806309 24548975 23227535 22059272 20979660
4650 20979660 19925343 19037216 18198924 17451561 16800500 16255877 15682096 15184429 14719543
4641 14719543 14305516 13913824 13508037 13123373 12802753 12341769 11999224 11563804 11153276
4632 11153276 10763189 10360114 9927106 9639747 9291623 8967653 8594365 8249878 8007277
4623 8007277 7662929 7460943 7219697 6973814 6781280 6575896 6379985 6247196 6106938 5868843
4613 5868843 5751651 5618927 5468366 5300491 5132225 4938985 4793737 4612592 4483161 4367803
4603 4367803 4137566 3969665 3833400 3654788 3557674 3386453 3233207 3116754 3017808 2858749
4593 2858749 2743622 2683317 2535344 2467779 2343965 2240934 2133823 2046379 1927188 1920823
4583 1920823 1874669 1819089 1700106 1674869 1624308 1596335 1527191 1519865 1476665 1401636 1383314
4572 1383314 1331589 1315708 1281666 1280564 1292198 1234394 1279591 1303348 1203420 1261854 1217542 1228713
4560 1228713 1188711 1164980 1132161 1065792 1098876 1090222 1024308 975995 1022177 1036232 990055 919031
4548 919031 962849 969242 911632 906308 885610 909616 855790 907666 898885 858101 822081 898940
4536 898940 926083 929829 909764 877012 927448 898531 973613 934809 919475 958602 949638 888815
4524 888815 964262 1001903 985684 986142 980507 1027812 1070587 1036020 1069387 1097160 1169881 1216216
4512 1216216 1211873 1260663 1291072 1301628 1337974 1327498 1387504 1346614 1345544 1355382 1399217 1422425
4500 1422425 1460441 1415733 1468730 1500069 1538089 1554772 1546299 1571077 1645961 1645594 1676537 1704164
4488 1704164 1714736 1736424 1776933 1833736 1840304 1897997 1940332 1962083 1969045 1970614 2025070 2062673
4476 2062673 2076062 2041443 2093988 2147810 2184489 2253145 2375663 2448932 2547173 2641090 2761220
4465 2761220 2867733 3041101 3198469 3375927 3610187 3841421 4125200 4420040 4808935 5309508
4455 5309508 5903698 6639706 7590997 8734153 10184630 11674989 13106476 14158782 14676544
4446 14676544 14567402 13874698 12759255 11534962 10283843 9101232 8080415 7311089 6657673
4437 6657673 6254041 6042827 5926773 5939109 6025816 6190847 6453812 6894633 7424732 8118144
4427 8118144 9004411 10127422 11653524 13712323 16286166 18973491 21440193 23068724
4419 23068724 23544429 23048682 21513933 19312801 17025790 14622358 12419308 10547474
4411 10547474 9053704 7935465 7059568 6434293 6042271 5763193 5604856 5495695 5496453 5544550
4401 5544550 5727154 6007063 6345849 6798053 7481113 8413895 9492520 10717322 11801456
4392 11801456 12586001 12887765 12670263 12052543 11141016 10047569 8969136 7911475 7050798
4383 7050798 6352722 5884653 5537443 5352036 5251461 5266089 5180858 5133699 5003932 4832136
4373 4832136 4700495 4495128 4317987 4232305 4157847 4076203 4076627 4032756 4075772 4172518 4226458
4362 4226458 4322334 4442120 4578586 4714251 4880167 5069266 5248261 5423920 5750449 6025357
4352 6025357 6446285 6874241 7304773 7671316 7821858 7819436 7710428 7566520 7374089 7219543
4342 7219543 7066351 7048007 7035973 7083869 7238036 7406713 7703732 7938495 8289579 8545590
4332 8545590 8833206 9137236 9524540 9825371 10252464 10709837 11240290 11843455 12656679 13581752
4322 13581752 14647983 15738198 16843368 18003366 19055280 19988074 20787379 21422056 21800385
4313 21800385 21855253 21712929 21270525 20604717 19870505 19046552 18239827 17457801 16730352 16030830
4303 16030830 15377727 14863700 14312025 13718921 13158101 12451769 11746788 10981159 10217826
4294 10217826 9400065 8677086 7971781 7293483 6624072 6103950 5643241 5238173 4861516
4285 4861516 4492321 4208302 3958856 3740051 3537040 3391345 3185060 3011956 2880900 2755033
4275 2755033 2596084 2463498 2354451 2254144 2133240 2064046 1937066 1867122 1799242 1716931
4265 1716931 1692458 1585126 1532856 1448518 1391431 1358889 1296162 1206326 1114994 1104565 1025679
4254 1025679 986791 980887 952865 848478 841613 800392 761269 763522 681125 684221 638167 643567
4242 643567 616951 601273 565072 580282 588414 526257 540251 507391 417949 462073 470816 427731
4230 427731 412233 434074 415789 387067 396881 437831 372756 378696 313134 320137 325410 335055 298515
4217 298515 305117 322641 297304 288613 244628 302872 300314 282885 300519 287531 263357 255773
4205 255773 275629 262853 292303 339116 331356 373762 373836 298635 400854 398847 377565 338820
4193 338820 363183 307171 322251 325151 275567 299060 249175 219572 221804 281691 231028 230142
4181 230142 219598 262076 203937 224591 197135 218781 261702 227923 276749 229100 320938 354566
4169 354566 329491 335388 363498 377277 373720 379888 346506 357565 359231 292500 319567 254693
4157 254693 329480 349626 353268 327166 344973 346291 374280 430206 440621 426177 461087 489447
4145 489447 515782 480235 497953 581849 588691 586505 583800 610927 593683 670342 700189 647022
4133 647022 655121 732390 704999 784910 752499 820817 855911 888859 898388 929636 1042548 1091939
4121 1091939 1163566 1199878 1275730 1356209 1421830 1487260 1551009 1693868 1788023 2030792 2134866
4110 2134866 2343422 2531525 2793811 2963912 3191870 3372093 3512197 3590598 3681317 3656239
4100 3656239 3646032 3659243 3636601 3693573 3687237 3627656 3673336 3618675 3677109 3625092 3552084 3516656
4088 3516656 3558603 3519684 3531892 3596740 3690138 3849596 4070760 4284823 4639965 4963511
4078 4963511 5375238 5834639 6344896 6789474 7267055 7678412 7891848 8031163 7908572 7735033
4068 7735033 7424392 7165900 6912348 6676829 6625657 6553566 6512763 6420246 6309983 6052789
4058 6052789 5883540 5773893 5681170 5581492 5632437 5678914 5774718 6042668 6337407 6743777
4048 6743777 7224906 7756537 8412213 9008946 9754923 10384428 10807016 11208954 11384081 11418587
4038 11418587 11322996 11179498 11023956 10832992 10664820 10519319 10370741 10273541 10165395 10072729
4028 10072729 9905851 9776583 9721881 9785165 9895631 10043025 10446467 11051823 11990573 13269418
4018 13269418 14510252 15499618 15973598 15757749 15085893 14159018 12876319 11613228 10430099
4009 10430099 9349264 8472336 7658876 7107193 6680344 6282993 5993008 5794443 5589413
4000 5589413 5577273 5490562 5548287 5554069 5635345 5802882 6030170 6233501 6503086 6617227 6699629
3989 6699629 6639137 6473521 6166919 5808718 5345558 4816085 4387491 3919540 3534280 3203413
3979 3203413 2860522 2579329 2372166 2263376 2010565 1937984 1795316 1650873 1514243 1420956
3969 1420956 1378247 1291405 1201155 1115397 1061097 999542 923370 888208 771910 768351 683343
3958 683343 623498 582012 545682 493308 429278 365579 386274 359669 347584 275844 265604 218788
3946 218788 276544 288012 203994 183993 167404 171269 111002 132414 137945 70140 90908 83057
3934 83057 70981 68804 58898 35812 46341 -11249 -18152 -34404 -55167 -40837 -46337 6600 -90001
3921 -90001 -86481 -87879 -86939 -73364 -31891 -92130 -112880 -67773 -123427 -160597 -113397 -155317 -157430
3908 -157430 -213902 -144937 -216989 -165702 -173028 -226871 -187503 -179646 -201843 -204859 -222471 -174025
3896 -174025 -223101 -265336 -266584 -231279 -223102 -206979 -251343 -235898 -235353 -199460 -219630 -264706
3884 -264706 -263899 -206350 -279143 -270332 -233236 -253661 -295853 -289907 -316185 -238763 -269224 -246988
3872 -246988 -222780 -251368 -270360 -263818 -271162 -257051 -276566 -256912 -245381 -273040 -274525 -286097
3860 -286097 -253802 -242166 -263655 -292361 -262263 -244345 -247210 -247905 -259784 -224389 -182824 -176728
3848 -176728 -186611 -197757 -226611 -268689 -191081 -240242 -249343 -248292 -214753 -200198 -279308 -189587
3836 -189587 -221785 -210964 -193042 -172144 -124062 -136910 -196565 -187052 -207592 -119669 -142287 -118319
3824 -118319 -113679 -133618 -106328 -136019 -62534 -72308 -127624 -78464 -84389 -7854 -72482 -5911
3812 -5911 -12807 -17489 16140 -671 79204 24746 62638 75260 129837 141858 123157 175364
3800 175364 215687 250712 247405 306329 365234 372430 404577 440887 512859 564485 600049 664766
3788 664766 760066 802884 781600 860617 829034 855669 883420 884235 892584 921374 979078 957007
3776 957007 1019096 1047861 1159378 1185796 1312110 1350785 1386727 1473489 1487033 1543004 1522583
3765 1522583 1580541 1538743 1584521 1617833 1643322 1725614 1743618 1789736 1883479 1900893 1910330 1943351
3753 1943351 1995811 1999681 1986564 2013008 2027956 2027565 2046974 2072842 2098765 2185255 2242368 2389144
3741 2389144 2431313 2505572 2613546 2627386 2616018 2578533 2515416 2450948 2346752 2248953 2166734
3730 2166734 2097440 2024576 2022278 1970242 1910816 1909986 1867447 1912307 1912965 1920065 1889695 1889644 1910666
3717 1910666 1854314 1885006 1858938 1836309 1831623 1890596 1890680 1866523 1907919 1928011 1931625 1887163
3705 1887163 1882327 1795288 1699855 1569853 1502476 1406651 1251265 1160275 1036551 953392 909168
3694 909168 799753 744391 723293 793002 772836 679858 679049 727968 704357 739260 653098 655631
3682 655631 622271 588615 519199 486427 513815 418640 401866 424195 337848 353209 240816
3671 240816 207570 212180 189464 177257 90592 100702 -21123 -28016 -105460 -70027 -57960 -55022
3659 -55022 -104789 -144703 -134854 -160687 -127230 -209005 -152068 -107155 -141749 -199921 -216300 -217545
3647 -217545 -273838 -241465 -281157 -293216 -323010 -313819 -300180 -284967 -355535 -294100 -368283 -364325
3635 -364325 -319622 -322212 -290947 -296393 -346418 -368479 -348597 -339502 -367043 -360018 -357352 -339997 -332655
3622 -332655 -330422 -313595 -338259 -339814 -305212 -395466 -399380 -358592 -369823 -349682 -314706 -368835
3610 -368835 -372262 -333120 -354320 -345163 -357403 -406467 -393936 -383972 -363887 -382310 -396829 -416052
3598 -416052 -386478 -349563 -409420 -362930 -383194 -373967 -397195 -369630 -383818 -404596 -329662 -389499
3586 -389499 -320037 -385204 -344880 -403342 -384781 -353780 -374177 -392531 -429149 -350229 -383801 -366346
3574 -366346 -356148 -364303 -329359 -360327 -398684 -401776 -357052 -420247 -390839 -366069 -352143 -351937
3562 -351937 -392200 -332299 -373488 -391246 -343857 -344572 -311460 -316782 -285170 -294407 -287995 -264712 -282954
3549 -282954 -319375 -290187 -328731 -299670 -384418 -366619 -364929 -376328 -385383 -317344 -402190 -329212
3537 -329212 -352084 -366341 -420874 -363398 -335898 -360006 -380055 -359399 -314667 -308045 -371388 -361307
3525 -361307 -348317 -381133 -362269 -368406 -408534 -359146 -389270 -367205 -350156 -390093 -348842 -360043
3513 -360043 -369244 -318408 -321295 -324693 -391302 -337700 -358959 -305718 -347887 -337239 -357007 -345971
3501 -345971 -349455 -330140 -333854 -372242 -378744 -315490 -329210 -286492 -329604 -396765 -349878 -301024
3489 -301024 -349828 -326549 -351080 -333824 -332238 -382295 -291601 -270837 -301228 -331096 -352319 -297753
3477 -297753 -326153 -315812 -284839 -313511 -329475 -286747 -304702 -317525 -345195 -323213 -355134 -264759
3465 -264759 -294039 -290829 -272016 -279751 -269187 -257131 -267075 -303652 -329768 -254282 -282617 -269540
3453 -269540 -254518 -257714 -261245 -271413 -254292 -292218 -328290 -270707 -292723 -289281 -320378 -308628
3441 -308628 -288781 -307892 -254110 -247235 -253758 -246219 -218184 -259544 -287358 -289941 -232647 -293286
3429 -293286 -242041 -247070 -237680 -275653 -200686 -238441 -234445 -210508 -217041 -212348 -214367 -217725 -250537
3416 -250537 -237667 -197533 -176705 -191562 -124684 -222195 -150116 -146108 -170362 -225740 -156966 -147527
3404 -147527 -149930 -137128 -134641 -160565 -79466 -90548 -151194 -144112 -121000 -131803 -142990 -76670
3392 -76670 -124799 -55644 -87842 -60069 -73604 -75798 -105209 -53985 18928 -22207 -60099 -57126
3380 -57126 53621 -46567 -8477 51773 68383 95180 63376 117894 141754 99367 110312
3369 110312 121377 149159 166021 180724 204533 189952 219676 205185 185556 280101 192927 310254
3357 310254 293671 377741 373387 436552 417228 417588 456823 462487 477045 490264 512686 514099 603689
3344 603689 656851 715783 771027 905737 929196 1052969 1232102 1368064 1573730 1854347
3334 1854347 2136650 2441007 2673024 2896944 3080947 3461800 3906131 4433215 5132723 6005173
3324 6005173 7168644 9046529 12160371 15760926 18759937 20533448 20449865 18739042 17294552
3315 17294552 14461651 11728668 9453741 7432605 5730320 4463454 3638884 3167750
3307 3167750 2822788 2452119 2179297 1932955 1718136 1513813 1309426 1133186 1022277 917285
3297 917285 821471 744545 746697 650454 613564 516165 438833 422532 384611 318451 270387 214492
3285 214492 160043 139812 106269 67787 32008 44804 31548 57272 34261 44955 -327 -53090
3273 -53090 -34098 -34621 -75588 -120192 -113470 -51015 -93744 -115383 -117841 -44528 -84153 -133444 -115396
3260 -115396 -128409 -106888 -132544 -226867 -169608 -136097 -172584 -169548 -165779 -218976 -211550 -191165
3248 -191165 -207030 -227987 -198089 -213462 -243099 -284299 -220902 -230489 -244988 -240371 -263879 -274021
3236 -274021 -303985 -277883 -270553 -310938 -300857 -263160 -300271 -307004 -292469 -296027 -261486 -314502
3224 -314502 -289400 -265274 -261947 -293170 -258442 -295876 -285193 -324818 -300898 -286318 -288238 -300642
3212 -300642 -276318 -304216 -326295 -295681 -320718 -299895 -300800 -323284 -298262 -289421 -281468 -277198 -287124
3199 -287124 -349995 -335189 -317026 -330040 -319784 -350829 -374521 -378918 -313584 -339776 -347380 -368536
3187 -368536 -366875 -380210 -332355 -375672 -374107 -353483 -395748 -353359 -380069 -375690 -400608 -415461
3175 -415461 -392698 -362909 -338964 -402499 -370116 -344723 -388854 -367891 -340032 -358923 -358995 -383983
3163 -383983 -399456 -327094 -392029 -341799 -378316 -450802 -378912 -332749 -386601 -369025 -379493 -328530
3151 -328530 -352895 -338298 -387883 -367742 -405173 -357331 -369202 -382374 -372494 -356450 -373724 -372293
3139 -372293 -348381 -361160 -403903 -319155 -384503 -353658 -338652 -377122 -375727 -371947 -371130 -326004
3127 -326004 -398456 -365462 -373618 -359982 -391698 -367043 -408498 -381165 -356592 -365097 -387898 -374847
3115 -374847 -349091 -376990 -372851 -399418 -370844 -401672 -372830 -422258 -378383 -361055 -358784 -391046
3103 -391046 -410518 -370611 -333691 -385804 -366517 -348862 -361640 -393637 -333083 -343762 -297807 -340119
3091 -340119 -352541 -353538 -313151 -341306 -303077 -315638 -326418 -300111 -261415 -287105 -344253 -289344
3079 -289344 -295711 -303447 -328897 -382610 -337912 -358237 -354718 -322299 -375816 -322744 -365814 -380807
3067 -380807 -357444 -329738 -360265 -354056 -353210 -374673 -360384 -409881 -384735 -383667 -371099 -414193
3055 -414193 -401126 -413607 -345408 -389235 -384575 -351109 -410706 -352769 -323878 -404531 -382485 -359970
3043 -359970 -351705 -389837 -315727 -391078 -448914 -366881 -423075 -391259 -384789 -363059 -377444 -374777
3031 -374777 -451965 -402020 -396621 -339179 -393504 -378730 -402373 -406151 -342344 -398178 -394096 -370185
3019 -370185 -361247 -414767 -400740 -392691 -331982 -334080 -400115 -405805 -336164 -393658 -362238 -361583 -377333
3006 -377333 -351852 -350168 -379399 -367359 -344477 -339999 -368249 -400462 -366702 -413794 -357141 -364481
2994 -364481 -342529 -351666 -390946 -406349 -383213 -369434 -370534 -363859 -357810 -339732 -405801 -390487
2982 -390487 -390831 -385139 -417268 -383651 -330497 -371447 -408840 -312150 -369538 -381238 -394386 -414611
2970 -414611 -362926 -412525 -328518 -390502 -346445 -332062 -403542 -373341 -367209 -418713 -378945 -343330
2958 -343330 -431065 -414072 -420756 -321130 -337326 -400834 -393496 -401067 -378102 -361483 -352240 -407742
2946 -407742 -345614 -396015 -361760 -413306 -361802 -365978 -370656 -357978 -340188 -370160 -376636 -355120
2934 -355120 -379102 -383030 -382529 -381099 -378602 -351501 -366375 -356364 -370690 -361361 -388830 -345271 -400534
2921 -400534 -360519 -382033 -358424 -394520 -392545 -354403 -340782 -356873 -374574 -379009 -344868 -376306
2909 -376306 -413469 -299734 -378041 -368090 -372859 -392387 -364157 -412597 -388136 -344773 -313016 -349996
2897 -349996 -354027 -357353 -399834 -396159 -373628 -340273 -349209 -345739 -401028 -352769 -356626 -367222 -342802
2884 -342802 -372589 -392890 -358744 -353345 -401308 -363040 -386536 -337442 -332637 -369572 -374246 -355756
2872 -355756 -352198 -352743 -417574 -321886 -336928 -387120 -321789 -329579 -410638 -371524 -352807 -372060
2860 -372060 -337072 -376648 -331546 -368928 -382958 -374587 -416806 -335346 -312908 -350401 -356304 -373519
2848 -373519 -404550 -414368 -389687 -331683 -358781 -394197 -361492 -398083 -358659 -326234 -364700 -306905
2836 -306905 -382054 -357590 -351583 -377673 -346041 -348782 -377245 -334943 -382404 -361536 -364163 -323054
2824 -323054 -414568 -345541 -333189 -349255 -393634 -345093 -332817 -320186 -370681 -376909 -374397 -347064
2812 -347064 -365769 -353296 -346355 -359767 -360823 -351451 -358143 -348367 -388788 -372226 -361553 -310509 -346932
2799 -346932 -353583 -353374 -350440 -376336 -352099 -306769 -393724 -338757 -375318 -371082 -368908 -380408 -396660
2786 -396660 -340444 -395009 -389566 -351943 -328405 -334564 -352007 -357164 -369698 -340736 -319595 -352275
2774 -352275 -350610 -400876 -333451 -364395 -356175 -358964 -400632 -379091 -337963 -345172 -379238 -363871
2762 -363871 -387586 -308417 -329716 -348524 -363719 -365686 -379295 -344626 -403214 -386912 -382516 -385200
2750 -385200 -318253 -375120 -375892 -367339 -347703 -397539 -336640 -363091 -322732 -385705 -381106 -351597
2738 -351597 -347339 -326782 -359982 -339317 -306748 -314447 -386486 -328100 -339815 -344181 -341397 -355463
2726 -355463 -400504 -351948 -368522 -334344 -306987 -344461 -353417 -342322 -343887 -347414 -329788 -343571
2714 -343571 -377431 -364866 -397465 -345010 -411369 -393707 -378340 -357086 -349707 -348085 -342576 -381865
2702 -381865 -349201 -363813 -365482 -384683 -355736 -348736 -356956 -360146 -365189 -359422 -340524 -370378 -323700
2689 -323700 -348088 -348948 -373384 -329837 -310739 -340978 -339474 -355728 -327572 -374954 -390589 -345606
2677 -345606 -382039 -373322 -338122 -335273 -335378 -306737 -379500 -329290 -373093 -345999 -351191 -360410 -336975
2664 -336975 -339396 -349513 -367097 -326865 -363489 -312558 -341572 -361312 -329041 -322179 -314000 -329341
2652 -329341 -340777 -320834 -364397 -353577 -342849 -392860 -357813 -352879 -307139 -335263 -336264 -335806
2640 -335806 -378528 -319894 -385723 -380721 -353294 -322360 -357456 -293026 -354777 -320134 -316046 -307850
2628 -307850 -371013 -377321 -344830 -313367 -381853 -329102 -338052 -324931 -349896 -289960 -329778 -358381
2616 -358381 -362885 -357430 -384055 -313209 -326299 -343118 -355798 -296260 -334249 -398329 -355756 -338806
2604 -338806 -330736 -386383 -385385 -366460 -326230 -307664 -333885 -365442 -311054 -305553 -325237 -317553 -371026
2591 -371026 -298524 -327257 -342006 -351353 -319387 -354004 -369526 -319347 -333349 -297102 -314503 -319122
2579 -319122 -326374 -348449 -381606 -333461 -356353 -328377 -329753 -343905 -365005 -347200 -320522 -336607
2567 -336607 -321964 -356261 -380319 -358606 -341064 -329486 -362307 -355596 -348706 -346777 -332214 -331452 -324103
2554 -324103 -358544 -326562 -333096 -365104 -353990 -333616 -371345 -316481 -351392 -359888 -359702 -336563
2542 -336563 -297009 -336978 -345403 -320064 -400348 -363097 -317018 -380535 -307037 -383364 -324505 -348419
2530 -348419 -366921 -348497 -327023 -368669 -321539 -317632 -334339 -375344 -323057 -360599 -321353 -366801
2518 -366801 -345451 -376213 -347026 -373541 -328413 -322283 -348896 -333547 -334007 -344060 -318795 -331062
2506 -331062 -344446 -344670 -396486 -368394 -336296 -279720 -347784 -357839 -319440 -334988 -368371 -313576
2494 -313576 -357244 -302614 -394721 -364195 -350540 -371443 -337569 -310499 -357440 -318478 -353837 -396351
2482 -396351 -350118 -366301 -345221 -308295 -319627 -365158 -327625 -339150 -306255 -321009 -357888 -288132
2470 -288132 -316626 -372859 -318385 -347266 -376154 -312569 -320471 -328347 -329739 -321983 -351265 -333393
2458 -333393 -307918 -321004 -333259 -319030 -345409 -425335 -301245 -311735 -343449 -329686 -320643 -308549
2446 -308549 -267063 -359514 -322768 -327009 -301722 -386595 -354018 -373871 -306252 -352225 -348425 -361146
2434 -361146 -310688 -337386 -330111 -374223 -338412 -346407 -299140 -343651 -311190 -359644 -372617 -317308
2422 -317308 -352622 -336472 -319031 -326811 -350113 -347755 -312762 -345964 -376294 -354460 -318039 -300647
2410 -300647 -347261 -357328 -283385 -327218 -324982 -400015 -346891 -324602 -363607 -354788 -329747 -339700
2398 -339700 -331053 -304633 -350294 -327149 -359335 -324171 -357297 -337830 -360093 -331216 -354311 -325983
2386 -325983 -359534 -343629 -334425 -329114 -321248 -407572 -338980 -362194 -312560 -314454 -322750 -352103 -371876
2373 -371876 -301119 -316635 -294802 -305703 -375844 -337581 -379386 -363294 -327302 -293090 -376906 -319726
2361 -319726 -353448 -292852 -304549 -294777 -375984 -323704 -326634 -333550 -313171 -306334 -323707 -345566
2349 -345566 -337069 -334281 -351173 -347141 -361515 -294663 -352790 -303296 -345585 -275490 -355748 -326214
2337 -326214 -357779 -312105 -359675 -361169 -322860 -325651 -320872 -322081 -301778 -358868 -374131 -272219
2325 -272219 -341938 -324543 -346707 -333954 -281214 -305831 -319490 -370225 -306721 -335896 -330098 -321178
2313 -321178 -307015 -301840 -310766 -319570 -305485 -337344 -332420 -298951 -313017 -331951 -378979 -366549
2301 -366549 -307416 -349973 -334392 -353722 -299513 -311389 -333782 -307705 -325644 -383297 -360057 -356636
2289 -356636 -337627 -323710 -332545 -342265 -333988 -306804 -356451 -311332 -327783 -317593 -292645 -303953
2277 -303953 -352032 -370141 -252272 -300379 -331806 -325629 -286288 -298162 -273036 -336351 -295592 -338681
2265 -338681 -319883 -373350 -319596 -315722 -357323 -338130 -282609 -317840 -343873 -352006 -353763 -379112
2253 -379112 -283179 -350089 -351570 -380109 -320144 -298729 -321164 -321205 -315241 -287857 -340953 -335400 -332097
2240 -332097 -328495 -322143 -349915 -338129 -319788 -316938 -343217 -318018 -346401 -289831 -305904 -329892
2228 -329892 -304548 -341206 -328803 -278046 -377088 -366807 -322764 -354322 -375629 -338932 -348718 -301482
2216 -301482 -319110 -349015 -359584 -342334 -372483 -342750 -324707 -355823 -388765 -328697 -310931 -273090
2204 -273090 -343992 -339782 -316967 -326499 -342808 -348846 -353645 -312412 -316036 -312687 -322919 -335126 -298318
2191 -298318 -351286 -335086 -327543 -269703 -274748 -377989 -334987 -300597 -341259 -311883 -321397 -341252
2179 -341252 -324881 -364282 -311951 -293596 -329170 -312094 -326468 -297439 -286052 -367739 -323577 -312774
2167 -312774 -297271 -302744 -310618 -334600 -319220 -299155 -315739 -371894 -347577 -275400 -340951 -323048
2155 -323048 -306501 -325641 -332227 -301113 -322610 -310398 -304961 -376368 -311734 -336902 -324741 -306741
2143 -306741 -300163 -331243 -333457 -301926 -372110 -314258 -368235 -300578 -348190 -395031 -320837 -305859
2131 -305859 -330390 -323907 -338483 -309779 -310940 -355038 -300116 -324688 -384702 -378558 -329826 -338223
2119 -338223 -323351 -323518 -343117 -324221 -302498 -342267 -315752 -294485 -306884 -326695 -315907 -346801
2107 -346801 -343247 -334575 -404084 -328480 -313434 -351119 -307009 -274382 -303062 -326575 -278751 -319898
2095 -319898 -360269 -339655 -309595 -303066 -336501 -323775 -268773 -349814 -336871 -329740 -344653 -344401
2083 -344401 -292494 -307684 -352070 -347079 -334193 -288745 -317668 -308309 -346674 -341176 -331170 -288874
2071 -288874 -335364 -337222 -337131 -271563 -321834 -305152 -297285 -307442 -313033 -312951 -274726 -328027 -307431
2058 -307431 -353442 -348116 -256655 -314271 -358434 -331477 -340627 -342338 -329092 -302822 -307339 -318932
2046 -318932 -331563 -302860 -330358 -296082 -303852 -324211 -337123 -263005 -310261 -350008 -334447 -319742
2034 -319742 -336653 -330098 -325449 -305979 -332430 -337263 -318014 -301261 -268602 -314550 -314614 -319670 -311386
2021 -311386 -340090 -342824 -339528 -336150 -299071 -330529 -285790 -311498 -304761 -257032 -336995 -308722
2009 -308722 -271966 -329620 -303544 -342998 -341175 -304408 -335465 -307503 -316528 -349561 -261841 -304259
1997 -304259 -323022 -268535 -359686 -345516 -342024 -325697 -303675 -287848 -289762 -299479 -346898 -272225
1985 -272225 -292759 -339179 -329632 -348890 -376029 -320939 -314497 -304087 -315347 -348460 -354973 -314071
1973 -314071 -295318 -349631 -368434 -287161 -291010 -291251 -282912 -297150 -312935 -323144 -338858 -331100 -311971
1960 -311971 -351128 -368098 -313333 -341847 -310387 -284814 -357269 -309385 -329873 -326292 -322924 -336056
1948 -336056 -319312 -326589 -314107 -334522 -337106 -326211 -301106 -319093 -374018 -308576 -381583 -299777
1936 -299777 -254596 -282319 -315227 -342101 -322416 -331940 -301265 -292558 -332907 -297525 -338169 -313163
1924 -313163 -338640 -336535 -341297 -339357 -349845 -326503 -353141 -294791 -387149 -361232 -337733 -338565 -312032
1911 -312032 -357535 -308927 -311967 -315628 -345808 -295909 -328148 -323936 -278772 -332379 -260647 -316758
1899 -316758 -326060 -310901 -305506 -270957 -288920 -288688 -348160 -302199 -308366 -299111 -308238 -274368 -312167
1886 -312167 -323645 -275144 -301362 -324294 -306399 -309437 -302601 -323641 -341804 -320432 -313038 -317325
1874 -317325 -349266 -302333 -314217 -311601 -328758 -325285 -266048 -284688 -291569 -297787 -277079 -330424
1862 -330424 -285899 -303965 -308238 -273508 -326264 -352942 -287208 -301826 -261232 -309628 -333854 -339098
1850 -339098 -274450 -322507 -296166 -304391 -295120 -321041 -305408 -305035 -322603 -311122 -334366 -356502
1838 -356502 -320662 -295188 -307450 -328439 -277439 -315944 -325435 -301932 -306286 -318370 -290014 -315104
1826 -315104 -313257 -339185 -344955 -384315 -318148 -261941 -270391 -331860 -271971 -287737 -305647 -308750
1814 -308750 -335588 -314871 -296804 -301202 -344775 -342235 -320458 -308747 -295354 -328501 -315540 -331851
1802 -331851 -280428 -309670 -303983 -267598 -310166 -330647 -350990 -307662 -252118 -301831 -331182 -290760
1790 -290760 -322455 -304100 -371774 -326846 -339914 -287626 -322766 -298402 -349037 -339817 -317519 -316266
1778 -316266 -289633 -307534 -256379 -317181 -304624 -307718 -320823 -303099 -324996 -306955 -252131 -314396
1766 -314396 -331442 -285203 -279806 -327746 -310172 -311984 -298793 -296453 -312795 -303718 -293137 -288024 -270604
1753 -270604 -344638 -294511 -256677 -330541 -270523 -320700 -316890 -312411 -284637 -245252 -298526 -292644
1741 -292644 -288474 -307839 -304658 -288796 -306001 -333503 -318936 -311646 -319544 -262205 -300117 -325517
1729 -325517 -298352 -347605 -333796 -312688 -323192 -351690 -314590 -315262 -341123 -296674 -326399 -297167
1717 -297167 -340038 -323910 -333513 -313903 -337517 -300180 -348128 -306169 -335952 -295897 -320163 -325119
1705 -325119 -320786 -309192 -301140 -340061 -328134 -268816 -329340 -321711 -306900 -309411 -300696 -307881 -273593
1692 -273593 -291999 -291056 -268415 -323055 -370982 -346520 -313596 -324226 -296206 -307216 -284144 -298300
1680 -298300 -308434 -314669 -311519 -303817 -312099 -273663 -332704 -313757 -320904 -252766 -295288 -246226 -327988
1667 -327988 -296451 -285730 -306030 -293688 -316152 -353894 -282379 -329160 -273574 -296399 -278342 -308007
1655 -308007 -287137 -282681 -303939 -344607 -330804 -324355 -297815 -304747 -338338 -330970 -292147 -356415
1643 -356415 -310581 -294403 -341750 -335337 -283586 -311216 -335407 -392709 -323179 -310121 -298293 -331239
1631 -331239 -289476 -276686 -342713 -344559 -259543 -263153 -265557 -283974 -314017 -328388 -343740 -254995
1619 -254995 -315561 -290177 -291760 -329755 -331227 -310204 -328870 -308247 -357404 -304085 -299807 -273437
1607 -273437 -328834 -317535 -320929 -307361 -315692 -325891 -296576 -326778 -341150 -272827 -288783 -296963
1595 -296963 -283671 -335115 -325181 -305690 -318340 -334811 -297269 -320394 -309164 -324015 -271176 -330328
1583 -330328 -287287 -331384 -303921 -295643 -296470 -314550 -292578 -252869 -274354 -286964 -300811 -268151
1571 -268151 -322195 -327369 -364451 -272540 -316753 -305067 -297362 -279743 -346789 -319892 -260628 -360424
1559 -360424 -310125 -297787 -341098 -343970 -278570 -284810 -312310 -283572 -285196 -311528 -302474 -296972 -305692
1546 -305692 -304949 -340546 -315273 -292376 -334927 -287000 -319326 -324207 -289904 -245561 -365238 -319906
1534 -319906 -299654 -312817 -292216 -315821 -322807 -302448 -285739 -263753 -321053 -302225 -287790 -328244
1522 -328244 -321292 -278649 -239914 -314555 -317010 -322144 -280159 -290558 -309251 -346976 -262883 -309496
1510 -309496 -316828 -326086 -287706 -319736 -265976 -278266 -287281 -301174 -310499 -335299 -332172 -339588 -327627
1497 -327627 -309026 -262814 -341336 -308704 -313857 -330415 -339016 -322492 -303950 -318969 -306707 -315772
1485 -315772 -338921 -350088 -295269 -281682 -346208 -310323 -330528 -299813 -264886 -308214 -243588 -281530
1473 -281530 -319082 -312504 -291144 -292678 -298507 -296465 -267836 -313026 -289023 -341231 -255174 -284846
1461 -284846 -340593 -274255 -313154 -296082 -273242 -349252 -336205 -266496 -291294 -302598 -287393 -312980
1449 -312980 -298126 -301927 -304731 -282355 -275579 -279787 -301605 -276251 -321801 -260623 -310709 -315110 -320473
1436 -320473 -324905 -294415 -309042 -332757 -305632 -320846 -303765 -310190 -323684 -309625 -303952 -274887
1424 -274887 -327165 -317179 -303389 -347089 -352596 -354218 -321982 -290498 -295141 -286719 -307771 -272849 -272092
1411 -272092 -307088 -263401 -294794 -299407 -285911 -299980 -296665 -314634 -302832 -298929 -292377 -283622 -310099
1398 -310099 -288624 -350790 -265558 -283037 -281966 -318184 -300261 -324122 -342234 -318417 -293633 -267136
1386 -267136 -328869 -293446 -308645 -240349 -337127 -279601 -261148 -261656 -329737 -341196 -335325 -287238
1374 -287238 -299229 -301306 -285346 -286063 -282888 -323202 -298187 -310644 -322767 -301094 -323856 -300584
1362 -300584 -289595 -291290 -330094 -315207 -289285 -294551 -279899 -264000 -253836 -270878 -292621 -303300
1350 -303300 -290584 -286778 -280179 -313740 -293325 -329423 -289297 -297313 -329027 -314333 -309041 -264437
1338 -264437 -325309 -317912 -268158 -310671 -362008 -306747 -296400 -303498 -294404 -292602 -298002 -335380 -286768
1325 -286768 -317975 -286844 -311499 -341894 -278035 -322543 -312473 -284100 -298747 -343179 -285556 -275905
1313 -275905 -288016 -296858 -332356 -296300 -275520 -333148 -284701 -333137 -247860 -281199 -264861 -265124
1301 -265124 -288676 -301053 -337276 -320307 -320298 -331162 -353146 -286882 -343817 -347216 -288353 -294225 -294238
1288 -294238 -311450 -274124 -339783 -298710 -315303 -320068 -296214 -344365 -333841 -291498 -246143 -273653
1276 -273653 -267994 -286423 -273561 -279452 -310785 -300296 -317842 -337208 -305083 -306513 -294754 -343769
1264 -343769 -343950 -287202 -295470 -255514 -308942 -327174 -318694 -278571 -279322 -289804 -309056 -343228 -298803
1251 -298803 -314446 -295769 -317220 -277598 -318703 -292029 -265365 -350661 -322095 -291624 -305605 -256059
1239 -256059 -248900 -352163 -285427 -256569 -254027 -347721 -290413 -263130 -281138 -269354 -296432 -290433
1227 -290433 -326388 -312799 -293208 -302044 -285549 -315224 -270151 -292158 -314470 -279105 -326719 -324990
1215 -324990 -279752 -289735 -300195 -321066 -271241 -352616 -292345 -293760 -305743 -248045 -251120 -269533
1203 -269533 -314757 -297575 -280081 -255206 -305111 -298303 -317929 -271641 -312923 -317985 -260078 -300830
1191 -300830 -311394 -255152 -306469 -291109 -308849 -339518 -278624 -290568 -260710 -288042 -301243 -340763
$$ [...]
##END NTUPLES=NMR SPECTRUM
##END=
