##TITLE=abcd
##JCAMPDX= 6.0         $$ Bruker NMR JCAMP-DX V2.0
##DATA TYPE= NMR SPECTRUM
##DATA CLASS= NTUPLES
##ORIGIN= UXNMR, Bruker Analytische Messtechnik GmbH
##OWNER= root
$$ XWIN-NMR		Version 3.5
$$ Sat Aug  1 10:55:26 2026 Russian Standard Time (UT+4h)  servis@DPX200
##.OBSERVE FREQUENCY= 200.131235884673
##.OBSERVE NUCLEUS= ^1H
##.ACQUISITION MODE= SIMULTANEOUS
##.ACQUISITION SCHEME= undefined
##.AVERAGES= 8
##.DIGITISER RES= 18
##SPECTROMETER/DATA SYSTEM= spect
##.PULSE SEQUENCE= zg
##.SOLVENT NAME= DMSO
##.SHIFT REFERENCE= (INTERNAL, DMSO, 0, 16.4885)
##AUDIT TRAIL= $$ (NUMBER, WHEN, WHO, WHERE, WHAT)
$$ ##TITLE= Audit trail, XWIN-NMR		Version 3.5
$$ ##JCAMPDX= 5.01
$$ ##ORIGIN= Bruker BioSpin GmbH
$$ ##OWNER= servis
$$ F:\spectra/data/av/nmr/H1/1/pdata/1/auditp.txt
$$ ##AUDIT TRAIL=  $$ (NUMBER, WHEN, WHO, WHERE, WHAT)
(   1,<2026-08-01 10:55:04.98 +0400>,<servis>,<DPX200>,
      <created by zg, POWCHK disabled, PULCHK disabled
       terminated by command 'halt'
       configuration hash MD5:
       00 E9 B6 7A A2 85 ED C7 34 08 36 98 17 FE 4E 26
       data hash MD5: 32K
       E6 49 1A 98 D6 1C 9D C4 60 15 13 D2 0C 24 E7 CA>)
(   2,<2026-08-01 10:55:06.78 +0400>,<servis>,<DPX200>,
      <Start of raw data processing
       efp BC_mod = 2 LB = 0.05 FT_mod = 6 PKNL = 1 PHC0 = -416.9518 PHC1 = 3.101563 SI = 16K 
       data hash MD5: 16K
       17 98 C7 FF 46 05 14 62 24 7A AE 80 A2 CF 38 90>)
$$ ##END=
$$ 
$$ hash MD5
$$ 1A F1 15 68 45 DA 30 91 5E B0 13 4B 1A D0 63 16
##$RELAX= 
##$RELAX= 
##$RELAX= 
##$RELAX= 
##$RELAX= 
##$RELAX= 
##$RELAX= 
##$RELAX= 
$$ Bruker specific parameters
$$ --------------------------
##$DU= <F:\spectra>
##$EXPNO= 1
##$NAME= <H1>
##$PROCNO= 1
##$TYPE= <nmr>
##$USER= <av>
##$AMP= (0..31)
100 100 100 100 100 100 100 100 100 100 100 100 100 100 100 100 100 100 
100 100 100 100 100 100 100 100 100 100 100 100 100 100 
##$AQSEQ= 0
##$AQ_mod= 1
##$AUNM= <au_zg>
##$AUTOPOS= <>
##$BF1= 200.13
##$BF2= 200.13
##$BF3= 200.13
##$BF4= 200.13
##$BF5= 500.13
##$BF6= 500.13
##$BF7= 500.13
##$BF8= 500.13
##$BYTORDA= 1
##$CFDGTYP= 0
##$CFRGTYP= 5
##$CHEMSTR= <none>
##$CNST= (0..31)
1 1 145 1 1 1 1 1 1 1 1 1 1 1 1 1 1 1 1 1 1 1 1 1 1 1 1 1 1 1 1 1 
##$CPDPRG= <>
##$CPDPRG1= <>
##$CPDPRG2= <>
##$CPDPRG3= <>
##$CPDPRG4= <mlev>
##$CPDPRG5= <mlev>
##$CPDPRG6= <mlev>
##$CPDPRG7= <mlev>
##$CPDPRG8= <mlev>
##$CPDPRGB= <>
##$CPDPRGT= <>
##$D= (0..31)
0 2 0 0 0 0 0 0 0 0.06 0 0 0 0 0 0 0.0002 0 0 0 0 0 0 0 0 0 0 0 0 0 0 
0 
##$DATE= 1785567304
##$DBL= (0..7)
120 120 120 120 120 120 120 120 
##$DBP= (0..7)
150 150 150 150 150 150 150 150 
##$DBP07= 0
##$DBPNAM0= <>
##$DBPNAM1= <>
##$DBPNAM2= <>
##$DBPNAM3= <>
##$DBPNAM4= <>
##$DBPNAM5= <>
##$DBPNAM6= <>
##$DBPNAM7= <>
##$DBPOAL= (0..7)
0.5 0.5 0.5 0.5 0.5 0.5 0.5 0.5 
##$DBPOFFS= (0..7)
0 0 0 0 0 0 0 0 
##$DE= 6
##$DECBNUC= <off>
##$DECIM= 32
##$DECNUC= <off>
##$DECSTAT= 4
##$DIGMOD= 1
##$DIGTYP= 9
##$DL= (0..7)
0 120 120 120 120 120 120 120 
##$DP= (0..7)
$$ [...]
##$SUBNAM4= <"">
##$SUBNAM5= <"">
##$SUBNAM6= <"">
##$SUBNAM7= <"">
##$SUBNAM8= <"">
##$SUBNAM9= <"">
##$SW= 20.6817932712277
##$SWIBOX= (0..15)
0 0 3 0 0 0 0 0 0 0 0 0 0 0 0 0 
##$SW_h= 4139.07284768212
##$TD= 32768
##$TD0= 1
##$TE= 0
##$TE2= 300
##$TE3= 300
##$TEG= 300
##$TL= (0..7)
0 120 120 120 120 120 120 120 
##$TP= (0..7)
150 150 150 150 150 150 150 150 
##$TP07= 0
##$TPNAME0= <>
##$TPNAME1= <>
##$TPNAME2= <>
##$TPNAME3= <>
##$TPNAME4= <>
##$TPNAME5= <>
##$TPNAME6= <>
##$TPNAME7= <>
##$TPOAL= (0..7)
0.5 0.5 0.5 0.5 0.5 0.5 0.5 0.5 
##$TPOFFS= (0..7)
0 0 0 0 0 0 0 0 
##$TUNHIN= 0
##$TUNHOUT= 0
##$TUNXOUT= 0
##$USERA1= <user>
##$USERA2= <user>
##$USERA3= <user>
##$USERA4= <user>
##$USERA5= <user>
##$V9= 5
##$VALIST= <valist>
##$VCLIST= <CCCCCCCCCCCCCCC>
##$VD= 0
##$VDLIST= <DDDDDDDDDDDDDDD>
##$VPLIST= <PPPPPPPPPPPPPPP>
##$VTLIST= <TTTTTTTTTTTTTTT>
##$WBST= 1024
##$WBSW= 30
##$XGAIN= (0..3)
0 0 0 0 
##$XL= 0
##$YL= 0
##$YMAX_a= 69567
##$YMIN_a= -136375
##$ZGOPTNS= <>
##$ZL1= 120
##$ZL2= 120
##$ZL3= 120
##$ZL4= 120
##$ABSF1= 0
##$ABSF2= 0
##$ABSG= 0
##$ABSL= 0
##$ALPHA= 0
##$AQORDER= 0
##$ASSFAC= 0
##$ASSFACI= 0
##$ASSFACX= 0
##$ASSWID= 0
##$AUNMP= <proc_1d>
##$AZFE= 0.1
##$AZFW= 0.1
##$BCFW= 0
##$BC_mod= 2
##$BYTORDP= 0
##$COROFFS= 0
##$CY= 18.4799938201904
##$DATMOD= 1
##$DC= 0
##$DFILT= <>
##$DTYPP= 0
##$F1P= 9.9274215381318
##$F2P= -0.165520771350173
##$FCOR= 1
##$FTSIZE= 16384
##$FT_mod= 6
##$GAMMA= 0
##$GB= 0
##$INTBC= 1
##$INTSCL= 4.127829e-11
##$ISEN= 128
##$LB= 0.05
##$LEV0= 0
##$LPBIN= 0
##$MAXI= 10000
##$MC2= 0
##$MEAN= 0
##$ME_mod= 0
##$MI= 50
##$NCOEF= 0
##$NC_proc= -8
##$NLEV= 6
##$NOISF1= 3.799351
##$NOISF2= 2.8
##$NSP= 0
##$NTH_PI= 0
##$NZP= 0
##$OFFSET= 16.48848
##$PC= 4
##$PHC0= -416.9518
##$PHC1= 3.101563
##$PH_mod= 1
##$PKNL= yes
##$PPARMOD= 0
##$PSCAL= 4
##$PSIGN= 0
##$REVERSE= no
##$SF= 200.130005582386
##$SI= 16384
##$SIGF1= 3
##$SIGF2= 2
##$SINO= 400
##$SIOLD= 16384
##$SREGLST= <1H.CDCl3>
##$SSB= 0
##$STSI= 16384
##$STSR= 0
##$SW_p= 4139.07284768211
##$SYMM= 0
##$S_DEV= 0
##$TDeff= 32768
##$TDoff= 0
##$TI= <>
##$TILT= no
##$TM1= 0
##$TM2= 0
##$TOPLEV= 0
##$USERP1= <user>
##$USERP2= <user>
##$USERP3= <user>
##$USERP4= <user>
##$USERP5= <user>
##$WDW= 1
##$XDIM= 16384
##$YMAX_p= 428281813
##$YMIN_p= -1142403
$$ End of Bruker specific parameters
$$ ---------------------------------
##NTUPLES= NMR SPECTRUM
##VAR_NAME=  FREQUENCY,     SPECTRUM/REAL,   SPECTRUM/IMAG
##SYMBOL=    X,             R,               I
##VAR_TYPE=  INDEPENDENT,   DEPENDENT,       DEPENDENT
##VAR_FORM=  AFFN,          ASDF,            ASDF
##VAR_DIM=   16384,         16384,           16384
##UNITS=     HZ,            ARBITRARY UNITS, ARBITRARY UNITS
##FACTOR=    0.252644378177508, 1,           1
##FIRST=     3299.83951724647, 0,            0
##LAST=      -839.233330435636, 0,           0
##MIN=       -839.233330435636, -1142403,    0
##MAX=       3299.83951724647, 428281813,    0
$$ Real data points
##PAGE= N=1
##DATA TABLE= (X++(R..R)), XYDATA
$$ [...]
9179A540150O4020k86358J79510K88474J11297n66197J15942k1525l9042K33334
9169A619605M09539k16260j30828j20643M46603q0120r1892J96455j26140k46946
9159A659373J97299R3123K01890r3034j83768j942n5361J43551k53647M40480
9149B147964n695k75785L41363K93641l11219o2414n43694M27707j07651K31869
9139B136086m4011K8165K65752k33857L36641m02061N6914O7865o22123M36878
9129B026249L12476j35913K57462Q0982m06980K32982J45118j04055K6260j99382
9119B235199K82476P7400k15725M63901L7725m71957L1925M34399j43511m2694
9109B689138j07426J03202j49390K18971L07527j39391r8267K17201K01298o0050
$$ plain form
9179 1540150 1604170 1317812 1497322 1785796 1897093 1330896 1446838 1425313 1386271 1619605
9169 1619605 2029144 1812884 1682056 1561413 2008016 1927896 1836004 2032459 1906319 1659373
9159 1659373 1856672 1949795 2151685 2058651 1874883 1872941 1817580 1961131 1707484 2147964
9149 2147964 2142269 1866484 2207847 2501488 2190269 2127855 1584161 2011868 1904217 2136086
9139 2136086 2092075 2120240 2385992 2152135 2488776 2086715 2143629 2211494 1589371 2026249
9129 2026249 2338725 2202812 2460274 2541256 2134276 2367258 2512376 2408321 2434581 2235199
9119 2235199 2517675 2595075 2379350 2843251 2880976 2409019 2440944 2875343 2731832 2689138
9109 2689138 2581712 2684914 2535524 2754495 3062022 2922631 2824364 3041565 3242863 3182813
9099C182813j1017l3605j52365J95294J18930P5180k51407J52087K44480l19402
9089C200988J00641R0006M63400k67774J1174K49910Q4359K58034l62734N3141
9079C881145j40195J842K1610m63132O68071M12683j48957J02434k72882j0467
9069D052152J29012L42505m02790L21540j05154J26314k49619L87997o1559J80696
9059D721094K3800m2066m1657J71779K24424n371p4073p4028p8500r185K20706
9048E036923j42021J86718L06754J44316j8627L6512K28083r9486M054k6850J57830
9037E814206k38490J79262J83164L3353L56459j33946o8401m9025J91036M43856
9027F711474m76996N71394J15409j39142K39709r9179L54658O4343m4233L86717
$$ plain form
9099 3182813 3171796 3138191 2985826 3181120 3300050 3375230 3123823 3275910 3520390 3200988
9089 3200988 3301629 3391635 3855035 3587261 3598435 3848345 3932704 4190738 3828004 3881145
9079 3881145 3740950 3742792 3764402 3301270 3969341 4382024 4233067 4335501 4062619 4052152
9069 4052152 4181164 4523669 4120879 4442419 4337265 4463579 4213960 4601957 4540398 4721094
9059 4721094 4744894 4702828 4661171 4832950 5057374 5052003 4977930 4903902 4825402 4816217 5036923
9048 5036923 4894902 5081620 5388374 5532690 5514063 5550575 5778658 5679172 5683226 5656376 5814206
9037 5814206 5575716 5754978 5938142 5971495 6327954 6194008 6125607 6076582 6267618 6711474
9027 6711474 6234478 6805872 6921281 6782139 7021848 6922669 7277327 7341670 7297437 7684154
9017G684154n4152K70647l920J96370n1383p7814K41196J42372K96172L8873j29228
9006H553287o7298L27882P53K92029J1259j9345L28890K1223K13398k16477O54461
8995A0100062j05232L13430K25453O7429K44101J24088K94662l63051O08931M34082
8985A1943955o9265L3976K27951k16765N82417M65108n9288K42388K11135M24741
8975A3786353L12936n18498R57397Q7668R7645j4255L40773Q96822m92286O18139
8965A6072694O6511J32120N74658K33815K15581M09052L90620M63039M7479M82762
8955A9088331P97790l00231L44876L80497N43840j65577P23031K33349N20781
8946B2166687K59872K32801N82288M65594J68965K18922P35309K44338M95880
$$ plain form
9017 7684154 7630002 7900649 7896729 8093099 8041716 7963902 8205098 8347470 8643642 8682515 8553287
9006 8553287 8485989 8813871 8814624 9106653 9117912 9098567 9427457 9448680 9662078 9445601 10100062
8995 10100062 9994830 10308260 10533713 10601142 10845243 10969331 11263993 10900942 11509873 11943955
8985 11943955 11874690 11908666 12136617 11919852 12502269 12967377 12908089 13150477 13361612 13786353
8975 13786353 14099289 13580791 14538188 14625856 14723501 14709246 15050019 15946841 15454555 16072694
8965 16072694 16139205 16271325 16845983 17079798 17295379 17704431 18095051 18558090 18605569 19088331
8955 19088331 19886121 19585890 19930766 20311263 20855103 20689526 21412557 21645906 22166687
8946 22166687 22426559 22659360 23241648 23707242 23876207 24095129 24830438 25074776 25570656
8937B5570656K33919O89421L15473L32654Q93178K57108M37047M9055Q64526N18007
8927C0161044m3414P76170L28546O23225K50569P6370Q62111K39365O50135R256
8917C3933377M84316J18704O7083P42418K19291R2247K73025j85486R89259J71987
8907C6906221p0281K68486o0330L36247p1787M51658j33898j91205J84217j23618
8897C7495710q5292j27714j11926q5176j53401j63102r7599k28134j35812K63272
8887C6570826j081013K48510k85854p70320l01319l98852j62243m48476j02390
8878C3268869p40216j84195l15701m35574m95344j40030n81224j40572m91079
8869B9744934n96327n36477j46323q24255O9091k71375p30996n13540j81265o02380
$$ plain form
8937 25570656 25804575 26493996 26809469 27142123 28035301 28292409 28729456 28778511 29643037 30161044
8927 30161044 30117630 30893800 31222346 31845571 32096140 32172510 33034621 33273986 33924121 33933377
8917 33933377 34417693 34536397 34603480 35345898 35565189 35657436 35930461 35744975 36734234 36906221
8907 36906221 36835940 37104426 37044096 37380343 37308556 37760214 37626316 37435111 37619328 37495710
8897 37495710 37410418 37282704 37170778 37085602 36932201 36769099 36671500 36443366 36307554 36570826
8887 36570826 35489813 35738323 35452469 34682149 34380830 33981978 33819735 33371259 33268869
8878 33268869 32528653 32344458 32028757 31593183 31097839 30957809 30376585 30236013 29744934
8869 29744934 29148607 28612130 28465807 27641552 27710643 27439268 26708272 26194732 26013467 25411087
8859B5411087m70270k13789m61379j51153m86684k85106q56795R4173n18872o3390
8849B1997822o74468k29102l61705j45399n81285j87752o54458j37715j86076
8840A8839862m25864k56532m27909j10034o77842K5841j83152l57974k56944n60865
8830A5608587K13137m62845m89910J73284l27759j83831M6193o99000r7260m1995
8820A3738601o352o12539m19321q3145k01686L01896m44886l15082M67207q41123
8810A1583570m12059K38937j92800j35894k11814n61381L00576k86603M88677
8801A0811209m66843o17032J83190l9518N4152m55837k28304L9108k89112N68297
8791I559310p06480J6974j28889J1514N14719q1699j079027K75182P6101k54694
$$ plain form
8859 25411087 24940817 24727028 24265649 24114496 23627812 23342706 22485911 22580084 22061212 21997822
8849 21997822 21323354 21094252 20732547 20587148 20005863 19818111 19163653 19025938 18839862
8840 18839862 18413998 18157466 17729557 17619523 16941681 16967522 16784370 16426396 16169452 15608587
8830 15608587 15821724 15358879 14868969 15042253 14714494 14530663 14576856 13877856 13780596 13738601
8820 13738601 13732249 13119710 12700389 12617244 12415558 12717454 12272568 11957486 12424693 11583570
8810 11583570 11171511 11410448 11217648 11081754 10869940 10308559 10609135 10322532 10811209
8801 10811209 10344366 9727334 9910524 9871006 9925158 9469321 9241017 9280125 8991013 9559310
8791 9559310 8852830 8869804 8740915 8752429 9267148 9185449 8106422 8381604 8457705 8203011
8781H203011J72318J2155m66208L41507k33182j43602L38861K71203m09608l46
8771H086109j30477K66262R2245J99125K76696K09198O59747O3647M83371N82699
8761A0788622J421598J011280P03456J023302Q79391r2053l58079q84566j028664
8752A3464287k006419j020949q57719q97506k88639q68820l28208l12326j00795
8743F782906J5539k72573l53029j42825j88995m76968j23498Q81k83481J16990
8733E074947k23650M04520J0130p23062K12105k89525k2159R1943r943l22696
8723D202610K85570r0411l33119K87401k06838j98556J55998m74500j14066M07207
8713C921296J01644n0816m9414j96802m22246K46162m01104Q18650p18227J84711
$$ plain form
8781 8203011 8375329 8387484 7921276 8262783 8029601 7885999 8224860 8496063 8086455 8086109
8771 8086109 7955632 8221894 8314139 8513264 8789960 8999158 9658905 9722552 10205923 10788622
8761 10788622 12210220 13221500 13924956 14948258 15827649 15735596 15377517 14492951 13464287
8752 13464287 11457868 10436919 9579200 8681694 8393055 7524235 7196027 6883701 6782906
8743 6782906 6798445 6525872 6172843 6030018 5841023 5364055 5240557 5241438 4957957 5074947
8733 5074947 4851297 5255817 5265947 4542885 4754990 4465465 4443306 4535249 4525306 4202610
8723 4202610 4488180 4397769 4064650 4352051 4145213 3946657 4102655 3628155 3514089 3921296
8713 3921296 4022940 3972124 3922710 3725908 3303662 3549824 3148720 3967370 3249143 3433854
8703C433854l89240q7669L85513P1855k26693Q1255L4804l74042M72929o77446
8693B725120O19957q34038M11643J00859k92438J95724k49436K59283j9348P8266
8683B995592m30185Q1340J88409n8647L3744j61275l65457J68610k18384L34663
8673B568410k93541j07286N05174l27682n8972K20389m23993J94737L15674l30633
8663B262277K21063j01055l3248j23997r2284K78275j84480m36908J55754j03217
8653A842180M52701j43129j01504k38962k44998L51696j86443N4701l58515L30179
8643A757906M54850n187l02665k55496K5345O6649r1639O97972o67190p8852N59834
8632B161527k07379k63453J10039j98048J0635m79980N95992N7521j52181K4148
$$ plain form
8703 3433854 3044614 2956945 3342458 3414313 3187620 3268875 3303679 2929637 3402566 2725120
8693 2725120 3345077 2511039 2922682 3023541 2731103 2926827 2677391 2936674 2917326 2995592
8683 2995592 2565407 2646747 2835156 2776509 2810253 2648978 2283521 2452131 2233747 2568410
8673 2568410 2274869 2167583 2672757 2345075 2286103 2506492 2082499 2277236 2592910 2262277
8663 2262277 2483340 2382285 2349037 2225040 2132756 2411031 2226551 1789643 1945397 1842180
8653 1842180 2294881 2151752 2050248 1811286 1566288 1917984 1731541 1786242 1427727 1757906
8643 1757906 2212756 2207569 1904904 1649408 1674753 1741402 1649763 2347735 1680545 1601693 2161527
8632 2161527 1954148 1690695 1800734 1602686 1613321 1133341 1729333 1786854 1634673 1658821
8622A658821j78152K77307j85358M3790L0419J80240j79339q4140k67101R1160
8612A387647M5518L7848k79804o9786k2740J03031J14381j13481n6437n0085k62441
8601H33651K40569L28894j38576P5996n0924O2528k41246N5126J19691m28772
8591H56937K89567P9154K4830l12159L3560J09880j61530L08205n968l68270k39464
8580F14742P85109l59069l082L53798k62538m70017L03417j24821M26130n84524
8570F79145N00233l32912j37819N82481k94961J29242j10192J1175J5482N1983
8560A093857l23766M38276n12475L12360J22638j55448j46085M260j7635J06871
8550I22853k64805L27911q8418k5821j82417O2022K11743o01860O70504J33300
$$ plain form
8622 1658821 1480669 1757976 1572618 1616408 1646827 1827067 1647728 1563588 1296487 1387647
8612 1387647 1433165 1471013 1191209 1121423 1098683 1201714 1316095 1202614 1146177 1096092 833651
8601 833651 1074220 1403114 1264538 1340534 1289610 1352138 1110892 1166018 1285709 856937
8591 856937 1146504 1225658 1250488 938329 971889 1081769 920239 1228444 1222476 854206 614742
8580 614742 1399851 1040782 1037700 1391498 1128960 658943 962360 837539 1263669 679145
8570 679145 1179378 846466 708647 1291128 996167 1125409 1015217 1026392 1041874 1093857
8560 1093857 770091 1208367 695892 1008252 1130890 975442 829357 833617 815982 922853
8550 922853 658048 985959 897541 871720 689303 751325 963068 361208 1031712 1165012
8540A165012l98140r993J35727k3283r0468M23508l63220k94854K2253O18860
8530A185402P5420m79440K21527j47895m62241L28270q4951M58183m28041M07140
8520A073374j13661k39733j3202P4368k81833J97601J60604k66891L48922m79382
8510D60167k11643P59492o17356N70139k88788P7482Q9105m52412L28741m82288
8500B32639K72204K08468r5483O5823p8242K95661k82181K6376J72499J9939j18876
8489G18827o4814J30039j1556j05576m54376O22060K13664p30216J97448l07709
8479B07791N80276j33366P0350n54880M89055l86900M09531k49945K39717J53119
8469H24748n11212n6578K82662m77922N56490L77256l53657K33520o39821K09810
$$ plain form
8540 1165012 766872 756879 892606 869323 778855 1202363 839143 544289 566542 1185402
8530 1185402 1260822 781382 1002909 855014 392773 721043 636092 1094275 666234 1073374
8520 1073374 959713 719980 706778 781146 499313 696914 857518 590627 939549 460167
8510 460167 248524 1008016 390660 960799 672011 749493 838598 386186 714927 232639
8500 232639 504843 713311 617828 683651 605409 901070 618889 645265 817764 837703 718827
8489 718827 654013 784052 772496 666920 212544 834604 1048268 318052 515500 207791
8479 207791 788067 654701 725051 170171 659226 272326 681857 431912 671629 824748
8469 824748 313536 256958 539620 61698 618188 995444 641787 875307 235486 445296
8459D45296k48901K90710L0971p9657J38370j53950Q5968r6431R9838j16287L17325
8448G13252m08646J96934l43056N1872K83241m17758O74930J15383o12042j06849
8438A47261N36929l1445k55052P1837o3739j93363K89792k36308J01002O81871
8428A048785n76442n012k17674K51320K1293M33897m47679j50759L97666k83456
8418D71939J73409r7994k50019L69253m25287N00478j46903k45036J02437r5680
8408C56597n1652K09887p3254k00981M966K00509l4870k57656k8451J42234M4101
8397C11430K49710m30342L02173N4305l6409n7389L6866L04449o02435j72521
8387d0163N22934R7218l39871P5070J42538l02890o48L39984l87616L67357o4746
$$ plain form
8459 445296 196395 487105 518076 438419 576789 422839 508807 412376 512214 395927 713252
8448 713252 304606 501540 158484 210356 493597 75839 750769 866152 254110 147261
8438 147261 684190 652745 397693 469530 405791 212428 502220 265912 366914 1048785
8428 1048785 472343 467331 249657 500977 522270 956167 508488 357729 755395 471939
8418 471939 645348 547354 297335 666588 241301 741779 594876 349840 452277 356597
8408 356597 304945 514832 441578 240597 245563 446072 411202 153546 125095 267329 311430
8397 311430 561140 130798 432971 487276 450867 393478 430344 734793 132358 -40163
8387 -40163 482771 579989 240118 315188 457726 154836 154188 494172 106556 473913 409167
8376D09167Q9846k47883L44705j86932j86058K44482J2284r2485j04357m0706
8366B42063J84270k50067K19867m18383M83354m87239P63995q19120P20812o04242
8356C5310K91657J50492j65878L72451m00696L54876n74354K01132K27784j14002
8346C78772k46180L74925k33068J28768m11978J87949K31103Q029J48939l40436
8336B26823J79747J68872J90088m30036k20321K07897r1656k75731L79837k03858
8326A31662J64017O5732J62135l08215O9357j94963J86193K40086n7153l25996
8316A32855L95398k77714l7778L37315p59924O31727K39899l42644K2669l01374
8306D0429K23326J76077k43397J6826n1416K36743l32688M57056j4704l09538
$$ plain form
8376 409167 499013 251130 595835 408903 222845 467327 479611 387126 282769 242063
8366 242063 426333 176266 396133 -22250 461104 -26135 737860 -81260 639552 35310
8356 35310 326967 477459 311581 684032 283336 638212 63858 264990 492774 378772
8346 378772 132592 507517 274449 403217 -8761 179188 410291 418320 567259 226823
8336 226823 406570 575442 765530 335494 115173 323070 231414 -44317 335520 131662
8326 131662 295679 361411 523546 215331 284688 89725 275918 516004 458851 132855
8316 132855 528253 250539 212761 550076 -209848 421879 661778 319134 341803 40429
8306 40429 263755 439832 196435 213261 161845 398588 65900 522956 508252 198714
8296A98714J24566j78913K02262J70536n49992M54481j21553k14678K72998K2435
8286C80856q7787m07817L32708K60249m01109L21105j92046L25211m29750K64438
8276C66058j82322R6384K17208n77480K46494J93691m510j57773l2279R8897j45448
8265A18920L947M16923m7308M7304n05386O90242n00712o9859N7518M4688j10203
8254A46074N64570k82483m15702O92734p75799N09407l0555l29064L85296J95568
8244F60046m63450r1252k82822R82572o28207L22824k12867o6885O9244j71230
8234A17973M7520J67050L25087m03350k09600L6147l3432K53398j0237j05826
8224A84730J38012j55326j44729J89652k56703K51865q1586k9799P8822L2327
$$ plain form
8296 198714 323280 144367 346629 517165 -32827 421654 300101 85423 358421 380856
8286 380856 293069 -114748 217960 478209 77100 398205 206159 531370 101620 366058
8276 366058 183736 280120 497328 -80152 166342 360033 355523 197750 165471 264368 118920
8265 118920 122867 539790 492482 539786 34400 724642 223930 154071 211589 256277 146074
8254 146074 710644 428161 12459 705193 -70606 438801 408246 79182 464478 660046
8244 660046 196596 105344 -177478 805094 176887 499711 286844 219959 289203 117973
8234 117973 165493 332543 657630 254280 44680 80827 47395 300793 290556 184730
8224 184730 322742 167416 22687 212339 -44364 207501 125915 96116 174938 207265
8214B07265P363J08304R0700R394l17596k41725K79519L27889o63242J89397K69691
8203B66959k67886P19917k14871o38876O28447o29427N56244J66477l97923k54200
8193f5139m6321J2599o9200P63130l05523k54602K00870K83336j45101M4174J58032
8182E76255m17858J20067o23607J009171k78570k47459O092N4238J4812J43898
8172C57039p7819j92876M02389l96878K72251J29166J08027k53363J5936q37056
8162d73184O91193j74756J83673K5490R3828N49269o73290M30643l17572j56878
8152A78416N8263m41600J046063p95420r8129N16793n92631N18203L3600o04931
8142a81373P84046l93523j359n09902P27057j5453p9330k42120n0380j07920J34773
$$ plain form
8214 207265 214628 322932 413632 423026 105430 -136295 143224 471113 -192129 -2732 266959
8203 266959 -927 718990 504119 -134757 493690 -135737 420507 586984 189061 -65139
8193 -65139 -111460 -98861 -168061 595069 289546 34944 235814 519150 374049 418223 576255
8182 576255 158397 278464 -345143 664028 385458 137999 144091 198329 213141 357039
8172 357039 279220 86344 488733 91855 364106 493272 601299 347936 363872 -473184
8162 -473184 218009 43253 226926 252416 346244 895513 222223 652866 335294 178416
8152 178416 236679 -204921 841142 45722 -52407 464386 -128245 389958 423558 -181373
8142 -181373 602673 209150 207791 -302111 424946 409493 330163 88043 37663 -70257 64516
8131F4516N3465J70340N3111k85658j35791R5319K55383J49109q3263k34178l6845
8120F5508M49879Q2168n76565N39741p23580M15210j6804m7773P6321j07515O3348
8109B19938J44879j18265n053L4239k75071q382J03337K7938J46413P1919J29894
8098D71786l54198M10939k78586l87303O27184m32894j62010M57572R687l3099
8088C29078j78847L30422j83334K29544J44530N0973n185j03645L47583j68139
8078G92980j14179j47547k54703K88830j70568j16119L55894j04630L7836O1519
8068F29313K57252R4475n46047Q2198l2048L76928l4858l39657O58266k9977j47980
8057I67865J60034j05580K67091J93539J19696r5546j16776j3712k49177o2656
$$ plain form
8131 64516 117981 288321 341432 55774 -80017 15302 270685 419794 336531 102353 65508
8120 65508 515387 597555 20990 560731 -162849 252361 235557 187784 264105 156590 219938
8109 219938 364817 246552 241499 275738 667 -7715 95622 123560 269973 341892 471786
8098 471786 117588 528527 249941 -137362 489822 56928 -105082 352490 362177 329078
8088 329078 150231 480653 297319 526863 671393 722366 717181 613536 961119 792980
8078 792980 678801 531254 276551 565381 394813 278694 634588 529958 567794 629313
8068 629313 886565 981040 434993 517191 485143 862071 827213 487556 1145822 1115845 967865
8057 967865 1127899 1022319 1289410 1482949 1602645 1507099 1390323 1376611 1127434 1064778
8047A064778J35240k35817k29456j83509M39859m61282P148J61683k3108k67830
8037D07706N58945k83179K29770j64249k8609K45831J76250J85988j12211M39638
8027A655880o18946O17798J28438k26716j34582N2588p32414M59004o80959J04006
8017F24097J2563N11870o47914j63696L25579k87287J14099L28621k70113j35005
8007D12814J21888k77195L66280m91909O21912j38201K7328K02068J7356L2812
7997H95153j78922m55968Q63226j44480q39659L0695L56764p9121k30523L3805
7987B50970l0817J75888k5r1476L84056l34023j98159Q1499J06584L6037k81627
7976I8907L11032k69104K500M54122n96017N68309j61494j93658J74504L76777
$$ plain form
8047 1064778 1200018 964201 734745 551236 991095 529813 536961 698644 675536 407706
8037 407706 966651 683472 913242 748993 720384 966215 1142465 1328453 1216242 1655880
8027 1655880 1036934 1654732 1783170 1556454 1421872 1474460 742046 1201050 520091 624097
8017 624097 636660 1148530 500616 336920 662499 375212 489311 817932 547819 412814
8007 412814 534702 257507 623787 131878 753790 615589 642917 844985 862341 895153
7997 895153 716231 260263 1123489 979009 139350 170045 526809 447688 217165 250970
7987 250970 220153 396041 396016 304540 688596 354573 156414 237913 344497 380534 98907
7976 98907 409939 140835 143335 597457 1440 569749 408255 214597 389101 765878
7966G65878n06950l61445J80688j07370K42152o1597N6700N07651j34853l91470
7956A89384r0725L18652r6930Q8063K37682m30271l63405M20728J20253l02625
7946I0806N9179J48014m37701N35132m32672L07910j00905o31840M69998m0173
7936c2252J99207O4171q7832p49k89611M02828j36983M30669l99401J77452k13866
7925A13633j75819J28801L27258j56577M88462q89885K82341R7391j57077p9817
7915b1289q0768K95294J57399l32775Q4682K57497j76960K92747k77438J77807
7905C76196m38167M10188o8795m75116K96298p080m41315L18445q6324M79016
7895C63346k51250k2989k13331L18028J58992n08277K37651P2541k01925K73602
$$ plain form
7966 765878 258928 -102517 78171 -29199 212953 151356 208056 715707 580854 189384
7956 189384 98659 417311 320381 408444 646126 215855 -147550 273178 393431 90806
7946 90806 149985 297999 -139702 395430 -37242 270668 169763 -462077 7921 -32252
7936 -32252 166955 231126 143294 142545 -147066 255762 118779 549448 150047 327499 113633
7925 113633 -62186 66615 393873 237296 725758 -164127 118214 215605 58528 -21289
7915 -21289 -102057 193237 350636 17861 102543 360040 183080 475827 198389 376196
7905 376196 -61971 348217 279422 -195694 100604 93524 -347791 -29346 -115670 363346
7895 363346 112096 89107 -124224 193804 352796 -155481 82170 154711 -47214 226388
7885B26388M05085o21772j55513J50471J41208N4590k05022n4209L88083l20600
7875H709J91500m59997N57914O4781N8755k1436l11209J85534m29443J37545m01497
7864d18844M27200J14093l27222M65694k1144l26156R3270l52419K11734j29391
7854b63185o38113L588974k434356J70249k88378j64114Q08843p18969L34716
7845C95667n39580M03035j38256k6722L28208m01967M36522n81949J08953J269
7835a4820M73630l77278k67743M78269j65271K93682o31023L86075J12284j2368
7825B75437j39343l5111l46255M78396k79290K64082J92231m20053L16989j11216
7815A95867P5614J11820r9519N5089l27902L85149j99777M1633J08219J40408
$$ plain form
7885 226388 631473 9701 -145812 4659 145867 200457 -4565 -58774 329309 8709
7875 8709 200209 -259788 298126 362907 421662 400226 89017 274551 -154892 -17347 -418844
7864 -418844 8356 122449 -204773 260921 239777 -86379 6891 -345528 -133794 -263185
7854 -263185 -901298 2687676 253320 423569 135191 -28923 779920 60951 395667
7845 395667 -143913 259122 120866 94144 422352 20385 456907 -125042 -16089 -14820
7835 -14820 458810 81532 -186211 292058 126787 420469 -210554 175521 287805 275437
7825 275437 136094 100983 -245272 233124 -46166 217916 410147 -9906 307083 195867
7815 195867 271481 383301 283782 338871 10969 396118 196341 237974 346193 486601
7805D86601k38125m3420q3069P6906m0095J22759P987k45283J63181j98559k4636
7794a5753o763L65410k97278J1588O9370J06241j36566J25982K16776j71925L6431
7783C03513j40765n4934J26815l41236L30608l20066j42110L45775M06752o03211
7773h8859N3707O0944J08050k33970J97644J10369j50972k82246K08934N07411
7763D91012l66042K15686k28303K19041k59267N04050l53482k99120J1221J75837
7753A10633K69097J0440j48896o5651j643k8009k24242K3580J46650J97096l21848
7742c2793n7736L6577K43074j23546j55253M5874N52929q07434N96157j45549
7732A52300l1311p8575j96113j12136N50206j0957k31605n2552n1266L03718l48927
$$ plain form
7805 486601 248476 205056 121987 198893 158798 281557 289544 44261 207442 8883 -15753
7794 -15753 -22516 342894 45616 57204 126574 232815 96249 222231 439007 267082 303513
7783 303513 162748 107814 234629 -106607 224001 -96065 -238175 107600 514352 -88859
7773 -88859 -35152 25792 133842 -100128 97516 207885 56913 -225333 -16399 491012
7763 491012 124970 340656 112353 331394 72127 576177 222695 -76425 -65204 110633
7753 110633 379730 390170 241274 175623 173980 145971 -78271 -54691 91959 289055 -32793
7742 -32793 -90529 -53952 189122 65576 -89677 -43803 509126 -298308 297849 152300
7732 152300 120989 42414 -153699 -265835 284371 273414 41809 -10743 -62009 241709 -107218
7721a07218L06287Q9784j24276L92580L749j07527n83882N44898k56812j91659
7711c4076k55344M37898o420K1216j18611k06318j10069L86006L58662J07201
7701E80145n62622q4159n2711N00136j74178l3462K01334l72368J35228J50984
7691B88327j41961M4329K67556l70031J91870J69842k30401M78145q00498l52768
7681d55590J002898m45086J69995k2134L26600L3561p7238j72720N22626l36661
7671E46251N55943m55468J52808M11854l03172k84133N5882j75384Q5417M9093
7661F39091o25413J78089l2151L46616o02185K97758J62898q0371L13370m79433
7651A18269Q934M4250m93287O34027n52520P93925m83412O3042k16688K22649
$$ plain form
7721 -107218 199069 288853 164577 557157 560906 453379 -130503 414395 157583 -34076
7711 -34076 -289420 148478 142058 163274 44663 -161655 -271724 114282 472944 580145
7701 580145 17523 -66636 -119347 380789 206611 173149 374483 2115 137343 288327
7691 288327 146366 190695 458251 88220 280090 449932 219531 697676 -102822 -455590
7681 -455590 547308 102222 272217 250083 576683 610244 533006 360286 882912 546251
7671 546251 1102194 646726 799534 1211388 908216 624083 679965 504581 589998 639091
7661 639091 13678 191767 159616 506232 -95953 201805 364703 284332 597702 118269
7651 118269 127203 171453 -321834 312193 -240327 553598 70186 133228 -83460 139189
7641A39189J49960r3484P9715N2886j62296k81431L35559J96001m70574J53385
7631I8910K65733m8032m57607L91409L81534j19879m23066l5656n9878j77839
7621a84371N8344M09665k26617r4052N96181n17125M67573n85648L32284J71594
7611D27828k72833J83611k08970M02714l62704j9595K88537l10718K75299l29574
7601G3595J92107l04470q0547P73147l67512p0984M7715l89383M42108m84999
7591a69223M37235L74958n08668J33157l12146K69894j02655o8500j63857j29659
7581b39464M46306j98592K66493Q2026k59492l3352J36739K72990j60438k71560
7571D1656k19349P1017k9878L56769l06985O07782m53552J25773k20024L79553
$$ plain form
7641 139189 289149 195665 275380 328266 165970 -115461 220098 416099 -54475 98910
7631 98910 364643 316611 -140996 250413 631947 512068 89002 53346 -6532 -184371
7621 -184371 -126027 283638 57021 -37031 559150 42025 509598 -76050 256234 427828
7611 427828 154995 338606 129636 532350 169646 150051 438588 127870 403169 73595
7601 73595 265702 -38768 -119315 653832 286320 215336 263051 -126332 315776 -169223
7591 -169223 268012 642970 134302 267459 -44687 225207 122552 54052 -109805 -239464
7581 -239464 206842 8250 274743 356769 97277 63925 200664 473654 313216 41656
7571 41656 -177693 -106676 -136554 220215 -86770 521012 67460 193233 -26791 352762
7561C52762l87345K2471K50056j06776J04525l58620N94843m38672K90587k4806
7551B99025J40098k78834p1048K64623K6383J25090k37907l00582O64297p57960
7541a26815K72724J27555K7740r9914l49000M60167J6095j78857k17698L77561
7531C09558l38920J97476L46546l24115j10524j30890K29160j49388n37071P35149
7521B26981r3193o3625L034j73967K51679j10160Q3969J43637l28162O7524J21927
7510A29644k91106N08814m6159J40834l53366N0749J4149J57838k93686L87298
7500D05009k1341k10516J07230N1257k11412q3915J9446k11797N23467O2471l7563
7489C92336n17662M96326j52757q8332R7619r4621j42324J84554J5626J93963
$$ plain form
7561 352762 -34583 -12112 237944 131168 235693 -122927 471916 33244 323831 299025
7551 299025 439123 160289 89241 353864 380247 505337 267430 -33152 631145 -126815
7541 -126815 145909 273464 301204 201290 -147710 312457 328552 149695 -68003 309558
7531 309558 -29362 168114 514660 190545 80021 -50869 178291 28903 -508168 226981
7521 226981 133788 70163 73197 -100770 150909 40749 124718 268355 -59807 7717 129644
7510 129644 -161462 347352 301193 442027 88661 139410 153559 311397 17711 405009
7500 405009 383668 173152 280382 331639 120227 36312 55758 -156039 367428 429899 392336
7489 392336 -125326 371000 218243 129911 227530 132909 -9415 175139 190765 384728
7479C84728m36096J35635J33294J6670Q1392n16767N18174j76905j8898k5416
7469I5811K43543J50109p62880L48078k24051L34782j82761n0970K99986j14326
7459A37321M98387n72017K87756p9708j80210R3619J05089k53721l7399L45483
7449C44600O0243m02606J25467j25054L20263k87392N8521K16166L73704l65197
7439C18715K3073k32957J51652n41924M13184K10070j90103J30155J50837j73490
7429B59212L77680l85668K55358m39000J91007J17096k99695J99865P7948K35196
7419E88999o55064K93736k29824K11033J57667l64238J7985J54174k1496K6351
7409A79323j66816L44533j32764Q8691P6934K11402j96531K83024l37675j884
$$ plain form
7479 384728 -51368 84267 217561 234231 315623 -201144 317030 140125 121227 95811
7469 95811 339354 489463 -273417 74661 -149390 185392 2631 -48339 251647 137321
7459 137321 635708 63691 351447 271739 91529 185148 290237 36516 -883 344600
7449 344600 404843 2237 127704 2650 322913 35521 94042 310208 683912 318715
7439 318715 341788 108831 260483 -281441 131743 341813 151710 281865 432702 259212
7429 259212 636892 251224 506582 67582 258589 375685 75990 275855 353803 588999
7419 588999 -66065 227671 -2153 208880 366547 2309 20294 174468 152972 179323
7409 179323 12507 357040 224276 312967 389901 601303 404772 687796 350121 348237
7399C48237J0339j66122j20010N6637n4246K22921q2943L84506l41833J07286
7389C64772K0700p01841J75968M22715m55195L47241J9249K93519j94406R5678
7379C88400j07997n4081l8542j94561J27364O6525N1681k04103K67329k04105
7369I7910J29869l08810O84684m02079Q6925j54175k12543L28825n0345J49486
7359C49747K00676m14654L29852m84740L56517j20929k40233p8955M50142M8190
7349C95613n63313J0105M61543j76457r0379J50501p7434L10225m61976K22607
7339A81035J36388l47995K56517P2785P2600l73260N93188p10421K31506L57732
7329D70075j31211n05954L39762j7698J26417r8128K20390k58959L63592j92287
$$ plain form
7399 348237 358576 192454 72444 129081 74835 297756 214813 599319 257486 364772
7389 364772 385472 -316369 -140401 282314 -172881 174360 193609 487128 292722 388400
7379 388400 280403 226322 187780 -6781 120583 187108 238789 34686 302015 97910
7369 97910 227779 -81031 603653 201574 288499 134324 -78219 250606 200261 349747
7359 349747 550423 135769 465621 -19119 337398 216469 -23764 -102719 347423 395613
7349 395613 -167700 -157595 303948 127491 37112 187613 110179 420404 -41572 181035
7339 181035 317423 -30572 225945 298730 371330 -1930 591258 -119163 112343 470075
7329 470075 338864 -167090 172672 154974 281391 183263 403653 144694 508286 315999
7319C15999m5136k7568j02629R9624j54776j18345M89656o0799k24348K50275
7309D21953m90164O72564k35364k73891K90679j46954j15401K80631m96593Q3331
7299i209J64561J92994K57733R3376m51784k89517K69226J56162l20944l05788
7289b43190J94378O4343J95457K81805j23042l41285K58127j22059n5109j90271
7279h0846K82118L3255J52986j40746P3864K34421n46833k34690Q32102N8790
7269F64421n72686L54420j49519l3188L01385k71239Q0092l11546K38302j71554
7259A28888N9641K1340P0626l06690L31055M40600n96992J86769n2373N2960M152
7248C39976L64415r95815M889N84562p9575p2588K6130m6321r3753J50514o4585
$$ plain form
7319 315999 270863 243295 140666 240290 85514 -32831 456825 396026 171678 421953
7309 421953 -68211 604353 368989 95098 385777 238823 123422 404053 -92540 -9209
7299 -9209 155352 348346 606079 699455 247671 -41846 227380 383542 62598 -243190
7289 -243190 -48812 15531 210988 492793 369751 28466 286593 164534 109425 -80846
7279 -80846 201272 234527 387513 246767 320631 555052 8219 -226471 605631 664421
7269 664421 91735 446155 296636 263448 564833 293594 373686 62140 300442 128888
7259 128888 188529 209869 280495 -26195 304860 745460 148468 335237 282864 335824 339976
7248 339976 704391 -291424 -286535 298027 218452 145864 171994 125673 31920 182434 117849
7237A17849M84162l06136L30423l44649J44338o7610m8781J83175l86320L89386
7227D95837n62095M88999l83828L05317K65346k35907Q1449M7454l93629K72539
7217C81482P2612m28255M9038L16679J61081l09156K87858l86073n4958O40170
7207G30478p32638K66604r6972L63163o09300O51115K18328r4154j24682j31468
7197D40474Q3190Q4829n14863J70451K45194j47289J16513k95903k53747J00202
7187B9051M09862p8858J86553o6831k04902Q6936p5592L818q5911m4643Q7987
7176B47470L38812J3657p5473j25616m7228l09515M27931P5995j4374j41035L325
7165C93949N02274k06935J88813m36910M5026K6002J60260j77355m95661P15004
$$ plain form
7237 117849 602011 295875 626298 281649 425987 358377 309596 492771 106451 495837
7227 495837 -66258 422741 38913 344230 609576 373669 455118 502572 108943 381482
7217 381482 454094 25839 74877 391556 552637 243481 531339 145266 90308 730478
7207 730478 -2160 264444 167472 530635 -78665 572450 790778 696624 571942 440474
7197 440474 523664 608493 93630 264081 509275 361986 478499 182596 -71151 29051
7187 29051 438913 360055 546608 479777 274875 361811 286219 290037 204126 159483 247470
7176 247470 586282 599939 524466 398850 351622 42107 470038 546033 531659 390624 393949
7165 393949 896223 689288 878101 441191 486217 512219 672479 495124 -537 714467
7155G14467o26907q2266O28025m4656q0523J63688k88025K90763m89533O99125
7145H84158p78593N88924k11826r5333m33712O08683j88265K67736j17083j30587
7135C94102j26292r9991K01327n34422M34453K62360l66131M7689k00885M33086
7125D45296n05045M30653m137q0313M58379o55608J99468J70924j49422j49457
7115A60738J698R2927K54930k45386M00634O1077j06542k84698k31736K85697
7105C89339n819m5207j93360m7498j76074M56168j00059n485J35352j80170o4405
7094A62782K7774J23548K04903N1979k74380M5647j44421L19388o5730k22077
7084B29413L71432l27882L0053K44578k01214l952k04612J46311J73829k40085
$$ plain form
7155 714467 87560 5294 633319 588663 508140 671828 383803 674566 185033 884158
7145 884158 105565 694489 482663 387330 -46382 562301 374036 641772 524689 394102
7135 394102 267810 167819 369146 -165276 269177 531537 165406 213095 12210 445296
7125 445296 -59749 370904 366767 286454 744833 89225 288693 459617 310195 160738
7115 160738 162436 255363 510293 264907 665541 726618 620076 335378 103642 389339
7105 389339 383520 338313 144953 97455 -78619 377549 277490 272005 407357 227187 162782
7094 162782 190556 314104 519007 570986 296606 342253 197832 517220 451490 229413
7084 229413 600845 272963 303016 547594 346380 342428 137816 284127 457956 217871
7074B17871J56492P3923o879l11162P26620n35413k01721M2914L45264j74872
7064C33037N42415o35599J19400Q279m8424k58433L65814L3314j61864l36454
7054c8515K25218k7869K77706P6513k41233J00957l9699J54894r3256j4350l5045
7043C45321l4615L40650M4823m17422R1499k5633J4855Q7581J07983k37895L66491
7032F83638l00061J82676j28777J11272j45133L0172J05907l79400N03015l82994
7022B80315P75357l30043n48104K62537m18709L49541j7695L56241l91082L24038
7012F42396k45791K00544L216J94856m24641l52919L69959M40578r5245k07739
7002E25214l3647L6746J46716j26510J95032J49423p07203L78250L9132Q0155
$$ plain form
7074 217871 374363 448286 441407 130245 856865 321452 119731 162645 507909 333037
7064 333037 875452 239853 359253 367532 319108 60675 426489 459803 297939 -38515
7054 -38515 186703 158834 436540 513053 271820 372777 333078 487972 394716 380366 345321
7043 345321 310706 651356 696179 278757 370256 344623 359478 447059 555042 317147 683638
7032 683638 383577 566253 437476 548748 403615 433787 539694 160294 663309 280315
7022 280315 1055672 725629 177525 440062 21353 370894 353199 709440 318358 642396
7012 642396 396605 597149 600365 795221 370580 17661 387620 828198 732953 525214
7002 525214 491567 528313 675029 548519 743551 892974 185771 564021 603153 683308
6992F83308k18415K13498j40386L9565l72676M84715m0165j19557L16885l13025
6982E33747k3474j84766J15329J82253n03539J08705K71804J35401j93811r078
6972D32571J47364k3855k06054J92905j85658L43229k02873M9386o5024j97283
6962B84708K62294K81566m19509J95241J79960n66820N39542r3037J52060k44985
6952E71020L26459m32866J62453j50276J64160q0672r3368J85464L5103J0447
6942F97924j22043j63436q6357M00671j66356M08991k33356k14655l83763M32551
6932E70171J01007l54604P5120J0493L27332L34863l89919L5521k8029l83229
6922B98726L95527l31329K86166J52330l51782J38364K67502k57732q7443j70033
$$ plain form
6992 683308 464893 678391 538005 577570 204894 689609 649444 529887 846772 533747
6982 533747 510273 325507 440836 623089 119550 228255 500059 635460 441649 432571
6972 432571 579935 556080 350026 542931 357273 700502 497629 547015 481991 284708
6962 284708 547002 828568 409059 604300 784260 217440 756982 663945 816005 571020
6952 571020 897479 464613 627066 476790 640950 560278 466910 652374 687477 697924
6942 697924 575881 412445 326088 726759 560403 969394 736038 521383 137620 570171
6932 570171 671178 316574 391694 402187 729519 1064382 674463 709984 681955 298726
6922 298726 694253 362924 649090 801420 449638 588002 855504 597772 510329 340296
6912C40296j82615K28620R3335Q1849j34717n7003J34665j1873j3189K53296m317
6901G28347n88406O15312m59896j44795L53071K3054Q7158L38926o68104L79626
6891F64293l36182N65266m53809K43045l48681Q27910o20156J59371k29690k70186
6881B01181J99523J90240L02946j96139k08979q0529O6585Q063j44067j30262
6871B08562P13988n13925N870k16465L88688J18396l18031Q9635J76454L29798
6861I82970j38802k24665r1440J04812P2578j53126J88236J14693l72788J47616
6851F30084J60795J69433j95622K06872l03908M736M40452l65153k82212J83287
6841F48764k08306K91391k49758P26236o76247O1599L26713K13972l73376K59956
$$ plain form
6912 340296 157681 386301 479636 561485 426768 369765 504430 492557 479368 732664 728347
6901 728347 139941 755253 295357 150562 503633 526687 613845 952771 284667 664293
6891 664293 328111 893377 439568 682613 333932 1161842 541686 701057 471367 201181
6881 201181 400704 590944 893890 697751 488772 408243 474828 482891 338824 208562
6871 208562 922550 408625 414495 198030 586718 705114 387083 476718 653172 982970
6861 982970 844168 619503 528063 632875 705453 552327 740563 855256 482468 630084
6851 630084 790879 960312 764690 971562 667654 672390 1112842 747689 465477 648764
6841 648764 440458 731849 482091 1208327 532080 593679 920392 1134364 760988 1020944
6831A020944j26332j71070j4019J93048k39214J31521M32313n00111J93169K94605
6821A214854m60411J66863L4993M96735l00105k20159P08815m53270K25446j45664
6811A268097j50251k23811P50729J84240n4584N03563l29970M48898m3552m1480
6801B311879R7491L73104j331l3109l02099m17056j65784J74018L65496o82399
6791A720210K767j62754N04009j7414J17670J58786n0807K25307q7289j31076
6781B279409P07807K35801J02301O99709K07737K21156O87148M63532j22880R0530
6771E572250k19348m68788k39355o19892r344j08027n08100J98793p02902k80050
6761B615237J29759l76380N1442J97145M51308n85364J61536M6838L54460J67017
$$ plain form
6831 1020944 894612 723542 709523 902571 663357 794878 1227191 727080 920249 1214854
6821 1214854 754443 921306 956299 1453034 1152929 932770 1641585 1188315 1413761 1268097
6811 1268097 1117846 894035 1644764 1829004 1774420 2277983 1948013 2396911 2353359 2311879
6801 2311879 2409370 2782474 2781143 2748034 2445935 2028879 1863095 2037113 2402609 1720210
6791 1720210 1722977 1560223 2064232 2046818 2164488 2323274 2272467 2497774 2410485 2279409
6781 2279409 2987216 3223017 3325318 4025027 4232764 4453920 5141068 5604600 5481720 5572250
6771 5572250 5352902 4884114 4644759 4024867 4015523 3907496 3399396 3598189 2895287 2615237
6761 2615237 2744996 2368616 2420058 2617203 3068511 2483147 2644683 2691521 3045981 3212998
6751C212998N20341N07158K07448L40725M05212L04184o120j06563q114l54849
6741E022420k56949k11274o34159j59509o07590l65285L57126j50249m74201K0621
6731B540951k1482k9573l85553l7659J19457K2369J25565j72482L39032l71502
6721B129123K95249M20631j63884M67569p1978l64595k05278j09326K12576l59765
6711B250322M81081m52513j49761O2104K3148m42856K05946r7187k41725L517
6701A642076O3055K00589K00422l87707N54316o7635J16114n6082K88863J35991
6691B690002P3179n92085L08651J1276j13321J2654k5237k33983k27646K77095
6681B180585k0779m31955M2308j1774l9171k57779K56626l0526j93808P0671j61621
$$ plain form
6751 3212998 3733339 4240497 4447945 4788670 5193882 5498066 5491946 5385383 5377269 5022420
6741 5022420 4765471 4554197 3920038 3760529 3152939 2787654 3144780 2994531 2520330 2540951
6731 2540951 2519469 2489896 2104343 2066684 2186141 2208510 2334075 2161593 2500625 2129123
6721 2129123 2424372 2845003 2681119 3148688 3076710 2712115 2506837 2397511 2610087 2250322
6711 2250322 2731403 2278890 2129129 2191233 2214381 1771525 1977471 1880284 1638559 1642076
6701 1642076 1705131 1905720 2106142 1718435 2272751 2205116 2321230 2265148 2554011 2690002
6691 2690002 2763181 2171096 2479747 2491023 2377702 2390356 2365119 2131136 1903490 2180585
6681 2180585 2159806 1727851 1770159 1758385 1719214 1461435 1718061 1687535 1493727 1564398 1402777
6670A402777K65800j80390N7362L09440r1597m43612m1376L24246k7688J42578
6660A717540k24744L07865l03486J30730N8937j87856j03881J69739j16016K37724
6650A686552R1393j14656r3062K74237k41161J65911L5097j60092J7743n6574
6640A605388q4196Q8001K85m4468J44409K51699o2614k0284M64708J77853j38262
6629B382519J85137j33489L48119l21162m83589M20080l69184P5591j08281K59128
6619B254869j77728j92842M1741L11332m6703J9533Q49k18634j06267m2881K49965
6608B093234p9799J85404r75Q2390J33665r9079j38709q734K93878L83946j05461
6597B739760k65012N0890k99523j16998j12176L30858m7052m2745J60357j60560
$$ plain form
6670 1402777 1668577 1488187 1545549 1854989 1763392 1319780 1278404 1602650 1574962 1717540
6660 1717540 1492796 1800661 1497175 1627905 1686842 1498986 1395105 1564844 1448828 1686552
6650 1686552 1777945 1663289 1570227 1844464 1603303 1769214 1804311 1644219 1661962 1605388
6640 1605388 1521192 1609193 1609478 1565010 1709419 1961118 1898504 1878220 2342928 2520781 2382519
6629 2382519 2567656 2434167 2782286 2461124 1977535 2397615 2028431 2104022 1995741 2254869
6619 2254869 2077141 1884299 1926040 2237372 2190669 2210202 2211051 1992417 1886150 1843269 2093234
6608 2093234 2013435 2198839 2197864 2280254 2413919 2314840 2176131 2167397 2461275 2845221 2739760
6597 2739760 2474748 2525638 2226115 2109117 1996941 2327799 2280747 2238002 2398359 2237799
6587B237799J28591k62675k33282J58423J60954p5880j08272N06190l03474l09689
6577A898685j2706J93301N17222k99634J84653K05307l04581Q779L53815l70056
6567B374785O0408m0448L08741k30223k77271M77485n7563R8088J72647j07810
6557B778839k94022R5978N1575P6786P3100k27516P7232J60120l94752P49959
6547C147299j30031J31590Q3406k44796J78505N31496O6404j31422l7856M19567
6537D014162O0477L19951M34090L01352l4876L34644k28971o1884l44356J75191
6527D969780m73913j80716M7802J03894m24394p7393J7160j34036J02851k40059
6517C710976K94739m7996j99679J30815M0485k0264l60789K28930k794j35792
$$ plain form
6587 2237799 2366390 2103715 1870433 2028856 2189810 2113930 2005658 2511848 2208374 1898685
6577 1898685 1885979 2079280 2596502 2296868 2481521 2686828 2382247 2391026 2744841 2374785
6567 2374785 2435193 2394745 2703486 2473263 2195992 2673477 2615914 2714002 2886649 2778839
6557 2778839 2484817 2580795 2632370 2709156 2782256 2554740 2631972 2792092 2397340 3147299
6547 3147299 3017268 3148858 3232264 2987468 3165973 3697469 3763873 3632451 3594595 4014162
6537 4014162 4074639 4394590 4828680 5130032 5095156 5429800 5200829 5138945 4794589 4969780
6527 4969780 4495867 4315151 4362953 4466847 4042453 3965060 3982220 3848184 3951035 3710976
6517 3710976 4005715 3957719 3758040 3888855 3929340 3909076 3548287 3777217 3774423 3638631
6507C638631J25550m5391L32246n96738J07686O00803l63970L94601M6721O2315
6497D302454o3943L01499n2910m62587J47482M5161k091M27503N95537k10831
6487E027274k09342L45798J97132k63708J25448K5171k466J68461Q0149K04659
6477E698576k79360n1917M25063k87201M74912J05170l90247N93575K53053l95022
6467F146602o1320K57552L35665j49822L07593k77752M57582M87368n6932j94005
6457G252531N16983N787O4247J13885M42518J56461K95037j19614K01709K41141
6447I170685L68962M40481r7223q374L22092R7117N19261j97286O64090M4994
6437A1324799O8780L43032M49973M15165Q11911M58486M50555O94695P59308O85645
$$ plain form
6507 3638631 3764181 3718790 4051036 3454298 3561984 4162787 3798817 4193418 4240139 4302454
6497 4302454 4238511 4540010 4487100 4024513 4171995 4217156 4215065 4642568 5238105 5027274
6487 5027274 4817932 5163730 5360862 5097154 5222602 5247773 5245307 5413768 5493917 5698576
6477 5698576 5419216 5367299 5792362 5505161 5980073 6085243 5694996 6288571 6541624 6146602
6467 6146602 6085282 6342834 6678499 6528677 6836270 6558518 7016100 7503468 7446536 7252531
6457 7252531 7769514 7775301 7839548 7953433 8395951 8552412 8847449 8727835 8929544 9170685
6447 9170685 9539647 9980128 9882905 9874531 10196623 10293740 10813001 10615715 11279805 11324799
6437 11324799 11393579 11736611 12186584 12601749 13413660 13872146 14322701 15017396 15776704 16462349
6427A6462349O72443J036147R87446J601762N97176J879352R82891J817993J538090
6418B7575649J502244K281321K075712K177690K527297L606904L207314N165502
6410E0119633N279212O469623Q557922J0013159J2516036J4700194J6445812J8710512
6402A42812103K0425053K1556504J7922008J0472509M362717k766017j2543188
6395B02241689j9484113k1090967k0235483j7825633j6120460j4636411j1931143
6388H0917479r952058p966616o728017n419988m878140m046574l322616l208185
6380C5395285k389966k703498j522807j813135j442951j143617r65795j340534
6372B2072982j72538p97159l90350n87676k16747m35631J82154l49417j16321
$$ plain form
6427 16462349 17134792 18170939 19158385 20760147 21357323 23236675 24219566 26037559 27575649
6418 27575649 29077893 31359214 33434926 35612616 38139913 41746817 44954131 50119633
6410 50119633 55398845 61868468 70426390 80439549 92955585 107655779 124101591 142812103
6402 142812103 163237156 184793660 202715668 213188177 217550894 214784877 202241689
6395 202241689 182757576 161666609 141431126 123605493 107485033 92848622 80917479
6388 80917479 70965421 62998805 56270788 50850800 45972660 41926086 38603470 35395285
6380 35395285 33005319 30301821 28779014 26965879 25522928 24379311 23413516 22072982
6372 22072982 21900444 21103285 20712935 20125259 19908512 19472881 19655035 19305618 19189297
6363A9189297m84023l70467j64107k49517k14614n55347n54253K2709m77565j14944
6353A6027169m48841n35876J10848m58675M4654k67137l51179M17810k6176K13233
6343A4725830j7023L6010K7585J17963n090L05457J44940J17160K66748P20427
6333A6440007M39672M11001L1729P58534P29595P32557M43150J039415O23987
6324B1649647J195413J255049J528334J859102L121363L976152L049381M895370
6316D2529811M823607N463978N344417K168137O50153n91200l526697o334550
6308E0527656o079453m957606m252735l136678k331146k107606j274487j096816
6300B5291129p52498q59008m85456n30302j88259m39835p0192r7187K53595J06392
$$ plain form
6363 19189297 18705274 18334807 18170700 17921183 17706569 17151222 16596969 16619678 16142113 16027169
6353 16027169 15578328 15042452 15153300 14694625 14739279 14472142 14120963 14538773 14512597 14725830
6343 14725830 14708807 14744817 14772402 14890365 14885275 15190732 15335672 15452832 15719580 16440007
6333 16440007 16879679 17290680 17322409 18080943 18810538 19543095 19986245 21025660 21649647
6324 21649647 22845060 24100109 25628443 27487545 30608908 34585060 37634441 42529811
6316 42529811 47353418 52817396 58161813 60329950 60980103 60388903 56862206 50527656
6308 50527656 44448203 39490597 35237862 32101184 29770038 27662432 26387945 25291129
6300 25291129 24538631 23679623 23194167 22663865 22475606 22035771 21965579 21868392 22121987 22228379
6290B2228379o01582L72719J05604O21326l60954L73045N23291L43415K96742
6281B3901985R38242N29283J116462J045039J472887J085264J462212J762702
6273C3314076R74130K055788J414813K522046J922572K770912K542038K745755
6265E0262130L597671L172543L887554M023606M993832N943184P024643Q249199
6257I1154362J0062146J1939696J5435028J9180009K3398827K8019834L2685314
6250B31875216L6157426M0662915M3290537M0037304K7851987Q406428n047971
6243D23233842k5040157m5096946n1545257m7433836m0595737l1292007k5350413
6236A56879489k1499432j6023801j3546120j1131380j0227260q107448p538417
$$ plain form
6290 22228379 21626797 21999516 22105120 22726446 22365492 22738537 23261828 23605243 23901985
6281 23901985 24840227 25369510 26485972 27531011 29003898 30089162 31551374 33314076
6273 33314076 34288206 36343994 37758807 40280853 42203425 44974337 47516375 50262130
6265 50262130 53859801 57032344 60919898 64943504 69937336 75880520 82905163 91154362
6257 91154362 101216508 113156204 128591232 147771241 171170068 199189902 231875216
6250 231875216 268032642 308695557 351986094 392023398 419875385 428281813 423233842
6243 423233842 398193685 353096739 301551482 254117646 213521909 182229902 156879489
6236 156879489 135380057 119356256 105810136 94678756 84451496 76344048 68805631
6229F8805631o683187n336017m635425m355691l224898l130784k484360j764449
6221C7190820j946101j428814j636899q25710q16133p19509q80093j127884m11171
6212B7398506n95332q19682r19835j084093p03717p53541q11398p69564r77242
6203A9964102n22017r37436j041924n00815p05754n03578k22333p00039l41708
6194A4488498l47785n31153k0476r61148k32941l04791k36361l05604k11984m45213
6184A0891042j59538k47125l2079n03532J39665p32494M22187J49818J01754m10643
6174I619055l86626l62291J9005r4841j49714n59948j46688p511m22707l68719
6164G139015k96920J49441j02671k58397M9131j50194j53595k64814K10077k54933
$$ plain form
6229 68805631 62122444 56786427 52151002 47795311 44570413 41439629 38955269 37190820
6221 37190820 35244719 33815905 32179006 31353296 30537163 29817654 28937561 27809677 27398506
6212 27398506 26803174 25983492 25063657 23979564 23275847 22522306 21710908 20941344 19964102
6203 19964102 19442085 18504649 17462725 16961910 16256156 15752578 15530245 14830206 14488498
6194 14488498 14140713 13609560 13589084 12627936 12394995 12090204 11853843 11548239 11336255 10891042
6184 10891042 10731504 10484379 10452300 9948768 10088433 9355939 9778126 9927944 10029698 9619055
6174 9619055 9232429 8870138 8889143 8794302 8644588 8084640 7937952 7930441 7507734 7139015
6164 7139015 6842095 6991536 6888865 6630468 6679599 6529405 6375810 6110996 6321073 6066140
6154F066140O883k16716L08713j9435j99127K85443n6709o11712K95921k43603
6144E615798k877J1278j82524j69975j81388K87562r3576k65309j95212j74368
6134D649409J38458m97522L95542k48114m90732J1421J67318j99551K88294J11872
6124D326395k831O3152J30488j35158l47991j38498N61697n25125R3966m25037
6114C601058J93288J46719l00655L97680l6370J71343l22984M73104J59437J22572
6104D605192Q8409n3053m10741Q9318m16222J7366M6193k75903M9386q37281L60466
6093C263130l62908J6369K62282k15068P9254R0360j50445N1641p6916N7304M33159
6082C448162l53910p2934j81774m8471j69178L19214k0756k61103j31098k21395
$$ plain form
6154 6066140 6073023 5856307 6165020 6145585 5946458 6231901 6175192 5563480 5859401 5615798
6144 5615798 5612921 5624199 5441675 5271700 5090312 5377874 5284298 5018989 4823777 4649409
6134 4649409 4787867 4290345 4685887 4437773 3947041 3958462 4125780 3926229 4214523 4326395
6124 4326395 4323564 4386716 4517204 4382046 4034055 3895557 4457254 3932129 4026095 3601058
6114 3601058 3794346 3941065 3640410 4038090 4001720 4173063 3850079 4323183 4482620 4605192
6104 4605192 4693601 4640548 4229807 4319125 3902903 3920269 3966462 3690559 3739945 2902664 3263130
6093 3263130 2900222 2916591 3178873 2963805 3043059 3133419 2982974 3034615 2957699 3015003 3448162
6082 3448162 3094252 3021318 2839544 2791073 2621895 2941109 2920353 2659250 2528152 2306757
6072B306757l16729J81445M41024j15472M58630o3993k89246O8786O1063J36718
6062B868983l42093M59241k34269K45166l77595J32082Q4514R5550j02972M9629
6052B878236n9130R0902j44929j7742L2880K14966k62584j19220l08022O93503
6042B998860j0495R942j05450M9710l69770L7850K32071M47446j142m02528n8966
6031B827528k20568m16810P0164M51233K91872J16629m72941K83190L02262O5303
6021C297862l00923L9123m99634K67930Q5752J65643J19986j61845o37880O40255
6011C016269k95906O8648J27954J60163K05280p17750N54276j95208l3495j88025
6001B702206N06660l4489J38895k96772K54510l04769L86462L0580k27089N2045
$$ plain form
6072 2306757 1990028 2171473 2612497 2497025 2955655 2891662 2602416 2671202 2732265 2868983
6062 2868983 2526890 2986131 2751862 2997028 2619433 2751515 2836029 2931579 2828607 2878236
6052 2878236 2819106 2910008 2765079 2747337 2780217 2995183 2732599 2613379 2305357 2998860
6042 2998860 2988365 2998307 2892857 2942567 2572797 2610647 2842718 3290164 3289022 2886494 2827528
6031 2827528 2606960 2190150 2260314 2711547 3003419 3120048 2647107 2930297 3232559 3297862
6021 3297862 2996939 3036062 2536428 2804358 2890110 3055753 3175739 3013894 2376014 3016269
6011 3016269 2720363 2789011 2916965 3077128 3282408 2564658 3118934 2923726 2890231 2702206
6001 2702206 3208866 3174377 3313272 3016500 3271010 2966241 3352703 3383283 3156194 3208239
5991C208239p8252m7816J42079p6401J81990j0115K8877m19280N71614j2067j5657
5980C473211N1905l48452M52466p4180j96613L51573j24427J45750j70879L20304
5970C880658J18192j87616k3318L36307n86606Q8954L82172K31421P9824L65906
5960D685894j02432M49308j143J16878J13102K91534K104L08512j05348l29929
5950E428480m72501j08861j894l55929J66363n7608K50819m21440K344l5391j22883
5939D271499K0506j2551l7783L17540J40577m1300m38993N49640n21216m71726
5929C776193O40454K06462R6455l10018n6299k34120J21366L34610J80985k48073
5919D508015M1323L36693J63349j92108K31747l33330L47391l70912M37754k46994
$$ plain form
5991 3208239 3129987 3082171 3224250 3147849 3329839 3319724 3348601 2929321 3500935 3488868 3473211
5980 3473211 3525116 3176664 3629130 3554950 3358337 3709910 3585483 3731233 3560354 3880658
5970 3880658 3998850 3811234 3787916 4124223 3537617 3626571 4008743 4240164 4319988 4685894
5960 4685894 4583462 5032770 5031627 5148505 5261607 5553141 5555245 5863757 5758409 5428480
5950 5428480 4955979 4847118 4845224 4489295 4655658 4598050 4848869 4427429 4429773 4394382 4271499
5939 4271499 4292005 4279454 4241671 4559211 4699788 4658488 4219495 4769135 4247919 3776193
5929 3776193 4416647 4623109 4719564 4409546 4353247 4119127 4240493 4575103 4756088 4508015
5919 4508015 4549338 4886031 5049380 4857272 5089019 4755689 5103080 4732168 5169922 4922928
5909D922928k37543K8245J60039J45129M29801k61136J3640k32759L58722L41319
5899E668385o36054K48657P5074J81670K1147J62402J34611j33901J67K74078
5889E996236j66318J93827j9993K77681J27464q7341k32952J14400J82052K83645
5879F668701n17213L93492q5274j69125K36767K32549l58769N93781j08708l0543
5869F855658J78567L16346k66736K54870m8739J86974k95220P32218j21712J32150
5859G924376J30282l31692L91871k70998O98293k48473k12025M14175j95324P4347
5849H374832M34623k6785q2201K50048j9785K79545J49499k75476M96833j78387
5839I402746J35887K92981J16480J6860L27942k50813L52396j25954q4589J20610
$$ plain form
5909 4922928 4685385 4713630 4873669 5018798 5448599 5187463 5201103 4968344 5327066 5668385
5899 5668385 5032331 5280988 5356062 5537732 5558879 5721281 5855892 5721991 5722158 5996236
5889 5996236 5829918 6023745 6003752 6281433 6408897 6321556 6088604 6203004 6385056 6668701
5879 6668701 6151488 6544980 6459706 6290581 6527348 6759897 6401128 6994909 6886201 6855658
5869 6855658 7034225 7350571 7083835 7338705 7289966 7476940 7181720 7913938 7792226 7924376
5859 7924376 8054658 7722966 8114837 7843839 8542132 8293659 8081634 8495809 8300485 8374832
5849 8374832 8809455 8782670 8700469 8950517 8930732 9210277 9359776 9084300 9581133 9402746
5839 9402746 9538633 9831614 9948094 9964954 10292896 10042083 10394479 10268525 10183936 10304546
5829A0304546M4037L92377J22599j94257O45878J98794K47708J11908j25349l27696
5819A1420545M82918J61320J15330K45455Q9047j73811O0095j81896N05438N9399
5809A2783840k87971J00334N94381j82746o5639L86174K15724J86410K10429m22582
5799A3518354L28409J15695p0176O66341j91432j6244Q6644O28931k5036l18866
5789A4722620Q35315l74354j30689N61204k61845L58457L02969m22786M50894
5780A6041785r0685J92156o24k11677L44273J33349L01789j2931L54197j62408
5770A6889224o0185O3107J90448l25692L11852M4233k38540K7192N4161L19295
5760A7275095j50791q048r397l16492J81871j38336j73776k09881M31999p746
$$ plain form
5829 10304546 10348583 10740960 10863559 10669302 11315180 11513974 11761682 11873590 11748241 11420545
5819 11420545 11903463 12064783 12180113 12425568 12514615 12340804 12400899 12219003 12724441 12783840
5809 12783840 12495869 12596203 13190584 13007838 12942199 13328373 13544097 13730507 13940936 13518354
5799 13518354 13846763 13962458 13892282 14558623 14367191 14350947 14437591 15066522 15041486 14722620
5789 14722620 15557935 15183581 15052892 15614096 15352251 15710708 16013677 15590891 16041785
5780 16041785 15951100 16143256 16142632 15930955 16275228 16408577 16710366 16697435 17051632 16889224
5770 16889224 16829039 16892146 17082594 16756902 17068754 17112987 16874447 16901639 16955800 17275095
5760 17275095 17124304 17116256 17106859 16790367 16972238 16833902 16660126 16450245 16882244 16874498
5750A6874498L039l84120P8479M1548m53036N5435j46156K48283N4489l27073
5740A6045386K56895l08232J98345k40525m35513K90163k99696q052n74314L46324
5730A5270781j62349l23378M03199k10695j60935Q9489k97830k04530N8694q4811
5720A4377635j52195p2926j39136J81242n47900O0185l17887L27272m37694j39011
5710A3139585N70797o72397K70777k12766j47906l48892l64641P7008m262l04666
5700A2002637Q1075q3580l55341L2614K06849m46582J71663l07787R5489k41508
5690A1155529l01390L0109j66586J05796j26273o4884j86346n9623L08466l64487
5680A0330311l85476J53918K41342l99720j65239K12441k87403j25755J77987
$$ plain form
5750 16874498 16877537 16493417 16571896 16613444 16160408 16215843 16069687 16317970 16372459 16045386
5740 16045386 16302281 15994049 16192394 15951869 15516356 15806519 15506823 15498771 14924457 15270781
5730 15270781 15108432 14785054 15188253 14977558 14816623 14906112 14608282 14403752 14462446 14377635
5720 14377635 14225440 14152514 14013378 14194620 13646720 13706905 13389018 13716290 13278596 13139585
5710 13139585 13710382 13037985 13308762 13095996 12948090 12599198 12234557 12311565 12307303 12002637
5700 12002637 12083712 12000132 11644791 11677405 11884254 11437672 11609335 11301548 11397037 11155529
5690 11155529 10854139 10884248 10717662 10823458 10697185 10632301 10445955 10386332 10694798 10330311
5680 10330311 9944835 10098753 10340095 9940375 9775136 9987577 9700174 9574419 9752406
5671I752406k25510K12759m51594R7207o979K4758K93503l60464L6837j32847
5661I240076L17477J21842q3385k36665Q02750q25427N36611K72114l92946M01343
5651A0153790m33597o4293L9096j98736Q6246m60434n24480L96645l31190J60116
5641H823163P3587k12521j15667P4547k87128q4161M94612L59473j022837J03050
5631H206118K26208j47556o1125L13772n6691r3211J642J28349k49433q5386k54975
5620G927712N82162k65736l1147J85383j55326l6675m48444L16067K18369j50105
5610H142260P5911J50247l79601L03394K5728L9885r1780j08673N14883k54233
5600H418021K9931j15299O0474j06896J43890K29535J24068K10008l60685O4052
$$ plain form
5671 9752406 9526896 9739655 9288061 9385268 9378289 9403047 9696550 9336086 9372923 9240076
5661 9240076 9557553 9679395 9596010 9359345 10162095 9336668 9873279 10145393 9752447 10153790
5651 10153790 9720193 9655900 9694996 9496260 9582506 9122072 8597592 8994237 8663047 8823163
5641 8823163 8896750 8684229 8568562 8643109 8355981 8271820 8766432 9125905 8103068 8206118
5631 8206118 8432326 8284770 8223645 8537417 8480726 8387515 8389157 8517506 8268073 8182687 7927712
5620 7927712 8509874 8244138 8212991 8398374 8243048 8206373 7757929 8073996 8292365 8142260
5610 8142260 8218171 8368418 7988817 8292211 8317939 8357824 8266044 8157371 8672254 8418021
5600 8418021 8447952 8332653 8393127 8286231 8430121 8659656 8783724 8993732 8633047 8697099
5590H697099J9442J12830N9829R1362O8267l25025L28932M32483n58150K67878
5580I194947K10666J75678L1532p4674J63915M48414k40715J63125J12992K47721
5570A0433601K87427L003k3901L40500J17463K20555K76795J80919K57619K75830
5560A2369811j4917M0784Q34444j22154K77435L17848N21187J81025M1463P90432
5550A5237358N81521K86994N59188R71J036206P19150N24490Q29650Q16325R43731
5540B1535584Q12240J079898J333426J457411J393096J496490R34756J965369
5532C2008270J726483J423273J285688J459092P68887J463795J461063J068969
5524D2665520J473193J404228J574727J618803Q18989J502059J407209J971735
$$ plain form
5590 8697099 8716541 8829371 8889200 8980562 9048829 8723804 9052736 9485219 8927069 9194947
5580 9194947 9405613 9581291 9612823 9538149 9702064 10150478 9909763 10072888 10185880 10433601
5570 10433601 10721028 10724031 10700130 11040630 11158093 11378648 11655443 11836362 12093981 12369811
5560 12369811 12354894 12395678 13230122 13107968 13385403 13703251 14224438 14405463 14446926 15237358
5550 15237358 15818879 16105873 16665061 16666032 17702238 18421388 18945878 19775528 20591853 21535584
5540 21535584 22347824 23427722 24761148 26218559 27611655 29108145 30042901 32008270
5532 32008270 33734753 35158026 36443714 37902806 38671693 40135488 41596551 42665520
5524 42665520 44138713 45542941 47117668 48736471 49555460 51057519 52464728 54436463
5516E4436463J698287K054232K651074K979606L446676L747219M741627M425535
5508H0180719N281339N537503N344924N733455L024477J695461K1494k308115
5500A04511257l816765l994798m349491l430352k614268k313578k086735j543591
5492H0361679j479336j667956j347259l65457p53164q01022l59898L43233n03615
5483G3427205P01070o03708q1201O63758L2806j62325l865l56397K67956o40891
5473G3244408J01230j64711n14191Q7442j29472j41223Q86J59302J15753L26242
5463G3085666J45919M38196J370696J50851P48822J217860O15323K72914M46038
5454G8492285K79404K76082J815r59211n95208r94674j137538j555849j329887
$$ plain form
5516 54436463 56134750 58188982 60840056 63819662 67266338 71013557 75755184 80180719
5508 80180719 85462058 90999561 96344485 102077940 105102417 106797878 106819372 104511257
5500 104511257 100694492 96699694 92350203 88919851 86305583 83992005 81905270 80361679
5492 80361679 78882343 77214387 75867128 75501671 74748507 73947485 73587587 73930820 73427205
5483 73427205 74128275 73524567 73443366 74107124 74139930 73977605 73973740 73617343 73885299 73244408
5473 73244408 73345638 73180927 72666736 72754178 72624706 72483483 72484369 72643671 72759424 73085666
5463 73085666 73231585 73669781 75040477 75191328 75940150 77158010 77773333 78046247 78492285
5454 78492285 78771689 79047771 79049586 78090375 77495167 76500493 75362955 73807106 72477219
5445G2477219j920251j760327j871043j843233j705464j687190j214249j327011
5437E9148451p24228j151391m99167o38733o53082m91992n01737m42253n81703
5428E3464165p15871o94173p26434k90296j081899Q8155o48281n50657k72185
5419D8572524J80883J45542K42234R18461L20952J361769J036336J849795J550204
5410E6178700J502069K120081J431966J716521J472162J920917J644821J613302
5402F9600539J515954J402297P64497M37638R61715M86996J358588L04522J315175
5393G8147921J700246J942662K754562K828428L506541L351986L834245K906639
5385A00973230L297531L176230K593622J888685J951073J497503Q09843K02102
$$ plain form
5445 72477219 70556968 68796641 66925598 65082365 63376901 61689711 60475462 59148451
5437 59148451 58424223 57272832 56773665 56134932 55481850 54989858 54488121 54045868 53464165
5428 53464165 52748294 52054121 51327687 51037391 49955492 50043647 49395366 48844709 48572524
5419 48572524 48753407 48898949 49141183 50059644 50380596 51742365 52778701 54628496 56178700
5410 56178700 57680769 59800850 61232816 62949337 64421499 66342416 67987237 69600539
5402 69600539 71116493 72518790 73283287 73720925 74682640 75169636 76528224 76832746 78147921
5393 78147921 79848167 81790829 84545391 87373819 90880360 94232346 98066591 100973230
5385 100973230 104270761 107446991 110040613 111929298 113880371 115377874 116187717 116389819
5377A16389819p23517j093375j960477k007868j925231k288679k008160k850682
5369A01531830k228331k444949j842526j784610j612261j650495j458597j632937
5361H6877124p38797j961587j751447k360266k208478k976097l046638l091868
5353F8741946k931065l319861l683080k802452l414292k718522k239775k540776
5345D5092123k065173j406604j939196j321869j035650j141561l79898p39282
5337C5062890J10016m07169j03004N39741M67333L89273K0345j29891k91783j042214
5327C4615537j416101q99038o99115l79354k58507r361J23339L27365L96247P86265
5317C2587277O63113J000139R69757Q04654J303397J002825R95430Q08476J172563
$$ plain form
5377 116389819 115666302 114572927 112612450 110604582 108679351 106390672 104382512 101531830
5369 101531830 99303499 96858550 95016024 93231414 91619153 89968658 88510061 86877124
5361 86877124 86138327 84176740 82425293 80065027 77856549 74880452 71833814 68741946
5353 68741946 65810881 62491020 58807940 56005488 52591196 49872674 47632899 45092123
5345 45092123 43026950 41620346 39681150 38359281 37323631 36182070 35802172 35062890
5337 35062890 35172906 34765737 34662733 35202474 35669807 36059080 36079425 35949534 35657751 34615537
5327 34615537 33199436 32300398 31601283 31221929 30963422 30954061 31077400 31404765 31801012 32587277
5317 32587277 33250390 34250529 35220286 36024940 37328337 38331162 39326592 40135068 41307631
5308D1307631R47009J626713K28733J201020L33136R61879O71410N00370L56071
5299D8133972O7208P2075K03421j43634M2056O04876k31180K9847K66449N4433
5289D9099523P15891N38736J386052J039298R44641J986667J705023J781407K265734
5280F1462972J859414K809259K540341K213317K169594J981057K282218J869831
5272G9188003J257329J224053J463717J071234J866402J377528K074833J795806
5264I1318905K276689K501495K183152K563427K436500J960511K010866J702968
5256A08954513J433617J431582J12506j48169j225844j218924k555079k299912
5248A04484290l349359k680093l797348l602556l333488l685286l319224k411025
$$ plain form
5308 41307631 42254640 43881353 44110086 45311106 45644242 46606121 47277531 47777901 48133972
5299 48133972 48201180 48273255 48476676 48333042 48375098 48979974 48748794 48778641 49045090 49099523
5289 49099523 49815414 50354150 51740202 52779500 53724141 55710808 57415831 59197238 61462972
5280 61462972 63322386 66131645 68671986 70885303 73054897 75035954 77318172 79188003
5272 79188003 80445332 81669385 83133102 84204336 86070738 87448266 89523099 91318905
5264 91318905 93595594 96097089 98280241 100843668 103280168 105240679 107251545 108954513
5256 108954513 110388130 111819712 111932218 111784049 110558205 109339281 106784202 104484290
5248 104484290 101134931 98454838 94657490 91054934 87721446 84036160 80716936 78305911
5240G8305911j752647k198473p54050j424400j128123m60294r52598j227481j165938
5231F7241907j824696j926172k025061k255422k800152k245255k347973k707237
5223D9109939k469531k654308l062319k566363k459205k331028k404568k080677
5215B9081940j961796j528631j554004j264491j582394r13511r59642q95525j032679
5206A7389267n39573n75618m86670q63918r3786n09222l40246r65744n74229l14202
5196A2126059m57507l25970K2521l55330k64482q46933j17566o5850n52353n1248
5186I111341j69443k63037j38226p5294l11204n67005j88927K6100k65454j67230
5176F991621J1685j15123n28899K51110m35448n4257k50108r7065Q5436J71252
$$ plain form
5240 78305911 76553264 74354791 73600741 72176341 71048218 70587924 69635326 68407845 67241907
5231 67241907 65417211 63491039 61465978 59210556 56410404 54165149 51817176 49109939
5223 49109939 46640408 43986100 40923781 38357418 35898213 33567185 31162617 29081940
5215 29081940 27120144 25591513 24037509 22773018 21190624 20277113 19317471 18421946 17389267
5206 17389267 16849694 16274076 15787406 14923488 14829702 14320480 13980234 13014490 12440261 12126059
5196 12126059 11668552 11342582 11365103 11009773 10745291 9898358 9780792 9714942 9162589 9111341
5186 9111341 8941898 8678861 8540635 8465341 8154137 7587132 7398205 7424305 7158851 6991621
5176 6991621 7003306 6888183 6359284 6610394 6174946 6120689 5870581 5773516 5858952 6030204
5166F030204p74361J66118l2719l2442r8215l76611m6462k7968J25254j80313
5156D752485q0797J69188o78475L32389l40967J51027r7388n3364k16000J74919
5146D113017l20254j32859K5500o90J38944M5476k86239k84354K91242J07557
5136C697340m61727K38328m30225M19424K2836k56622Q4385M3035m0171k58634
5126C057969J95415L9989j94717p7157j66275K4945J47559k8995l71687n7047
5116B569999K50173P1309k09567P811r689m73110P13552p85006N23548j00148
5106B558872j81442K34713J8452N3621m13448P8015K13519j75508m00053K17136
5096B203877n7361K01423K16539m63486K12144L18391m21623j82960N08576l17915
$$ plain form
5166 6030204 5255843 5421961 5389242 5356800 5258585 4881974 4835512 4807544 4932798 4752485
5156 4752485 4671688 4840876 4162401 4494790 4153823 4304850 4207462 4154098 3938098 4113017
5146 4113017 3792763 3659904 3685404 3684714 3823658 3869134 3582895 3298541 3589783 3697340
5136 3697340 3235613 3473941 3043716 3463140 3485976 3229354 3313739 3356774 3316603 3057969
5126 3057969 3253384 3293373 3098656 3021499 2855224 2880169 3027728 2998733 2627046 2569999
5116 2569999 2820172 2891481 2681914 2689725 2680036 2206926 2920478 2135472 2659020 2558872
5106 2558872 2377430 2612143 2630595 2684216 2270768 2348783 2562302 2386794 1986741 2203877
5096 2203877 2146516 2347939 2564478 2100992 2313136 2631527 2209904 2026944 2535520 2217605
5086B217605J11372J62131l18278M9660J83273n49792K02676J73261q0950j93137
5076A957821O4474K76357L1043k27075P9850q0320j27067l16121N22199k32719
5066A948442L17245J99040j87292K22082r3959J64737j70840o1371k51296K46544
5056B333332K6497R6862P4536R9047k06806K13669p37096N74246j92646J84942
5046B466583N8423n4951n45914N88647j92741K42600k20037O25866m82176j51594
5036B334706J48078J95787J22264J28956k12072K00756L24177m32518J88776l0559
5026B968351K72597k56269L52491k92303r5251J33833K02108m24033K81360l27003
5016B815881p3507L25841k38098j94049K30806k16499P30888q13297N13340n0026
$$ plain form
5086 2217605 2328977 2491108 2172830 2222490 2405763 1855971 2058647 2231908 2150958 1957821
5076 1957821 2022295 2298652 2329695 2102620 2182470 2102150 1975083 1658962 2181161 1948442
5066 1948442 2265687 2464727 2277435 2499517 2405558 2570295 2399455 2338084 2086788 2333332
5056 2333332 2359829 2456691 2531227 2630274 2423468 2637137 1900041 2474287 2281641 2466583
5046 2466583 2525006 2470055 1924141 2512788 2320047 2562647 2342610 2968476 2486300 2334706
5036 2334706 2482784 2678571 2800835 2929791 2717719 2918475 3242652 2810134 2998910 2968351
5026 2968351 3240948 2984679 3337170 3044867 2949616 3083449 3285557 2861524 3142884 2815881
5016 2815881 2742374 3068215 2830117 2636068 2866874 2650375 3381263 2567966 3081306 3031280
5006C031280j567k43442M15668k95849O9536L56656K68341J5587j793j54497k34777
4995C225143O5544n0571J84876k18080j33554L70500j11589n66139L20209L14290
4985C400629k29576K90394j28865j48109J74543L39366m49134M11638o49550J27945
4975C139281J18590K2163K3327M0347R9212o35600M43404J77052j46214q118K8111
4964C301555j58364M49752j51313r1809l08344K89100k8837n7140J54371l67178
4954C031793K3665m8697O06435k08741o40165M69787j72413R4789M66969m23092
4944C200330j24122J56757j99285L07866l6442M4333k67702M27755j25884Q8292
4934C471898Q8943k24031M58852m51171Q59267n72041K5088m9597N4839J7697
$$ plain form
5006 3031280 3029713 2786271 3201939 2906090 2975626 3332282 3600623 3616210 3614417 3459920 3225143
4995 3225143 3290687 3240116 3424992 3206912 3073358 3443858 3332269 2766130 3086339 3400629
4985 3400629 3171053 3461447 3332582 3184473 3359016 3698382 3249248 3660886 3011336 3139281
4975 3139281 3257871 3280034 3303361 3343708 3442920 2807320 3250724 3427776 3281562 3273444 3301555
4964 3301555 3143191 3592943 3441630 3349821 3041477 3330577 3301740 3244600 3398971 3031793
4954 3031793 3055458 3006761 3613196 3404455 2764290 3234077 3061664 3156453 3623422 3200330
4944 3200330 3076208 3232965 3033680 3341546 3305104 3349437 3081735 3509490 3383606 3471898
4934 3471898 3560841 3336810 3795662 3344491 4203758 3631717 3656805 3607208 3662047 3679744
4924C679744M1784L34795k92906K4498m4128m467M815K48765K62713l13370K4061
4913C966304j19645L9721O31922m45108K11169n0908k1968J08377K1836K3348
4903D365048P4247r5183K27611J56398o05054N40972J12195l22513K63747J40844
4893D858312l2752j24287Q2526L39745k51436L15002m84119K07678K92474Q6947
4883E290090k45870N51356o6474n5637J98677l8280Q4159J93968j69768j43097
4873E599124m1071M99171j06353R0089n427L68145K31811k38872M39391J31414
4863F967422O7239j75843r9613L72994l24070N64120K13735n70083P71935L77777
4853H165613k0151N29330l00373p0936j40668N03774J5521r0259N11191J32554
$$ plain form
4924 3679744 3721528 4056323 3763417 3787915 3743787 3739320 3744135 3992900 4255613 3942243 3966304
4913 3966304 3846659 3886380 4518302 4073194 4284363 4233455 4211487 4319864 4341700 4365048
4903 4365048 4439295 4344112 4571723 4728121 4123067 4664039 4776234 4453721 4717468 4858312
4893 4858312 4825560 4701273 4783799 5123544 4872108 5187110 4702991 4910669 5203143 5290090
4883 5290090 5044220 5595576 5529102 5473465 5672142 5633862 5718021 5911989 5742221 5599124
4873 5599124 5558053 6057224 5950871 6040960 6035533 6403678 6635489 6396617 6836008 6967422
4863 6967422 7034661 6858818 6759205 7132199 6808129 7372249 7585984 7015901 7787836 8165613
4853 8165613 8145462 8674792 8374419 8303483 8162815 8666589 8682110 8591851 9103042 9235596
4843I235596N7349L72797M64967K61318J83955Q02222K53551M37165N25494j88706
4833A2405708P68280J97226P47569N38294J30114p1439K63830J03455M28793l77448
4823A5134382O58683K1290N58630K19122L35492O59413N88593K09414P18955l12469
4813A8791505J091981M06931M46717P40140N46964O10765M81803R51533k08412
4804B3859927J278836N47202P96359N65686K67999N58048P29835R16558N34685
4795C0055135J009640P81808P60021J084609J286049Q59129J529159J399721J499496
4786D0264767J558518J798082J757463K108889K052922K454837K238285K299067
4778E6532830K451554K347913K255897J986834K475385K377303K212089K523556
$$ plain form
4843 9235596 9292945 9665742 10130709 10392027 10575982 11378204 11631755 12068920 12594414 12405708
4833 12405708 13173988 13371214 14118783 14657077 14787191 14715752 14979582 15083037 15511830 15134382
4823 15134382 15793065 15814355 16372985 16592107 16927599 17587012 18175605 18385019 19103974 18791505
4813 18791505 19883486 20290417 20737134 21477274 22024238 22635003 23116806 24068339 23859927
4804 23859927 25138763 25685965 26482324 27048010 27316009 27874057 28603892 29520450 30055135
4795 30055135 31064775 31846583 32606604 33691213 34977262 35836391 37365550 38765271 40264767
4786 40264767 41823285 43621367 45378830 47487719 49540641 51995478 54233763 56532830
4778 56532830 58984384 61332297 63588194 65575028 68050413 70427716 72639805 75163361
4770G5163361K543802K788463L192202L304554L345054M136277L956127L839152
4762A02268992L964366M292609L144442L376115K586745K380888K206117K755489
4754A26975763J945379K649486K103681K149462J874085J643840J725990N11057
4746A41578743J158329N04969P1038P3146j42208p87822r32006p98178k219249
4737A38506762j580236j466384j962283k239032j986684k164834j988991j607909
4729A23510409j281108j294416l67229J11831l13420Q86869R43763J000030J238514
4720A24435243Q77210R33419P63705O16252N61422J17841M24443k62349M20815
4711A28888001L70630q9847J208386J360019J803178K642860K486592L616469
$$ plain form
4770 75163361 77707163 80495626 83687828 86992382 90337436 94473713 98429840 102268992
4762 102268992 106233358 110525967 113670409 117046524 119633269 122014157 124220274 126975763
4754 126975763 128921142 131570628 133674309 135823771 137697856 139341696 141067686 141578743
4746 141578743 142737072 143242041 143313079 143386225 143244017 142456195 141524189 140726011 138506762
4737 138506762 136926526 135460142 133497859 131258827 129272143 127107309 125118318 123510409
4729 123510409 122229301 120934885 120567656 120679487 120366067 121252936 122196699 123196729 124435243
4720 124435243 125312453 126245872 127009577 127625829 128187251 128305092 128729535 128467186 128888001
4711 128888001 129258631 129168784 130377170 131737189 133540367 136183227 138669819 142286288
4703A42286288M181877M877580M833629N408155N543047N188815M264031K970055
4695A79553477K586199J499160n66639K78059j077691o23361q51474k78131q13558
4686A79706041n27781r3785j099260n28853p57418j402232o88790o79886j073776
4677A72854260p49212j143168j999628j481806l216114l704158m610474n267773
4669A50681927o613118o090213o504811o175376n944565m811592m785769l967774
4661A05788709m096135l123772l020872k492229k638502k375856k130426j906201
4653H4004716j980049k253549j755731k031038k470776k003469k421593k497326
4645F6591185k547073k338622k259601k299874j584877k093005k336365j756982
$$ plain form
4703 142286288 146468165 151345745 156179374 161587529 167130576 172319391 176583422 179553477
4695 179553477 182139676 183638836 183072197 183350256 182272565 181649204 180797730 180519599 179706041
4686 179706041 179178260 179084475 177985215 177456362 176698944 175296712 174607922 173928036 172854260
4677 172854260 172105048 170961880 168962252 167480446 164264332 160560174 155949700 150681927
4669 150681927 144068809 137978596 131473785 125298409 119353844 114542252 109756483 105788709
4661 105788709 101692574 98568802 95547930 93055701 90417199 88041343 85910917 84004716
4653 84004716 82024667 79771118 78015387 75984349 73513573 71510104 69088511 66591185
4645 66591185 64044112 61705490 59445889 57146015 55561138 53468133 51131768 49374786
4637D9374786k099953j837740j558076j020254k081955j111965p51543j029927
4629C7883373o19908r58202j100100o86926j180368j085689r16346j215429q02355
4620B9318050r80946p39687j094747q10260q99186j104952o86817p86087q19379
4611B1395989j345310k18119q11371p39411r76469k69671j284924m00085o69361
4602A4681268j80847q75144n03495r01090J70847q26915j61537j96801p88960
4593A0417326j49908l57441k27188l52304j28420j09090j31531l73240l15236
4584H272968k83027j25565q3620m07013K61229m10581l32379j41366M9515k31052
4574F569109n2778J78654n29359k40061P8549m57827J02965l23719L4090l42456
$$ plain form
4637 49374786 47274833 45437093 43879017 42858763 40776808 39664843 38913300 37883373
4629 37883373 37263465 36305263 35205163 34518237 33337869 32252180 31335834 30120405 29318050
4620 29318050 28337104 27597417 26502670 25692410 24793224 23688272 23001455 22215368 21395989
4611 21395989 20050679 19832560 19021189 18281778 17305309 17035638 15750714 15350629 14681268
4602 14681268 14500421 13625277 13121782 12220692 12391539 11564624 11403087 11206286 10417326
4593 10417326 10267418 9909977 9682789 9330485 9202065 9092975 8961444 8588204 8272968
4584 8272968 7989941 7864376 7780756 7373743 7634972 7224391 6892012 6750646 6800161 6569109
4574 6569109 6516331 6694985 6165626 5925565 6004114 5546287 5649252 5325533 5359623 5017167
4564E017167J12350K48788j70469m1228o26192M27798j27423k07650N50909m86976
4554D697074n2170j54588k52123R3560p00042N93093J05730o17215N4425q9726
4544C678018J67295n3683l28339O6542m98724J81541J2764K14577n2065j8905
4534C369021k89807m1168l6249Q9291p7189j47121K27012L6762J63793n75703
4524B718642K21918n94725N75250n97558K03319K37062k89113j02912J62483Q096
4514B542462p306K38901n08656M26861n56271O9760K78595j31428J85508o81681
4504A856745N39599K15197j21447N8767j35377m97829N29419k2836L0898N8498
4494B511634r0713j72463k27813L49268l29092M07631k00035o03384R03459l49002
$$ plain form
4564 5017167 5129517 5378305 5207836 5166608 4540416 4968214 4840791 4633141 5184050 4697074
4554 4697074 4644904 4490316 4238193 4331753 3631711 4224804 4330534 3713319 3767744 3678018
4544 3678018 3845313 3791630 3463291 3529833 3031109 3212650 3225414 3439991 3387926 3369021
4534 3369021 3079214 3038046 3001797 3091088 3013899 2866778 3093790 3130552 3294345 2718642
4524 2718642 2940560 2345835 2921085 2323527 2526846 2763908 2474795 2371883 2534366 2542462
4514 2542462 2535156 2774057 2265401 2692262 2135991 2205751 2484346 2352918 2538426 1856745
4504 1856745 2396344 2611541 2490094 2548861 2413484 1915655 2445074 2422238 2453136 2511634
4494 2511634 2420921 2248458 2020645 2369913 2040821 2448452 2248417 1645033 2548492 2199490
4484B199490k64349J97709r5781o5854K63793J06535J38809l33917N0105P8270
4474B274810p1907o5441J60713M35463q2699L5211m47295M23077j24790J18597
4464B655739L11200K42839k96580O60510L41019K39845L89248O93466o7912P00576
4454E869950J22604M58045L45786N28582r87715j59913k23084o27602j41151n29538
4444D655964m81435J91649k57205k32963L30284k43870J95420p4644L43188K23835
4434D650223k31460P97941J61396P50910M62349O92603P49469Q68461N18825R77131
4424A0397848Q99762o1388p96714p55911n54821j185746j067803n40053n70308
4415E764866o66371n72933o7609j72426m95657O1481J99116n69538L21770Q8790
$$ plain form
4484 2199490 1935141 2132850 2037069 1971215 2235008 2341543 2480352 2146435 2196540 2274810
4474 2274810 2202903 2137462 2298175 2733638 2650939 2686150 2238855 2661932 2537142 2655739
4464 2655739 2966939 3209778 2913198 3573708 3914727 4154572 4543820 5237286 5169374 5869950
4454 5869950 5992554 6450599 6796385 7324967 6337252 6177339 5954255 5326653 5185502 4655964
4444 4655964 4174529 4366178 4108973 3876010 4206294 3962424 4157844 4083200 4426388 4650223
4434 4650223 4418763 5216704 5378100 6129010 6591359 7283962 8033431 8901892 9420717 10397848
4424 10397848 11297610 11236222 10439508 9683597 9128776 7943030 6875227 6335174 5764866
4415 5764866 5098495 4525562 4457953 4285527 3789870 3851351 4050467 3480929 3802699 3891489
4405C891489J48644M42030n85481K73455O82986J88230K50367L80106K93816l00488
4395E665154O89382O3716p39392K4410p71719j28993l51609l52202l47569l52626
4385C398552L45319k18065K39417k58115k45497n23839J44866k49206k8660j1127
4375B593645k12352k84073l7269N30329J24107p73773L00236J28635l53946M62835
4365B478374L3094J44058J8772r8059K57704K42651J53450K40390L96632j26338
4355C740728J00597K73810K99560j96041k17660l19129K5504k18425J1609k43583
4345C256970N44093j24053m93162L46857r7785K33369K83312J70390k03199j11872
4335C804920L12835J41495j09758O01295K95416Q825K10427Q56041L27467J88426
$$ plain form
4405 3891489 4040133 4482163 3896682 4170137 4853123 5041353 5291720 5671826 5965642 5665154
4395 5665154 6354536 6418252 5678860 5703270 4931551 4802558 4450949 4098747 3751178 3398552
4385 3398552 3743871 3525806 3765223 3507108 3261611 2737772 2882638 2633432 2604772 2593645
4375 2593645 2381293 2097220 2059951 2590280 2714387 1940614 2240850 2369485 2015539 2478374
4365 2478374 2511468 2655526 2674298 2576239 2833943 3076594 3230044 3470434 3867066 3740728
4355 3740728 3841325 4115135 4414695 4218654 4000994 3681865 3707369 3488944 3500553 3256970
4345 3256970 3801063 3677010 3183848 3530705 3432920 3666289 3949601 4119991 3916792 3804920
4335 3804920 4117755 4259250 4149492 4750787 5046203 5055028 5265455 6121496 6448963 6637389
4325F637389K71584J90144J64670J18319m65405K39340o2015l553j24919l05544
4315F660010m43591l8485j57526m08668j26111K21861o20875n42075J62585j22588
4305D584537k4200j93817m49932j89966l6710n3809j90397m46635J4411l56128
4295B657354m6253j69785k39178l70969j84189J76490J71353l32807j25201l65376
4285A171439K93817k23486K42464j53882m030J44139m26163L09386l74356r3159
4275H86169j78559K03484N4475R1437m41515J55763j05998M1292K1796J9548J08401
4264H56293j25619j84406Q9346o6389k04482r4853K50058K16691l00927l205J42036
4253E74543m84242M66492j48233l2293j21858J98746k9352l35900J85502m1324
$$ plain form
4325 6637389 6908973 7099117 7263787 7382106 6916701 7156041 7094026 7090473 6965554 6660010
4315 6660010 6216419 6177934 6020408 5611740 5485629 5707490 5086615 4544540 4707125 4584537
4305 4584537 4560337 4366520 3916588 3726622 3689912 3636103 3445706 2999071 3013482 2657354
4295 2657354 2611101 2441316 2202138 1831169 1646980 1823470 1994823 1662016 1536815 1171439
4285 1171439 1465256 1241770 1484234 1330352 1326322 1470461 1044298 1353684 979328 886169
4275 886169 707610 911094 965569 1057006 615491 771254 665256 706548 728344 747892 856293
4264 856293 730674 546268 635614 569225 364743 269890 519948 736639 435712 432507 574543
4253 574543 90301 556793 408560 376267 254409 453155 423803 87903 273405 232081
4243B32081P2458k24010j10953J98895o0925N37677k19585M5507j69065J05393
4233D07473Q8381r7137j35359M3392r6034P3248j34419K77534j17920J51200K4357
4222D84716m48569M41216n8840m96200K6475L92807K65243j9218o80580j87489
4212b80439P82680j14225o7542M6584J53790J42089l88108J14357J24397k13049
4202C00534L24246J19381o92407N84473M132m70518J7292J39638k83056J31367
4192A75082J4189J5044q8707l327j25989N6244J50346K6339l92285M78838j15335
4181A90439k5367J52607m67479K21483L28107l69767O23407l60826l97288L17272
4171B12588L469L83320m39618n6503j15706j18613k09764L76490J59584k43670
$$ plain form
4243 232081 304539 80529 -30424 168471 107546 645223 425638 471145 302080 407473
4233 407473 495854 398717 263358 306750 210716 283964 149545 427079 309159 460359 484716
4222 484716 36147 477363 418523 -77677 -51202 341605 606848 587630 -92950 -280439
4212 -280439 502241 388016 320474 367058 520848 662937 274829 389186 513583 300534
4202 300534 624780 744161 51754 636227 640359 169841 187133 326771 43715 175082
4192 175082 189271 204315 115608 112281 -13708 42536 192882 219221 -173064 305774 190439
4181 190439 165072 317679 -149800 71683 399790 30023 653430 292604 -104684 212588
4171 212588 216057 599377 159759 103256 -12450 -131063 -340827 35663 195247 -48423
4161d8423J43576J40411m38182K04463L15289k86916l36124L6859J48363q1639
4151b02323J27099K994L1238j8895r474M9852N3550j06995l87216P24149l62527
4140i8548K89568j71133J93919k70536j06425K15795k16296J12462N53549l34690
4130A67665J2885k66394j31281K5934M10312l08643J41909N6223k00410J64096
4120G2296K2101o7259n7575K0549k73948K89179j32403L3905M75044N237n32551
4109a45425L94135m59758L06297n6445J55835K8481l29589K41965l3155j20727
4099a8386l8605M01126l30934L37089l78614J29728p3557m7143p1423j54117M80130
4088B35294k90586M39355n8815j55576L75522o36856K04319K71252L7836j77734
$$ plain form
4161 -48423 95153 235564 -202618 1845 317134 30218 -305906 -269047 -120684 -202323
4151 -202323 -75224 -72230 -40992 -59887 -69361 -19509 34041 -72954 -460170 263979 -98548
4140 -98548 191020 19887 213806 -56730 -163155 52640 -163656 -51194 502355 167665
4130 167665 180550 -85844 -217125 -191191 219121 -89522 52387 108610 -91800 72296
4120 72296 94397 27138 -30437 -9888 -283836 5343 -127060 -93155 381889 387126 -145425
4109 -145425 248710 -211048 95249 38804 194639 223120 -106469 135496 102341 -18386
4099 -18386 -56991 344135 13201 350290 -28324 101404 27847 -19296 -90719 -244836 235294
4088 235294 -55292 384063 325248 169672 545194 -91662 112657 383909 421745 244011
4078B44011m82520N35396j44565O0233N90276m73910j4497J01103k7628J33115
4068E21014k4080K08859O3262K17881L03153o27402k2571K9736j70343K75118
4058G74627L01192K3442K57680M250q5257K74699k2255r5279L03283L57953k95641
4047A798694M52556j47086L78361q4213o804J4834m4344O0620J15019m11082N75593
4036B702148m54237L53555J36089J68631j48189L6811j69635k7968R00721m60593
4026C037333J21184J039333j06721J53257R1470N1967j4317j01840j28992l78126
4016C764548n7452j20685n93592n34210q0210r8159N18031p31496Q2734K56864
4006B406373m78892Q8976j89222j30539L26674K00528o71749N68920k42704M78808
$$ plain form
4078 244011 -238509 296887 152322 212555 802831 328921 314424 415527 387899 521014
4068 521014 496934 705793 769055 986936 1290089 662687 640116 669852 499509 774627
4058 774627 1075819 1099261 1356941 1361191 1275934 1550633 1528378 1433099 1736382 2094335 1798694
4047 1798694 2251250 2104164 2482525 2398312 2391508 2406342 2361998 2422618 2537637 2126555 2702148
4036 2702148 2247911 2601466 2737555 2906186 2757997 2794808 2625173 2597205 3497926 3037333
4026 3037333 3158517 4197850 4091129 4244386 4335856 4387823 4373506 4271666 4142674 3764548
4016 3764548 3707096 3586411 2992819 2458609 2378399 2280240 2798271 2066775 2149509 2406373
4006 2406373 1927481 2016457 1827235 1696696 2023370 2223898 1552149 2121069 1878365 2357173
3996B357173l16153M75447k79503l21831M55222k92887k94240m42581j32286K79525
3986A487886l66886J96715m08738J35877l69042M92390l51321k12027M67881n26402
3976E46333L47580j67301k73498L14666l45603r4758M4659R6216R3683j44836
3966D17141l61493K57390p9693K96857j72712l76650K98043N1693J49359k59647
3956B20288l39784J83091l43248J90527K77164j345k15535l74969L48374L2498
3946b2939J83498J9401o877l95527P2702n6981l0139J81045p5198j41425M6395
3935b26045L50454k27247n3851O639k02531J22680k64802Q64962m09311p5853
3925a14905J16497r3924j51353L82134j04264m60579K9771J49916M06425m16740
$$ plain form
3996 2357173 2041020 2516467 2236964 1915133 2370355 2077468 1783228 1340647 1208361 1487886
3986 1487886 1121000 1317715 908977 1044854 675812 1168202 816881 604854 1072735 546333
3976 546333 893913 726612 453114 767780 422177 327419 372078 468294 561977 417141
3966 417141 55648 313038 233345 530202 357490 -19160 278883 330576 479935 220288
3956 220288 -119496 63595 -279653 -89126 188038 186693 -28842 -403811 -55437 -22939
3946 -22939 160559 179960 173083 -222444 -149742 -206723 -236862 -55817 -131015 -272440 -226045
3935 -226045 124409 -102838 -156689 -150050 -352581 -229901 -494703 370259 -39052 -114905
3925 -114905 1592 -92332 -243685 138449 34185 -426394 -396623 -246707 159718 -257022
3915b57022J32334L28725k24597k29599r4160P0708j27301K38670o1375l96728
3905f20345M68171n85601J98949M64227l47041L53955j59714L01059n49164L85403
3895i0101o19100N81183m60869N45039l34866M8207k49447J95778J07523L37373
3885F0720l39611J02586k13800k16898J90587J46038M0544j00002L4909P5687
3875b19240J36709j82163o1926p2815M32062k81270R0129k32858J83767j39289
3865c46894j5525j64985J40794K00769Q2398k29626J63931k12334J07068M943
3855b69461J08515k32604R3306J8663O0605l04345K29546n21733M43253K44206
3845a30049k11172J3111J31266j50431J18076k37340J89215J71186r4403K63520
$$ plain form
3915 -257022 -124688 204037 -20560 -250159 -344319 -273611 -400912 -162242 -223617 -620345
3905 -620345 -152174 -737775 -538826 -74599 -421640 -67685 -227399 73660 -475504 -90101
3895 -90101 -709201 -128018 -588887 -43848 -378714 -330507 -579954 -384176 -276653 60720
3885 60720 -278891 -176305 -390105 -607003 -416416 -270378 -229834 -329836 -294927 -219240
3875 -219240 -82531 -264694 -326620 -399435 32627 -248643 -158514 -391372 -207605 -346894
3865 -346894 -362419 -527404 -386610 -185841 -103443 -333069 -169138 -381472 -274404 -269461
3855 -269461 -160946 -393550 -300244 -281581 -220976 -525321 -295775 -817508 -374255 -130049
3845 -130049 -341221 -328110 -196844 -347275 -229199 -466539 -277324 -106138 -200541 62979
3835F2979p24085J20135j41678k41995M28947J56471M9124J45002l12347K46403
3825b11044j15905R8143n5219p8435M4909l26421J43419N26439m94409K87331
3815a81192k35491j4207j41544k9316M01811n6848l85973L68884J46270l80707
3805e08313K10734p1689k00337L04721q0420l8404k90552L28891j83910N92428
3795F3149m53044k32213J97319K19559k81862J62232m4200M05933l82442l83615
3785g29184N09817j85453J97380j33570k2156O8686K6126O1048l97687L38593
3775b66400k97151J69672L16629l59187K0590M9888J6470J39303j99931J90933
3765b19184J43904J7147m29074o6693M93290k96768K363k7454k0968N8117j0392
$$ plain form
3835 62979 -661106 -540971 -682649 -924644 -495697 -339226 -290102 -145100 -457447 -211044
3825 -211044 -326949 -228806 -284025 -362460 -317551 -643972 -500553 25886 -468523 -181192
3815 -181192 -416683 -430890 -572434 -601750 -199939 -256787 -642760 -273876 -127606 -508313
3805 -508313 -297579 -369268 -569605 -264884 -345304 -383708 -674260 -345369 -529279 63149
3795 63149 -389895 -622108 -424789 -205230 -487092 -324860 -369060 36873 -345569 -729184
3785 -729184 -219367 -404820 -207440 -341010 -363166 -294480 -268354 -207306 -604993 -266400
3775 -266400 -563551 -393879 -77250 -436437 -415847 -365959 -349489 -210186 -410117 -219184
3765 -219184 -75280 -58133 -487207 -553900 -60610 -357378 -355015 -382469 -403437 -345320 -355712
3754c55712j3276O54840o05697j19168J12748Q6372o1341K26385n88401O26928
3744c6322j1120k01176P1540m0939Q2788N8864m47051M26074k31370K07866j45720
3733b66566j89718M38214j30861n43635L09411J40053k3839o2160J96501L05528
3723A72928n95796P6648j52080p9267J74198o6186J83312k4804j80105M83860
3713g292k46873k1964L10604j86292k29456k16858M87255l12686p8371J28757
3703c73176L10945n63375L31889L41800m44443L46450m5270p30721N74620N78125
3693C26844l38705j98016r8503m3917J01181M9553K11412k44026J16063L1538
3683h6576m84895M83256k92824K04244n8732N1714j85543K98153J63021n7283
$$ plain form
3754 -355712 -368988 285852 -319845 -439013 -326265 -239893 -301234 -74849 -663250 -36322
3744 -36322 -47442 -248618 -177078 -218017 -135229 -76365 -523416 -97342 -328712 -120846 -266566
3733 -266566 -456284 -18070 -148931 -692566 -383155 -243102 -266941 -329101 -132600 172928
3723 172928 -422868 -346220 -498300 -577567 -403369 -469555 -286243 -311047 -491152 -7292
3713 -7292 -254165 -276129 34475 -151817 -381273 -598131 -110876 -423562 -501933 -373176
3703 -373176 -62231 -625606 -293717 48083 -396360 -49910 -95180 -825901 -251281 326844
3693 326844 -11861 -209877 -308380 -352297 -251116 -201563 9849 -234177 -118114 -86576
3683 -86576 -571471 -88215 -381039 -176795 -235527 -183813 -369356 -71203 91818 34535
3673C4535k73933k04004L44505o11743O18142k48806O9161J52223j18859k4654
3663b63433K94641m2030k31955J8989k08045M21537j08010k38778M40290n2713
3653C0493r2949n4083j90975J32297J64161m2041j29492q1235J99912L60950o64747
3642c67709r8438M0787O07667l43913j22181n6276l26594P78771k76297J87320
3632B3137n03223K40613m31728L44155Q7965m43642L05311L89855j92921M05098
3622B24620p85711K89798J79638l11478K61338J2388j39901j99278M50946j85661
3612b03301J52542k72964O451L27918l41716l2058L60655j65355k10565j88319
3602e66712M83320m13730J85513K3735K44621J8704J12671l8234J40227j71297
$$ plain form
3673 34535 -239398 -443402 -98897 -710640 -92498 -341304 -272143 -119920 -238779 -263433
3663 -263433 31208 -10822 -242777 -223788 -431833 -10296 -118306 -357084 83206 30493
3653 30493 -62456 -116539 -307514 -175217 -11056 -53097 -182589 -263824 -63912 297038 -367709
3642 -367709 -466147 -425360 182307 -161606 -283787 -340063 -666657 112114 -164183 23137
3632 23137 -480086 -239473 -671201 -327046 -239081 -682723 -377412 12443 -180478 224620
3622 224620 -561091 -271293 -91655 -403133 -141795 -129407 -269308 -468586 -17640 -203301
3612 -203301 -50759 -323723 -317272 10646 -331070 -363128 -2473 -167828 -378393 -566712
3602 -566712 -83392 -497122 -311609 -287874 -43253 -24549 88122 49888 190115 18818
3592A8818j95084j53979M71449l51598J43646L19500L63358o91768L3984m10482
3582d52156M55913j13617k27632N79066o8476l84282J66870Q7676J61286j54369
3572E0279k52986N07233k88382K03025p9299j57824k11364P0308L54786j14403
3562H1373L05861p9995k93720O89837m49195M31711j56677k59652L78543J7317
3552F65403j2999K30936J22410j94417k9425j32306k52196J9876J60091m30523
3542A46850M1598k14512M61853m53121R2468j90798J86605L06095n36831M43385
3532B83592j09413O6933j6253k65094k58583J36557O546L75886j37207K04180
3522B87144P2389m87571K45961k67037L68602k20589l45366N78049k458l7671
$$ plain form
3592 18818 -176266 -330245 141204 -210394 -66748 252752 616110 -75658 -41674 -452156
3582 -452156 3757 -109860 -337492 241574 173098 -211184 -44314 43362 204648 50279
3572 50279 -202707 304526 16144 219169 139870 -17954 -229318 -159010 195776 81373
3562 81373 387234 307239 13519 703356 254161 685872 529195 269543 648086 665403
3552 665403 652404 883340 1005750 811333 781908 649602 397406 417282 577373 146850
3542 146850 188448 -26064 435789 -17332 75136 -115662 70943 377038 -159793 283592
3532 283592 174179 241112 224859 -40235 -298818 -162261 -155715 220171 82964 287144
3522 287144 359533 -128038 117923 -149114 219488 -1101 -346467 231582 229124 191453
3512A91453J11715j52776k09498L62182k70888j41418N70816k96326O1813K18696
3502D45769n97579K16727J7507L9806j09661J10438n0894k4842L18874p8289Q8228
3491C76084l82538k00686J60780r9670J189868p37565K21320k69241J82689J78581
3481F19622k10761K48374n05351M05559o66893M16583n7232K76587o5019k39422
3471B22047K50441j27503J57154j53029j64355N69232P681k10109j13695r4821
3461C43043K55074o6309J65193K27198m51312M70576j40099j38403L18715k59041
3451G24635J38201j06820j12306K54199j58004J76009N2441O4023q6973K3401
3441I68806k501L16738o6855l50526O06125Q4007n75260L6299L58711j34823M86802
$$ plain form
3512 191453 303168 150392 -59106 303076 32188 -109230 461586 165260 227073 445769
3502 445769 -151810 64917 82424 122230 12569 123007 72113 47271 366145 287856 376084
3491 376084 -6454 -207140 -46360 -146030 1043838 306273 527593 258352 441041 619622
3481 619622 408861 657235 151884 557443 -109450 307133 249901 526488 461469 222047
3471 222047 472488 344985 502139 349110 184755 753987 761668 551559 437864 343043
3461 343043 598117 531808 697001 924199 472887 943463 803364 664961 983676 724635
3451 724635 862836 756016 643710 897909 739905 915914 968355 1032378 945405 968806
3441 968806 966305 1283043 1216188 865662 1471787 1555794 980534 1016833 1375544 1240721 1727523
3430A727523m40426O4958k41911J89045K62434l97735K01501K70178k40055j8785
3420A376727m8328J81031K98665j01858J6691m2787O0727L53123o08781M63554
3410A948764l07475L95078k36346R2947M48162j94164j19375P15688k01246O2227
3400B604260k68908L55697n70291N80089J8592r2625j89727K21935J29578j74200
3390B614400j05263P54103n84617M99256M6888P4833K67300k29552L47985L15658
3380D000991p0025M19394n32544K19629K25239k65905J33372K34234j32061K44282
$$ plain form
3430 1727523 1287097 1352055 1110144 1299189 1561623 1163888 1365389 1635567 1395512 1376727
3420 1376727 1328399 1509430 1808095 1706237 1722928 1680141 1740868 2093991 1485210 1948764
3410 1948764 1641289 2036367 1800021 1892968 2341130 2146966 2027591 2743279 2542033 2604260
3400 2604260 2335352 2691049 2120758 2700847 2719439 2626814 2437087 2659022 2788600 2614400
3390 2614400 2509137 3263240 2678623 3177879 3224767 3299600 3566900 3337348 3685333 4000991
3380 4000991 3930966 4350360 3817816 4037445 4262684 3996779 4130151 4364385 4232324 4476606
$$ [...]
##END NTUPLES=NMR SPECTRUM
##END=
