##TITLE=abcd
##JCAMPDX= 6.0         $$ Bruker NMR JCAMP-DX V2.0
##DATA TYPE= NMR SPECTRUM
##DATA CLASS= NTUPLES
##ORIGIN= UXNMR, Bruker Analytische Messtechnik GmbH
##OWNER= root
$$ XWIN-NMR		Version 3.5
$$ Fri Jun 12 08:40:06 2026 Russian Standard Time (UT+4h)  servis@DPX200
##.OBSERVE FREQUENCY= 200.131235884673
##.OBSERVE NUCLEUS= ^1H
##.ACQUISITION MODE= SIMULTANEOUS
##.ACQUISITION SCHEME= undefined
##.AVERAGES= 8
##.DIGITISER RES= 18
##SPECTROMETER/DATA SYSTEM= spect
##.PULSE SEQUENCE= zg
##.SOLVENT NAME= DMSO
##.SHIFT REFERENCE= (INTERNAL, DMSO, 0, 16.4885)
##AUDIT TRAIL= $$ (NUMBER, WHEN, WHO, WHERE, WHAT)
$$ ##TITLE= Audit trail, XWIN-NMR		Version 3.5
$$ ##JCAMPDX= 5.01
$$ ##ORIGIN= Bruker BioSpin GmbH
$$ ##OWNER= servis
$$ F:\spectra/data/av/nmr/H1/1/pdata/1/auditp.txt
$$ ##AUDIT TRAIL=  $$ (NUMBER, WHEN, WHO, WHERE, WHAT)
(   1,<2026-06-12 08:39:38.26 +0400>,<servis>,<DPX200>,
      <created by zg, POWCHK disabled, PULCHK disabled
       terminated by command 'halt'
       configuration hash MD5:
       00 E9 B6 7A A2 85 ED C7 34 08 36 98 17 FE 4E 26
       data hash MD5: 32K
       42 EE 7A 0A B7 60 0A 2A 0B E2 92 64 C6 9A D0 43>)
(   2,<2026-06-12 08:39:43.70 +0400>,<servis>,<DPX200>,
      <Start of raw data processing
       efp BC_mod = 2 LB = 0.05 FT_mod = 6 PKNL = 1 PHC0 = -412.19 PHC1 = 3.101563 SI = 16K 
       data hash MD5: 16K
       85 AB 49 3C A0 9A 09 66 9C BD 69 7C 64 78 95 2B>)
$$ ##END=
$$ 
$$ hash MD5
$$ E5 3E 14 4E DF B9 0E 40 C3 F1 FE CE 92 1A 87 68
##$RELAX= 
##$RELAX= 
##$RELAX= 
##$RELAX= 
##$RELAX= 
##$RELAX= 
##$RELAX= 
##$RELAX= 
$$ Bruker specific parameters
$$ --------------------------
##$DU= <F:\spectra>
##$EXPNO= 1
##$NAME= <H1>
##$PROCNO= 1
##$TYPE= <nmr>
##$USER= <av>
##$AMP= (0..31)
100 100 100 100 100 100 100 100 100 100 100 100 100 100 100 100 100 100 
100 100 100 100 100 100 100 100 100 100 100 100 100 100 
##$AQSEQ= 0
##$AQ_mod= 1
##$AUNM= <au_zg>
##$AUTOPOS= <>
##$BF1= 200.13
##$BF2= 200.13
##$BF3= 200.13
##$BF4= 200.13
##$BF5= 500.13
##$BF6= 500.13
##$BF7= 500.13
##$BF8= 500.13
##$BYTORDA= 1
##$CFDGTYP= 0
##$CFRGTYP= 5
##$CHEMSTR= <none>
##$CNST= (0..31)
1 1 145 1 1 1 1 1 1 1 1 1 1 1 1 1 1 1 1 1 1 1 1 1 1 1 1 1 1 1 1 1 
##$CPDPRG= <>
##$CPDPRG1= <>
##$CPDPRG2= <>
##$CPDPRG3= <>
##$CPDPRG4= <mlev>
##$CPDPRG5= <mlev>
##$CPDPRG6= <mlev>
##$CPDPRG7= <mlev>
##$CPDPRG8= <mlev>
##$CPDPRGB= <>
##$CPDPRGT= <>
##$D= (0..31)
0 2 0 0 0 0 0 0 0 0.06 0 0 0 0 0 0 0.0002 0 0 0 0 0 0 0 0 0 0 0 0 0 0 
0 
##$DATE= 1781239178
##$DBL= (0..7)
120 120 120 120 120 120 120 120 
##$DBP= (0..7)
150 150 150 150 150 150 150 150 
##$DBP07= 0
##$DBPNAM0= <>
##$DBPNAM1= <>
##$DBPNAM2= <>
##$DBPNAM3= <>
##$DBPNAM4= <>
##$DBPNAM5= <>
##$DBPNAM6= <>
##$DBPNAM7= <>
##$DBPOAL= (0..7)
0.5 0.5 0.5 0.5 0.5 0.5 0.5 0.5 
##$DBPOFFS= (0..7)
0 0 0 0 0 0 0 0 
##$DE= 6
##$DECBNUC= <off>
##$DECIM= 32
##$DECNUC= <off>
##$DECSTAT= 4
##$DIGMOD= 1
##$DIGTYP= 9
##$DL= (0..7)
0 120 120 120 120 120 120 120 
##$DP= (0..7)
$$ [...]
##$SUBNAM4= <"">
##$SUBNAM5= <"">
##$SUBNAM6= <"">
##$SUBNAM7= <"">
##$SUBNAM8= <"">
##$SUBNAM9= <"">
##$SW= 20.6817932712277
##$SWIBOX= (0..15)
0 0 3 0 0 0 0 0 0 0 0 0 0 0 0 0 
##$SW_h= 4139.07284768212
##$TD= 32768
##$TD0= 1
##$TE= 0
##$TE2= 300
##$TE3= 300
##$TEG= 300
##$TL= (0..7)
0 120 120 120 120 120 120 120 
##$TP= (0..7)
150 150 150 150 150 150 150 150 
##$TP07= 0
##$TPNAME0= <>
##$TPNAME1= <>
##$TPNAME2= <>
##$TPNAME3= <>
##$TPNAME4= <>
##$TPNAME5= <>
##$TPNAME6= <>
##$TPNAME7= <>
##$TPOAL= (0..7)
0.5 0.5 0.5 0.5 0.5 0.5 0.5 0.5 
##$TPOFFS= (0..7)
0 0 0 0 0 0 0 0 
##$TUNHIN= 0
##$TUNHOUT= 0
##$TUNXOUT= 0
##$USERA1= <user>
##$USERA2= <user>
##$USERA3= <user>
##$USERA4= <user>
##$USERA5= <user>
##$V9= 5
##$VALIST= <valist>
##$VCLIST= <CCCCCCCCCCCCCCC>
##$VD= 0
##$VDLIST= <DDDDDDDDDDDDDDD>
##$VPLIST= <PPPPPPPPPPPPPPP>
##$VTLIST= <TTTTTTTTTTTTTTT>
##$WBST= 1024
##$WBSW= 30
##$XGAIN= (0..3)
0 0 0 0 
##$XL= 0
##$YL= 0
##$YMAX_a= 168193
##$YMIN_a= -291093
##$ZGOPTNS= <>
##$ZL1= 120
##$ZL2= 120
##$ZL3= 120
##$ZL4= 120
##$ABSF1= 0
##$ABSF2= 0
##$ABSG= 0
##$ABSL= 0
##$ALPHA= 0
##$AQORDER= 0
##$ASSFAC= 0
##$ASSFACI= 0
##$ASSFACX= 0
##$ASSWID= 0
##$AUNMP= <proc_1d>
##$AZFE= 0.1
##$AZFW= 0.1
##$BCFW= 0
##$BC_mod= 2
##$BYTORDP= 0
##$COROFFS= 0
##$CY= 18.4799938201904
##$DATMOD= 1
##$DC= 0
##$DFILT= <>
##$DTYPP= 0
##$F1P= 9.9274215381318
##$F2P= -0.165520771350173
##$FCOR= 1
##$FTSIZE= 16384
##$FT_mod= 6
##$GAMMA= 0
##$GB= 0
##$INTBC= 1
##$INTSCL= 4.127829e-11
##$ISEN= 128
##$LB= 0.05
##$LEV0= 0
##$LPBIN= 0
##$MAXI= 10000
##$MC2= 0
##$MEAN= 0
##$ME_mod= 0
##$MI= 50
##$NCOEF= 0
##$NC_proc= -6
##$NLEV= 6
##$NOISF1= 3.799351
##$NOISF2= 2.8
##$NSP= 0
##$NTH_PI= 0
##$NZP= 0
##$OFFSET= 16.48848
##$PC= 4
##$PHC0= -412.19
##$PHC1= 3.101563
##$PH_mod= 1
##$PKNL= yes
##$PPARMOD= 0
##$PSCAL= 4
##$PSIGN= 0
##$REVERSE= no
##$SF= 200.130005582386
##$SI= 16384
##$SIGF1= 3
##$SIGF2= 2
##$SINO= 400
##$SIOLD= 16384
##$SREGLST= <1H.CDCl3>
##$SSB= 0
##$STSI= 16384
##$STSR= 0
##$SW_p= 4139.07284768211
##$SYMM= 0
##$S_DEV= 0
##$TDeff= 32768
##$TDoff= 0
##$TI= <>
##$TILT= no
##$TM1= 0
##$TM2= 0
##$TOPLEV= 0
##$USERP1= <user>
##$USERP2= <user>
##$USERP3= <user>
##$USERP4= <user>
##$USERP5= <user>
##$WDW= 1
##$XDIM= 16384
##$YMAX_p= 487576081
##$YMIN_p= -701582
$$ End of Bruker specific parameters
$$ ---------------------------------
##NTUPLES= NMR SPECTRUM
##VAR_NAME=  FREQUENCY,     SPECTRUM/REAL,   SPECTRUM/IMAG
##SYMBOL=    X,             R,               I
##VAR_TYPE=  INDEPENDENT,   DEPENDENT,       DEPENDENT
##VAR_FORM=  AFFN,          ASDF,            ASDF
##VAR_DIM=   16384,         16384,           16384
##UNITS=     HZ,            ARBITRARY UNITS, ARBITRARY UNITS
##FACTOR=    0.252644378177508, 1,           1
##FIRST=     3299.83951724647, 0,            0
##LAST=      -839.233330435636, 0,           0
##MIN=       -839.233330435636, -701582,     0
##MAX=       3299.83951724647, 487576081,    0
$$ Real data points
##PAGE= N=1
##DATA TABLE= (X++(R..R)), XYDATA
$$ [...]
$$ plain form
9299 513161 379977 352786 406927 494059 143956 268933 535059 594857 332093 504488
9289 504488 389653 351928 593857 529386 517392 389178 407193 128802 624588 352597
9279 352597 524778 483285 659138 604923 307409 527408 216290 545834 480166 655923
9269 655923 634498 555124 533997 449984 653733 446918 590726 441599 731652 376242
9259 376242 378165 643241 455820 433912 363451 587841 379647 466109 657131 633641 737487
9248 737487 171349 641915 372079 399857 519652 856906 535242 332672 838698 417319
9238 417319 593127 427564 677485 395032 733982 586220 601062 659799 406905 577462
9228 577462 443406 711686 757032 518135 462264 515984 316127 578896 738519 564064
$$ packed form
9299E13161j33184k7191N4141Q7132l50103J24977K66126N9798k62764J72395
9289E04488j14835l7725K41929o4471j1994j28214J8015k78391M95786k71991
9279C52597J72181m1493J75853n4215k97514K19999l11118L29544o5668J75757
9269F55923k1425p9374k1127q4013K03749k06815J43808j49127K90053l55410
9259C76242J923K65076j87421k1908p0461K24390k08194Q6462J91022k3490J03846
9248G37487n66138M70566k69836K7778J19795L37254l21664k02570N06026m21379
9238D17319J75808j65563K49921k82453L38950j47762J4842N8737k52894J70557
9228E77462j34056K68280M5346k38897n5871N3720j99857K62769J59623j74455
$$ plain form
9218 564064 448116 506470 481906 711220 456292 660804 562725 459581 454960 765509 430105
9207 430105 614806 657012 629781 667459 691558 846549 669010 475408 609594 650259 768669
9196 768669 587082 352252 619167 682487 630622 780261 648459 801587 344581 673651
9186 673651 709854 489058 617512 711135 645384 587602 626368 652378 858756 582264 819830
9175 819830 749530 787812 699717 896611 777880 852617 689137 826436 721291 652191 841955
9164 841955 746433 837181 753313 610507 789093 933166 569668 589850 904354 834127 777447
9153 777447 725483 918804 822329 558439 1001580 830132 769905 646349 963422 950964
9143 950964 788688 934139 880746 1174703 548303 870584 1040380 1046684 807816 841342
$$ packed form
9218E64064j15948N8354k4564K29314k54928K04512r8079j03144m621L10549l35404
9207D30105J84701M2206k7231L7678K4099J54991j77539j93602J34186M0665J18410
9196G68669j81587k34830K66915O3320n1865J49639j31802J53128m57006L29070
9186F73651L6203k20796J28454R3623o5751n7782L8766K6010K06378k76492K37566
9175H19830p0300L8282q8095J96894j18731P4737j63480J37299j05145o9100J89764
9164H41955r5522R0748q3868j42806J78586J44073l63498K0182L14504p0227n6680
9153G77447n1964J93321r6475k63890M43141j71448o0227j23556L17073j2458
9143I50964j62276J45451n3393K93957o26400L22281J69796O304k38868L3526
$$ plain form
9133 841342 887491 1016041 906126 919906 1075504 783655 848214 973906 1057051 944379
9123 944379 826771 999653 949010 982198 867603 909568 878411 885144 962034 1061501 966090
9112 966090 993966 790395 996233 885776 1133045 910939 1051092 923212 1079567 847946
9102 847946 1028840 1023626 979673 1094220 974706 1117019 841881 1150487 909500 920248
9092 920248 999631 1213367 1013856 1113208 1297687 1179031 995225 1071744 1096117 1156521 1026457
9081 1026457 1099981 1208191 973071 1009499 1223702 1313059 917679 1105095 1079205 1342680
9071 1342680 1078645 1252126 1213626 1031641 897021 1071209 1233185 1211209 1032113 969735
9061 969735 1071281 1072352 941596 1216746 1271182 1010736 996999 1185088 1190688 1181824 990421
$$ packed form
9133H41342M6149J28550j09915J3780J55598k91849O4559J25692Q3145j12672
9123I44379j17608J72882n0643L3188j14595M1965l1157O733P6890R9467r5411
9112I66090K7876k03571K05838j10457K47269k22106J40153j27880J56355k31621
9102H47946J80894n214m3953J14547j19514J42313k75138L08606k40987J0748
9092I20248P9383K13736j99511R9352J84479j18656j83806P6519K4373O0404j30064
9081A026457P3524J08210k35120L6428K14203Q9357l95380J87416k5890K63475
9071A342680k64035J73481l8500j81985j34620J74188J61976k1976j79096o2378
9061I69735J01546J071j30756K75150N4436k60446j3737J88089N600q864j91403
$$ plain form
9050 990421 1308902 1221535 1205610 1181013 1448838 1348951 1297253 977540 1463269 1330811 1210600
9039 1210600 1250185 1599337 1330062 1561840 1578130 1529703 1574935 1039607 1348070 1561238
9029 1561238 1461853 1368300 1642032 1434984 1273039 1352029 1525900 1534201 1348811 1648271
9019 1648271 1464128 1400597 1523426 1561821 1417917 1541431 1407171 1609955 1358191 1718541
9009 1718541 1518541 1796610 1533848 1723901 1475141 1571597 1540197 1637333 1682503 1607236
8999 1607236 1796591 1807111 1756082 1678191 1814397 1600647 1704977 1767571 1852682 1835590 1751917
8988 1751917 1934228 1830649 1777346 1833839 1974498 1765051 1757782 1928059 2169574 1685876
8978 1685876 1974257 1879207 1920982 1769437 2062696 2186803 1887115 1868520 2063474 1920026
$$ packed form
9050I90421L18481q7367j5925k4597K67825r9887n1698l19713M85729j32458j20211
9039A210600L9585L49152k69275K31778J6290m8427M5232n35328L08463K13168
9029A561238r9385r3553K73732k07048j61945P8990J73871Q301j85390K99460
9019A648271j84143o3531J22829L8395j43904J23514j34260K02784k51764L60350
9009A718541k00000K78069k62762J90053k48760R6456l1400R7136M5170p5267
8999A607236J89355J0520n1029p7891J36206k13750J04330O2594Q5111j7092q3673
8988A751917J82311j03579n3303N6493J40659k09447p269J70277K41515m83698
8978A685876K88381r5050M1775j51545K93259J24107k99688j8595J94954j43448
$$ plain form
8968 1920026 1643481 2119891 1889888 1962530 2025686 2109013 2008124 2231061 2043079 2161137
8958 2161137 1925895 2000049 2251218 2016274 2168175 2338975 2210166 2355978 2248540 2097879
8948 2097879 2172287 2233875 2538136 2562022 2514034 2506347 2466852 2020513 2498462 2278540 2452827
8937 2452827 2432122 2539289 2453173 2163368 2443742 2407650 2377800 2350371 2370881 2268752 2306656
8926 2306656 2498101 2332753 2301092 2406793 2616781 2400634 2485404 2395210 2402647 2498185 2589679
8915 2589679 2720457 2613904 2566513 2569093 2576271 2666917 2724788 2882255 2488753 2703676 2666118
8904 2666118 2665721 2951351 2899611 2965590 2888760 2806301 2656588 3026238 2774187 3012018 3089338
8893 3089338 3027079 3007577 2664473 2934531 2918400 3054361 2908372 3084122 3240323 2987218
$$ packed form
8968A920026k76545M76410k30003P2642O3156Q3327j00889K22937j87982J18058
8958B161137k35242P4154K51169k34944J51901J70800j28809J45812j07438j50661
8948B097879P4408O1588L04261K3886m7988p687l9495m46339M77949k19922J74287
8937B452827k0705J07167q6116k89805K80374l6092k9850k7429K0510j02129L7904
8926B306656J91445j65348l1661J05701K09988k16147Q4770r0194P437R5538R1494
8915B589679J30778j06553m7391K580P178R0646N7871J57467l93502K14923l7558
8904B666118l97K85630n1740O5979p6830q2459j49713L69650k52051K37831P7320
8893C089338o2259j9502l43104K70058j6131J35961j45989J75750J56201k53105
$$ plain form
8883 2987218 3028167 3294698 3157648 2877590 3248321 3404936 3092908 3275686 3223492 3339310
8873 3339310 3221806 3316853 3531760 3152761 3208126 3210638 3333103 3526182 3679232 3278848
8863 3278848 3390685 3367414 3471890 3532143 3528489 3667501 3559319 3614493 3703451 3847921 3760554
8852 3760554 3585746 3798626 3805684 3562369 3758023 3862808 3852459 3829883 3916069 4093639
8842 4093639 3992833 3957976 3975455 4003650 3989105 4185783 4100233 4354396 4089045 4256070
8832 4256070 4167035 4360006 4038331 4438321 4380754 4329311 4471930 4262321 4397700 4257159
8822 4257159 4460552 4538581 4656939 4582571 4796329 4729731 4784982 4653442 4589809 4951325
8812 4951325 4671860 4633884 5192792 4918965 4912457 4856832 5072831 4823039 5140366 4890620
$$ packed form
8883B987218M0949K66531j37050k80058L70731J56615l12028J82778n2194J15818
8873C339310j17504R5047K14907l78999N5365K512J22465J93079J53050m00384
8863C278848J11837k3271J04476O0253l654J39012j08182N5174Q8958J44470q7367
8852C760554j74808K12880P058k43315J95654J04785j0349k2576Q6186J77570
8842D093639j00806l4857J7479K8195j4545J96678q5550K54163k65351J67025
8832D256070q9035J92971l21675L99990n7567n1443J42619k09609J35379j40541
8822D257159K03393P8029J18358p4368K13758o6598N5251j31540o3633L61516
8812D951325k79465l7976N58908k73827o508n5625K15999k49792L17327k49746
$$ plain form
8802 4890620 5117092 5307151 5176379 5442034 5349931 5264972 5109844 5317347 5276657 5494684
8792 5494684 5524510 5429556 5752425 5613372 5741292 5463222 5730073 5681830 5558749 5784662
8782 5784662 5945127 5920232 5645652 5952709 5918155 6004999 6095293 6206583 6195491 5919676
8772 5919676 6036110 6306482 6399944 6293396 6364990 6447548 6415375 6502533 6678308 6674386 6554379
8761 6554379 6822002 6869193 6679519 6975087 6984853 6953644 7168422 7250703 7300050 7249938 7415740
8750 7415740 7296548 7361649 7654500 7741766 7865984 7727775 7993224 8190337 8322218 8999164
8740 8999164 9442518 10131378 10275821 10508039 10380334 10136142 9858218 9753139 9368098 8806797
8730 8806797 9096378 8799583 8521851 8580257 8664564 8575998 8760546 8770778 8657038 8725564
$$ packed form
8802D890620K26472J90059j30772K65655r2103q4959j55128K07503m0690K18027
8792E494684K9826r4954L22869j39053J27920k78070K66851m8243j23081K25913
8782E784662J60465k4895k74580L07057l4554Q6844R0294J11290j1092k75815
8772E919676J16434K70372R3462j06548P1594Q2558l2173Q7158J75775l922j20007
8761F554379K67623M7191j89674K95568R766l1209K14778Q2281M9347n0112J65802
8750G415740j19192O5101K92851Q7266J24218j38209K65449J97113J31881O76946
8740H999164M43354O88860J44443K32218j27705k44192k77924j05079l85041n61301
8730H806797K89581k96795k77732N8406Q4307q8566J84548J0232j13740O8526
$$ plain form
8720 8725564 8544204 8873878 8896314 8840943 8909910 8981657 9274901 9124215 9013955 9304566
8710 9304566 9051756 9057332 9380562 9446250 9337782 9652567 9625493 9576684 9674291 9751740 9728033
8699 9728033 10014067 9844605 9859769 10030523 10130081 9989534 9907704 10065583 10205027 10299189
8689 10299189 10182973 10225658 10279558 10478854 10310728 10688150 10595381 10675085 10624641 10915522
8679 10915522 10868343 10634349 11005456 10895144 10928786 10941079 11062899 11257246 11305619 11148488
8669 11148488 11206840 11476846 11261299 11160133 11386741 11623615 11884445 11382215 11974177 11874540
8659 11874540 11565435 11656604 11941444 11886863 11803555 12107320 12047005 12410701 12044032 12157863
8649 12157863 12368181 11969501 12211249 12190417 12240752 12318189 12477507 12296050 12246116 12628735
$$ packed form
8720H725564j81360L29674K2436n5371O8967P1747K93244j50686j10260K90611
8710I304566k52810N576L23230O5688j08468L14785k7074m8809R7607P7449k3707
8699I728033K86034j69462J5164J70754R9558j40547q1830J57879J39444R4162
8689A0299189j16216M2685N3900J99296j68126L77422r2769P9704n0444K90881
8679A0915522m7179k33994L71107j10312L3642J2293J21820J94347M8373j57131
8669A1148488N8352K70006k15547j01166K26608K36874K60830n02230N91962r9637
8659A1874540l09105R1169K84840n4581q3308L03765o0315L63696l66669J13831
8649A2157863K10318l98680K41748k0832N0335P7437J59318j81457m9934L82619
$$ plain form
8639 12628735 12626333 12435366 12568737 12739471 12767436 12605170 12893910 12784707 12690404 12546219
8629 12546219 12936565 12972981 12795905 13073610 12905786 13014488 12775098 13029434 13065229 13101249
8619 13101249 12993540 13068109 13022514 13013268 13111830 12957378 13092869 13114281 13067912 12985643 13031207
8608 13031207 13096752 13077657 13051323 13122758 13026453 13126846 12974345 13105092 13068860 13186931
8598 13186931 12903263 13317967 13270809 13075086 13038303 13119233 13176646 12926049 13076563 13082153
8588 13082153 12954337 12801511 13071354 13128637 13142071 12813178 12899047 12991053 12675340 12725709
8578 12725709 12928120 13099101 12630703 12916849 12825282 12776723 12547527 12552610 12572547 12574473 12646206
8567 12646206 12412638 12419221 12317487 12338320 12187416 12490927 12274627 12012376 12117264 12171379
$$ packed form
8639A2628735k402j90967J33371J70734K7965j62266K88740j09203r4303j44185
8629A2546219L90346L6416j77076K77705j67824J08702k39390K54336L5795L6020
8619A3101249j07709P4569m5595r246R8562j54452J35491K1412m6369q2269M5564
8608A3031207O5545j9095k6334P1435r6305J00393j52501J30747l6232J18071
8598A3186931k83668M14704m7158j95723l6783Q0930N7413k50597J50514N590
8588A3082153j27816j52826K69843N7283J3434l28893Q5869R2006l15713N0369
8578A2725709K02411J70981m68398K86146r1567m8559k29196N083J9937J926P1733
8567A2646206k33568O583j01734K0833j50904L03511k16300k62251J04888N4115
$$ plain form
8557 12171379 12280925 11991769 11973687 12213109 11869059 11825540 11778546 12031321 11680636 11605400
8547 11605400 11844163 11721045 11606731 11463835 11705102 11324912 11573368 11356537 11534934
8538 11534934 11378321 11244351 11208919 11376028 11242770 11003716 10880436 11424217 11130629 10963302
8528 10963302 10954544 10929115 10772840 10563559 10766932 10539454 10599917 10263813 10467071 10548984
8518 10548984 10427707 10328333 10315038 10265298 9828110 10100301 10219866 9937018 10086718 9952423
8508 9952423 9880092 9912673 9739908 9625632 9361191 9738523 9433819 9616369 9416454 9267776
8498 9267776 9150751 9048305 9339023 9107623 9130448 8871188 9154922 8848031 8964536 8763604
8488 8763604 8922621 8703888 8699798 8695604 8597638 8552382 8489051 8508020 8328048 8339615 8392804
$$ packed form
8557A2171379J09546k89156j8082K39422l44050m3519m6994K52775l50685p5236
8547A1605400K38763j23118j14314j42896K41267l80190K48456k16831J78397
8538A1534934j56613j33970l5432J67109j33258k39054j23280N43781k93588j67327
8528A0963302q758k5429j56275k09281K03373k27478O0463l36104K03258Q1913
8518A0548984j21277r9374j3295m9740m37188K72191J19565k82848J49700j34295
8508I952423p2331L2581j72765j14276k64441L77332l04704J82550j99915j48678
8498I267776j17025j02446K90718k31400K2825k59260K83734l06891J16505k00932
8488H763604J59017k18733m090m194r7966m5256o3331J8969j79972J1567N3189
$$ plain form
8477 8392804 8206322 8182945 8097279 8077161 8174540 8093294 8019322 7845535 7999162 7702271 7867824
8466 7867824 7752438 7718076 7556507 7588790 7569782 7345052 7513986 7159524 7396422 7352378
8456 7352378 7294793 7266058 7111257 7270724 7130558 7329797 7190044 6808648 6964297 6719949
8446 6719949 6939552 6992620 7171492 6715088 6617536 6750886 6509673 6707133 6498275 6561436
8436 6561436 6257915 6315230 6440227 6268005 6286926 6043755 6328869 6000684 6277907 6230531
8426 6230531 5915133 6062442 5759862 6072523 5953439 5877916 5878926 5802349 5551480 5943077
8416 5943077 6009253 5341340 5660475 5683085 5483191 5458716 5618341 5597860 5592882 5486649 5647207
8405 5647207 5567828 5104746 5173618 5500428 5129839 5253740 5340584 5146839 5142100 5125442 5024811
$$ packed form
8477H392804j86482k3377q5666k0118R7379q1246p3972j73787J53627k96891J65553
8466G867824j15386l4362j61569L2283j9008k24730J68934l54462K36898m4044
8456G352378n7585k8735j54801J59467j40166J99239j39753l81396J55649k44348
8446F719949K19603N3068J78872m56404r7552J33350k41213J97460k08858O3161
8436F561436l03521N7315J24997j72222J8921k43171K85114l28185K77223m7376
8426F230531l15398J47309l02580L12661j19084p5523J010p6577k50869L91597
8416E943077O6176o67913L19135K2610j99894k4475J59625k0481m978j06233J60558
8405E647207p9379m63082O8872L26810l70589J23901Q6844j93745m739j6658j00631
$$ plain form
8394 5024811 5134770 5134900 4861236 5163369 4688721 5270629 4883419 4688026 4589702 4816674
8384 4816674 4625198 4794758 4847360 4618679 4581116 4541407 4560268 4629633 4471531 4546607 4479883
8373 4479883 4565541 4716775 4532810 4440154 4218505 4293994 4191805 4363224 4451028 4326187
8363 4326187 4054276 4184728 4206082 4146818 3910542 4101284 3971347 3958611 4058364 4016902
8353 4016902 3963881 3844916 4019939 3762469 4000797 3730619 3820310 3566051 3805732 3769499
8343 3769499 3813661 3524968 3608225 3770826 3435669 3622814 3799073 3691455 3265913 3495106
8333 3495106 3750644 3468129 3440116 3693037 3497923 3318089 3542962 3534753 3491561 3272032
8323 3272032 3528694 3417622 3511261 3255775 3235844 3302778 3188592 3400132 3276057 3127008
$$ packed form
8394E024811J09959J30k73664L02133m74648N81908l87210j95393r8324K26972
8384D816674j91476J69560N2602k28681l7563l9709J8861O9365j58102P5076o6724
8373D479883Q5658J51234j83965r2656k21649P5489j02189J71419Q7804j24841
8363D326187k71911J30452K1354n9264k36276J90742j29937j2736R9753m1462
8353D016902n3021j18965J75023k57470K38328k70178Q9691k54259K39681l6233
8343C769499M4162k88693Q3257J62601l35157J87145J76259j07618m25542K29193
8333C495106K55538k82515k8013K52921j95114j79834K24873q209m3192k19529
8323C272032K56662j11072R3639k55486j9931O6934j14186K11540j24075j49049
$$ plain form
8313 3127008 3195952 3203213 3232863 3003224 3350776 2939161 3065794 3004954 3228214 2938728
8303 2938728 2827169 3079667 2767454 2802556 2747254 3014998 2703247 2852169 2947427 2625960
8293 2625960 3023901 2664890 2687686 2678358 2633598 2690146 2762647 2897652 2479341 2783120 2462991
8282 2462991 2598542 2497861 2560263 2608953 2781406 2596481 2562020 2767830 2549845 2469671
8272 2469671 2425028 2478506 2621259 2428046 2437693 2524311 2374522 2426571 2338710 2258028 2236300
8261 2236300 2520338 2307203 2614057 2266489 2126138 2141566 2078416 2226096 2050701 2310510
8251 2310510 2127697 2295939 2167548 2138921 2148341 2064089 2051012 2089948 2040630 2158983 2005616
8240 2005616 2317933 1902551 2193222 2024247 2183095 1954532 1933669 2225945 2040636 2237087
$$ packed form
8313C127008O8944P261K9650k29639L47552m11615J26633o0840K23260k89486
8303B938728j11559K52498l12213L5102n5302K67744l11751J48922R5258l21467
8293B625960L97941l59011K2796r328m4760N6548P2501J35005m18311L03779l20129
8282B462991J35551j00681O2402M8690J72453j84925l4461K05810k17985q0174
8272B469671m4643N3478J42753j93213R647Q6618j49789N2049q7861q0682k1728
8261B236300K84038k13135L06854l47568j40351J5428o3150J47680j75395K59809
8251B310510j82813J68242j28391k8627R420q4252j3077L8936m9318J18353j53367
8240B005616L12317m15382K90671j68975J58848k28563k0863K92276j85309J96451
$$ plain form
8230 2237087 1867375 2040766 1716816 2153069 2018516 1934265 1998331 1841079 1819054 1887938
8220 1887938 1998265 2026566 1883742 1974388 1845592 1764049 1931785 1936230 1864087 1597558 1924237
8209 1924237 1782380 1827449 1618641 2010644 1772172 1796012 1937939 1869802 1798399 1412400
8199 1412400 1863149 1774172 1523446 1542460 1641842 1690444 1788933 1401628 1429128 1682156 1896965
8188 1896965 1595595 1663162 1710740 1699746 1608588 1884258 1962235 1627989 1525575 1688396
8178 1688396 1688838 1414381 1860483 1660147 1891593 1494902 1805680 1884769 1445155 1589173
8168 1589173 1408184 1716050 1517188 1666046 1484051 1703388 1376474 1353347 1739764 1395349
8158 1395349 1686860 1339038 1597077 1471844 1497850 1327872 1531040 1580669 1242995 1234730
$$ packed form
8230B237087l69712J73391l23950M36253j34553q4251O4066j57252k2025O8884
8220A887938J10327K8301j42824R0646j28796q1543J67736M445p2143k66529L26679
8209A924237j41857M5069k08808L92003k38472K3840J41927o8137p1403l85999
8199A412400M50749q8977k50726J9014R9382M8602R8489l87305K7500K53028K14809
8188A896965l01370O7567M7578j0994r1158K75670P7977l34246j02414J62821
8178A688396M42k74457M46102k00336K31446l96691L10778P9089m39614J44018
8168A589173j80989L07866j98862J48858j81995K19337l26914k3127L86417l44415
8158A395349K91511l47822K58039j25233K6006j69978K03168M9629l37674q265
$$ plain form
8148 1234730 1442249 1575417 1369095 1336440 1502187 1216199 1326447 1389161 1458785 1303701
8138 1303701 1262056 1437546 1213654 1337363 1176107 1203576 1257798 1697442 1223082 1369615
8128 1369615 1313916 1334731 1299815 1282566 1560252 1305845 1333743 1051194 1346725 1092892
8118 1092892 1221646 1333769 1286778 1175703 1234206 1403990 1124913 1171309 1185019 1277654
8108 1277654 1300413 1329695 1265282 1116203 1092772 1444827 1152567 1139921 1133451 1310628 884690
8097 884690 1302365 1194927 1093915 1109895 995112 1018737 1030376 970834 1238764 1162327 1071516
8086 1071516 1170394 1146152 1042062 979250 1128280 1288960 1227475 1006475 1100114 844197
8076 844197 866348 1242435 1202369 1150459 1065986 1295884 1040068 1320267 972173 1029713 1068535
$$ packed form
8148A234730K07519J33168k06322l2655J65747k85988J10248O2714O9624j55084
8138A303701m1645J75490k23892J23709j61256K7469N4222M39644m74360J46533
8128A369615n5699K0815l4916j7249K77686k54407K7898k82549K95531k53833
8118A092892J28754J12123m6991j11075N8503J69784k79077M6396J3710R2635
8108A277654K2759K9282o4413j49079k3431L52055k92260j2646o470J77177m25938
8097H84690M17675j07438j01012J5980j14783K3625J1639n9542K67930p6437r0811
8086A071516R8878k4242j04090o2812J49030J60680o1485k21000R3639k55917
8076H44197K2151L76087m0066n1910q4473K29898k55816K80199l48094N7540L8822
$$ plain form
8065 1068535 1038462 990591 821413 1060498 1126710 944977 997977 1332309 952070 1025838
8055 1025838 1007278 1015349 1106558 1107868 1143714 1360722 1166712 921026 1356632 1297680 1297495
8044 1297495 1230230 1226884 1229259 1040931 974929 1247950 1007655 1093916 902761 1142629 1035289
8033 1035289 808713 616129 977663 1059464 674496 981589 1120951 941873 926654 1217240
8023 1217240 1063366 1082426 1015043 1097135 1460691 1297088 1114661 1196169 1237014 1035801
8013 1035801 986356 1020869 1167762 762779 1092972 941090 1069976 715216 960212 784863
8003 784863 936707 829578 878862 983932 837974 678010 933539 982754 1028583 924076
7993 924076 935685 871333 741277 838106 778824 930101 840323 916641 829485 835360 696717
$$ packed form
8065A068535l0073m7871j69178K39085O6212j81733N3000L34332l80239P3768
8055A025838j8560Q071R1209J310L5846K17008j94010k45686M35606n8952j85
8044A297495o7265l346K375j88328o6002K73021k40295Q6261j91155K39868j07340
8033A035289k26576j92584L61534Q1801l84968L07093J39362j79078j5219K90586
8023A217240j53874J9060o7383Q2092L63556j63603j82427Q1508M0845k01213
8013A035801m9445L4513J46893m04983L30193j51882J28886l54760K44996j75349
8003G84863J51844j07129M9284J05070j45958j59964K55529M9215M5829j04507
7993I24076J1609o4352j30056R6829n9282J51277q9778P6318q7156N875j38643
$$ plain form
7982 696717 660933 891404 724653 776388 554619 818228 590030 805233 636117 967243
7972 967243 618379 629075 536763 741957 573825 620676 714831 735374 649985 509564 684086
7961 684086 640528 554481 629618 618823 633414 542534 698279 800245 422915 787227 584855
7950 584855 668025 538944 618013 708772 383202 836233 353545 703997 379323 544112
7940 544112 415359 680111 750717 383072 599596 621920 427353 552553 759599 534700
7930 534700 467171 605612 319811 487443 552804 584805 810932 477757 490431 256914
7920 256914 644798 362072 716062 641814 675250 562627 383634 509435 416794 778145
7910 778145 442143 340284 517573 656931 357177 652719 635956 90865 550058 523752
$$ packed form
7982F96717l5784K30471j66751N1735k21769K63609k28198K15203j69116L31126
7972I67243l48864J0696r2312K05194j68132M6851R4155K0543q5389j40421J74522
7961F84086m3558q6047P5137j0795J4591r0880J55745J01966l77330L64312k02372
7950E84855Q3170j29081P9069R0759l25570M53031m82688L50452l24674J64789
7940E44112j28753K64752P0606l67645K16524K2324j94567J25200K07046k24899
7930E34700o7529J38441k85801J67632O5361L2001K26127l33175J2674k33517
7920B56914L87884k82726L53990p4248L3436j12623j78993J25801r2641L61351
7910G78145l36002j01859J77289J39358k99754K95542j6763n45091M59193k6306
$$ plain form
7900 523752 589214 356363 496870 378520 303872 383185 514310 576793 558976 399692 608708
7889 608708 496452 793310 295387 783124 326857 297398 589061 687029 473675 366024
7879 366024 525447 312646 538669 222553 711348 627192 275775 505349 454868 547718
7869 547718 271690 534163 431038 329975 313715 562571 524224 467300 418118 532931
7859 532931 418806 667498 454607 339825 614363 567574 1070577 208326 441032 531106
7849 531106 343112 482439 531072 605839 374160 594076 583142 316568 498276 432501
7839 432501 579447 564535 341547 426203 282923 406431 289035 537846 434196 478292
7829 478292 43593 593714 433465 316820 590088 603612 206554 378282 549454 684893
$$ packed form
7900E23752O5462k32851J40507j18350p4648P9313J31125O2483j7817j59284K09016
7889F08708j12256K96858m97923M87737m56267k9459K91663R7968k13354j07651
7879C66024J59423k12801K26023l16116M88795q4156l51417K29574n0481R2850
7869E47718k76028K62473j03125j01063j6260K48856l8347n6924m9182J14813
7859E32931j14125K48692k12891j14782K74538m6789N03003q62251K32706R0074
7849E31106j87994J39327M8633P4767k31679K19916j0934k66574J81708o5775
7839D32501J46946j4912k22988Q4656j43280J23508j17396K48811j03650M4096
7829D78292m34699N50121j60249j16645K73268J3524l97058J71728J71172J35439
$$ plain form
7819 684893 271920 329031 360367 447623 431228 578071 685387 389701 421450 369847 107848
7808 107848 316306 307186 494055 164337 552685 533880 358331 264448 486527 148826
7798 148826 293182 534168 609506 166749 559726 262295 312124 370585 296039 178383
7788 178383 462889 395090 531030 349359 252025 406744 332979 324320 469023 375932 391231
7777 391231 310437 94743 403483 372591 171518 458182 53091 395799 362614 361341 278213
7766 278213 549779 48219 290015 592630 186444 271913 257000 460078 234961 86634
7756 86634 486075 322909 269862 342284 405288 232730 374931 232431 301295 383724 310352
7745 310352 419824 258905 244458 244688 424715 362547 311422 508593 363667 391569 231682
$$ packed form
7819F84893m12973N7111L1336Q7256j6395J46843J07316k95686L1749n1603k61999
7808A07848K08458r120J86869l29718L88348j8805j75549r3883K22079l37701
7798A48826J44356K40986P5338m42757L92977k97431M9829N8461p4546j17656
7788A78383K84506o7799J35940j81671r7334J54719p3765q659J44703r3091J5299
7777C91231q0794k15694L08740l0892k01073K86664m05091L42708l3185j273q3128
7766B78213K71566n01560K41796L02615m06186Q5469j4913K03078k25117j48327
7756H6634L99441j63166n3047P2422O3004j72558J42201j42500O8864Q2429p3372
7745C10352J09472j60919j4447K30J80027o2168n1125J97171j44926K7902j59887
$$ plain form
7734 231682 221635 154092 405431 444230 325819 131313 218893 59094 148469 443161 169553
7723 169553 325153 41180 182212 257760 475690 238554 143495 117186 -69278 287515
7713 287515 516499 328259 240424 100284 378941 206601 414111 462940 326028 63045
7703 63045 405358 306302 153134 419292 278784 310084 452634 286406 480984 453766
7693 453766 302004 287120 481521 199744 448234 173971 307476 327767 77815 121237
7683 121237 354721 168801 214305 356655 179973 351435 46550 323626 513273 -30831
7673 -30831 208783 167397 68040 209075 335142 414566 174880 221506 26938 354109 196784
7662 196784 441900 404764 61082 363544 233498 358141 408796 378388 148144 163089
$$ packed form
7734B31682j0047o7543K51339L8799j18411j94506Q7580j59799Q9375K94692k73608
7723A69553J55600k83973J41032P5548K17930k37136r5059k6309j86464L56793
7713B87515K28984j88240q7835j40140K78657j72340K07510M8829j36912k62983
7703F3045L42313r9056j53168K66158j40508L1300J42550j66228J94578k7218
7693D53766j51762j4884J94401k81777K48490k74263J33505K0291k49952M3422
7683A21237K33484j85920M5504J42350j76682J71462l04885K77076J89647n44104
7673c0831K39614m1386r9357J41035J26067P9424k39686M6626j94568L27171j57325
7662A96784K45116l7136l43682L02462j30046J24643N0655l0408k30244J4945
$$ plain form
7652 163089 319404 165785 187095 197601 347248 333414 183718 434814 220783 -10019
7642 -10019 231959 484300 88965 50764 336994 84491 255533 229478 425885 463643
7632 463643 51104 275510 288975 31400 133938 254784 210021 331439 283343 78435
7622 78435 146540 273356 225564 440612 73376 228347 101021 -50424 377336 380620 159845
7611 159845 303080 174511 -78010 93548 331609 212826 271411 3482 133121 175747
7601 175747 256153 257115 438230 50208 5820 56080 108867 177226 147840 212639 169051 52686
7589 52686 14111 195806 32627 166788 143747 168827 89538 -86585 173245 217901 64682
7578 64682 29404 243665 725 28555 292999 97710 -79094 297959 283262 311063 80513
$$ packed form
7652A63089J56315j53619K1310J0506J49647j3834j49696K51096k14031k30802
7642a0019K41978K52341l95335l8201K86230k52503J71042k6055J96407L7758
7632D63643m12539K24406J3465k57575J02538J20846m4763J21418m8096k04908
7622G8435O8105J26816m7792K15048l67236J54971j27326j51445M27760L284k20775
7611A59845J43235j28569k52521J71558K38061j18783N8585k67929J29639M2626
7601A75747Q0406R62J81115l88022m4388N0260N2787O8359k9386O4799m3588j16365
7589E2686l8575J81695j63179J34161k3041K5080p9289j76123K59830M4656j53219
7578F4682l5278K14261k42940K7830K64444j95289j76804L77053j4697K7801k30550
$$ plain form
7567 80513 389480 55515 27827 -14168 243146 30080 230079 122843 246672 198849
7557 198849 92059 271502 212076 -46044 23281 183042 71617 213530 218976 101978
7547 101978 -29301 198238 3904 245249 297216 136212 -29548 78446 227984 99943
7537 99943 63273 274039 36374 43067 135291 53538 105507 135565 154232 64155 421500
7526 421500 300806 21579 198676 -17756 -163751 112486 206485 147547 65773 52659
7516 52659 61676 -1639 153099 188983 230024 -87423 -142336 49838 80507 94932 77996
7505 77996 68502 -273439 -78022 -103256 94184 139812 197062 -111692 -156493 -72581 99354
7494 99354 149766 156341 87514 -80663 81532 25977 58414 221033 50076 146809 292196
$$ packed form
7567H0513L08967l33965k7688m1995K57314k13066J99999j07236J23829m7823
7557A98849j06790J79443n9426k58120O9325J59761j11425J41913N446j16998
7547A01978j31279K27539j94334K41345N1967j61004j65760J07994J49538j28041
7537I9943l6670K10766k37665O693R2224q1753N1969L0058J8667r0077L57345
7526D21500j20694k79227J77097k16432j45995K76237R3999n8938q1774j3114
7516E2659R017o3315J54738L5884M1041l17447n4913J92174L0669J4425j6936
7505G7996r494l41941J95417k5234J97440M5628N7250l08754m4801Q3912J71935
7494I9354N0412O575o8827j68177J62195n5555L2437J62619j70957R6733J45387
$$ plain form
7483 292196 308900 228697 247495 192372 27846 202178 123862 174006 165481 265782 183727
7472 183727 43114 102781 29109 11270 -97565 18332 -28838 82578 1817 256312 147007
7461 147007 -368728 -32509 -70475 -31307 -212293 318043 81209 91086 88087 159275 24119
7450 24119 -803 109983 -7717 63243 32538 161487 65785 -2839 44550 87797 -59841
7439 -59841 79179 160643 28275 -55644 84015 7190 42374 33754 254021 -86573 28818
7428 28818 79437 145768 -6649 36478 23917 -223097 252767 95926 304466 238580 11388
7417 11388 -8107 25771 70987 -31475 237877 79422 -101713 -14465 60061 10782 208124
7406 208124 279266 -14748 -52703 -79831 -67716 -59563 105138 51436 139572 131411 -139356
$$ packed form
7483B92196J6704q0203J8798n5123j64526J74332p8316N0144q525J00301q2055
7472A83727j40613N9667p3672j7839j08835J15897m7170J11416q0761K54495j09305
7461A47007n15735L36219l7966L9168j80986N30336k36834R877k999P1188j35156
7450B4119k4922J10786j17700P0960l0705J28949r5702o8624M7389M3247j47638
7439e9841J39020Q1464j32368q3919J39659p6825L5184q620K20267l40594J15391
7428B8818N0619O6331j52417M3127j2561k47014M75864j56841K08540o5886k27192
7417A1388j9495L3878M5216j02462K69352j58455j81135Q7248P4526m9279J97342
7406B08124P1142k94014l7955k7128J2115Q153J64701n3702Q8136q161k70767
$$ plain form
7395 -139356 76207 100086 -189198 -127228 10357 -208450 103296 273721 127818 -44999
7385 -44999 -107745 -168278 -206109 18813 135315 40047 -50606 99179 131565 -25496 291558
7374 291558 99913 35333 -23053 -174058 86030 30034 -134389 48466 216205 -225894
7364 -225894 119328 62962 -17655 188466 -57918 -167411 119200 87778 -35603 19634
7354 19634 30062 122879 -140005 16356 190966 -28374 20213 126307 -44522 237186
7344 237186 35021 -100673 31768 -13349 -220091 73314 100900 -62371 -161943 -194150
7334 -194150 169839 2782 190163 -78671 179866 -175636 -140227 -44967 106717 -36651
7324 -36651 -274518 150381 57607 -6594 124847 66930 -148952 40680 -9572 -88372 180989
$$ packed form
7395a39356K15563K3879k89284O1970J37585k18807L11746J70425j45903j72817
7385d4999o2746o0533l7831K24922J16502r5268r0653J49785L2386j57061L17054
7374B91558j91645o4580n8386j51005K60088n5996j64423J82855J67739m42099
7364b25894L45222n6366q0617K06121k46384j09493K86611l1422j23381N5237
7354A9634J0428R2817k62884J56361J74610k19340M8587J06094j70829K81708
7344B37186k02165j35694J32441m5117k06742K93405K7586j63271r9572l2207
7334a94150L63989j67057J87381k68834K58537l55502L5409R5260J51684j43368
7324c6651k37867M24899r2774o4201J31441n7917k15882J89632n0252p8800K69361
$$ plain form
7313 180989 174998 -173663 159009 -34639 108727 -27178 -15601 70933 -18606 -176094 -43935
7302 -43935 141367 -47971 189331 -50484 -57761 -296219 -127108 136591 161147 -164275
7292 -164275 11484 -337474 -149222 183878 -43345 -3327 113099 -121876 -181958 362732
7282 362732 20468 -36345 -106271 -79686 142893 21271 172633 177470 -174423 6253 -56196
7271 -56196 139884 126133 492 32576 70639 17015 119875 155672 -171409 313179 -8720
7260 -8720 -16361 55731 119396 -331964 -104800 150035 28657 -237785 -1272 -108771 -349330
7249 -349330 -44336 68044 -94560 -161970 -55781 137301 20658 -170306 -114486 65591
7239 65591 -162742 -89135 186983 -71370 -75848 -36746 -63670 -42822 -45329 -59414 -247832
$$ packed form
7313A80989n991l48661L32672j93648J43366j35905J1577Q6534q9539j57488J32159
7302d3935J85302j89338K37302k39815p277k38458J69111K63699K4556l25422
7292a64275J75759l48958J88252L33100k27223M0018J16426k34975o0082N44690
7282C62732l42264n6813o9926K6585K22579j21622J51362M837l51893J80676o2449
7271e6196J96080j3751j25641L2084L8063n3624J02860L5797l27081M84588l21899
7260h720p641P2092O3665m51360K27164K54835j21378k66442K36513j07499k40559
7249c49330L04994J12380j62604o7410J06189J93082j16643j90964N5820J80077
7239F5591k28333P3607K76118k58353m478L9102k6924K0848k507j4085j88418
$$ plain form
7228 -247832 205608 117509 46039 141178 52690 -114151 -147830 308009 288141 -46081 73787
7217 73787 -75219 -88686 -44292 -27318 -114009 109394 49421 114021 118635 56677 -99355
7206 -99355 -42629 -180243 45719 75848 -166252 44941 138073 -153016 -163164 3775 -12646
7195 -12646 -137379 -50695 145110 -287336 -191864 50055 -326243 -40918 62751 -171320
7185 -171320 -272680 -85252 68109 -112482 90855 -47202 -181985 -276497 -231688 212176
7175 212176 87816 -69667 -223125 86267 -264070 -137016 126106 -41841 -171365 -177739
7165 -177739 48553 -18278 145753 -52334 -24283 19132 156437 -130906 11430 -107489
7155 -107489 -207205 -81488 278240 4574 87446 -174234 19736 -36395 47692 -46636 -227854
$$ packed form
7228b47832M53440q8099p1470R5139q8488j66841l3679M55839j9868l34222J19868
7217G3787j49006j3467M4394J6974q6691K23403n9973O4600M614o1958j56032
7206i9355N6726j37614K25962L0129k42100K11193R3132k91089j0148J66939j6421
7195a2646j24733Q6684J95805m32446R5472K41919l76298K85325J03669k34071
7185a71320j01360J87428J53361j80591K03337j38057j34783r4512M4809M43864
7175B12176j24360j57483j53458L09392l50337J27054K63122j67947j29524o374
7165a77739K26292o6831J64031j98087K8051M3415J37305k87343J42336j18919
7155a07489r9716J25717L59728k73666Q2872k61680J93970n6131Q4087r4328j81218
$$ plain form
7144 -227854 78794 -47306 40231 -19312 129462 -91174 -10281 -105269 -103497 157889 -214794
7133 -214794 -26931 147080 55607 -91345 219281 -160066 -122335 22939 -19416 -124821
7123 -124821 183692 -183909 -9314 -107687 196127 -140023 -102378 50093 147684 -136679
7113 -136679 -171244 72325 -147500 3582 4233 260503 5906 -264496 18847 -18574 -114905
7102 -114905 -127967 255604 -71578 -10810 114043 120146 168137 85793 -39204 150430 83665
7091 83665 159399 -76558 245072 165233 5253 -92040 198321 -112128 257765 65069
7081 65069 95906 38683 -195141 -246665 71266 -7623 -196450 185852 67849 -124449 -252515
7070 -252515 50962 100331 -140137 -163761 -179773 9264 8514 12189 -23341 118212 -156025
$$ packed form
7144b27854L06648j26100Q7537n9543J48774k20636Q0893r4988J772K61386l72683
7133b14794J87863J74011r1473j46952L10626l79347L7731J45274m2355j05405
7123a24821L08513l67601J74595r8373L03814l36150L7645J52471R7591k84363
7113a36679l4565K43569k19825J51082O51K56270k54597k70402K83343l7421r6331
7102a14905j3062L83571l27182O0768J24853O103M7991q2344j24997J89634o6765
7091H3665P5734k35957L21630p9839j59980r7293K90361l10449L69893j92696
7081F5069L0837n7223k33824n1524L17931p8889j88827L82302j18003j92298j28066
7070b52515L03477M9369k40468k3624j6012J89037p50L675l5530J41553k74237
$$ plain form
7059 -156025 -251674 89764 58291 -90505 93613 -53663 -229829 -214663 178165 -138979
7049 -138979 62628 -162165 -63589 73336 155122 -231601 -33757 72332 -99980 -18042
7039 -18042 29424 -171406 -267419 -194400 -93158 -198187 124320 -218264 -75288 50903
7029 50903 -139577 -129701 43698 -90130 -180426 -64867 -114874 34648 135135 -228208 49000
7018 49000 22181 113066 -179272 39752 169787 -219038 -170518 -109366 166522 -310691 89679
7007 89679 62730 131028 106419 -245082 109226 -167510 -122793 -210856 142140 -11409 -140226
6996 -140226 24630 -97744 158342 -219688 -212979 -190288 120613 -10380 -117023 247307
6986 247307 -196087 -237864 -122566 222695 -151976 -167594 -120476 -61952 73214 -146661
$$ packed form
7059a56025r5649L41438l1473j48796J84118j47276j76166J5166L92828l17144
7049a38979K01607k24793R8576J36925Q1786l86723J97844J06089j72312Q1938
7039a8042M7466k00830r6013P3019J01242j05029L22507l42584J42976J26191
7029E0903j90480R876J73399j33828r0296J15559n0007J49522J00487l63343K77208
7018D9000k6819R0885k92338K19024J30035l88825M8520O1152K75888m77213M00370
7007H9679k6949O8298k4609l51501L54308k76736M4717q8063L52996j53549j28817
6996a40226J64856j22374K56086l78030O709K2691L10901j30993j06643L64330
6986B47307m43394m1777J15298L45261l74671j5618M7118N8524J35166k19875
$$ plain form
6976 -146661 164102 -192147 56989 -337642 14608 102189 -158681 -180997 -134414 -69852
6966 -69852 -295618 -32159 -242541 151922 6584 -228929 119967 -160717 -129143 -267066
6956 -267066 335028 -66724 -99475 -156927 43714 59159 -46985 158458 -57556 -188645
6946 -188645 -100962 -109347 64575 117736 -54642 -52921 329124 -180439 87843 -10448 -98374
6935 -98374 -192406 -123630 -165266 -86506 181926 -438741 163349 -17485 -71834 -133785 -77161
6924 -77161 -204482 -122014 23751 -63412 -47123 -217103 -110051 -103824 -153692 -89039 -399281
6913 -399281 -37098 -6592 -247397 -161869 -52639 -175026 -369555 -104476 -131614 90555
6903 90555 -140980 -186940 100200 -214343 -247316 -199207 -33196 -213501 -211097 11804 -134196
$$ packed form
6976a46661L10763l56249K49136l94631L52250Q7581k60870k2316M6583O4562
6966f9852k25766K63459k10382L94463j45338k35513L48896k80684L1574j37923
6956b67066O02094m01752l2751n7452K00641J5445j06144K05443k16014j31089
6946a88645Q7683q385J73922N3161j72378J721L82045n09563K68282r8291q7926
6935i8374r4032O8776m1636P8760K68432o20667O02090j80834n4349o1951N6624
6924g7161j27321Q2468J45765q7163J6289j69980J07052O227m9868O4653l10242
6913c99281L62183L0506k40805Q5528J09230j22387j94529K65079k7138K22169
6903I0555k31535m5960K87140l14543l2973M8109J66011j80305K404K22901j46000
$$ plain form
6892 -134196 -106882 2682 30098 -98960 -151094 4908 -335593 39349 -130003 -94671
6882 -94671 -14158 -127833 -196841 -422730 154526 -68582 229467 -288633 102924 -234726
6872 -234726 -214747 -140335 -68783 28120 -282583 -186562 -156437 -69845 -301610 -99225 31481
6861 31481 -68198 13829 -331287 -266228 -215625 -131696 -98350 -118431 -68467 -451573 -115697
6850 -115697 -145101 -86102 -213411 -3578 -196236 -248736 69556 -222114 -34556 -237610
6840 -237610 -134009 -325168 56376 34471 110727 -197295 -65097 -19003 -88042 -257656
6830 -257656 -140274 -95869 -81976 60812 15227 9700 -102187 -402884 -230079 -182702 60020
6819 60020 98918 85339 -120143 54671 -162450 -97095 149494 -236762 69685 -78423
$$ packed form
6892a34196K7314J09564K7416j29058n2134J56002l40501L74942j69352L5332
6882i4671Q0513j13675o9008k25889N77256k23108K98049n18100L91557l37650
6872b34726J9979P4412P1552R6903l10703R6021L0125Q6592k31765K02385J30706
6861C1481r9679Q2027l45116O5059N0603Q3929L3346k0081M9964l83106L35876
6850a15697k9404N8999j27309K09833j92658n2500L18292k91670J87558k03054
6840b37610J03601j91159L81544k1905P6256l08022J32198M6094o9039j69614
6830b57656J17382M4405J3893J42788m5585n527j11887l00697J72805M7377K42722
6819F0020L8898j3579k05482J74814k17121O5355K46589l86256L06447j48108
$$ plain form
6809 -78423 156672 -62740 25871 2509 45426 -47483 -119826 147685 -70331 -82001 110793
6798 110793 82858 75520 -27361 96284 69246 2316 -14620 144271 80315 -99516 -59250
6787 -59250 14244 38616 27211 83674 75392 209521 -162742 -44222 39551 -101850 -45950
6776 -45950 106867 215567 121215 -16755 -9704 208150 -25276 60611 -30378 149633 -192472
6765 -192472 -166546 269986 88696 -74863 -257901 93036 22819 323909 123226 142312
6755 142312 91394 -315029 -137782 225953 19724 -105678 11244 88715 -3923 -54185
6745 -54185 -38894 202750 -203262 125744 266897 238098 280157 -21293 215932 125323 242211
6734 242211 -31604 230301 -5234 347771 249390 97590 152390 140216 20986 135092
$$ packed form
6809g8423K35095k19412Q8611k3362M2917r2909p2343K67511k18016j1670J92794
6798A10793k7935p338j02881J23645k7038o6930j6936J58891o3956j79831M0266
6787e9250P3494K4372j1405N6463q282J34129l72263J18520Q3773j41401N5900
6776d5950J52817J08700r4352j37970P051K17854k33426Q5887r0989J80011l42105
6765a92472K5926M36532j81290j63559j83038L50937p0217L01090k00683J9086
6755A42312n0918m06423J77247L63735k06229j25402J16922P7471r2638n0262
6745e4185J5291K41644m06012L29006J41153k8799M2059l01450K37225r0609J16888
6734B42211k73815K61905k35535L53005r8381j51800N4800j2174j19230J14106
$$ plain form
6724 135092 262782 162590 -801 85775 143573 45526 120596 168199 164233 -150905 157627
6713 157627 134187 245987 94340 142495 237486 244276 30552 241722 181877 70388 102618
6702 102618 269757 52701 68617 160137 190471 91568 64818 251569 48946 169417 135365
6691 135365 95744 62933 24985 11859 -55182 66569 -79327 314339 120990 62682 251718
6680 251718 82318 4097 12192 162407 -176131 68303 123888 35837 195047 -7343 -18875
6669 -18875 54749 -104701 23428 -25969 -13121 -13675 84451 -206361 -143642 -397069 -56806
6658 -56806 -50907 -66790 -57565 -17353 -110687 -171308 59091 -122771 -17899 -192081 -129589
6647 -129589 -139347 96800 -26671 -96426 -293302 -267244 -188394 70470 -293297 -53249 -160074
$$ packed form
6724A35092J27690j00192j63391Q6576N7798r8047P5070M7603l966l15138L08532
6713A57627k3440J11800j51647M8155R4991O790k13724K11170n9845j11489L2230
6702A02618J67139k17056J5916R1520L0334r8903k6750J86751k02623J20471l4052
6691A35365l9621l2811l7948j3126o7041J21751j45896L93666j93349n8308J89036
6680B51718j69400p8221Q095J50215l38538K44434N5585q8051J59210k02390j1532
6669a8875P3624j59450J28129m9397J2848n54R8126k90812O2719k53427L40263
6658e6806N899j5883R225M0212r3334o0621K30399j81862J04872j74182O2492
6647a29589r758K36147j23471o9755j96876K6058P8850K58864l63767K40048j06825
$$ plain form
6636 -160074 -126030 54992 44743 -102626 -199649 -73379 -86091 147091 -170522 -12584
6626 -12584 -156133 -259349 81789 -130134 13569 -31000 -45324 -52091 114769 -75831 -29357
6615 -29357 -35446 -92231 85758 75711 128712 122980 -287329 2637 197997 38565 28325
6604 28325 219155 -39349 -47319 2025 -41888 -5857 -293332 -83058 -108946 -34536 -167439
6593 -167439 159059 -328936 -88778 7000 -79486 -166107 -205638 -46134 -229502 -92060
6583 -92060 -199251 118468 -283529 -147037 253080 24803 -101115 17825 -170913 113480
6573 113480 102761 1293 27383 -16839 -470919 152224 -187296 -87548 127952 -87723
6563 -87723 -186665 -103637 180589 -147686 128038 -41895 183124 -125038 117667 219623
$$ packed form
6636a60074L4044J81022j0249j47369r7023J26270j2712K33182l17613J57938
6626a2584j43549j03216L41138k11923J43703m4569j4324o767J66860j90600M6474
6615b9357o089n6785J77989j0047N3001n732m10309K89966J95360j59432j0240
6604B8325J90830k58504p970M9344m3913L6031k87475K10274k5888P4410j32903
6593a67439L26498m87995K40158R5778q6486q6621l9531J59504j83368J37442
6583i2060j07191L17719m01997J36492M00117k28277j25918J18940j88738K84393
6573A13480j0719j01468K6090m4222m54080O23143l39520R9748K15500k15675
6563h7723r8942Q3028K84226l28275K75724j69933K25019l08162K42705J01956
$$ plain form
6553 219623 -9232 255059 329803 350519 138402 181489 129878 512395 598019 453096 546384
6542 546384 470583 465228 728465 1094533 1527469 1653317 2320499 2572342 2765444 2610185
6532 2610185 2504975 2399818 2074226 1857705 1653807 1452501 964455 785767 621530 495965
6522 495965 540201 589895 334409 208648 477485 690497 413230 449033 652836 340410
6512 340410 348424 524378 523422 470305 558565 393683 594170 118999 370319 539765 293226
6501 293226 545618 674781 611326 548366 477336 457265 541002 681150 588601 598491 526817
6490 526817 708581 576591 470286 659002 557093 618659 310336 290761 149884 262357
6480 262357 266150 474165 514211 345416 181744 451153 525715 267671 501532 476328 388992
$$ packed form
6553B19623k28855K64291P4744K0716k12117M3087n1611L82517Q5624j44923R3288
6542E46384p5801n355K63237L66068M32936J25848O67182K51843J93102j55259
6532B610185j05210j05157l25592k16521k03898k01306m88046j78688j64237j25565
6522D95965M4236M9694k55486j25761K68837K13012k77267L5803K03803l12426
6512C40410Q014J75954r56n3117Q8260j64882K00487m75171K51320J69446k46539
6501B93226K52392J29163o3455o2960p1030k0071Q3737J40148r2549R890p1674
6490E26817J81764j31990j06305J88716j01909O1566l08323j9575j40877J12473
6480B62357L793K08015M0046j68795j63672K69409P4562k58044K33861k5204q7336
$$ plain form
6469 388992 350185 322261 680756 522603 468003 420694 500451 185601 358797 629004 421242
6458 421242 360119 289208 601607 285420 455410 629531 473560 540868 660012 546333
6448 546333 410823 613321 298660 521794 306322 642553 538450 376508 267098 439533
6438 439533 194391 350458 448035 490444 455009 345028 493011 469419 280760 639115
6428 639115 758067 567869 445072 765151 733669 812036 881459 962134 852609 547134
6418 547134 817013 858580 874724 752438 999879 888768 857237 1024699 1243172 1163349
6408 1163349 893337 1269239 873470 1066742 1271500 982494 879481 1127239 1049644 1063157
6398 1063157 1256700 942905 802038 763245 847177 1001984 1151954 983602 1179503 1123260
$$ packed form
6469C88992l8807k7924L58495j58153n4600m7309P9757l14850J73196K70207k07762
6458D21242o1123p0911L12399l16187J69990J74121j55971O7308J19144j13679
6448E46333j35510K02498l14661K23134k15472L36231j04103j61942j09410J72435
6438D39533k45142J56067R7577M2409l5435j09981J47983k3592j88659L58355
6428F39115J18952j90198j22797L20079l1482P8367O9423Q0675j09525l05475
6418E47134K69879M1567J6144j22286K47441j11111l1531J67462K18473p9823
6408A163349k70012L75902l95769J93272K04758k89006j03013K47758p7595J3513
6398A063157J93543l13795j40867l8793Q3932J54807J49970j68352J95901n6243
$$ plain form
6388 1123260 1018921 1352717 1557769 1379977 1512300 1502743 1544374 1561377 1658208 1487011
6378 1487011 1471680 1285395 1472183 1411854 1349306 1698042 1538292 1757662 1961044 1820923
6368 1820923 1802686 2483045 2455199 2484059 2830863 2823375 2706371 2927061 2885348 3036551 2940632
6357 2940632 2937113 2983762 3039729 2864683 2645212 2867708 2610194 2703338 2942061 3106194
6347 3106194 3043051 3100796 3043488 3103118 3341353 3165972 3293554 3540285 3264411 3648123
6337 3648123 3787615 4032798 3788461 3975898 4060083 4285183 3842463 4273936 4340909 4091833
6327 4091833 4549401 4671916 5003915 5090862 5374345 5510031 5616909 6055773 6020547 6304549
6317 6304549 6325778 6923900 7154368 7996250 8602462 9369369 11193207 13396765 16836938
$$ packed form
6388A123260j04339L33796K05052j77792J32323r557M1631J7003R6831j71197
6378A487011j5331j86285J86788o0329o2548L48736j59750K19370K03382j40121
6368A820923j8237O80359k7846K8860L46804p488j17004K20690m1713J51203r5919
6357B940632l519M6649N5967j75046k19471K22496k57514R3144K38723J64133
6347C106194o3143N7745n7308N9630K38235j75381J27582K46731k75874L83712
6337C648123J39492K45183k44337J87437Q4185K25100m42720M31473O6973k49076
6327D091833M57568J22515L31999Q6947K83483J35686J06878M38864l5226K84002
6317F304549K1229N98122K30468Q41882O06212P66907J823838K203558L440173
$$ plain form
6308 16836938 18976996 20609569 20034484 19786727 18793385 16865775 15103721 13573037 12911315
6299 12911315 11961678 11919492 11481498 11218572 11784603 12192023 12362369 12739347 13696368 13769367
6289 13769367 13981505 14473836 14889658 15443630 15548594 16107346 16410080 16984945 17253405
6280 17253405 18018754 18020243 18491626 18861894 19034173 19587753 20346399 20984492 21948179 23261561
6270 23261561 24234235 25703344 27423692 29402870 31727090 33685133 36613773 39545322
6262 39545322 43088792 47178149 51874658 56902558 62844714 70621417 81307239 96524319
6254 96524319 116173305 142585635 179949516 234725957 309643454 389580746 455392790
6247 455392790 487576081 474573584 446161986 405617420 340832855 277531231 231907663
$$ packed form
6308A6836938K140058J632573n75085k47757r93342j927610j762054j530684o61722
6299A2911315r49637m2186m37994k62926N66031M07420J70346L76978R57021P2999
6289A3769367K12138M92331M15822N53972J04964N58752L02734N74865K68460
6280A7253405P65349J489M71383L70268J72279N53580P58646O38093R63687J313382
6270B3261561R72674J469109J720348J979178K324220J958043K928640K931549
6262C9545322L543470M089357M696509N027900N942156P776703J0685822J5217080
6254I6524319J9648986K6412330L7363881N4776441P4917497P9937292O5812044
6247D55392790L2183291j3002497k8411598m0544566o4784565o3301624m5623568
$$ plain form
6240 231907663 195641255 159352801 129321686 107637289 91342962 77465673 66739214
6233 66739214 58811874 52928388 48629220 45111584 42064765 39518645 37402007 35519361
6225 35519361 33747656 32076631 30789345 29675774 28246545 27288514 26083460 24744075
6217 24744075 23150347 21808201 20411406 19367985 18010925 16965470 16140688 15286527
6209 15286527 14517732 13896265 13080554 12673824 11971035 11528981 11372809 11080342 10311885
6200 10311885 10369622 10107138 9882125 9836499 9666030 9673930 9367922 9100845 8933072 8952283
6190 8952283 8694272 8350562 8598810 8617080 8736513 8357076 8049218 7816139 7651882 7709312
6180 7709312 7495821 7475763 7096822 6729808 6659787 6631889 6540762 6044155 6116783 5920527
$$ packed form
6240B31907663l6266408l6288454l0031115k1684397j6294327j3877289j0726459
6233F6739214p927340n883486m299168l517636l046819k546120k116638j882646
6225C5519361j771705j671025j287286j113571j429229r58031j205054j339385
6217B4744075j593728j342146j396795j043421j357060j045455q24782q54161
6209A5286527p68795o21467q15711m06730p02789m42054j56172k92467p68457
6200A0311885N7737k62484k25013m5626j70469P900l06008k67077j67773J9211
6190H952283k58011l43710K48248J8270J19433l79437l07858k33079j64257N7430
6180G709312k13491k0058l78941l67014p0021k7898r1127m96607P2628j96256
$$ plain form
6170 5920527 5566229 5429733 5742476 5508058 5253220 5478774 5273104 5226709 4870110 4688590
6160 4688590 4657169 4577202 4393093 4390761 4678728 4004812 4233295 4334870 4235086 3886444
6150 3886444 3915375 3719254 3787784 3641608 3657559 3682902 3648062 3475034 3688764 3424596
6140 3424596 3552353 3262596 3298009 3279962 3419035 3025904 2878602 2658625 2422840 2499072
6130 2499072 2057795 2430495 2210642 1976453 1973216 2320639 2177867 2222027 2544306 2343857
6120 2343857 2518830 2414425 2426948 2330126 2337311 2073497 1985024 1993584 1778157 1739833 1881225
6109 1881225 1708250 1691044 1794920 1732357 1608781 1658199 1471713 1578484 1751746 1581524
6099 1581524 1625586 1466224 1375451 1363074 1354500 1210402 1179763 1245738 1095795 1063740 824368
$$ packed form
6170E920527l54298j36496L12743k34418k54838K25554k05670m6395l56599j81520
6160D688590l1421p9967j84109k332K87967o73916K28483J01575r9784l48642
6150C886444K8931j96121O8530j46176J5951K5343l4840j73028K13730k64168
6140C424596J27757k89757L5413j8047J39073l93131j47302k19977k35785P6232
6130B499072m41277L72700k19853k34189l237L47423j42772M4160L22279k00449
6120B343857J74973j04405J2523r6822P185k63814q8473Q560k15427l8324J41392
6109A881225j72975j7206J03876o2563j23576M9418j86486J06771J73262j70222
6099A581524M4062j59362r0773j2377q574j44098l0639O5975j49943l2055k39372
$$ plain form
6088 824368 915476 738531 779664 901747 952010 707167 833778 918447 985612 917100 858010
6077 858010 1101692 887719 757030 1044261 1203302 733147 611063 873299 874167 820301
6067 820301 835364 880000 740366 616236 774967 587257 772452 741223 560222 985054
6057 985054 672345 576711 660317 886180 734179 808813 749959 864653 1034782 823538
6047 823538 725914 751319 680784 382391 323877 633315 623957 284317 554419 476262 453447
6036 453447 294758 580328 505419 512359 222065 363736 597757 391672 296366 557870
6026 557870 764438 384996 507961 474554 447409 232585 450224 472596 680989 422452
6016 422452 639059 445594 402091 510707 419387 470186 375763 335515 222891 391504 322545
$$ packed form
6088H24368R1108j76945M1133J22083N0263k44843J26611Q4669O7165o8512n9090
6077H58010K43682k13973j30689K87231J59041m70155j22084K62236Q68n3866
6067H20301J5063M4636j39634j24130J58731j87710J85195l1229j81001M24832
6057I85054l12709r5634Q3606K25863j52001P4634n8854J14694J70129k11244
6047H23538r7624K5405p0535k98393n8514L09438r358l39640K70102p8157k2815
6036D53447j58689K85570p4909O940k90294J41671K34021k06085r5306K61504
6026E57870K06568l79442J22965l3407k7145k14824K17639K2372K08393k58537
6016D22452K16607j93465m3503J08616r1320N0799r4423m0248j12624J68613o8959
$$ plain form
6005 322545 469279 190505 323631 194738 66796 54064 420548 203161 260439 170563
5995 170563 293030 208977 110218 451429 207585 126515 229079 297641 538425 197711
5985 197711 59527 220182 286433 -83572 384514 515289 125801 388075 217017 251689
5975 251689 474757 390327 595760 565699 395210 596505 580693 496475 531768 588169 761926
5964 761926 935250 817554 1163682 1085641 1396134 2131577 2291539 2520428 2733979 2628508
5954 2628508 2413476 2342953 2071444 1640547 1471551 1231857 927412 918490 551755 745007
5944 745007 430469 449087 367047 482900 312074 403214 311886 401854 497658 231805 383315
5933 383315 76889 97221 353168 560977 360559 473460 231024 211235 322153 139281
$$ packed form
6005C22545J46734k78774J33126j28893j27942j2732L66484k17387N7278q9876
5995A70563J22467q4053r8759L41211k43844q1070J02564O8562K40784l40714
5985A97711j38184J60655O6251l70005M68086J30775l89488K62274j71058L4672
5975B51689K23068q4430K05433l0061j70489K01295j5812q4218L5293N6401J73757
5964G61926J73324j17696L46128p8041L10493P35443J59962K28889K13551j05471
5954B628508k15032p0523k71509m30897j68996k39694l04445q922l66735J93252
5944G45007l14538J8618q2040J15853j70826R1140r1328Q9968R5804k65853J51510
5933C83315l06426K0332K55947K07809k00418J12901k42436j9789J10918j82872
$$ plain form
5923 139281 442217 302313 -5616 94108 182896 92517 54120 245720 104764 312867
5913 312867 29965 484397 437969 -50339 501201 220970 302879 45968 159638 213219
5903 213219 291363 76012 14576 321728 -265101 306511 20768 16062 -102059 3972
5893 3972 88007 169640 153798 -70292 132058 -136359 -66286 138827 75509 159875 -144121
5882 -144121 81852 -29368 123907 99502 47757 -78187 -111893 106292 138773 417796
5872 417796 93465 151597 296 356530 315396 181587 329792 139325 237158 183005
5862 183005 597330 528146 129538 164227 112381 357567 140609 491251 164041 192587
5852 192587 118166 341974 483957 43535 350800 12413 348945 272270 154178 -69473
$$ packed form
5923A39281L02936j39904l07929R9724Q8788r0379l8397J91600j40956K08103
5913C12867k82902M54432m6428m88308N51540k80231Q1909k56911J13670N3581
5903B13219P8144k15351o1436L07152n86829N71612k85743m706j18121J06031
5893C972Q4035Q1633j5842k24090K02350k68417P0073K05113o3318Q4366l03996
5882a44121K25973j11220J53275k4405n1745j25944l3706K18185L2481K79023
5872D17796l24331N8132j51301L56234m1134j33809J48205j90467R7833n4153
5862A83005M14325o9184l98608L4689n1846K45186k16958L50642l27210K8546
5852A92587p4421K23808J41983m40422L07265l38387L36532p6675j18092k23651
$$ plain form
5842 -69473 246339 218476 98762 162720 163656 81988 208989 292861 375421 327733 204756
5831 204756 238479 264715 13066 300145 436974 267651 295176 145461 218568 -1157
5821 -1157 178407 -109845 262894 128934 280982 21948 10562 201958 64422 7239
5811 7239 68814 317805 -371031 158342 174045 112427 68240 46991 -15806 43015 -160325
5800 -160325 146343 214205 -66700 -10811 157716 -73725 -54889 -9212 -205237 198058
5790 198058 112875 201423 61865 -9507 98763 175755 20054 182458 104334 -243116 -11790
5779 -11790 175316 159489 -13703 33856 -26219 -59297 -96691 50543 28357 105270 -211773
5768 -211773 30659 -36076 40202 -95293 -119228 -26434 -123466 230298 -43013 110665 -146901
$$ packed form
5842f9473L15812k7863j19714O3958R36q1668J27001Q3872Q2560m7688j22977
5831B04756L3723K6236k51649K87079J36829j69323K7525j49715P3107k19725
5821a157J79564k88252L72739j33960J52048k59034j1386J91396j37536n7183
5811G239O1575K48991o88836N29373J5703o1618m4187k1249o2797N8821k03340
5800a60325L06668O7862k80905N5889J68527k31441J8836M5677j96025M03295
5790A98058q5183Q8548j39558p1372J08270P6992j55701J62404p8124l47450K31326
5779a1790J87106j5827j73192M7559o0075l3078l7394J47234k2186P6913l17043
5768b11773K42432o6735P6278j35495k3935R2794r7032L53764k73311J53678k57566
$$ plain form
5757 -146901 132279 -82117 274481 -114901 -66161 -318140 -90370 87565 244347 55904
5747 55904 98281 117982 -195623 27585 179380 80293 -64660 69854 20955 192130 17851
5736 17851 -72062 -7874 107831 -116440 78981 44664 8700 46955 54994 368344 -107380
5725 -107380 169325 -134659 181596 50674 79525 3353 89837 136631 -64081 106708
5715 106708 219383 2016 -80568 309001 87118 -44216 -21306 117859 -39970 191713
5705 191713 -142396 205683 -51103 -292082 138345 76641 -63042 -83531 116545 -36492
5695 -36492 56132 -150366 206657 -56298 -20382 -1441 277237 -21438 330262 -137282
5685 -137282 144713 204858 129140 91207 399059 209900 -176972 162803 22278 249562
$$ packed form
5757a46901K79180k14396L56598l89382M8740k51979K27770J77935J56782j88443
5747E5904M2377J9701l13605K23208J51795r9087j44953J34514m8899J71175j74279
5736A7851q9913O4188J15705k24271J95421l4317l5964L8255Q039L13350m75724
5725a07380K76705l03984L16255j30922K8851p6172Q6484M6794k00712J70789
5715A06708J12675k17367q2584L89569k21883j31334K2910J39165j57829K31683
5705A91713l34109L48079k56786k40979M30427o1704j39683k0489K00076j53037
5695c6492R2624k06498L57023k62955L5916J8941K78678k98675L51700m67544
5685a37282K81995O0145p5718l7933L07852j89159l86872L39775j40525K27284
$$ plain form
5675 249562 131641 327235 205548 239365 181311 358962 473967 265818 131471 260157
5665 260157 320148 386768 221937 407250 611402 408946 693563 476564 422095 414572 622798
5654 622798 589272 875233 683754 702537 607999 733790 690531 896522 1183745 906394
5644 906394 1147610 1273284 1258802 945205 1096636 968663 973581 845816 846974 1205556 895446
5633 895446 1003693 963548 888172 624729 813582 710742 881786 764486 854539 774816
5623 774816 620941 498735 962244 573986 747813 752499 637057 795562 799775 760196 836139
5612 836139 789628 538053 625826 516589 620389 606568 480605 728233 539795 330177
5602 330177 648090 580925 535912 443239 531226 502667 577552 490784 351155 455427 277525
$$ packed form
5675B49562j17921J95594j21687L3817n8054J77651J15005k08149j34347J28686
5665B60157N9991O6620j64831J85313K04152k02456K84617k16999n4469p523K08226
5654F22798l3526K85961j91479J8783r4538J25791m3259K05991K87223k77351
5644I06394K41216J25674j4482l13597J51431j27973M918j27765J158L58582l10110
5633H95446J08247m0145p5376k63443J88853j02840J71044j17300R0053p9723
5623G74816j53875j22206M63509l88258J73827M686j15442J58505M213l9579P5943
5612H36139m6511k51575Q7773j09237J03800j3821j25963K47628j88438k09618
5602C30177L17913o7165m5013r2673Q7987k8559P4885q6768j39629J04272j77902
$$ plain form
5591 277525 528431 597010 410420 608202 371491 434165 635259 426308 467775 761029
5581 761029 643451 641876 781101 615110 876763 561700 365966 907692 705009 359127
5571 359127 1015951 701846 820001 842986 1059530 982888 812660 743181 1135082 897658
5561 897658 822039 1235491 683655 1068179 1064726 753217 969974 1327559 813506 1138717
5551 1138717 1186733 1179270 1151121 1151001 1212968 1577008 967947 1300059 1525740 1292308 1364952
5540 1364952 1719257 1733907 1601348 1527451 1650519 2017397 1701456 2028028 2194701 2098018
5530 2098018 2094049 2242466 2168318 2212371 2271201 1875029 2386847 2136447 2360248 2213511
5520 2213511 2436294 2435359 2365756 2459230 2747482 2604504 2515838 2844595 3024487 3156737 3349828
$$ packed form
5591B77525K50906O8579j86590J97782k36711O2674K01094k08951M1467K93254
5581G61029j17578j575J39225j65991K61653l15063j95734N41726k02683l45882
5571C59127O56824l14105J18155K2985K16544p6642j70228o9479L91901k37424
5561H97658p5619M13452n51836L84524l453l11509K16757L57585n14053L25211
5551A138717M8016p463k8149j20O1967L64040o09061L32112K25681k33432P2644
5540A364952L54305J4650j32559p3897J23068L66878l15941L26572J66673r6683
5530B098018l969J48417p4148M4053N8830l96172N11818k50400K23801j46737
5520B213511K22783r35o9603R3474K88252j42978q8666L28757J79892J32250J93091
$$ plain form
5509 3349828 3501607 3972452 4256502 4635021 5586462 6633085 8112968 10050860 12062604
5500 12062604 13306574 13482057 12410115 12017175 10779568 8578082 7565271 6947809 5914825
5491 5914825 5123059 4839302 4464350 4396397 3896287 3788024 3571827 3530092 3393315 3856757
5481 3856757 3513212 3566673 3480775 3677016 3799391 3673824 3769763 3722593 3560123 3671456
5471 3671456 3780629 3711287 3698149 3701909 3893393 3976748 3763619 4053837 4084506 4157069 4162317
5460 4162317 4315995 4423311 4457620 4076253 4513121 4751499 4725768 5044700 5173391 5267605
5450 5267605 5161975 5368104 5742128 5911283 5871066 6197146 6447848 6399328 6787167 6886263
5440 6886263 7370529 7678284 7726373 8196680 8446536 8920737 9286251 9644731 10212187 10398894
$$ packed form
5509C349828J51779M70845K84050L78519R51441J046623J479883J937892K011744
5500A2062604J243970J75483j071942l92940j237607k201486j012811o17462j032984
5491E914825p91766k83757l74952o7953n00110j08263k16197m1735j36777M63442
5481C856757l43545N3461q5898J96241J22375j25567R5939m7170j62470J11333
5471C671456J09173o9342j3138L760J91484Q3355k13129K90218L0669P2563N248
5460D162317J53678J07316L4309l81367M36868K38378k5731L18932J28691R4214
5450E267605j05630K06129L74024J69155m0217L26080K50702m8520L87839R9096
5440F886263M84266L07755M8089M70307K49856M74201L65514L58480N67456J86707
$$ plain form
5430 10398894 10856099 11367378 12217903 12697484 13458151 14109974 15328110 16108410 17540947
5421 17540947 19073163 20928578 22533006 24652386 27141525 29411902 31563357 33720991
5413 33720991 36176554 38168992 40229179 42627909 44898287 47342201 49189991 51332927
5405 51332927 53130392 54015332 54749446 55191822 55246427 55186913 55701666 56303237 57875895
5396 57875895 59448063 61950778 65255456 68722842 73173642 77048754 81439739 84876380
5388 84876380 88179207 91773737 95116669 97813571 100122108 102026600 102281588 101841001
5380 101841001 100789987 99055730 97164100 94984996 93086054 90456449 88076608 85347287
5372 85347287 82788580 80704310 78643300 77394082 76470116 75518799 74649450 73945709 72764438
$$ packed form
5430A0398894M57205N11279Q50525M79581P60667O51823J218136P80300J432537
5421A7540947J532216J855415J604428K119380K489139K270377K151455K157634
5413C3720991K455563J992438K060187K398730K270378K443914J847790K142936
5405E1332927J797465Q84940P34114M42376N4605n9514N14753O01571J572658
5396E7875895J572168K502715L304678L467386M450800L875112M390985L436641
5388H4876380L302827L594530L342932K696902K308537J904492K54988m40587
5380A01841001j051014j734257j891630k179104j898942k629605k379841k729321
5372H5347287k558707k084270k061010j249218r23966r51317q69349p03741j181271
$$ plain form
5363 72764438 71627362 70126096 68025747 65713612 62648245 59368049 55943255 52285758
5355 52285758 48979956 45308038 41838966 39148093 36315188 33799367 32052012 29716831
5347 29716831 27890486 26388147 24881837 23635637 22356743 21449649 20691323 20068699 19289478
5338 19289478 18938208 18421124 18139213 18084116 18236453 18685397 18562517 18533298 18103026 17875071
5328 17875071 17412961 16824612 16287224 15914117 15628694 15515588 15464557 15646697 15162412 15394832
5318 15394832 15741286 15994554 15780628 16422722 16516068 16880571 17108825 17682137 18256283 18378039
5308 18378039 18612914 19090502 19423154 19703514 20312958 20762479 21341172 21620043 22013419
5299 22013419 22324306 22552152 22870148 23244773 24096011 24719358 25137056 25827588 26847056
$$ packed form
5363G2764438j137076j501266k100349k312135l065367l280196l424794l657497
5355E2285758l305802l671918l469072k690873k832905k515821j747355k335181
5347B9716831j826345j502339j506310j246200j278894r07094p58326o22624p79221
5338A9289478l51270n17084k81911n5097J52337M48944j22880k9219m30272k27955
5328A7875071m62110n88349n37388l73107k85423j13106n1031J82140m84285K32420
5318A5394832L46454K53268k13926O42094R3346L64503K28254N73312N74146J21756
5308A8378039K34875M77588L32652K80360O09444M49521N78693K78871L93376
5299B2013419L10887K27846L17996L74625Q51238O23347M17698O90532J019468
$$ plain form
5290 26847056 28055635 29238189 30895969 32412340 33958569 35975619 38240232 41241580
5282 41241580 43666469 46738308 49683900 52770593 55576417 58097168 60688863 62758119
5274 62758119 64793327 66230314 67876878 68628710 69510180 70673021 71675933 73657134
5266 73657134 75823634 78430176 81007067 83793988 86081793 88467993 91453579 93709630
5258 93709630 96565052 99297277 101498331 102658228 102851400 102732193 101059984 99353659
5250 99353659 96859539 94348528 90914721 86917089 82794617 78981559 74787148 71155882
5242 71155882 68502525 66000724 64363791 63163533 62823391 62257144 61862674 61597551 61302369
5233 61302369 60584974 59290772 57890383 55908573 54160969 51769581 49466459 47366554
$$ packed form
5290B6847056J208579J182554J657780J516371J546229K017050K264613L001348
5282D1241580K424889L071839K945592L086693K805824K520751K591695K069256
5274F2758119K035208J436987J646564P51832Q81470J162841J002912J981201
5266G3657134K166500K606542K576891K786921K287805K386200K985586K256051
5258I3709630K855422K732225K201054J159897J93172j19207j672209j706325
5250I9353659k494120k511011l433807l997632m122472l813058m194411l631266
5242G1155882k653357k501801j636933j200258l40142n66247l94470k65123k95182
5233F1302369p17395j294202j400389j981810j747604k391388k303122k099905
$$ plain form
5225 47366554 44800385 41926156 39509534 36943470 33879630 31378899 28684445 26317446
5217 26317446 24483271 22544750 20813088 19354200 18165710 16597283 16091236 15363645
5209 15363645 14498972 13825093 13281436 12710293 12312620 11768348 11300957 10793383 10317793
5200 10317793 9984970 9781937 9532742 9077365 8661910 8589270 8211221 8045619 7890491 7700518
5190 7700518 7137546 7210654 7123879 6844308 6794532 6366856 6262355 6192528 6051078 5945682
5180 5945682 5772228 5827396 5499540 5558446 5597244 5329515 5073051 5238249 5140647 4953885
5170 4953885 5244052 4881984 4748967 4607052 4386444 4624058 4433274 4363791 4083605 4299372
5160 4299372 4033150 3874983 3705450 3586567 3525010 3493344 3684587 3558447 3501561 3528934
$$ packed form
5225D7366554k566169k874229k416622k566064l063840k500731k694454k366999
5217B6317446j834175j938521j731662j458888j188490j568427n06047p27591
5209A5363645q64673o73879n43657n71143l97673n44272m67391n07574m75590
5200A0317793l32823k03033k49195m55377m15455p2640l78049j65602j55128j89973
5190G700518n62972P3108q6775k79571m9776m27676j04501o9827j41450j05396
5180E945682j73454N5168l27856N8906L8798k67729k56464J65198r7602j86762
5170D953885K90167l62068j33017j41915k20608K37614j90784o9483k80186K15767
5160D299372k66222j58167j69533j18883o1557l1666J91243j26140n6886K7373
$$ plain form
5150 3528934 3291059 3299446 3088024 3017820 3118160 2903264 3067774 3144058 3117219 2866788
5140 2866788 2771434 2592283 2631624 2656109 2951189 3005586 2590891 2835999 2549656 2629170
5130 2629170 2509598 2526653 2487297 2496380 2471466 2509118 2340218 2312439 2257282 2184578 2177559
5119 2177559 2267183 2159015 2048842 2095287 2327992 2159183 2077526 2023779 1917489 2049678
5109 2049678 1951177 2012843 1920373 1946786 1713641 1907230 1876113 1697788 1693139 1427049 1677140
5098 1677140 1449447 1366468 1631944 1350640 1250870 1353688 1289315 1378275 1105645 1231091
5088 1231091 1401095 1106069 1058609 1514959 963284 941873 1159582 1189071 1066310 1261932
5078 1261932 1115341 1252846 1112254 1122656 1131011 961402 1027333 1323629 1105600 1238096
$$ packed form
5150C528934k37875Q387k11422p0204J00340k14896J64510P6284k6839k50431
5140B866788r5354j79151L9341K4485K95080N4397m14695K45108k86343P9514
5130B629170j19572J7055l9356R083k4914L7652j68900k7779n5157p2704p019
5119B177559Q9624j08168j10173M6445K32705j68809q1657n3747j06290J32189
5109B049678r8501O1666r2470K6413k33145J93589l1117j78325m649k66090K50091
5098A677140k27693q2979K65476k81304r9770J02818o4373Q8960k72630J25446
5088A231091J70004k95026m7460M56350n51675k1411K17709K9489j22761J95622
5078A261932j46591J37505j40592J0402Q355j69609O5931K96296k18029J32496
$$ plain form
5068 1238096 1323458 1260906 1183141 1111066 1193539 1156191 1022774 1134176 1347791 1294018 1244401
5057 1244401 1296901 1456821 1151045 1337171 1233059 1151132 1454591 1362539 1520750 1329890
5047 1329890 1527110 1171611 1278889 1238552 1196702 1339844 1382370 1360430 1323469 1469828
5037 1469828 1185607 1165383 1397161 1175055 1297462 1356988 1500264 1265124 1535829 1484014
5027 1484014 1335641 1458102 1371895 1664123 1311285 1485361 1475423 1273354 1392465 1204653
5017 1204653 1428677 1317433 1396643 1369110 1743741 1327292 1530091 1359420 1403338 1335271
5007 1335271 1736985 1599589 1453213 1666879 1619222 1620373 1648847 1707163 1859444 1757502
4997 1757502 1748465 1760078 1650706 1552052 1596357 1716492 1676730 1700931 1553291 1582776 1428851
$$ packed form
5068A238096Q5362o2552p7765p2075Q2473l7348j33417J11402K13615n3773m9617
5057A244401N2500J59920l05776J86126j04112q1927L03459r2052J58211j90860
5047A329890J97220l55499J07278m0337m1850J43142M2526k1940l6961J46359
5037A469828k84221k0224K31778k22106J22407N9526J43276k35140K70705n1815
5027A484014j48373J22461q6207K92228l52838J74076r938k02069J19111j87812
5017A204653K24024j11244P9210k7533L74631m16449K02799j70671M3918o8067
5007A335271M01714j37396j46376K13666m7657J151K8474N8316J52281j01942
4997A757502r037J1613j09372r8654M4305J20135l9762K4201j47640K9485j53925
$$ plain form
4986 1428851 1535667 1624572 1724589 1747757 1663653 1775740 1773764 1750620 1568799 1708074 1944800
4975 1944800 1919608 1755180 1737649 1884264 1713990 1638782 1905407 1901136 1616617 1631892 1675295
4964 1675295 1889670 1592698 1747008 1744184 1910058 1614558 1775037 1849268 1747649 1680582
4954 1680582 1661975 1979168 1742248 1765673 1747259 2021487 1871631 1912840 2000984 1893737
4944 1893737 1715962 1855077 1904791 1982533 1917782 1982128 1847825 2097824 1985240 1877752
4934 1877752 2000650 1955603 1976182 1796072 2054908 1878743 1938065 1751624 1890133 1984840
4924 1984840 1925815 1727857 2066378 1827760 1646797 1983303 1988951 2014543 1652205 1928448
4914 1928448 1850819 1800512 1785315 1953608 1987579 1960373 1891991 1844282 1954751 1859382 1968509
$$ packed form
4986A428851J06816Q8905J00017K3168q4104J12087j976k3144j81821J39275K36726
4975A944800k5192j64428j7531J46615j70274p5208K66625m271k84519J5275M3403
4964A675295K14375k96972J54310k824J65874k95500J60479P4231j01619o7067
4954A680582j8607L17193k36920K3425j8414K74228j49856M1209Q8144j07247
4944A893737j77775J39115M9714P7742o4751O4346j34303K49999j12584j07488
4934A877752J22898m5047K0579j80110K58836j76165N9322j86441J38509R4707
4924A984840n9025j97958L38521k38618j80963L36506N648K5592l62338K76243
4914A928448p7629n0307j5197J68293L3971k7206o8382m7709J10469r5369J09127
$$ plain form
4903 1968509 1927708 1997336 1932088 1914446 1935612 1717820 1907945 2069169 1906701 1992780 1948709
4892 1948709 1885575 1802702 1936327 1850121 1736098 1898869 1696910 1765298 1782143 1820117 1692654
4881 1692654 2021148 1843135 1886686 1695739 1882178 1804871 2047834 1974253 1972816 2145879
4871 2145879 1737484 2014878 2128875 2163876 2060720 2100122 2149102 2123020 2014513 2087079
4861 2087079 2256267 2102704 2091839 2301291 2313614 2151582 2077896 2255811 2279779 2260401
4851 2260401 2107284 2147748 2305078 2109785 2333617 2463814 2368886 2510574 2245462 2420960
4841 2420960 2370826 2513630 2402035 2769254 2850267 2909870 3247153 3476061 3607542 3569031
4831 3569031 3356206 3752956 3575996 3214339 3293649 3202911 3132782 3118134 3202381 3145662 3120394
$$ packed form
4903A968509m0801O9628o5248j7642K1166k17792J90125J61224j62468Q6079m4071
4892A948709o3134q2873J33625q6206j14023J62771k01959O8388J6845L7974j27463
4881A692654L28494j78013M3551j90947J86439p7307K42963p3581j437J73063
4871B145879m08395K77394J13997L5001j03156L9402M8980k6082j08507P2566
4861B087079J69188j53563j0865K09452J2323j62032p3686J77915K3968j9378
4851B260401j53117M0464J57330j95293K23832J30197r4928J41688k65112J75498
4841B420960n0134J42804j11595L67219Q1013N9603L37283K28908J31481l8511
4831C569031k12825L96750j76960l61657P9310r0738p0129j4648Q4247n6719k5268
$$ plain form
4820 3120394 3121315 3340599 3293515 3242587 3310879 3322130 3401150 3369345 3575389 3432405 3414935
4809 3414935 3438075 3536965 3584728 3798814 3723805 3867184 3737483 3790740 3904912 3993782 4068243
4798 4068243 4008546 4308047 4313873 4412018 4364713 4652726 4615031 4705036 4797807 4981148 5082788
4787 5082788 5159250 5098354 5278007 5394455 5551216 5707988 5680316 5857088 6142741 6251045
4777 6251045 6455769 6748619 6620107 6785371 7127375 7508342 7580261 8164895 8419460 8810849
4767 8810849 9045708 9486304 10179105 10489411 11397625 11956308 13160258 13355161 14354203
4758 14354203 15060274 16156406 16564989 17658153 18566610 19020007 19511438 20481034 21294897
4749 21294897 21755649 22841401 23732150 24386547 25586211 26838757 27612529 28872152 29493059
$$ packed form
4820C120394R21K19284m7084n0928O8292J1251P9020l1805K06044j42984j7470
4809C414935K3140R8890M7763K14086p5009J43379j29701N3257J14172Q8870P4461
4798D068243n9697K99501N826R8145m7305K88013l7695R0005R2771J83341J01640
4787E082788P6462o0896J79653J16448J56761J56772k7672J76772K85653J08304
4777F251045K04724K92850j28512J65264L42004L80967P1919N84634K54565L91389
4767H810849K34859M40596O92801L10306R08214N58683J203950J94903R99042
4758A4354203P06071J096132M08583J093164R08457M53397M91431R69596Q13863
4749B1294897M60752J085752Q90749O54397J199664J252546P73772J259623O20907
$$ plain form
4740 29493059 30757688 31349384 32225907 32785319 33361678 33887347 34943163 35937439 37160761
4731 37160761 38496173 40109789 41555477 42775912 44705926 46487892 48392805 50401776
4723 50401776 53287401 55926622 58987042 61788492 64388350 66308552 68148793 69955700
4715 69955700 71481918 72948148 74526478 76428504 78173208 80387948 82158305 84583125
4707 84583125 87325687 90351054 94044056 98443066 103604946 109473638 116214878 123529830
4699 123529830 130908559 138098785 144156018 148477750 151337549 152479068 152800493 152848708
4691 152848708 152273819 152086566 152157903 152258170 152692736 152708920 152699633 152602714 152471421 151863466
4681 151863466 151525578 150983036 150663435 150699087 151042753 151904277 152343454 151652066 149926141
$$ packed form
4740B9493059J264629N91696Q76523N59412N76359N25669J055816R94276J223322
4731C7160761J335412J613616J445688J220435J930014J781966J904913K008971
4723E0401776K885625K639221L060420K801450K599858J920202J840241J806907
4715F9955700J526218J466230J578330J902026J744704K214740J770357K424820
4707H4583125K742562L025367L693002M399010N161880N868692O741240P314952
4699A23529830P378729P190226O057233M321732K859799J141519L21425M8215
4691A52848708n74889j87253P1337J00267M34566J6184r287r6919j31293o07955
4681A51863466l37888n42542l19601L5652L43666Q61524M39177o91388j725925
$$ plain form
4672 149926141 146589069 141563255 135908330 129333999 122410037 115426108 108737459 102937168
4664 102937168 97507026 92730896 88603088 85155329 82289281 79795623 77272102 75366270
4656 75366270 73596978 71971431 70714192 69485221 67831222 66249931 64303083 62197359
4648 62197359 60073381 57601058 55101003 53332599 51089856 49041235 47074007 45421572
4640 45421572 43286050 41089668 39193821 37721703 36165927 34817126 33607764 32472820
4632 32472820 31611035 31065382 30314874 29896287 29277586 28765021 28294091 27737708 26700098
4623 26700098 25879637 25049599 23815118 23259031 22467321 21763318 20994469 20172992 19075962
4614 19075962 18449584 17886500 17291926 16658686 16138346 15459398 14813113 14209727 13591126
$$ packed form
4672A49926141l337072n025814n654925o574331o923962o983929o688649n800291
4664A02937168n430142m776130m127808l447759k866048k493658k523521j905832
4656G5366270j769292j625547j257239j228971j653999j581291j946848k105724
4648F2197359k123978k472323k500055j768404k242743k048621j967228j652435
4640D5421572k135522k196382j895847j472118j555776j348801j209362j134944
4632C2472820q61785n45653p50508m18587o18701n12565m70930n56383j037610
4623B6700098q20461q30038j234481n56087p91710p04003p68849q21477j097030
4614A9075962o26378n63084n94574o33240n20340o78948o46285o03386o18601
$$ plain form
4605 13591126 12959269 12341923 12185284 11471022 10952269 10457888 9969946 9653434 9331900
4596 9331900 8963794 8860556 8788927 8271277 8039450 7933220 7732767 7359693 7234007 7080212
4586 7080212 6859842 6747504 6676281 6456876 6316885 5971259 5895280 5803334 5616557 5574949
4576 5574949 5404933 5413538 5209557 5223954 4857383 4849397 4886388 4908940 4755136 4668081 4834974
4565 4834974 4497367 4289977 4519501 4514431 4207272 4305076 4137113 3850396 3951006 3918237
4555 3918237 3949969 3624499 3643261 3587610 3485324 3622639 3327651 3475562 3362722 3509139
4545 3509139 3013215 3207227 3172533 2932363 3128506 2839367 2962967 2825595 2950703 2655782
4535 2655782 2773592 2648169 2648993 2720758 2725863 2712374 2630105 2905311 2874126 2722723 2893023
$$ packed form
4605A3591126o31857o17346j56639p14262n18753m94381m87942l16512l21534
4596I331900l68106j03238p1629n17650k31827j06230k00453l73074j25686j53795
4586G080212k20370j12338p1223k19405j39991l45626p5979r1946j86777m1608
4576E574949j70016Q605k03981J4397l66571p986L6991K2552j53804q7055J66893
4565D834974l37607k07390K29524n070l07159R7804j67963k86717J00610l2769
4555C918237L1732l25470J8762n5651j02286J37315k94988J47911j12840J46417
4545C509139m95924J94012l4694k40170J96143k89139J23600j37372J25108k94921
4535B655782J17810j25423Q24P1765N105j3489q2269K75206l1185j51403J70300
$$ plain form
4524 2893023 2899807 3329235 3107913 3364993 3264052 3352306 3520913 3503177 3725532 3719035 3577671
4513 3577671 3377370 3627061 3221646 3325984 3573478 3449758 3277300 3222753 3304412 3184424
4503 3184424 3160818 2961911 3133894 3184772 3075694 3151069 3073304 3075995 2746381 2675608 2755961
4492 2755961 2460349 2314892 2317061 2378957 2139020 2129050 2010890 1868085 1753794 1680876 1716362
4481 1716362 1771898 1738218 1597924 1810911 1630733 1558318 1591670 1599179 1550879 1630844 1626629
4470 1626629 1718595 1657167 1608527 1571961 1806759 1817673 1852323 1507703 1741255 1664922 1605992
4459 1605992 1840648 1769950 1815431 1742639 1781846 1670579 2060324 1733405 1840695 2013649
4449 2013649 1855820 1976802 1739085 1992930 1669272 1647141 1834415 1873268 1733422 1717041
$$ packed form
4524B893023O784M29428k21322K57080j00941Q8254J68607j7736K22355o497j41364
4513C577671k00301K49691m05415J04338K47494j23720j72458n4547Q1659j19988
4503C184424k3606j98907J71983N0878j09078P5375p7765K691l29614p0773Q0353
4492B755961k95612j45457K169O1896k39937r970j18160j42805j14291p2918L5486
4481A716362N5536l3680j40294K12987j80178p2415L3352P509m8300P9965m215
4470A626629R1966o1428m8640l6566K34798J0914L4650l44620K33552p6333n8930
4459A605992K34656p0698M5481p2792L9207j11267L89745l26919J07290J72954
4449B013649j57829J20982k37717K53845l23658k2131J87274L8853j39846j6381
$$ plain form
4439 1717041 1840166 1663967 1799380 1601578 1576636 1561278 1573852 1691968 1686886 1755188 1462087
4428 1462087 1713970 1405868 1345934 1574890 1702186 1546287 1465626 1614511 1260242 1316369
4418 1316369 1392838 1393783 1376870 1440140 1594774 1301956 1467418 1525726 1517864 1610465 1541061
4407 1541061 1533371 1433882 1694470 1634677 1947230 1721820 1649251 1885490 1878890 1889035 1912249
4396 1912249 2134299 1968099 1902172 2006066 2114092 2070990 1896293 2114564 2046099 1841808
4386 1841808 2157448 1936476 2018768 1594711 1711929 1724351 1829244 1591148 1606249 1821044
4376 1821044 1559619 1497916 1647248 1565633 1256727 1539078 1363611 1559047 1770406 1888903
4366 1888903 1790406 1666072 1809632 1730641 1740664 1967743 2018951 1800191 1777561 2142764
$$ packed form
4439A717041J23125j76199J35413j97802k4942j5358J2574J18116n082O8302k93101
4428A462087K51883l08102n9934K28956J27296j55899q0661J48885l54269N6127
4418A316369P6469R45j6913O3270J54634k92818J65462N8308p862R2601o9404
4407A541061p690r9489K60588n9793L12553k25410p2569K36239o600J0145K3214
4396A912249K22050j66200o5927J03894J08026m3102j74697K18271o8465k04291
4386A841808L15640k20972Q2292m24057J17218J2422J04893k38096J5101K14795
4376A821044k61425o1703J49332q1615l08906K82351j75467J95436K11359J18497
4366A888903r8497j24334J43560p8991J0023K27079N1208k18760k2630L65203
$$ plain form
4356 2142764 1878837 1978008 2066183 2046893 1965877 1758789 1990109 1928859 1772305 1522806
4346 1522806 1918353 1610945 1554176 1508873 1515439 1304392 1224589 1542357 1231279 1376821
4336 1376821 1154171 1173422 1212796 1313527 1067508 1233723 1392588 1325591 1125129 1123621
4326 1123621 1355637 1118186 1326510 1241698 1578530 1371489 1260986 1397946 1540620 1280708
4316 1280708 1413558 1565185 1585952 1507498 1724712 1910755 1955527 1784455 1905649 1904282
4306 1904282 1720798 1990463 2059194 2223970 2034314 1925973 1653757 1810517 1608286 1400549
4296 1400549 1469598 1252629 1318180 1268850 1156991 1134373 941313 728573 1203947 1320844
4286 1320844 1005321 720134 1205456 759863 958084 781159 917893 803865 657039 842434
$$ packed form
4356B142764k63927R9171Q8175j9290q1016k07088K31320o1250j56554k49499
4346A522806L95547l07408n6769m5303O566k11047p9803L17768l11078J45542
4336A376821k22650J9251L9374J00731k46019J66215J58865o6997k00462j508
4326A123621K32016k37451K08324q4812L36832k07041j10503J36960J42674k59912
4316A280708J32850J51627K0767p8454K17214J86043M4772j71072J21194j367
4306A904282j83484K69665O8731J64776j89656j08341k72216J56760k02231k07737
4296A400549O9049k16969O5551m9330j11859k2618j93060k12740M75374J16897
4286A320844l15523k85187M85322m45593J98221j76925J36734j14028j46826J85395
$$ plain form
4276 842434 784247 906894 652283 939128 847977 937090 777783 698214 758626 707360 852730
4265 852730 957924 988547 705832 700498 811483 803298 1014067 970063 786643 824274 767246
4254 767246 1139685 980404 1093215 813657 1102191 740805 1224914 1101474 1344879 938274
4244 938274 1319278 1571128 1395822 1528715 1218744 1535449 1344501 1834628 1734349 1853291
4234 1853291 1659481 1548675 1783666 1769950 2035732 1739311 1465255 1724215 1579542 1305182
4224 1305182 1401789 1464449 1051739 981887 1199823 1244884 1152541 1036051 1180450 1357003
4214 1357003 1343384 1209831 1385565 1054951 1002068 1261905 1255281 1148812 1024059 879320
4204 879320 975890 1042889 1057749 911590 918436 1026571 823723 933269 941810 851551 667824
$$ packed form
4276H42434n8187J22647k54611K86845r1151Q9113j59307p9569O0412n1266J45370
4265H52730J05194L0623k82715n334J10985q185K10769m4004j83420L7631n7028
4254G67246L72439j59281J12811k79558K88534l61386M84109j23440K43405m06605
4244I38274L81004K51850j75306J32893l09971L16705j90948M90127j00279J18942
4234A853291j93810j10806K34991j3716K65782k96421k74056K58960j44673k74360
4224A305182R6607O2660m12710o9852K17936M5061r2343j16490J44399J76553
4214A357003j3619j33553J75734l30614n2883K59837o624j06469j24753j44739
4204H79320R6570O6999J4860j46159O846J08135k02848J09546Q541r0259j83727
$$ plain form
4193 667824 626795 1118338 896850 834771 1003341 1240447 1303226 1519287 1496739 1529344 1083695
4182 1083695 1090242 1182732 1350483 1178772 1228934 1491431 1333117 1838492 2084504 2242668
4172 2242668 2193505 2189621 2272263 2031473 1882791 1477838 1227453 1145641 1010607 975541 990717
4161 990717 1190330 1169151 1080505 1063042 1015872 952826 1056120 1206033 1147553 1418643 1459976
4150 1459976 1627709 1838487 1862787 1888615 1693188 1488973 1261138 1141773 1145967 1091966
4140 1091966 845377 674691 406477 487480 435162 470934 435889 359067 452951 452267 567372
4129 567372 284594 463656 286526 444404 459423 560533 485338 157442 222470 331938
4119 331938 400864 487291 496125 324287 138978 186369 295286 496364 290125 172243 373143
$$ packed form
4193F67824m1029M91543k21488o2079J68570K37106O2779K16061k2548L2605m45649
4182A083695O547R2490J67751j71711N0162K62497j58314N05375K46012J58164
4172B242668m9163l884Q2642k40790j48682m04953k50385q1812j35034l5066J5176
4161I90717J99613k1179q8646j7463m7170o3046J03294J49913n8480K71090M1333
4150A459976J67733K10778K4300K5828j95427k04215k27835j19365M194n4001
4140A091966k46589j70686k68214Q1003n2318L5772l5045p6822R3884o84J15105
4129E67372k82778J79062j77130J57878J5019J01110p5195l27896O5028J09468
4119C31938O8926Q6427Q834j71838j85309M7391J08917K01078k06239j17882K00900
$$ plain form
4108 373143 307157 311418 395836 465002 246407 299113 261070 490906 130423 290515 175565
4097 175565 360242 432813 346778 331419 271588 287411 215495 529972 437282 214954 193976
4086 193976 155019 440160 158995 385816 371642 569591 302920 354602 344351 181656
4076 181656 169305 379111 550915 409380 360977 195254 276276 253337 577985 655191 601127
4065 601127 537911 518746 405086 618244 666077 607533 581565 671622 723480 677059 569478
4054 569478 816716 629604 895313 889714 806334 621115 864973 1035493 916667 1259889
4044 1259889 1043570 1193504 927329 1238364 1442912 1327783 1618517 1561998 1736376 1647195
4034 1647195 2062086 2273366 2438066 2638697 3176113 3672345 4355934 4859476 5230312 5935704
$$ packed form
4108C73143o5986M261Q4418O9166k18595N2706l8043K29836l60483J60092j14950
4097A75565J84677P2571q6035j5359n9831J5823p1916L14477r2690k22328k0978
4086A93976l8957K85141k81165K26821j4174J97949k66671N1682j0251j62695
4076A81656j2351K09806J71804j41535m8403j65723Q1022k2939L24648P7206n4064
4065F01127o3216j9165j13660K13158M7833n8544k5968R0057N1858m6421j07581
4054E69478K47238j87112K65709n599q3380j85219K43858J70520j18826L43222
4044A259889k16319J49934k66175L11035K04548j15129K90734n6519J74378q9181
4034A647195M14891K11280J64700K00631N37416M96232O83589N03542L70836P05392
$$ plain form
4024 5935704 6488011 6460779 6537503 6194963 5733380 4996513 4487141 4354827 3903493 3171410
4014 3171410 2869397 2536515 2164546 2151016 1938812 1831320 1713032 1530969 1563132 1685804
4004 1685804 1383653 1250196 1461036 1495229 1582465 1417687 1722759 1764607 1704466 1491471
3994 1491471 1753517 1578998 1227275 1069238 1091496 1033182 804910 1086785 914806 641460
3984 641460 432242 708596 576087 752776 734643 811831 673401 844624 440322 425671
3974 425671 510231 574169 788071 628841 462946 498844 403855 429306 449520 574590 626714
3963 626714 332997 497638 631017 444807 318538 533948 330948 236345 585169 343533
3953 343533 375366 316494 232795 555244 235753 293437 311802 166757 101169 123015 438527
$$ packed form
4024E935704N52307k7232P6724l42540m61583p36867n09372j32314m51334p32083
4014C171410l02013l32882l71969j3530k12204j07492j18288j82063L2163J22672
4004A685804l02151j33457K10840L4193Q7236j64778L05072M1848o0141k12995
3994A491471K62046j74519l51723j58037K2258n8314k28272K81875j71979k73346
3984F41460k09218K76354j32509J76689j8133P7188j38430J71223m04302j4651
3974D25671Q4560O3938K13902j59230j65895L5898r4989K5451K0214J25070N2124
3963F26714k93717J64641J33379j86210j26269K15410k03000r4603L48824k41636
3953C43533L1833n8872q3699L22449l19491N7684J8365j45045o5588K1846L15512
$$ plain form
3942 438527 -7624 286023 150264 296312 80548 253666 529068 253800 249332 -22102
3932 -22102 306079 -104702 537140 313123 208478 312168 254024 294808 35286 228797
3922 228797 163179 398874 269429 168972 337198 143166 283011 276936 347248 156137
3912 156137 306686 216504 43935 267190 150629 359904 138301 352817 188500 118045
3902 118045 171983 208757 110606 -33182 275689 -47180 336255 95685 147219 326838
3892 326838 11444 -16462 14992 69209 -136954 187251 116119 162504 50906 -42364 159616
3881 159616 -132893 -96391 147492 -28221 111949 37904 150085 206132 40092 -145179
3871 -145179 122087 89180 -226747 206977 218484 -9893 147450 128022 259759 287720
$$ packed form
3942D38527m46151K93647j35759J46048k15764J73118K75402k75268m468k71434
3932b2102L28181m10781O41842k24017j04645J03690n8144M0784k59522J93511
3922B28797o5618K35695j29445j00457J68226j94032J39845o075P0312j91111
3912A56137J50549r0182j72569K23255j16561K09275k21603K14516j64317p0455
3902A18045N3938L6774r8151j43788L08871l22869L83435k40570N1534J79619
3892C26838l15394k7906L1454N4217k06163L24205p1132M6385j11598r3270K01980
3881A59616k92509L6502K43883j75713J40170p4045J12181N6047j66040j85271
3871a45179K67266l2907l15927M33724J1507k28377J57343j9428J31737K7961
$$ plain form
3861 287720 263260 135658 197300 49779 -82560 69739 16187 185722 103268 171180 296098
3850 296098 -36902 -5802 -114287 -101032 -128653 162863 -131111 99105 -106518 60750
3840 60750 -160145 -88887 -167659 -214995 30646 48026 28735 -26056 62616 -122890 -14010
3829 -14010 -59563 -173429 149708 -185264 99179 24930 141794 -50084 91340 -51619
3819 -51619 -135540 167630 -48009 371846 -232176 37063 91567 -85973 159418 -41104
3809 -41104 -20010 28447 181992 -139186 75494 -23754 -154484 315768 132254 204414 -81259
3798 -81259 280768 -105143 -73917 87158 -43268 19635 -221526 233129 -129340 305448
3788 305448 -44688 60624 121997 -8328 130626 183007 51254 -122081 221381 -35038
$$ packed form
3861B87720k4460j27602O1642j47521j32339J52299n3552J69535q2454O7912J24918
3850B96098l33000L1100j08485J3255k7621K91516k93974K30216k05623J67268
3840F0750k20895P1258p8772m7336K45641J7380j9291n4791Q8672j85506J08880
3829a4010m5553j13866L23137l34972K84443p4249J16864j91878J41424j42959
3819e1619q3921L03170k15639M19855o04022K69239N4504j77540K45391k00522
3809d1104K1094M8457J53545l21178K14680r9248j30730M70252j83514P2160k85673
3798h1259L62027l85911L1226J61075j30426O2903k41161M54655l62469M34788
3788C05448l50136J05312O1373j30325J38954N2381j31753j73335L43462k56419
$$ plain form
3778 -35038 72979 265735 -102488 146367 168839 145165 -180161 41823 173476 -81961
3768 -81961 79055 6121 275666 -340797 119814 -45230 -179904 180090 -15456 79058
3758 79058 28381 247097 -17285 277551 -144111 -26410 67708 -31544 96430 261200
3748 261200 178291 59091 220802 76979 -127545 43456 85223 78419 74824 287943 35496
3737 35496 123106 94860 -161887 133305 -10965 105944 -56428 153711 -48458 -3069
3727 -3069 91370 247875 -53619 -168873 174582 -65212 103539 -23279 130467 -118668
3717 -118668 123938 -117079 88564 247964 103384 -48447 115897 69070 54657 -18382
3707 -18382 -47543 108671 166011 27043 204471 104816 -356674 -20497 3756 286799 111300
$$ packed form
3778c5038J08017J92756l68223K48855K2472k3674l25326K21984J31653k55437
3768h1961J61016p2934K69545o16463M60611j65044j34674L59994j95546R4514
3758G9058n0677K18716k64382K94836m21662J17701R4118r9252J27974J64770
3748B61200q2909j19200J61711j43823k04524J71001M1767o804l595K13119k52447
3737C5496Q7610k8246k56747K95192j44270J16909j62372K10139k02169M5389
3727c069R4439J56505l01494j15254L43455k39794J68751j26818J53746k49135
3717a18668K42606k41017K05643J59400j44580j51831J64344m6827j4413p3039
3707a8382k9161J56214N7340j38968J77428r9655m61490L36177K4253K83043j75499
$$ plain form
3696 111300 155527 48173 32540 -170779 24219 179103 -25605 97609 -62168 -121979
3686 -121979 6140 171741 -3916 51211 173720 -9608 74582 -19827 -134624 -153979
3676 -153979 -12669 -107802 67638 -50182 147470 -37199 -40435 164240 68425 -84375
3666 -84375 135414 -228608 139834 167982 -158261 98619 133079 -147204 -207217 152633
3656 152633 -57664 150539 150532 88584 65108 -47848 -190183 168320 165676 160970 118042 -89734
3644 -89734 49301 -89063 100435 180713 190232 -42123 196390 23543 13599 54717 -153156
3633 -153156 36750 193314 -156346 60728 367231 -88317 -183525 246971 67115 124366
3623 124366 128434 -104547 12191 62665 250105 67742 -10837 -169819 -110444 65602 198140
$$ packed form
3696A11300M4227j07354j5633k03319J94998J54884k04708J23214j59777n9811
3686a21979J28119J65601j75657N5127J22509j83328Q4190r4409j14797j9355
3676a53979J41310r5133J75440j17820J97652j84669l236K04675r5815j52800
3666h4375K19789l64022L68442K8148l26243K56880L4460k80283o0013L59850
3656A52633k10297K08203po1948k3476j12956j42335L58503k644m706m2928k07776
3644h9734J39035j38364J89498Q0278R519k32355K38513j72847r944M1118k07873
3633a53156J89906J56564l49660K17074L06503m55548r5208M30496j79856N7251
3623A24366M068k32981J16738N0474J87440j82363p8579j58982N9375J76046J32538
$$ plain form
3612 198140 69179 -86957 222676 -79450 327257 100908 -15100 67844 56136 -128482
3602 -128482 322182 316730 -152235 -33155 26153 58333 38419 204423 298724 6970 60614
3591 60614 345505 -58160 53826 -21083 -86937 64577 253587 139532 273435 212762
3581 212762 -139825 118697 108242 159617 2586 269999 -53729 92205 17593 52269
3571 52269 132497 316809 32222 164942 193185 -19112 56744 364951 263467 269943 158669
3560 158669 115730 82950 2896 298571 275611 267659 362760 384243 415355 389148 471947 196899
3548 196899 334532 220664 230084 -59327 63425 34278 235632 -20778 105565 108840 -259656
3537 -259656 -205820 257494 85832 -61878 276804 -321392 -51252 -220683 -46496 26405
$$ packed form
3612A98140j28961j56136L09633l02126M06707k26349j16008Q2944j1708j84618
3602a28482M50664n452m68965J19080N9308L2180j9914J66004R4301k91754N3644
3591F0614K84891m03665J11986p4909o5854J51514J89010j14055J33903o0673
3581B12762l52587K58522j0455N1375j57031K67413l23728J45934p4612L4676
3571E2269Q0228J84312k84587J32720K8243k12297P5856L08207j01484O476j11274
3560A58669m2939l2780q0054K95675k2960p952R5101K1483L1112k6207Q2799k75048
3548A96899J37633j13868R420k89411J22752k9147K01354k56410J26343L275l68496
3537b59656N3836M63314j71662j47710L38682n98196K70140j69431J74187P2901
$$ plain form
3527 26405 161989 -48362 204042 -96078 -163794 -35573 -136875 119957 393470 117148
3517 117148 129041 43126 -143567 -103627 -157007 302601 45101 -47586 -208859 214481 -8440
3506 -8440 342201 209455 182620 32853 10242 44092 201707 306440 -74526 374066 -2674
3495 -2674 194499 -150607 142789 28648 266851 69299 221046 360156 -20521 -81057
3485 -81057 147911 241897 -53156 142178 152566 130333 13064 327377 297102 314893 98540
3474 98540 56726 38564 175460 37839 255460 445431 155334 43609 23899 315772
3464 315772 170669 312951 237396 412060 305760 147726 42667 481880 223155 208153
3454 208153 297534 354536 332339 116391 396382 269592 331855 -13011 435533 261595
$$ packed form
3527B6405J35584k10351K52404l00120o7716J28221j01302K56832K73513k76322
3517A17148J1893q5915j86693L9940n3380M59608k57500r2687j61273M23340k22921
3506h440L50641j32746k6835j49767k2611L3850J57615J04733l80966M48592l76740
3495b674J97173l45106K93396j14141K38203j97552J51747J39110l80677o0536
3485h1057K28968R3986k95053J95334J0388k2233j17269L14313l0275J7791k16353
3474I8540m1814j8162J36896j37621K17621J89971k90097j11725j9710K91873
3464C15772j45103J42282p5555J74664j06300j58034j05059M39213k58725j5002
3454B08153Q9381N7002k2197k15948K79991j26790O2263l44866M48544j73938
$$ plain form
3444 261595 280397 73576 341473 362452 308546 386134 387533 390261 144780 210775 550754
3433 550754 480931 536430 373115 352764 441048 229098 135488 451418 332568 113825 533279
3422 533279 576333 285074 453301 221342 341939 544470 564626 446767 474016 491177
3412 491177 337729 235620 657424 441490 133491 378836 425198 630098 287386 468970
3402 468970 427693 610561 171553 465243 543809 220973 334557 533888 648310 451939
3392 451939 469337 443378 321856 612990 714690 379113 761056 740524 364976 433304
3382 433304 873686 396966 488162 670384 894277 641811 630324 1039956 983173 1002065
3372 1002065 938802 1130576 1060649 1100874 1023603 1479307 1406157 1507474 1469242 1435562 1496588
$$ packed form
3444B61595J8802k06821K67897K0979n3906P7588J399K728k45481O5995L39979
3433E50754o9823N5499j63315k0351Q8284k11950r3610L15930j18850k18743M19454
3422E33279M3054k91259J68227k31959J20597K02531K0156j17859K7249J7161
3412D91177j53448j02109M21804k15934l07999K45345M6362K04900l42712J81584
3402D68970m1277J82868m39008K93690P8566l22836J13584J99331J14422j96371
3392D51939J7398k5959j21522K91134J01700l35577L81943k0532l75548O8328
3382D33304M40382m76720R1196J82222K23893k52466j1487M09632n6783J8892
3372A002065o3263J91774o9927M0225p7271M55704p3150J01317l8232l3680O1026
$$ plain form
3361 1496588 1591024 1718326 1804008 2112718 1881485 1844080 2154094 2030078 2057484 2091322
3351 2091322 2333235 2321324 2506503 2382902 2303660 2571967 2607820 3025204 2971331 3120777
3341 3120777 3297122 3488744 4003171 4442940 5127947 5324159 6352068 6550863 7520208
3332 7520208 8019856 8587239 9435261 10550603 12396166 15270238 18729128 24247164 32921840
3323 32921840 43998472 54497817 62106884 61871295 57823350 54412324 46861278 36693327
3315 36693327 29955463 25592359 21317759 16585098 13739285 11968133 10456749 9258251
3307 9258251 8340615 7414829 6765179 6347179 5659092 5221456 4911528 4528606 4269026 3882519
3297 3882519 3738220 3558982 3361253 3321935 3333228 2969988 2878108 2763340 2458186 2505609
$$ packed form
3361A496588R4436J27302Q5682L08710k31233l7405L10014j24016K7406L3838
3351B091322K41913j1911J85179j23601p9242K68307L5853M17384n3873J49446
3341C120777J76345J91622N14427M39769O85007J96212J027909J98795R69345
3332G520208M99648N67383Q48022J115342J845563K874072L458890N518036Q674676
3323C2921840J1076632J0499345P609067k35589m047945l411026p551046j0167951
3315C6693327o737864m363104m274600m732661k845813j771152j511384j198498
3307I258251r17636r25786o49650m18000o88087m37636l09928l82922k59580l86507
3297C882519j44299j79238j97729l9318J1293l63240r1880j14768l05154M7423
$$ [...]
##END NTUPLES=NMR SPECTRUM
##END=
