##TITLE=abcd
##JCAMPDX= 6.0         $$ Bruker NMR JCAMP-DX V2.0
##DATA TYPE= NMR SPECTRUM
##DATA CLASS= NTUPLES
##ORIGIN= UXNMR, Bruker Analytische Messtechnik GmbH
##OWNER= root
$$ XWIN-NMR		Version 3.5
$$ Sat Apr 25 09:50:21 2026 Russian Standard Time (UT+4h)  servis@DPX200
##.OBSERVE FREQUENCY= 200.131235884673
##.OBSERVE NUCLEUS= ^1H
##.ACQUISITION MODE= SIMULTANEOUS
##.ACQUISITION SCHEME= undefined
##.AVERAGES= 24
##.DIGITISER RES= 18
##SPECTROMETER/DATA SYSTEM= spect
##.PULSE SEQUENCE= zg
##.SOLVENT NAME= DMSO
##.SHIFT REFERENCE= (INTERNAL, DMSO, 0, 16.4885)
##AUDIT TRAIL= $$ (NUMBER, WHEN, WHO, WHERE, WHAT)
$$ ##TITLE= Audit trail, XWIN-NMR		Version 3.5
$$ ##JCAMPDX= 5.01
$$ ##ORIGIN= Bruker BioSpin GmbH
$$ ##OWNER= servis
$$ F:\spectra/data/av/nmr/H1/1/pdata/1/auditp.txt
$$ ##AUDIT TRAIL=  $$ (NUMBER, WHEN, WHO, WHERE, WHAT)
(   1,<2026-04-25 09:49:45.53 +0400>,<servis>,<DPX200>,
      <created by zg, POWCHK disabled, PULCHK disabled
       terminated by command 'halt'
       configuration hash MD5:
       00 E9 B6 7A A2 85 ED C7 34 08 36 98 17 FE 4E 26
       data hash MD5: 32K
       18 6D E1 17 AE B6 89 33 C8 EC 07 49 9C E7 EB 81>)
(   2,<2026-04-25 09:49:47.75 +0400>,<servis>,<DPX200>,
      <Start of raw data processing
       efp BC_mod = 2 LB = 0.05 FT_mod = 6 PKNL = 1 PHC0 = -262.6274 PHC1 = 3.101563 SI = 16K 
       data hash MD5: 16K
       98 59 A5 B7 41 72 2E AF 95 52 26 B6 59 00 20 8C>)
(   3,<2026-04-25 09:50:00.01 +0400>,<servis>,<DPX200>,
      <pk PHC0 = 5.6 PHC1 = 0 
       data hash MD5: 16K
       7E 8E 79 F4 9E 69 02 42 35 AF F9 77 CF 94 BB A8>)
$$ ##END=
$$ 
$$ hash MD5
$$ D7 4B 9A D0 B4 09 46 12 90 39 6B D4 3A DD 8E 9A
##$RELAX= 
##$RELAX= 
##$RELAX= 
##$RELAX= 
##$RELAX= 
##$RELAX= 
##$RELAX= 
##$RELAX= 
$$ Bruker specific parameters
$$ --------------------------
##$DU= <F:\spectra>
##$EXPNO= 1
##$NAME= <H1>
##$PROCNO= 1
##$TYPE= <nmr>
##$USER= <av>
##$AMP= (0..31)
100 100 100 100 100 100 100 100 100 100 100 100 100 100 100 100 100 100 
100 100 100 100 100 100 100 100 100 100 100 100 100 100 
##$AQSEQ= 0
##$AQ_mod= 1
##$AUNM= <au_zg>
##$AUTOPOS= <>
##$BF1= 200.13
##$BF2= 200.13
##$BF3= 200.13
##$BF4= 200.13
##$BF5= 500.13
##$BF6= 500.13
##$BF7= 500.13
##$BF8= 500.13
##$BYTORDA= 1
##$CFDGTYP= 0
##$CFRGTYP= 5
##$CHEMSTR= <none>
##$CNST= (0..31)
1 1 145 1 1 1 1 1 1 1 1 1 1 1 1 1 1 1 1 1 1 1 1 1 1 1 1 1 1 1 1 1 
##$CPDPRG= <>
##$CPDPRG1= <>
##$CPDPRG2= <>
##$CPDPRG3= <>
##$CPDPRG4= <mlev>
##$CPDPRG5= <mlev>
##$CPDPRG6= <mlev>
##$CPDPRG7= <mlev>
##$CPDPRG8= <mlev>
##$CPDPRGB= <>
##$CPDPRGT= <>
##$D= (0..31)
0 2 0 0 0 0 0 0 0 0.06 0 0 0 0 0 0 0.0002 0 0 0 0 0 0 0 0 0 0 0 0 0 0 
0 
##$DATE= 1777096185
##$DBL= (0..7)
120 120 120 120 120 120 120 120 
##$DBP= (0..7)
150 150 150 150 150 150 150 150 
##$DBP07= 0
##$DBPNAM0= <>
##$DBPNAM1= <>
##$DBPNAM2= <>
##$DBPNAM3= <>
##$DBPNAM4= <>
##$DBPNAM5= <>
##$DBPNAM6= <>
##$DBPNAM7= <>
##$DBPOAL= (0..7)
0.5 0.5 0.5 0.5 0.5 0.5 0.5 0.5 
##$DBPOFFS= (0..7)
0 0 0 0 0 0 0 0 
##$DE= 6
$$ [...]
##$SUBNAM4= <"">
##$SUBNAM5= <"">
##$SUBNAM6= <"">
##$SUBNAM7= <"">
##$SUBNAM8= <"">
##$SUBNAM9= <"">
##$SW= 20.6817932712277
##$SWIBOX= (0..15)
0 0 3 0 0 0 0 0 0 0 0 0 0 0 0 0 
##$SW_h= 4139.07284768212
##$TD= 32768
##$TD0= 1
##$TE= 0
##$TE2= 300
##$TE3= 300
##$TEG= 300
##$TL= (0..7)
0 120 120 120 120 120 120 120 
##$TP= (0..7)
150 150 150 150 150 150 150 150 
##$TP07= 0
##$TPNAME0= <>
##$TPNAME1= <>
##$TPNAME2= <>
##$TPNAME3= <>
##$TPNAME4= <>
##$TPNAME5= <>
##$TPNAME6= <>
##$TPNAME7= <>
##$TPOAL= (0..7)
0.5 0.5 0.5 0.5 0.5 0.5 0.5 0.5 
##$TPOFFS= (0..7)
0 0 0 0 0 0 0 0 
##$TUNHIN= 0
##$TUNHOUT= 0
##$TUNXOUT= 0
##$USERA1= <user>
##$USERA2= <user>
##$USERA3= <user>
##$USERA4= <user>
##$USERA5= <user>
##$V9= 5
##$VALIST= <valist>
##$VCLIST= <CCCCCCCCCCCCCCC>
##$VD= 0
##$VDLIST= <DDDDDDDDDDDDDDD>
##$VPLIST= <PPPPPPPPPPPPPPP>
##$VTLIST= <TTTTTTTTTTTTTTT>
##$WBST= 1024
##$WBSW= 30
##$XGAIN= (0..3)
0 0 0 0 
##$XL= 0
##$YL= 0
##$YMAX_a= 775249
##$YMIN_a= -608427
##$ZGOPTNS= <>
##$ZL1= 120
##$ZL2= 120
##$ZL3= 120
##$ZL4= 120
##$ABSF1= 0
##$ABSF2= 0
##$ABSG= 0
##$ABSL= 0
##$ALPHA= 0
##$AQORDER= 0
##$ASSFAC= 0
##$ASSFACI= 0
##$ASSFACX= 0
##$ASSWID= 0
##$AUNMP= <proc_1d>
##$AZFE= 0.1
##$AZFW= 0.1
##$BCFW= 0
##$BC_mod= 2
##$BYTORDP= 0
##$COROFFS= 0
##$CY= 18.4799938201904
##$DATMOD= 1
##$DC= 0
##$DFILT= <>
##$DTYPP= 0
##$F1P= 9.9274215381318
##$F2P= -0.165520771350173
##$FCOR= 1
##$FTSIZE= 16384
##$FT_mod= 6
##$GAMMA= 0
##$GB= 0
##$INTBC= 1
##$INTSCL= 4.127829e-11
##$ISEN= 128
##$LB= 0.05
##$LEV0= 0
##$LPBIN= 0
##$MAXI= 10000
##$MC2= 0
##$MEAN= 0
##$ME_mod= 0
##$MI= 50
##$NCOEF= 0
##$NC_proc= -5
##$NLEV= 6
##$NOISF1= 3.799351
##$NOISF2= 2.8
##$NSP= 0
##$NTH_PI= 0
##$NZP= 0
##$OFFSET= 16.48848
##$PC= 4
##$PHC0= -257.0274
##$PHC1= 3.101563
##$PH_mod= 1
##$PKNL= yes
##$PPARMOD= 0
##$PSCAL= 4
##$PSIGN= 0
##$REVERSE= no
##$SF= 200.130005582386
##$SI= 16384
##$SIGF1= 3
##$SIGF2= 2
##$SINO= 400
##$SIOLD= 16384
##$SREGLST= <1H.CDCl3>
##$SSB= 0
##$STSI= 16384
##$STSR= 0
##$SW_p= 4139.07284768211
##$SYMM= 0
##$S_DEV= 0
##$TDeff= 32768
##$TDoff= 0
##$TI= <>
##$TILT= no
##$TM1= 0
##$TM2= 0
##$TOPLEV= 0
##$USERP1= <user>
##$USERP2= <user>
##$USERP3= <user>
##$USERP4= <user>
##$USERP5= <user>
##$WDW= 1
##$XDIM= 16384
##$YMAX_p= 402713709
##$YMIN_p= -1549312
$$ End of Bruker specific parameters
$$ ---------------------------------
##NTUPLES= NMR SPECTRUM
##VAR_NAME=  FREQUENCY,     SPECTRUM/REAL,   SPECTRUM/IMAG
##SYMBOL=    X,             R,               I
##VAR_TYPE=  INDEPENDENT,   DEPENDENT,       DEPENDENT
##VAR_FORM=  AFFN,          ASDF,            ASDF
##VAR_DIM=   16384,         16384,           16384
##UNITS=     HZ,            ARBITRARY UNITS, ARBITRARY UNITS
##FACTOR=    0.252644378177508, 1,           1
##FIRST=     3299.83951724647, 0,            0
##LAST=      -839.233330435636, 0,           0
##MIN=       -839.233330435636, -1549312,    0
##MAX=       3299.83951724647, 402713709,    0
$$ Real data points
##PAGE= N=1
##DATA TABLE= (X++(R..R)), XYDATA
$$ [...]
5154B45487k42931L51504k2553j25381m15994M41391P9173K50321O1500r3225
5144E29292n02307K37881o9203n11956L98128K48748r8424R2117l02176j14849
5134i2749P61739o61689L95727j7384Q211j34708K56484n57377M36841l85755
5124I340O8421M36082k15451l26390O4024K56545k69619M8605O7672J40377K43510
5113E23116j05866l53259k0470M64881l50564O09255r22351K87679k60564L86000
5103B57857J2855L27040k09776j74103l84320M44162p8138J0390k40732J91880
5093A57115M2979L79851m45381M80325n81165P3357L67352k32604m63626O5006
5083a56791J21416J52050N4519K1635o56494P11952k33023L55283q9023l2689
$$ y = [245487, 2556, 354060, 331507, 206126, -209868, 231523, 310696, 561017, 622517, 529292, 26985, 264866, 195663, -316293, 81835, 330583, 232159, 324276, 22100, -92749, 668990, 7301, 403028, 385644, 393855, 259147, 515631, -41746, 395095, 9340, 77761, 513843, 298392, -27998, 36026, 292571, 22952, 71557, 139229, 279606, 523116, 417250, 63991, 43521, 508402, 157838, 767093, -155258, 132421, -128143, 257857, 270712, 597752, 387976, 213873, -170447, 273715, 195577, 205967, -34765, 157115, 200094, 579945, 134564, 614889, 33724, 107081, 474433, 241829, -221797, -156791, -35375, 116675, 171194, 192829, -463665, 248287, 15264, 370547, 281524, 248835]
5073B48835k8035k09406P63768p81706N96929n84708K20520K18266N7034m71954
5063B9543N28554m86328K48817O37250J8369p56538K45495o55471N30232P6503
5053D16426k41839K26138k07389K66240m22161Q56318m74648L8592j73921j84126
5043I9630N89560l72507n9357M77508k08330L6517l52775j27297J95962j92865
5033H6046K47639M92774j54322q54413P69569N8588q17064L33338M03851m41332
5023A24674j40841N00456n08958P23452m80803N63175m24520l0793l3289L14132
5013F06685J64686k85047N8814o25535N16967m63381M62451k61900k36125P60334
5003F97949p50405N0881K36404j90796N37797q41690L02729M16322J93075l56677
$$ y = [248835, 220800, 11394, 775162, -6544, 590385, 5677, 226197, 444463, 501497, 29543, 558097, 71769, 320586, 957836, 976205, 219667, 465162, -190309, 339923, 416426, 174587, 400725, 193336, 459576, 37415, 893733, 419085, 457677, 283756, 99630, 689190, 316683, 257326, 734834, 526504, 563021, 210246, 82949, 278911, 86046, 333685, 826459, 672137, -182276, 587293, 645881, -171183, 162155, 566006, 124674, -16167, 484289, -24669, 698783, 217980, 781155, 356635, 325842, 292553, 606685, 771371, 486324, 545138, -80397, 436570, -26811, 435640, 173740, -62385, 697949, -52456, -1575, 234829, 44033, 581830, -259860, 42869, 459191, 652266, 295589]
4993B95589l02175p8290K063L9679L30685j90308L33234L1224j02289p7036l2791
4982B49585K91858j13336J35900k27151k50973J40631Q11567q95204J38969j96706
4972H5140N5241J89082K7055O92041m20264k77411J26900k72543J16011L69473
4962F90725j053806J124861l46132P0487p74085N42850K23448R7073k38455N7998
4952C94964J03718N18325q03180n1295K73634j94149j4516K82364o7102j3114
4942D29649k17561J32535J04937K79933n47693M71390O3592l33051k631L26972
4932G08072M1414l12611J40477R7127r4561L92344o73688K95135O0944K10153
4922H64806L42517j19066J1927r14911Q75154l03247l84553J79888k04012K30767
$$ y = [295589, -6586, -84876, -82813, -43134, 287551, 97243, 430477, 461701, 359412, 282376, 249585, 541443, 428107, 564007, 336856, 85883, 226514, 1038081, 142877, 281846, 85140, 140381, 329463, 356518, 1048559, 628295, 350884, 477784, 205241, 321252, 690725, -363081, 761780, 415648, 486135, -287950, 254900, 478348, 575421, 336966, 394964, 498682, 1017007, 213827, 162532, 436166, 242017, 227501, 509865, 442763, 429649, 212088, 344623, 449560, 729493, 181800, 653190, 716782, 383731, 381100, 708072, 749486, 436875, 577352, 674479, 579918, 972262, 298574, 593709, 654653, 864806, 1207323, 1088257, 1100184, 185273, 1060427, 757180, 372627, 552515, 348503, 579270]
4912E79270l4372k47192M58428J36930m90382j7733O82600j04918M6780n37223
4902D72188M02635M57310J50191l21147K82061K20767o2613n23954K61663n81322
4892G57779L68817j16670O076L57961m36052m74424k41561M27021J5093M24750
4882A088790k80191M41613k26254o83813L19213M21834K07806k81106k58827k12887
4872E36178R44822J81092n03084L37062L22088P9537n92981M38159k44312o19025
4862H79536N2135K4696L11694R8611k19687K40719J27619M9732k31603O0712l37133
4851A057031r0449J30544j84191m03990R68818j70112m50328m2140L34239N1205
4841A200627m70972L45971N08796m71260j17363Q3209M59541m64257j33162L18206
$$ y = [579270, 544898, 297706, 756134, 893064, 402682, 384949, 1067549, 962631, 1009411, 472188, 874823, 1332133, 1482324, 1161177, 1443238, 1664005, 1601392, 1077438, 1339101, 757779, 1126596, 1009926, 1016002, 1373963, 937911, 463487, 221926, 648947, 664040, 1088790, 808599, 1250212, 1023958, 340145, 659358, 1081192, 1288998, 1007892, 749065, 536178, 1481000, 1662092, 1159008, 1496070, 1818158, 1897695, 1304714, 1742873, 1498561, 879536, 931671, 956367, 1268061, 1366672, 1146985, 1387704, 1515323, 1565055, 1333452, 1394164, 1057031, 966582, 1097126, 912935, 508945, 1477763, 1307651, 857323, 815183, 1149422, 1200627, 729655, 1075626, 1584422, 1113162, 995799, 1079008, 1538549, 1074292, 941130, 1259336]
4831A259336k96176J91409l59962M75702k69327l79905J46625O78148o86145M41546
4821A201251O7501L63820p44102L36976j56133J47216n17216K15871K70687k79433
4811I06438P11697n65570J72583J41314J80192m80054k61867L08573p4547N1259
4801A090018m53514J139311k68818l76012k07279J041995n54623K45751j60982
4792A495847K01165L3768j44166P0383J7914j12167K68658L24678J71983l33425
4782A994638K92965Q8423P11175K8829R60708J050197k54856j95387n56661l17442
4772C802589o65265q8803L57615m68014J01548q09141L65709Q8896J39321o13095
4762B211360N21787l54989Q54821J78665l00157L36150L51478L27598M81562J117318
$$ y = [1259336, 963160, 1154569, 794607, 1270309, 1000982, 621077, 767702, 1445850, 759705, 1201251, 1268752, 1632572, 888470, 1225446, 1069313, 1216529, 699313, 915184, 1185871, 906438, 1618135, 1052565, 1225148, 1366462, 1546654, 1066600, 804733, 1113306, 1038759, 1090018, 636504, 1775815, 1506997, 1130985, 923706, 1965701, 1411078, 1656829, 1495847, 1697012, 1730780, 1586614, 1656997, 1674911, 1562744, 1831402, 2156080, 2328063, 1994638, 2287603, 2376026, 3087201, 3116030, 4076738, 5126935, 4872079, 4676692, 4120031, 3802589, 3137324, 3048521, 3406136, 2938122, 3039670, 2230529, 2596238, 2685134, 2824455, 2211360, 2733147, 2378158, 3232979, 3411644, 3111487, 3447637, 3799115, 4126713, 4608275, 5725593]
4752E725593P74361J209054K295607J667923M9446J54374j676044j169059j467797
4743G563458q15984p15476p23050m63715p12715M99348r78383Q08687o66776M29549
4733D224943j22870j64442Q717N81963j74432O34344K36173J098816K28934Q82277
4723G434423J496765J665150J742557R66826l93438j420813j110091j099847j349921
4714G931611j000485j100589m47169j14682l82838l50916L05102l49037N21376
4705E012373k89242n0673l8315J8287k8381K88653j1419K5174M519M23115Q72809
4694F226900N67947K23163K82029P53865j032859l05775l54463K89139q07152
4685E842794j64281k91731m295J97162q16886R17809k09962n05685m7199L40077
$$ y = [5725593, 6499954, 7709008, 10004615, 11672538, 11721984, 11876358, 10200314, 9031255, 7563458, 6747474, 6031998, 5308948, 4845233, 4132518, 4631866, 3653483, 4462170, 3795394, 4224943, 4102073, 3937631, 3946348, 4528311, 4353879, 4988223, 5224396, 6323212, 6552146, 7434423, 8931188, 10596338, 12338895, 13305721, 12912283, 11491470, 10381379, 9281532, 7931611, 6931126, 5830537, 5383368, 5268686, 4885848, 4534932, 4840034, 4490997, 5012373, 4723131, 4672458, 4634143, 4652430, 4624049, 4912702, 4901283, 4926457, 4930976, 5354091, 6226900, 6794847, 7018010, 7300039, 8053904, 7021045, 6715270, 6360807, 6649946, 5842794, 5678513, 5386782, 5382487, 5579649, 4762763, 5680572, 5470610, 4964925, 4917726, 5257803]
4675E257803K5213N65358Q4773J96740q38121K84598Q2425P59557m39918L02339
4665F280767O69837K23336J62351J37838L76893m13884M27559J19392Q90453k37031
4655H637511M82367P09844J78938N86130J060015M66399R12567R80379J081291
4646A5095441J200835J067957L266939K633126L491078N629283P635061R595518
4638D9615238J0368062O104506O34095m046359o981591o890931o492004n196398
4630C7114618m630911k623238k104135j413858o00893l40915P02193O34129J230707
4621B7967697K318816K453771J840310L934522L950281N765576Q156173J0732750
4613F7119896J5152186K1015911K9710749L3915536K5382504K606657j5508674
$$ y = [5257803, 5283016, 5848374, 5933147, 6129887, 5291766, 5576364, 5658789, 6418346, 5978428, 6280767, 6950604, 7173940, 7336291, 7474129, 7851022, 7437138, 7864697, 7984089, 8874542, 8637511, 9119878, 9829722, 10008660, 10594790, 11654805, 12121204, 13033771, 14014150, 15095441, 16296276, 17364233, 20631172, 23264298, 26755376, 32384659, 40019720, 49615238, 59983300, 66087806, 66721901, 62675542, 55693951, 48803020, 42311016, 37114618, 32483707, 29860469, 27756334, 26342476, 25741583, 25400668, 26102861, 26736990, 27967697, 30286513, 32740284, 34580594, 38515116, 42465397, 48230973, 56387146, 67119896, 82272082, 103287993, 132998742, 166914278, 192296782, 194903439, 179394765]
4606A79394765k5513951k3805711k2350396j9169514j4604682j1620476q055520
4599E4274515n990862l946222k180749k175143r54323M8154L55857J345642J824478
4590D2601347L025081L922804L951368P794337R938106J4954872K0722661K8301073
4582A35211649L3941969K7154554M554324j6196194k5209168k5606829k3805926
4575A10044379k0127618j6332324j2936843r448954o379908n541812l576403k733365
4567C2967152j911102j495161j468585L28830n77153n34420J101838N26065K240423
4558C1177887K672479M611951O620648P852448J0374884Q101381J622277m821285
4550F8212670q527950q487407p924280p489080n425253m177220m423682k765564
$$ y = [179394765, 153880814, 130075103, 107724707, 88555193, 73950511, 62330035, 54274515, 48283653, 44337431, 42156682, 39981539, 39027216, 39075370, 39431227, 40776869, 42601347, 45626428, 49549232, 53500600, 61294937, 71233043, 86187915, 106910576, 135211649, 169153618, 196308172, 200862496, 184666302, 159457134, 133850305, 110044379, 89916761, 73584437, 60647594, 51198640, 44818732, 39276920, 35700517, 32967152, 31056050, 29560889, 28092304, 28421134, 27843981, 27309561, 28411399, 28937464, 31177887, 33850366, 38462317, 45082965, 52935413, 63310297, 71411678, 73033955, 68212670, 59684720, 51197313, 43273033, 35783953, 30358700, 26181480, 21757798, 18992234]
4542A8992234j258798j995790j701303n94425q52355j471734l85479K5327j033882
4533I723795p0995m22873o43072k25958j52450l1276n29690m09932J85092j062651
4523F359990K15730p33413N03747k32351n79974N26359p05543K44083o14940J66615
4513E150303m65413j99694N63437l22497n23893k22550M21713q581m74105J18089
4503D036809l26053L12920j22086o16450O00687m94608J29814j05576M1770o19403
4493B837824J74514j29949j36694k35912K54624K78616o11075M34175n43732M67048
4483B789439o46295L31720l81826J40528J99137q5386l18380J43317l81500K96294
4473B087048l66794M73130l14320k61791J50176J43422l48196O57446o25058m65633
$$ y = [18992234, 17733436, 15737646, 14036343, 13441918, 12589563, 11117829, 10732350, 10757677, 9723795, 9652800, 9229927, 8586855, 8360897, 8208447, 8177171, 7647481, 7237549, 7422641, 6359990, 6575720, 5842307, 6346054, 6113703, 5533729, 6060088, 5354545, 5598628, 4983688, 5150303, 4684890, 4485196, 5048633, 4726136, 4202243, 3979693, 4401406, 4392825, 3918720, 4036809, 3710756, 4023676, 3901590, 3285140, 3885827, 3391219, 3521033, 3415457, 3457227, 2837824, 3012338, 2882389, 2745695, 2509783, 2764407, 3043023, 2431948, 2866123, 2322391, 2789439, 2143144, 2474864, 2093038, 2233566, 2432703, 2347317, 2028937, 2172254, 1790754, 2087048, 1720254, 2193384, 1879064, 1617273, 1767449, 1910871, 1562675, 2220121, 1595063, 1129430]
4463A129430K35642k54222J80713N0002J99720n41345M47771j45530J76992Q7186
4453A566359l23720J21690j1231j74328n474K89445K87131p01729k14298Q81966
4443A715811o97893n5002L8258K05447j98200j29685j13898K62281L21346m1960
4433A306505J10235k78897K58257n05228N97947o84287L94826K72048Q4493o69461
4423H86438q1480j1792J61791K81603m86018M9660l56234p8817Q40221n99338
4413F06034M55737l4252r04743M3706N40288n08429M10420K79042m57611m33543
4403c351N62655l58344M45451K01412l5053l80748O03173M4040p08085j16446
4393B54704M10803j86688l18890J96311L675L10538k35194J94076j10796R4058
$$ y = [1129430, 1365072, 1110850, 1291563, 1341565, 1541285, 999940, 1447711, 1302181, 1479173, 1566359, 1242639, 1364329, 1353098, 1178770, 1173296, 1462741, 1749872, 1048143, 833845, 1715811, 1017918, 962916, 1001174, 1206621, 1008421, 878736, 764838, 1027119, 1348465, 1306505, 1416740, 1137843, 1396100, 890872, 1488819, 804532, 1199358, 1471406, 1555899, 886438, 804958, 793166, 954957, 1236560, 750542, 800202, 443968, 365151, 1205372, 606034, 1061771, 1027519, 122776, 166482, 706770, 198341, 608761, 887803, 430192, -3351, 559304, 200960, 646411, 847823, 812770, 432022, 1035195, 1079235, 371150, 254704, 665507, 478819, 159929, 356240, 359915, 670453, 435259, 629335, 518539, 612597]
4383F12597M7045l24312J03830L48271l0029j69258l35100M14152k37768o8797
4373C60631L19575k37049J31198j27888K81437k16524j00886J21894l7693j36786
4363C57909L16857n90948P58274m98634J49582J151989o35890k95049K81370J93620
4353A189080m36275O33503k92172l34811l084L39406j66605K52383j81176L90905
4343A391154j79039l54323K10658L49843J83560k71562n18970J47408K05560K48944
4333A413233j87382M40163k51578J43499q77944M45184N37177m26648q9929L16876
4323A462651k1301K21064j88636N21320j41660J26890N35316j89213J48105k07919
4313B266617l71482m1899J18026J77977o30369M07286j70196Q2991l9093m9892
$$ y = [612597, 659642, 335330, 439160, 787431, 757402, 588144, 253044, 667196, 429428, 360631, 680206, 443157, 574355, 446467, 727904, 511380, 410494, 532388, 494695, 357909, 674766, 83818, 842092, 343458, 493040, 1645029, 1009139, 714090, 995460, 1189080, 752805, 1386308, 1094136, 759325, 756241, 1095647, 929042, 1181425, 1000249, 1391154, 1212115, 857792, 1068450, 1418293, 1601853, 1330291, 811321, 958729, 1164289, 1413233, 1225851, 1666014, 1414436, 1557935, 679991, 1125175, 1662352, 1235704, 1145775, 1462651, 1441350, 1662414, 1473778, 1995098, 1853438, 1980328, 2515644, 2326431, 2474536, 2266617, 1895135, 1853236, 1971262, 2149239, 1518870, 1926156, 1755960, 1838951, 1799858, 1749966]
4303A749966K80816J02180j64827O25739L30682n05307P60715M50784k47514Q88665
4293D271899R13919K17270J508088J622450K441697M092601N107424P999519N523734
4284C3698601j740541l923554n673048m061302m310397l359795j816746k220672
4276F592546j212297p22546m12225o65411o43766j24518j67223m03944L90230
4267B630846j33064m06922J3056p52036J97004R02356l84634p21844j80753N33224
4257A697233m26957p3967L36965l4782l61221J89294L19490p57819p0862l40391
4247D76983j10223P48675l66190K33441l05285K02381n54311Q85685q79129k2553
4237C09474K32956L62842o9435n26125R5427M58070L0161p2576j88137P3393j50916
$$ y = [1749966, 2030782, 2132962, 1968135, 2593874, 2924556, 2419249, 3179964, 3630748, 3383234, 4271899, 5185818, 5403088, 6911176, 8533626, 10975323, 15067924, 20175348, 28174867, 33698601, 31958060, 28034506, 22361458, 18300156, 13989759, 10629964, 8813218, 6592546, 5380249, 4657703, 4245478, 3580067, 2936301, 2811783, 2644560, 2240616, 2630846, 2497782, 2090860, 2103916, 1351880, 1548884, 2451240, 2066606, 1344762, 1164009, 1697233, 1270276, 1196309, 1533274, 1498492, 1137271, 1326565, 1646055, 888236, 817374, 476983, 366760, 1115435, 749245, 982686, 677401, 879782, 325471, 1211156, 332027, 309474, 542430, 905272, 835837, 309712, 405139, 863209, 893370, 820794, 632657, 706050, 555134]
4226E55134n86332L35280L26406p58706P75783r6297k76500J0949N16791k56082
4216E46426k04935N4559n887L84162l71834q676j10045Q7960j13373k75309L92607
4205C75655L49489P0415m44940k65877k3172J43852l07394O04927J2328l48986
4195A66297O0479N55826m76897j67896K64570J08511l87365L73064q0448N69007
4185I85148o71965m63615J89128N98056l52300n0723O17349m66702l05833m82159
4175d03616O92148m34039K38514K93769l39112O44716o15108K20831J98736K53029
4165G49868p05842j43900L78769l60548J63786r9412M77023k34001M05866p74957
4155a43348N66754L88691p49219L33225O21557n24047m40949Q68110o47600N53635
$$ y = [555134, -31198, 304082, 630488, -128218, 647565, 551268, 274768, 285717, 802508, 546426, 341491, 396050, 390163, 774325, 402491, 393815, 283770, 371730, 258357, -16952, 375655, 725144, 795559, 350619, 84742, 61570, 205422, -101972, 502955, 515283, 166297, 226776, 782602, 305705, 137809, 402379, 510890, 123525, 496589, 416141, 985148, 313183, -150432, 38696, 636752, 284452, 233729, 851078, 384376, 78543, -403616, 288532, -145507, 93007, 386776, 47664, 692380, 77272, 298103, 496839, 749868, 44026, -99874, 278895, -81653, 82133, -17279, 459744, 225743, 631609, -143348, 423406, 812097, 62878, 396103, 1017660, 493613, 52664, 920774, 273174, 826809]
4145H26809q95528K15003M15230m27496j79643N30296J32281r16553L59980Q17017
4135H77396k01452p72014R19840o55001N36900k52790m95355p730o2338N45229
4125D32685n4538l10764J04547L75148m04642O9654N53890m14392k44969R32720
4115A039339j167547P17202q4041L93122r52112K62936J69480j37944q2614K6386
4105A84207J87818M2729l01603l14775j58511L26055N48208J8604j28766n78236
4095a74270m0580M79294j86307J92396k64039N08447o61865m628R34266j021546
4085b38832M16692k2960K4531p76729P19661K16859J16674n31902O03335l57830
4075A69499k45667N57879m16828N893K69096k12212j63538L40462N14580k87692
$$ y = [826809, -68719, 146284, 561514, 134018, -45625, 484671, 616952, -299601, 60379, 877396, 675944, -96070, 823770, 168769, 705669, 452879, -42476, -50206, -112544, 432685, 378147, 67383, 171930, 547078, 142436, 212090, 765980, 351588, 106619, 1039339, -128208, 588994, 504953, 898075, -54037, 208899, 378379, 240435, 157821, 184207, 372025, 414754, 113151, -201624, -360135, -34080, 514128, 532732, 403966, -174270, -214850, 264444, 78137, 270533, 6494, 514941, -146924, -151552, 782714, -238832, 177860, 154900, 179431, -597298, 122363, 339222, 455896, -76006, 527329, 169499, -76168, 481711, 64883, 70776, 339872, 127660, -35878, 304584, 819164, 531472]
4065E31472l00369M42188n84106M07339k00256q4822N95744m49186k19650j1475
4055A26879K63202k16388k3722l99545L91145l8799K26392m26678O95442l79001
4045B18927Q4384Q4827j34032N2107L04436q29057J97416J07078n8531K9442J52639
4034B09636N16094m52818Q2052k83973M08165n90959M26551k10062p4632j92557
4024a62503P39116j13069m83759o9557N09207j1100m55109M08567j69523j67060
4014B5210J2079Q3070N04043n4289n30427M38812o61628N75270j36508L63203
4004F18835p50177P59270j947m22946J9764l12448M48829l57129R9055N41689
3994F42795j21230o41060O12375J00460k91085K52335l27848J73842l11781k0884
$$ y = [531472, 231103, 673291, 89185, 496524, 296268, 211446, 807190, 358004, 138354, 126879, 390081, 173693, 149971, -249574, 141571, 102772, 329164, -97514, 597928, 218927, 303311, 388138, 254106, 306213, 610649, -218408, -20992, 86086, 27555, 56997, 209636, 725730, 272912, 354964, 70991, 479156, -111803, 314748, 104686, 30054, -162503, 576613, 463544, -20215, -89772, 419435, 408335, -46774, 361793, 192270, 25210, 37289, 120359, 624402, 570113, 39686, 478498, -183130, 392140, 255632, 618835, -131342, 627928, 625981, 203035, 222799, -89649, 359180, 2051, 101106, 642795, 521565, -119495, 492880, 593340, 302255, 554590, 226742, 400584, 88803, 67919]
3984F7919j4339J52638J91410L75818k20915o83919N60104K29418k46577m42319
3974c0762R3358M96298o2362l27008J69385l52618K40171l93455P49824K49507
3964H32338m66079j13410L84153l64547K11152m30131K4632j26418J94568M36445
3954E82703q2960L13303m05521j4086n7865M08549n62055k19032M3534K18840
3944B25410m45300Q9507N57953J26357o58954O80844n21147j29845K84675M78319
3934F87819n19443M20917l59057J22581J49260n98103M30544L63533l97900K26958
3924E27109n9911N3766l00067J90736o8338K07605l35600L68235Q8827m94201
3914A78161J63720J81135q84604P38526K66736j36664k97746K38279m47978Q8660
$$ y = [67919, 53580, 206218, 397628, 773446, 552531, -131388, 428716, 658134, 411557, -30762, 62596, 558894, 496532, 169524, 338909, -13709, 226462, -166993, 582831, 832338, 366259, 252849, 637002, 272455, 483607, 53476, 78108, -48310, 146258, 582703, 499743, 813046, 407525, 393439, 335574, 744123, 182068, -36964, 6570, 225410, -219890, -130383, 427570, 553927, -105027, 575817, 54670, -75175, 209500, 687819, 168376, 589293, 230236, 352817, 502077, -96026, 334518, 698051, 300151, 527109, 467198, 520964, 220897, 411633, 343295, 550900, 215300, 583535, 672362, 178161, 341881, 523016, -361588, 376938, 643674, 507010, 209264, 447543, -435, 88225]
3904H8225L42099K47352l66300J9159Q816r2366M58442O9583k56046l3812j3710
3893D71442k13214k970j7780R4385J01359l12063K89225j29275j9453j47668l11652
3882a97664O92811o67949K74145J57119J41560p4880O7963l82889P05592o40021
3872G5787O95489o72890n8295k03223J85349L44624l11715L11281R1079K13185
3862F70671k16805J9623n00076M07250r8489j03076N21671k05715R4290J00772
3852F90116j88928j48714J38625k7855k84344j59472K78655K95850m57054J9242
3842A56121P08911j51062l14687k08230J62076P9670L98263o06299K91830l38114
3832A78479M86718k67271J75736l47690m00553Q45945o9051l55568J41912L84631
$$ y = [88225, 430324, 677676, 311376, 330535, 339351, 246985, 705427, 775010, 518964, 485152, 471442, 258228, 255258, 237478, 331863, 433222, 121159, 410384, 281109, 261656, 113988, -197664, 495147, -172802, 101343, 258462, 400022, 325142, 393105, 10216, 715808, 75787, 771276, 98386, 40091, -163132, 22217, 366841, 55126, 366407, 457486, 670671, 453866, 473489, -26587, 380663, 282174, 179098, 700769, 495054, 589344, 690116, 501188, 352474, 491099, 463244, 178900, 19428, 298083, 593933, 136879, 156121, 865032, 713970, 399283, 191053, 353129, 432799, 831062, 224763, 516593, 178479, 665197, 397926, 573662, 225972, -174581, 671364, 602313, 246745, 388657, 773288]
3822G73288k31761n86554M1454N60081J51089o23774M98626m40581q4020J03227
3812A61075l83998J111546q1391p73240M59213k43807j40091N44532p44917L48241
3802B57163N41344K01564m76747k83730N51131l89914r1456L36822J71233m8303
3792G69107J32185m6401l86311J08621L30940j99170J62119o6280j86710L39953
3782I58053p331J56342o18718K96780L99978K29974m98856m65407N67411m59900
3772E58326k08551M39849M62187m83675p7038Q8905k93080J93237m7919k0887
3762F11354j0117J13369J06768J57888n10382K59636m30467K77413K70598j95668
3752F50392R264j17488L74867j02216J2603j82791j4214j9170J69672j87495k79536
$$ y = [773288, 541527, -45027, -3573, 556508, 707597, 83823, 582449, 141868, 57848, 161075, -222923, 888623, 807232, 33992, 493205, 249398, 109307, 653839, -91078, 257163, 798507, 1000071, 523324, 239594, 790725, 400811, 309355, 646177, 817410, 769107, 901292, 854891, 468580, 577201, 908141, 708971, 871090, 804810, 618100, 958053, 950722, 1107064, 488346, 785126, 1185104, 1415078, 916222, 450815, 1018226, 558326, 349775, 789624, 1251811, 768136, 691098, 780003, 486923, 680160, 632241, 611354, 601237, 714606, 821374, 979262, 468880, 728516, 298049, 575462, 846060, 650392, 659656, 542168, 917035, 814819, 827422, 644631, 630417, 611247, 780919, 593424, 313888]
3741C13888N09918K09030J148l51989O5702J36439J38955n84517N16118k39054
3731G15638K63306o18107j11980L81995p4846r5431L39731m141k58719k6713N55644
3720A066377j82237q51668N67190K24006k21498l6168l9320r6553J34350K66047
3710H30526l92122M35915n63523M86916k05563k832K97780L8633m04351M64541
3700I85920p48770M21347k78350l3687K43390k15174K20094K47461L5906o35036
3690B43101L80429k7468N38191m52678J10244q0847j85020L02152r7738K16646
3680I47012q14284L27090R5892p4977L06734R5777K22484m1735j64925J1640n22074
3669C88634K95392J10777m19299N91533R7589J2383k06112J37571k92260N09395
$$ y = [313888, 823806, 1032836, 1033984, 681995, 747697, 884136, 1023091, 438574, 954692, 715638, 978944, 360837, 248857, 630852, 556006, 460575, 800306, 796165, 537446, 510733, 1066377, 884140, 32472, 599662, 823668, 602170, 566002, 526682, 430129, 564479, 830526, 438404, 874319, 310796, 797712, 592149, 589317, 887097, 925730, 521379, 985920, 237150, 658497, 380147, 346460, 589850, 374676, 594770, 842231, 878137, 243101, 623530, 596062, 1134253, 681575, 791819, 710972, 525952, 828104, 730366, 947012, 132728, 459818, 555710, 480733, 787467, 883244, 1105728, 1063993, 899068, 910708, 388634, 684026, 794803, 375504, 967037, 1064626, 1077009, 870897, 1008468, 716208, 1225603]
3659A225603o66301R71375l33254L6722o6347l53803K42645L72085j99300k34495
3649I94930J125862o06687Q2867q46187K85365L32527J6846K70500j74351l11039
3639A170633L34034k02492K95828L90201n5571J62582o50195K29170M9923K45385
3629A969498k22762K47947k78131O99546j29467O1278O1698J104915p34581m282
3619B775659n86412J68473j92687j71038J09292o2676J86705m07484K83567k48748
3609A854651k14903k19111L41006l22650M69958K7627j81356J30363O3224k92622
3599A656187m8235J30156p39854K70679L61824N98501n78084j05280O0033J4919
3589A620846K48531l69615j41749j5221J9071N72700m65626l18046R34567m81651
$$ y = [1225603, 559302, 1530677, 1197423, 1234145, 1167798, 813995, 1056640, 1428725, 1229425, 994930, 2120792, 1514105, 1596972, 750785, 1036150, 1368677, 1385523, 1656023, 1481672, 1170633, 1504667, 1302175, 1598003, 1988204, 1932633, 2095215, 1445020, 1674190, 1724113, 1969498, 1746736, 1994683, 1716552, 2416098, 2286631, 2347909, 2409607, 3514522, 2779941, 2775659, 2189247, 2357720, 2165033, 1993995, 2103287, 2040611, 2227316, 1819832, 2103399, 1854651, 1639748, 1420637, 1761643, 1438993, 1908951, 1936578, 1755222, 1885585, 1948809, 1656187, 1607952, 1738108, 998254, 1268933, 1630757, 2229258, 1651174, 1545894, 1605927, 1620846, 1869377, 1499762, 1358013, 1342792, 1361863, 1934563, 1468937, 1150891, 2085458, 1603807]
3579A603807M04321K78733j06227l48531K02659k17604m6687L42449l31564O6695
3569A848051K31642l0262k12319q1000K11599L5102m16535L00490J32372P7520
3559B096660n273j06516K11847K31875K31810o67196K60849o3546p5828j88382
3549A926300L13671J25929N22881k63577k95884J17280O25558o82221j1315L47580
3539B726202m99298M82512M24488M65725o97351o3697J2829Q15048l51388R8776
3529C413846M27608n31778L43363M67024K33089n59114K30812N13894J04260k9411
3519D613593L08782P09166k00223q6168M90134J64609O09820M60576M50163l75057
3509G145395K16057P39997j77773K14144l08648N65826o84443L32936M50195J09694
$$ y = [1603807, 2008128, 2286861, 2180634, 1832103, 2034762, 1817158, 1770471, 2112920, 1781356, 1848051, 2079693, 2049431, 1837112, 1756112, 1967711, 2002813, 1586278, 1886768, 2019140, 2096660, 2091387, 1984871, 2196718, 2428593, 2660403, 1993207, 2254056, 2190510, 2114682, 1926300, 2239971, 2365900, 2888781, 2625204, 2329320, 2446600, 3072158, 2389937, 2378622, 2726202, 2226904, 2709416, 3133904, 3599629, 2902278, 2838581, 2851410, 3666458, 3315070, 3413846, 3841454, 3309676, 3653039, 4120063, 4353152, 3794038, 4024850, 4538744, 4643004, 4613593, 4922375, 5631541, 5431318, 5345150, 5835284, 5999893, 6609713, 7070289, 7520452, 7145395, 7361452, 8101449, 7923676, 8137820, 7829172, 8394998, 7710555, 8043491, 8493686, 8603380]
3499H603380K22050j0899M33186o2047M69527P33343J61644J170201l2994L44335
3489A2031726N48976O66781J15732O74265L41443J149152R50943J580106J994866
3480B0053990K945660M936814N455355J191127k212243m316307l214910l264614
3472B1574872k799574j713257j623068j143270m99362k92643k48736m878j291909
3463A1958175K62251N02869k16711n24019l36320o14322L93141j56699j97399
3454A1070966M09533k93213L37018k38384P15110N46841K53544m28270J73340
3445A2546485N29341R6984k04299l4877N83557o7208O14447Q0880R00925M29090
3435A5475325j56049Q69637j6593j81484J320548L53467n9537N64033N87366l61655
$$ y = [8603380, 8825430, 8814531, 9247717, 9185670, 9655197, 10388540, 10550184, 11720385, 11687391, 12031726, 12580702, 13247483, 13363215, 14037480, 14378923, 15528075, 16479018, 18059124, 20053990, 22999650, 27936464, 33391819, 34582946, 32370703, 28054396, 24839486, 21574872, 18775298, 17062041, 15438973, 14295703, 13796341, 13503698, 13254962, 13250084, 11958175, 12220426, 12723295, 12506584, 11982565, 11646245, 11031923, 11425064, 11268365, 11070966, 11480499, 11187286, 11524304, 11285920, 12001030, 12547871, 12801415, 12373145, 12546485, 13075826, 13172810, 12968511, 12933634, 13517191, 13449983, 14064430, 14145310, 15046235, 15475325, 15319276, 16188913, 16172320, 15990836, 17311384, 17664851, 17605314, 18169347, 18756713, 18395058]
3425A8395058M59307L95663K17982L22231N53740J192388k76799J67463N49804
3416B1976837L28201J112295Q35091R05876J688463N45460K506827J749604K149251
3407C3797905L258735K991785K765824L022610L414983K349074J971732L091523
3399E6664171K592387L037670K744637K538129K487260K671520J455757P29488
3391G4921019L38289Q54609n02535O46165J441303J284461K655219L197464M554708
3382H9390702N854171N762842N304353N711716M696945M745433M202251L459361
3374A29127774L365328L148172J975987N67869j271030j294758k184437l611624
3366A29823281k784855l260065l131012l800973l042914l983484k754194k233069
$$ y = [18395058, 18854365, 19250028, 19468010, 19790241, 20343981, 21536369, 21259570, 21427033, 21976837, 22305038, 23417333, 24252424, 25158300, 26846763, 27392223, 29899050, 31648654, 33797905, 37056640, 40048425, 42814249, 45836859, 49251842, 51600916, 53572648, 56664171, 59256558, 62294228, 65038865, 67576994, 70064254, 72735774, 74191531, 74921019, 75259308, 76113917, 75611382, 76257547, 77698850, 78983311, 81638530, 84835994, 89390702, 95244873, 101007715, 106312068, 112023784, 116720729, 121466162, 125668413, 129127774, 132493102, 135641274, 137617261, 138185130, 136914100, 135619342, 133434905, 129823281, 127038426, 123778361, 120647349, 116846376, 113803462, 109819978, 107065784, 104832715]
3358A04832715k151126j323386p84746j268467j610770j898194j487847k196901
3350I2111278l917622l814622l762721n166407n672285m358871m663899m572417
3342E6182434l283482m678001l092888k885181k450621k386555j841855k741358
3334C2822493k040317j542523j405544j398978n98645q88113q14787j329160j010078
3325B1794348M05890n89393p59121n94895l7137o50352o07978k34091J28889J75729
3315A9031889o29182k73983K86760l07539N99131J011956J074449J028856k34824
3306B1587513p89038j112427j020232J96728j397162R2566m01862M17309l39360
3297A7234035O31037M92989M66958O09369R14584j75726R94697R80547R22961
$$ y = [104832715, 102681589, 101358203, 100573457, 99304990, 97694220, 95796026, 94308179, 92111278, 88193656, 84379034, 80616313, 75449906, 69777621, 65418750, 60754851, 56182434, 52898952, 48220951, 45128063, 42242882, 39792261, 37405706, 35563851, 32822493, 30782176, 29239653, 27834109, 26435131, 25836486, 24948373, 24133586, 22804426, 21794348, 22200238, 21610845, 20851724, 20256829, 20219692, 19569340, 18961362, 18727271, 18856160, 19031889, 18402707, 18128724, 18415484, 18107945, 18707076, 19719032, 20793481, 21822337, 21587513, 20798475, 19686048, 18665816, 18862544, 17465382, 17557948, 17156086, 17573395, 17234035, 17865072, 18358061, 18825019, 19434388, 20348972, 20173246, 21167943, 22148490, 23071451]
3288B3071451k20256J230410J232841J158659Q105M61594J139948Q2281J906257
3279C0071290J424416N35436N10698n4760N08936m2852J816318Q98518R06633
3270C6574633J324704M99880J610124J299631K296786K400562K242789L006155
3262E1255264L499341L200049L232876L846064M130810L648805L616533L794442
3254H0224184L005776K462248K651787J718262J658530P90975K166295J497124
3246I6175181J657390K904372L797356L602470L922262L211868K956519L201385
3238A21428803K835324M116517M398981J972321K575576K26020n92396k161672
3230A34799474k421164l034294l507470m740800m327493n840790n469840n831671
$$ y = [23071451, 22851195, 24081605, 25314446, 26473105, 26481210, 26942804, 28082752, 28165033, 30071290, 31495706, 32031142, 32541840, 32487080, 32996016, 32953164, 34769482, 35668000, 36574633, 37899337, 38399217, 40009341, 41308972, 43605758, 46006320, 48249109, 51255264, 54754605, 57954654, 61187530, 65033594, 69164404, 72813209, 76429742, 80224184, 83229960, 85692208, 88343995, 90062257, 91720787, 92511762, 94678057, 96175181, 97832571, 100736943, 104534299, 108136769, 112059031, 115270899, 118227418, 121428803, 124264127, 128380644, 132779625, 134751946, 137327522, 137553542, 136961146, 134799474, 132378310, 129344016, 125836546, 121095746, 116768253, 110927463, 105457623, 99625952]
3222I9625952m990780m327247l619138k219194j370733j057571p57106Q7063n53666
3213H0817580j637313q56664j493444j991789k523438k805002l152970m010161
3205F2346799k486488k907332l061299l628283l954084l778650l248640l432942
3197C5849081k533740k917500k408352j995144j844752j648956j247784j177051
3189B0075802j315816l0565j323677j239463n33360p00721p13938r2293q81811
3180A3244158r24265j85893Q1783p65812q33005j5564J47834m09156m63276m11555
3170I465249p07881K76893j57138L04101n8516p57109l14946O90641l4l61234
3160H380026J8870R22793m15633J68042J093543R08483J268284J661253K249654
$$ y = [99625952, 94635172, 90307925, 86688787, 84469593, 83098860, 82041289, 81284183, 81371246, 80817580, 79180267, 78323603, 76830159, 74838370, 72314932, 69509930, 66356960, 62346799, 59860311, 56952979, 53891680, 50263397, 46309313, 42530663, 39282023, 35849081, 33315341, 30397841, 27989489, 25994345, 24149593, 22500637, 21252853, 20075802, 18759986, 18729421, 17405744, 16166281, 15632921, 14932200, 14218262, 14125969, 13244158, 12319893, 12134000, 12215783, 11449971, 10616966, 10601402, 10749236, 10340080, 9876804, 9465249, 8757368, 9034261, 8877123, 9181224, 9122708, 8365599, 8050653, 8741294, 8741260, 8380026, 8398896, 9321689, 8906056, 9074098, 10167641, 11076124, 12344408, 14005661, 16255315]
3151A6255315K337252K286377J288873O49034j122488j623798j803890k994877
3143A5271798k165346j606975j389731j109357j071105p01632m72069o83345l88501
3134E683737j26635l41187l84389Q5467n33044L26865j102863M26098L24413j37246
3124D221216k74691J0660l97041k53549J80460o3584R61327q84419l38261N57532
3114C719650o45894m39052P53334L2576o63503M62241L1130n05512M16870n43801
3104B618039J89149j64899M76139q03911L52525j64382j5767K6310l89949J34281
3094B257535R0090j69584R6389K6057J75745j091569K49537J71091o290K80023
3084B079024l10115K97440r9263p11040J47007L96575M6106l06555L44911j12139
$$ y = [16255315, 18592567, 20878944, 22167817, 22816851, 21694363, 20070565, 18266675, 15271798, 13106452, 11499477, 10109746, 9000389, 7929284, 7227652, 6755583, 6072238, 5683737, 5557102, 5215915, 4831526, 4916993, 4383949, 4710814, 3607951, 4034049, 4358462, 4221216, 3946525, 3957185, 3560144, 3306595, 3487055, 3423471, 4384798, 3500379, 3162118, 3719650, 3073756, 2634704, 3388038, 3420614, 2757111, 3219352, 3250482, 2744970, 3161840, 2618039, 2807188, 2642289, 3118428, 2314517, 2667042, 2502660, 2486893, 2513203, 2123254, 2257535, 2347625, 2178041, 2274430, 2300487, 2476232, 1384663, 1634200, 1805291, 1799001, 2079024, 1768909, 2066349, 1967086, 1256046, 1403053, 1799628, 1845734, 1539179, 1884090, 1771951]
3074A771951r8681p16245R2822O07406k56569L1321J9105J97262m89156L1637
3064A190853P554n1073k17142J10256M56852k1460n62902N26756o58435M34943
3054A216202L2439m0567J9545M7679k38847j67418l81201Q6877L80490R3297j31863
3043I16633o03196N91102K9790o28318M73649k15609L06453L43132L7819n54875
3033F96580J22558O0321J0356q3131j37241K33875N35168o84303J4246j67622
3023F00807M1213k05287K63576O93853l2190o51587J31690k92315M54401j37333
3013H66828L02173j51126q2287R1514M6426j25051L35615P7099n47661N67746
3003A381276J67722n88324L39456k09536M9842l04524N50980K34112K10643q68392
$$ y = [1771951, 1673270, 957025, 1049847, 1657253, 1400684, 1432005, 1451110, 1648372, 1159216, 1190853, 1198407, 1147334, 930192, 1040448, 1497300, 1475840, 912938, 1439694, 781259, 1216202, 1248641, 1208074, 1227619, 1275298, 1036451, 869033, 487832, 574709, 955199, 1048496, 916633, 313437, 904539, 934329, 306011, 779660, 564051, 870504, 1213636, 1251455, 696580, 819138, 879459, 889815, 806684, 669443, 903318, 1438486, 754183, 768429, 600807, 642020, 436733, 700309, 1394162, 1361972, 710385, 842075, 549760, 1004161, 866828, 1169001, 1017875, 935588, 1027102, 1073528, 948477, 1284092, 1361191, 813530, 1381276, 1548998, 960674, 1300130, 1090594, 1140436, 835912, 1386892, 1621004, 1831647, 963255]
2993I63255M36634j69334m8469P33842J5408n38525N13452l20560j15563M69774
2983A939914q19939Q53612j22243l35335K00951n6254N29330r06224P06918j99624
2973A791106p4122j95326L07017R7037K89168l61567o5096l67567o4263N00673
2963A857060n99040J29450J048075n14719l03376L01449k27572j03446M8576R4608
2953A731065N56406k01387m67947m04604J04695M58087M52752p23041L66240R0119
2943A962385p2494q1081m890q5289R2386N36276r35258M90613q812k12995J75913
2932A856754M91597n85173j82625j68188K41965l42667N90022K24646k51658m17074
2922A457599L80303M36950k52750o0288k99402j07114M28590K61877J95159o11747
$$ y = [963255, 1399889, 1230555, 1182086, 1915928, 1931336, 1392811, 1906263, 1585703, 1470140, 1939914, 1119975, 1973587, 1851344, 1516009, 1716960, 1660706, 2190036, 1283812, 1990730, 1791106, 1716984, 1521658, 1828675, 1925712, 2214880, 1853313, 1788217, 1420650, 1356387, 1857060, 1258020, 1387470, 2435545, 1920826, 1617450, 1918899, 1691327, 1587881, 1636457, 1731065, 2287471, 2086084, 1618137, 1213533, 1318228, 1776315, 2229067, 1506026, 1872266, 1962385, 1889891, 1808810, 1803920, 1718631, 1811017, 2347293, 1412035, 1902648, 1893836, 1680841, 1856754, 2348351, 1763178, 1580553, 1412365, 1654330, 1311663, 1901685, 2126331, 1874673, 1457599, 1837902, 2274852, 2022102, 1961814, 1662412, 1555298, 1983888, 2245765, 2440924, 1829177]
2912A829177J83931q8002L15850m96099Q34994K3491p15365j24665K33331q2513
2902A914130Q515J5419O50796m12703n81254J70978P75672r8089p59894L03731
2892A987301K37800k80855j27815K48942l2966L50209n94416K97133m5772j73433
2882A866128K37207N34162o84842J20665n4534j4781P8997J746L471j00655K55256
2871B242820J45449j09794m57297M79602j54547j51489J7537Q6378Q76265n47506
2861B427418J43249p56031P24038o18174L46564j74526L22729j42674M57712j41540
2851B588765q5317L928l19755J09856O01143k33144j47134J41080L90159n36450
2841B513131j78608m399J96162k6140K2333J38511k90801M18364K47419j1312
$$ y = [1829177, 2013108, 1925106, 2240956, 1744857, 2579851, 2603342, 1887977, 1763312, 1996643, 1914130, 1922645, 1938064, 2588860, 2176157, 1594903, 1765881, 2541553, 2443464, 1683570, 1987301, 2225101, 1944246, 1816431, 2065373, 2032407, 2382616, 1788200, 2085333, 2039561, 1866128, 2103335, 2637497, 1952655, 2073320, 2018786, 2004005, 2083002, 2084748, 2088219, 1987564, 2242820, 2388269, 2278475, 1821178, 2300780, 2146233, 1994744, 2012281, 2098659, 2974924, 2427418, 2570667, 1814636, 2538674, 1920500, 2267064, 2092538, 2415267, 2272593, 2730305, 2588765, 2503448, 2507376, 2187621, 2297477, 2898620, 2665476, 2518342, 2659422, 3049581, 2513131, 2334523, 2330124, 2526286, 2500146, 2522479, 2660990, 2370189, 2788553, 3035972, 3024660]
2831C024660O1106M37222L76548j433265M23463M59982J3350r3008J24839N35131
2821C930028K16391o20669M15757K35725p72968N72956N47595P92118p0313r1831
2811E154789J038302P61099q25982M59131o31583L47503q68979j38050O8315k18145
2801E146400M70648n72740M31040K42528o4731N63917j86459m76143K2915J1847
2791E589222O64414o057L25243J07162J83736l01687J32883P67524K47131k92616
2781G416955L8735j27790N74250J64383j21417M75855N45100q4824M33354Q1673
2771I396274j29418M47181j06284p1696Q80033P87164p47712P58569r4675K09880
2761A1329316l12166R67116K40436Q68606p3259L21297P75008P30951Q9883K99031
$$ y = [3024660, 3085766, 3522988, 3899536, 2466271, 2889734, 3349716, 3363066, 3270058, 3394897, 3930028, 4146419, 3525750, 3941507, 4177232, 3404264, 3977220, 4524815, 5316933, 5246620, 5154789, 6193091, 6954190, 6128208, 6587339, 5955756, 6303259, 5434280, 5296230, 5364545, 5146400, 5617048, 5044308, 5475348, 5717876, 5653145, 6217062, 6030603, 5554460, 5577375, 5589222, 6253636, 6247579, 6572822, 6679984, 6863720, 6562033, 6694916, 7462440, 7709571, 7416955, 7455690, 7327900, 7902150, 8066533, 7945116, 8420971, 8966071, 8881247, 9314601, 9396274, 9266856, 9714037, 9607753, 9536057, 10416090, 11203254, 10455542, 11214111, 11119436, 11329316, 11017150, 11984266, 12224702, 13093308, 13020049, 13341346, 14116354, 14847305, 14937188, 15236219]
2751A5236219R36738O67020K90956M83777M57121R89967M92375O91539J147257
2742B1392969J111022O12559J425798K331205P00969J817783J716171R83744O64595
2733C2756815J559160R20998J867481O98785P49471J464803J852851O38635J332657
2724D3841656J885586J150069J079864J576504J597914O17579Q03521J456444
2716E4009137N71629J0924L89094N05167N36728O29346J332726J226524J971694
2707F1182969J413067J379489J654094J963649K399346K474922L022259L858791
2699G9348586M322327M308157L497435L093964K129877K569487J791685K354730
2691A03416248J624382L622315K739541K805676K937927K772493L563524M384011
$$ y = [15236219, 16172957, 16839977, 17130933, 17614710, 18071831, 19061798, 19554173, 20245712, 21392969, 22503991, 23116550, 24542348, 26873553, 27574522, 29392305, 31108476, 32092220, 32756815, 34315975, 35236973, 37104454, 37803239, 38552710, 40017513, 41870364, 42508999, 43841656, 45727242, 46877311, 47957175, 49533679, 51131593, 51749172, 52552693, 54009137, 54580766, 54591690, 54980784, 55485951, 56022679, 56652025, 57984751, 59211275, 61182969, 62596036, 63975525, 65629619, 67593268, 69992614, 72467536, 75489795, 79348586, 83670913, 87979070, 91476505, 94570469, 96700346, 99269833, 101061518, 103416248, 105040630, 108662945, 111402486, 114208162, 117146089, 119918582, 123482106, 127866117]
2683A27866117N082518O136276Q243310Q363198R946815J0551230J0134450Q447226
2675A94771140O690248M808199J833321Q09730r24399p72663k26125P52925R72549
2666B08714925O41115M41248N17057L33553k94623j212326j405139j525296j164455
2657B05046059j045995n13019m44960J86586q85817k394283m029300p107908q690743
2648A80120620r177821j0547868j0648268q571861p763812o910817o190613m641333
2640A15668227l696014m304206l115751k481531l563711k271734k325353j394133
2632I2515794k264948k052209k971180l718697l087805l198493m034045k862101
2624F8326316k516093k854583k230693k747635k304736k222947k713210k700246
$$ y = [127866117, 132948635, 139084911, 147328221, 155691419, 165638234, 176189464, 186323914, 194771140, 201461388, 206269587, 208102908, 208912638, 207988239, 207215576, 206989451, 207742376, 208714925, 209356040, 209797288, 210314345, 210647898, 210353275, 209140949, 207735810, 206210514, 205046059, 204000064, 203487045, 203042085, 203228671, 202342854, 199948571, 195919271, 188811363, 180120620, 170942799, 160394931, 149746663, 141174802, 133410990, 126500173, 120309560, 115668227, 111972213, 107668007, 104552256, 102070725, 98507014, 96235280, 93909927, 92515794, 90250846, 88198637, 85227457, 81508760, 78420955, 75222462, 71188417, 68326316, 65810223, 62955640, 60724947, 57977312, 55672576, 53449629, 50736419, 48036173]
2616D8036173j464360k453835j660830j096822n31868j308383k37692k81520r51888
2607C8048975q13768r17522r39615j205134j117417j630798o09265j593028j272551
2598B7949877p76157o90980j462041j120005j133047j045371p42544n61150l78097
2589B0040485j237941n20249q27756r93923n15703o24572R9543o69705m76004
2580A4274175k59240l74578j388536q94195J92m47528o70054j55236j118248M48254
2570I415006l82177q4693j72662p45682K11897m29982p1388k57086n65679O43731
2560G561285r69744J23362O12193j60549p09558J02716K94664k96225j46213Q38614
2550G250545j122996o8815M46753r48943k87856j84032K80412p02728J43260m4315
$$ y = [48036173, 46571813, 44117978, 42457148, 41360326, 40828458, 39520075, 39282383, 39000863, 38048975, 37235207, 36317685, 35378070, 34172936, 33055519, 31424721, 30815456, 29222428, 27949877, 27173720, 26482740, 25020699, 23900694, 22767647, 21722276, 20979732, 20418582, 20040485, 18802544, 18282295, 17454539, 16460616, 15944913, 15320341, 15419884, 14750179, 14274175, 14014935, 13640357, 12251821, 11357626, 11357818, 10910290, 10240236, 10085000, 8966752, 9415006, 9032829, 8948136, 8775474, 8029792, 8241689, 7811707, 7740319, 7483233, 6917554, 7561285, 6591541, 6714903, 7327096, 7166547, 6456989, 6559705, 6854369, 6558144, 6411931, 7250545, 6127549, 6058734, 6505487, 5556544, 5268688, 5084656, 5365068, 4662340, 4805600, 4761285]
2540D761285N9528m90587L80655k11311o46931J20773n6375P4037K84862o24110
2530C651826M24897r3201n62697P06464k77674k92431L61610K4062l56115l27784
2520C258957J53371L19247l96967R82505j539319R00027m54302K56162q3378m92597
2510B903706O41503p23043K96671L68457l28858m31355O14680l47856m43547O29285
2500C179643j84682O53536q49136L64306N19962q03997R3866L57163J09428m31311
2490C008778p020J98139K456n39328M77114O56793m38916K75781m46911J80967
2480C367853k14888L78727n00037j7513N51540J07610J0631P7844L36449q07264
2470C290952n5990N95957J39025M40351n41496K41899k12033M1793K31340K03064
$$ y = [4761285, 4820813, 4330226, 4710881, 4499570, 3852639, 3973412, 3917037, 3991074, 4275936, 3651826, 4076723, 3983522, 3420825, 4127289, 3849615, 3557184, 3918794, 3942856, 3586741, 3258957, 3412328, 3731575, 3334608, 4317113, 2777794, 3677821, 3223519, 3479681, 3396303, 2903706, 3545209, 2822166, 3118837, 3487294, 3158436, 2727081, 3341761, 2993905, 2550358, 3179643, 2994961, 3648497, 2799361, 3163667, 3683629, 2879632, 2973498, 3330661, 3440089, 3008778, 3001758, 3199897, 3202353, 2663025, 3140139, 3796932, 3358016, 3633797, 3186886, 3367853, 3152965, 3531692, 3031655, 3014142, 3565682, 3673292, 3683923, 3761767, 4098216, 3290952, 3234962, 3830919, 3969944, 4410295, 3868799, 4110698, 3898665, 3940458, 4171798, 4374862]
2460D374862m87772L74538L97632j9440k88017L12879J5891n48295L91107J25544
2450D648929k92897J34701N35129J57448j74102L68280N52452k46129k94100J275392
2440F665103m13807K76026l24612J158890J136312j36188N36673K68963p983R94432
2430A0153809K506654J715782J390882K04847o90612j139398j141982q69978j158427
2421A0971577n90330m46961K77272j88385J49552J32753L68380M6943J60427m5372
2411A0835856K49854O41350P46116O04622M09425J58570J213786J409609K172459
2402A8441647L370913L749926K848625Q96015l60043k164841k681676j893098
2394B2207468k207108j190448r73732p19263J87361l80623J05712L12621j13193
$$ y = [4374862, 3887090, 4261628, 4659260, 4639820, 4351803, 4664682, 4680573, 4132278, 4523385, 4648929, 4356032, 4490733, 5025862, 5183310, 5009208, 5377488, 5929940, 5683811, 5389711, 6665103, 6251296, 6527322, 6202710, 7361600, 8497912, 8361724, 8898397, 9167360, 9159377, 10153809, 12660463, 14376245, 15767127, 15971974, 15281362, 14141964, 12999982, 12130004, 10971577, 10381247, 9934286, 10211558, 10023173, 10172725, 10305478, 10673858, 10720801, 10881228, 10835856, 11085710, 11727060, 12473176, 13077798, 13487223, 13645793, 14859579, 16269188, 18441647, 21812560, 25562486, 28411111, 29307126, 28947083, 26782242, 24100566, 22207468, 20000360, 18809912, 17836180, 17116917, 17304278, 16923655, 17029367, 17341988, 17228795]
2385A7228795O18J322367K56577R5921J268096J38079P07193J592585J655643
2376B4265874J590063L036346K792480L406909L854222L765466K788628L124573
2368D8624561L613179M678299P962281J1138714J6287863K4022956L2651676L5840417
2360A84819946K4063387k77152j8250063k6039737k3919411k3137532j9551452
2353I7707986j4174502j0939240o748561n086942l234406j594602l47803J341942
2345E6923872Q56308L345661L478537M368801O468462P466989J0360456J4233244
2337A07502330K1513339L0730234M5504885O5367474P8039976N3908628J46843
2330D02713709m0141636n4914186n2626258m8536147m0732862l1514962k3191345
$$ y = [17228795, 17229413, 18551780, 18808357, 18904278, 20172374, 20310453, 21017646, 22610231, 24265874, 25855937, 28892283, 31684763, 35091672, 38945894, 42711360, 45499988, 48624561, 52237740, 56916039, 64878320, 76017034, 92304897, 116327853, 148979529, 184819946, 208883333, 208606181, 190356118, 164316381, 140396970, 117259438, 97707986, 83533484, 72594244, 65845683, 60758741, 57524335, 55929733, 55581930, 56923872, 57780180, 61125841, 64604378, 68973179, 75441641, 82908630, 93269086, 107502330, 129015669, 159745903, 205250788, 270618262, 348658238, 402566866, 402713709, 362572073, 307657887, 255031629, 206495482, 165762620, 134247658, 111056313]
2323A11056313j6714459j1161828r250598o296001m478227l287249k026784j459591
2315E6381576j88324J021562P90024J780264L929472O045107R042525J3918019
2307I2720225K0193300K7488194L3088811K5553948J994347j6647027k5609761
2300A58782037k5590360k4364558k0052818j5800263j2632930q855441o807614
2293D4678053n143263m343954l181163k575395k098372j907251r25719k565885
2285B1937051p77361j208501n92340q19092j087825r1989j023997o88962j334502
2276A4312482M71275j048910m91561n12463l32051j022230l1716o82708k95232
2267A0366886o69625m78129L17622k03884o24788J55954q32977k21155N850n78512
$$ y = [111056313, 94341854, 83180026, 73929428, 67633427, 63155200, 59867951, 57841167, 56381576, 56193252, 57214814, 58004838, 59785102, 63714574, 69759681, 78802206, 92720225, 112913525, 140401719, 173490530, 199044478, 201038825, 184391798, 158782037, 133191677, 108827119, 88774301, 72974038, 60341108, 51485667, 44678053, 39534790, 35190836, 32009673, 29434278, 27335906, 25428655, 24502936, 21937051, 21159690, 19951189, 19358849, 18539757, 17451932, 17359943, 16335946, 15646984, 14312482, 14783757, 13734847, 13243286, 12730823, 12398772, 11376542, 11344826, 10662118, 10366886, 9697261, 9219132, 9536754, 9332870, 8708082, 8864036, 8031059, 7809904, 7815754, 7237242]
2257G237242R5801l50515n47847J47848J60586j52778J1648p27755j98609O82663
2247F358284q66278K1986K61263p37950k82397o7025N33876n02947j08322r97038
2237C613452P95522r3957k04335k09021M03690n82274J85562l04464k94130M19216
2227C729261n29121j52575N14003m26769O7281l20332j10750j13532j45560K79368
2217B791274j98482n18658M73678l84446j29815M06485R7581n30819r9906P47163
2207B654055o38807m34321L35470j62200K41477n01183M57662j83878j34847N3971
2197A687399K37254q16701L68485k4097k98770N8281K40808J00125l57000j53525
2187A042259N43590l66435l28036K81789j5139Q9005l64592M61351j76458q3437
$$ y = [7237242, 7333043, 6982528, 6434681, 6582529, 6743115, 6590337, 6601985, 5874230, 5675621, 6358284, 5492006, 5513992, 5775255, 5037305, 4754908, 4687883, 5221759, 4718812, 4610490, 3613452, 4408974, 4315017, 4110682, 3901661, 4305351, 3723077, 3908639, 3604175, 3310045, 3729261, 3200140, 3047565, 3561568, 3134799, 3202080, 2881748, 2770998, 2657466, 2511906, 2791274, 2592792, 2074134, 2547812, 2163366, 2033551, 2440036, 2537617, 2006798, 1906892, 2654055, 2015248, 1580927, 1916397, 1754197, 1995674, 1494491, 1952153, 1768275, 1633428, 1687399, 1924653, 1107952, 1476437, 1452340, 1153570, 1211851, 1452659, 1552784, 1195784, 1042259, 1585849, 1219414, 891378, 1173167, 1158028, 1247033, 882441, 1343792, 1167334, 1083897]
2177A083897K77471j2631l87595J8987k31611O7643n915N791m71704O22705K53832
2166A220870m07057j12342k70757M21304q88572P94483L2900M8639m90641k81880
2156F6947J39813M19294L85693n91301Q04988m29479n54069K88332M08931n04434
2146D34715M00479k29201J67640l52421j95034l796k99497O97178J68833q97882
2136a08986K46491n08000J197278o98378n2998l5702M76034K68960q78164j03817
2126a97282L52485m16052K78058K41034K06197L80835m27844L14999J2590k30932
2116E14088K61307n74602L47859R6348L85356n28440K41252J93549l21367Q11443
2106A426793j082098O78232l63587J24050j02041o03075L43201j74118L1473K76735
$$ y = [1083897, 1361368, 1348737, 961142, 980129, 748518, 816161, 810246, 816037, 344333, 967038, 1220870, 813813, 701471, 430714, 852018, -36554, 757929, 790829, 839468, 348827, 66947, 206760, 626054, 1011747, 420446, 1225434, 795955, 241886, 530218, 939149, 434715, 835194, 605993, 773633, 421212, 226178, 222382, -77115, 620063, 788896, -108986, 137505, -370495, 826783, 128405, 75407, 39705, 515739, 784699, -93465, -197282, 155203, -260849, 17209, 258243, 464440, 845275, 417431, 732430, 745020, 514088, 775395, 200793, 548652, 645000, 1030356, 501916, 743168, 936717, 615350, 1426793, 344695, 1022927, 659340, 783390, 681349, 78274, 421475, 247357, 278830, 555565]
2096E55565K50881K19698o56097L28476M18629k85686k25753j92254l35512L80124
2086D58071J51325Q07936j71164r6301M77537k7612M99437L10653o90354m96050
2076A223478l84970k19O8913j61095m12539k64844j56593L59795O08219m88100
2066C92045O1494J74014n04696k64981K96194K06127m10391j17668N33901l7899
2056C28140q0197P69071m49691j67903J14876N29099R1063q60709K02178M75009
2046I50936q82295l71535M04467J86591j09856n17155J78455K78805l86018L14121
2036D6516k56732K31964K90956j59147p14064O94009P0276l06542M7734j60416
2026b15446J64701J71970j64134l31316N45356o66138K63463Q7418N15259n36461
$$ y = [555565, 806446, 1026144, 370047, 698523, 1117152, 831466, 605713, 413459, 77947, 458071, 609396, 1417332, 1246168, 1149867, 1627404, 1599792, 2099229, 2409882, 1719528, 1223478, 838508, 838289, 907202, 746107, 333568, 68724, -87869, 271926, 880145, 392045, 453539, 627553, 122857, -142124, 154070, 360197, -50194, -167862, 366039, 328140, 247943, 1017014, 567323, 399420, 514296, 1043395, 1134458, 273749, 475927, 950936, 68641, -302894, 101573, 288164, 178308, -338847, -160392, 118413, -267605, 46516, -210216, 21748, 312704, 153557, -560507, 133502, 203778, -102764, -55030, -215446, -50745, 121225, -42909, -374225, 171131, -495007, -231544, -144126, 371133, -165328]
2016a65328M41676n91829L8571L98265n15113J78414K75054m93631M79113l07162
2006b61970L55509l0176J93762j77950k3563K94004l90186P3972p42434L25761
1996c83271j7298L55935j01279Q9123l38898K97548j35111J95182K65741o16906
1986c89234J51900m03563J418565j104419O9502j71527N92055p29114P1573J69829
1976c24433M83156m97418J393L69525n51758P8251L31045J65036J29489J83328
1966C67614m94211K7083k85980M83756m44313m94135P25197K86939p0635n24467
1956d23152M74557k10211L06263L26323r89736l0885M83944o22695N77611R454
1946i8527l70198N34330o32018J60898N7515j18466l28488N70619l01715K2468
$$ y = [-165328, 276348, -315481, -276910, 121355, -393758, -215344, 59710, -433921, 45192, -261970, 93539, 63363, 257125, 79175, 55612, 349616, -40570, 33402, -709032, -383271, -400569, -44634, -145913, -56790, -395688, -98140, -233251, -38069, 227672, -389234, -237334, -640897, 777668, -326751, -257249, -428776, 163279, -565835, -494262, -324433, 158723, -338695, -337302, 32223, -519535, -441284, -110239, 54797, 184286, 367614, -126597, -99514, -385494, 98262, -346051, -840186, -114989, 171950, 101315, -423152, 51405, -158806, 147457, 473780, -515956, -546841, -62897, -685592, -107981, -98527, -468725, 65605, -566413, -405515, -348000, -466466, -794954, -224335, -526050, -503582]
1936e03582L8739o4414J96329k71872L02220q0547o815m88384j79503N51052J57128
1925c49649k40362p6229J57680R3242r1478l5606L95235J12842p92116M9095K79758
1914d97588K42084j32803L01517n00661Q0511l94164N70758o1456l1736L68593
1904e4945k39684p1258j6475R3435P1015o41966P31954k68775j61764J11604j79135
1893f25994J83652M80909L563o89319M86377k6765j06023j95330j91017K67967
1883d11980L22877n17070P1638k80720R18676j61810p19128M98871K06456k83731
1873c55921K1188k18886J96272K54833m49532J04080K65483k44610j27701N32699
1863b2095m47391J55714o99040P33079m14389L25272K05591J54955o87406K97504
$$ y = [-503582, -464843, -529257, -332928, -604800, -302580, -383127, -389942, -878326, -1057829, -506777, -349649, -590011, -666240, -508560, -415318, -506796, -542402, -147167, -34325, -826441, -777346, -497588, -255504, -388307, -86790, -587451, -506940, -901104, -330346, -391802, -423538, -54945, -294629, -365887, -382362, -288927, -217912, -859878, -127924, -396699, -558463, -446859, -625994, -442342, 38567, 42130, -647189, -160812, -187577, -293600, -488930, -679947, -411980, -89103, -606173, -534535, -815255, 103421, -58389, -777517, -278646, -72190, -355921, -334733, -553619, -357347, -102514, -552046, -447966, -182483, -427093, -554794, -22095, -469486, -313772, -1012812, -279733, -694122, -368850, -163259, -8304, -695710, -398206]
1853c98206j10093P7143k8472J04167J45132o67485M38410k47657J91631N99451
1843A04021m65499J98420k80362K85503k79989J51441k59863j36638j53000K19118
1833f16848M68238o6684m6123j40691O8943K71505m47048K59051Q0609n21680
1823f90728j80187M1320P71185k37974O2137j95144k58716L81717l8896l56857
1813g02143J37016L51070o5802m8167j78038J02486j34207n1672l06396M51391
1803d44462j74769n4458r9316M54902k34610K32673m03969K58035o6430L01117
1793b31287k03036K81799J42494p60944O53422j97020L2860o67154J105323k65058
1783a08601k07543j99995R9598j80044M54704j00990P246j4744m32779k7435K41721
$$ y = [-398206, -508299, -431156, -459628, -355461, -210329, -877814, -439404, -687061, -495430, 104021, -361478, -163058, -443420, -157917, -437906, -286465, -546328, -682966, -835966, -616848, -148610, -215294, -261417, -402108, -333165, -61660, -508708, -249657, -169048, -690728, -870915, -829595, -58410, -296384, -234247, -429391, -688107, -306390, -345286, -702143, -565127, -214057, -279859, -328026, -506064, -403578, -537785, -589457, -895853, -444462, -619231, -673689, -773005, -318103, -552713, -320040, -724009, -465974, -532404, -231287, -434323, -152524, -10030, -770974, -117552, -314572, -281712, -948866, 156457, -108601, -316144, -516139, -416541, -596585, -141881, -242871, -235625, -250369, -683148, -710583, -468862]
1772d68862J71992k31072J29279Q8947k63155M80668p27686M55548K46700n52519
1762f70160Q0936K30153M097l6455K08601M2045o03074p0948N00612m70155P32520
1751e1828m05835Q041N4874n57388Q18439l5393k7220q7859j87808l80527N11768
1740c40736J71589m06400N33030r004k50291J36535l49611N00690n94318L71647
1730b36869k77311K28529o7850R1247N6803j41044n4267P6755J64875l16847j29325
1719f05304j25729M00805j41213N83247o71622N62844m62288L33064O2756j1332
1709g4772k41283k41786K0088q1802K38639r8122N08878p2749l99030o27461R76897
1698i2503m96042L14398k43679N46335n32027J94444l29152m55192R53129K89184
$$ y = [-468862, -296870, -527942, -398663, -309716, -572871, -92203, -819889, -364341, -117641, -670160, -589224, -359071, -354974, -391429, -182828, -140783, -743857, -814805, -314193, -784348, -51828, -457663, -449622, -394748, -952136, -133697, -169090, -196310, -284169, -471977, -852504, -340736, -169147, -575547, -42517, -51521, -301812, -165277, -514888, -14198, -608516, -236869, -514180, -285651, -353501, -262254, -205451, -346495, -400762, -324007, -159132, -475979, -605304, -731033, -330228, -471441, 111806, -559816, 3028, -459260, -126196, -63440, -74772, -316055, -557841, -537753, -619555, -380916, -479038, 29840, -42909, -441939, -1069400, -92503, -588545, -274147, -517826, 28509, -503518, -309074, -638226, -1093418, -140289, 148895]
1688A48895l55346j25695P6371k60407O5040j14515M62487o07998J08151J90942
1678d12075l88051k8323L20594J02811k47917r2004P28195p04600K72490J24166
1668c24714l3318M26566l38045J79079N4010o16130Q5509J48592J81342j98200
1658d35309k90707O58737j02543l74024M55156o25262j73052L11484q6563P2591
1648e89492L27148j31058j15378R608j50117L26449j177J7808M92556l62731J5046
1637a61338k91108o6419J36102J26697p4848o13589N83055K31909l55491M23449
1627f1581k52138O6607k54109J28077j81082k8498M72783O8996o15192J13660
1617e42477l89061P49989l80946L27287L41226k08510l99109l81312J047460j15868
$$ y = [148895, -206451, -332146, -255775, -516182, -451142, -565657, -103170, -711168, -603017, -412075, -800126, -828449, -507855, -405044, -652961, -744965, -16770, -721370, -448880, -324714, -358032, 68534, -269511, -90432, -36422, -652552, -567043, -418451, -237109, -435309, -726016, -67279, -169822, -543846, -88690, -713952, -887004, -575520, -662083, -589492, -262344, -393402, -508780, -499172, -649289, -322840, -324017, -306209, 186347, -176384, -161338, -452446, -518865, -382763, -256066, -330914, -944503, -361448, -129539, -485030, -61581, -313719, -247112, -501221, -373144, -554226, -582724, -109941, -40945, -656137, -542477, -931538, -181549, -562495, -235208, 106018, -102492, -501601, -882913, 164547, 48679]
1607D8679k16498n97124j49869J51395J27213L78003k3549k62789M29152m33934
1597e49321K46651j1832K35518j0190j63985l06967k8756K37212K86577M04791
1587C39698p21528n17445K82316L00416n23401P04619J4710l25166J15986k24342
1577e54137M55271k00416L09415l53466k7010j8630L93408l27484L25688J21092
1567A23731m94526J43814N84709j287026N66739p69919O55312j94952K77702M8125
1557c46291K62498L52910p79411L14278K00578K12631l24509J28856k33584p7599
1547b89643k65448M37436L2896L53904n29640J33184M3439k82338M05086j45427
1537a06551k7277J15616n3254M99628k9902N09767p84524M4252J0279K03340J67773
$$ y = [48679, -167819, -764943, -914812, -763417, -636204, -258201, -281750, -544539, -115387, -549321, -302670, -314502, -78984, -89174, -253159, -560126, -588882, -351670, -65093, 339698, -381830, -899275, -616959, -316543, -839944, -135325, -120615, -445781, -329795, -554137, -98866, -299282, 10133, -343333, -370343, -388973, 4435, -323049, 2639, 123731, -370795, -226981, 357728, -929298, -362559, -1132478, -477166, -672118, -394416, -346291, -83793, 269117, -510294, -196016, 4562, 217193, -107316, 21540, -212044, -289643, -555091, -117655, -84759, 269145, -260495, -127311, -83872, -366210, 38876, -106551, -133828, -18212, -71466, 428162, 398260, 908027, 123503, 167755, 178034, 381374, 549147]
1526E49147k14082n69913J42122j46384O2231j07835O01760n57740q9880J50347
1516a80227k23114R9665l12997L77025K34180k17525J74546k74341M4473L8535
1506b39780j57599k56073L43326J55399L1150p4644m76758P08291p03635K13713
1496d56610J77903M00162J3921n67235J79952q4020n20888J009762l96737K39415
1486d375p7554J43254k44683R3286k17381o28862J015161K4345j12134R4005Q0634
1475A65696l67089k07175k37061L01129l1204N51672m56062r2497J48340p0004
1465b94255L14318k34688q3883O5599q0190Q5188K83640m15051l7830L61531Q7062
1454E1441l33997M31772l72420J92004K10787l19615J73806O4574q1456m12103
$$ y = [549147, 335065, -234848, -92726, -239110, -176879, -284714, 317046, -240694, -330574, -180227, -403341, -303676, -616673, -239648, -5468, -222993, -48447, -322788, -278315, -239780, -397379, -653452, -310126, -154727, -123577, -198221, -674979, 33312, -670323, -456610, -278707, 121455, 135376, -431859, -251907, -335927, -856815, 152947, -243790, -4375, -81929, 61325, -183358, -90072, -307453, -936315, 78846, 103191, -8943, 85062, 165696, -201393, -408568, -645629, -344500, -375704, 175968, -280094, -372591, -224251, -294255, 20063, -214625, -298508, -232909, -313099, -227911, 55729, -359322, -397152, -35621, 51441, -282556, 149216, -223204, -31200, 179587, -140028, 33778, 98352, 16896, -395207]
1444c95207O92452k30866m48615N01315J41269l91759L27954K1621m30248r7387
1434c09471M95369J80287o92250P44097l13199l0273q4071J12636l51236K33201
1424a4910K96449k21665j80826K96570q0147p6837k90444P95191o19025J86777
1414I1133P87343o83710O775j58522L45215n26163K92260K96137k75629J29004
1404C03843O8443m79509K04925m1544J23870J49759k70086O52243m79668L1511
1394B63787N6001m78921P80973R3752p66137L82762J7552l56952J47102K6369
1384A66288J45596N52337o41403L46198J79462m0282r7170K49439N59273q69155
1374E50583L34320K13517j42272o31184P42356n26107Q21694n11454L05968p71014
$$ y = [-395207, 297245, 66379, -382236, 119079, 260348, -131411, 196543, 218164, -212084, -309471, 185898, 366185, -326065, 418032, 104833, 74560, -9511, 103125, -248111, -14910, 281539, 59874, -120952, 175618, 95471, 18634, -271810, 523381, -95644, 91133, 878476, 194766, 201541, 43019, 388234, -137929, 154331, 450468, 174839, 303843, 372286, -107223, 97702, 56158, 180028, 329787, 59701, 711944, 232276, 263787, 319788, -159133, 621840, 715592, -50545, 332217, 349769, -7183, 139919, 166288, 311884, 864221, 222818, 569016, 748478, 708196, 611026, 860465, 1419738, 550583, 884903, 1098420, 956148, 324964, 1067320, 541213, 1362907, 851453, 1157421, 386407]
1364C86407Q26998k89365j86292M84095j39999K05102K40718k25770J4972j17910
1354A198956O6191M14100l02984m27866P18238R5471n53941K31018K59280L68906
1344B067369l64200k03928P51172j64384k6754n65660P36808L01821J10522k90901
1334B351865M83951r331m33821Q88134k85024N4869O8192K57914m64145N49430
1324C462034j5584P34415J64555M29233j98558J011532J02792N23166P10574J063800
1314G987959J401032J940568J847278R78893J309522Q48748J553840J900900K270023
1305B2038763L529866O316448Q532980J2810884J9691239L0797239L3813974J1359324
1297A48890717j2080229k3737903k0926713j9479399j6300064j2895126j0454404
$$ y = [386407, 1213405, 924040, 737748, 1221843, 1081844, 1286946, 1527664, 1301894, 1316866, 1198956, 1265147, 1679247, 1376263, 948397, 1666635, 1762106, 1208165, 1439183, 1698463, 2067369, 1703169, 1499241, 2250413, 2086029, 2059275, 1493615, 2230423, 2532244, 2642766, 2351865, 2835816, 2826485, 2392664, 3280798, 2995774, 3050643, 3118835, 3376749, 2912604, 3462034, 3446450, 4180865, 4345420, 4774653, 4576095, 5587627, 5690419, 6213585, 6924159, 7987959, 9388991, 11329559, 13176837, 14155730, 15465252, 16314000, 17867840, 19768740, 22038763, 25568629, 31885077, 40418057, 53228941, 72920180, 103717419, 137531393, 148890717, 136810488, 113072585, 92145872, 72666473, 56366409, 43471283, 33016879]
1290C3016879o205270m092410l019986j397129j549037j170052j393551j493345
1282A2696099r32783j619037j352222j305064l46568k66488q17769J11349p39749
1273E427768m9332l20333q13485l85152K97823l42199J03239N8180m30382M50337
1263C996464m58176l06410k48022j16998K86542m01048M6862k95928n27347P67340
1253B743279n7832p75269O97290p30613q7745o1397L43844m03949m75440P48876
1243A941044q1953j20121M02036q44695j12145L30422P3316k86511m8033m88020
1233G65340K18465m4702m8074K95153k40311N1487q628k11273L55500l69333J38614
1222I02238n22648K83125N86448l76306n13818j26062N96291n85203M19031l70599
$$ y = [33016879, 26811609, 22719199, 19699213, 18302084, 16753047, 15582995, 14189444, 12696099, 11763316, 10144279, 8792057, 7486993, 7140425, 6873937, 6056168, 6167517, 5427768, 5378436, 5058103, 4244618, 3859466, 4157289, 3815090, 3918329, 3976509, 3546127, 3996464, 3538288, 3231878, 2983856, 2866858, 3153400, 2752352, 2799214, 2503286, 1975939, 2743279, 2685447, 1910178, 2607468, 1876855, 1789110, 1727713, 2071557, 1667608, 1192168, 1941044, 1859091, 1738970, 2141006, 1296311, 1184166, 1514588, 1587904, 1301393, 1253360, 765340, 983805, 939103, 891029, 1186182, 945871, 997358, 988730, 777457, 1132957, 763624, 902238, 379590, 662715, 1249163, 872857, 359039, 232977, 829268, 244065, 663096, 292497]
1212B92497m9167K55344k51142N24979n95541p2446O21401n16982K65854m04356
1202G0441n78474Q56666p0549K19587k9766j7587m13259M74240l59082k85341
1192a33124O93028j60305k29490q3079K64401J64446l62618R0131o6926k55037
1182g8573l26155M49967J67535j61814n36673L84170k45943L4498O89876o8680
1172C08208J04577p98106N90376k86377m69242L19867M70680k50723j31416o4446
1162b06602m99097P96964j04566J36842n10411J76164k1452K2943k17855j5380
1152d42450j14931L69203K63713k41968J7034k17381j07507J68089N78M44505
1142A38885P1548j89348o02793N31315p0601j58301n78991M61396k73559M15877
$$ y = [292497, 243330, 498674, 247532, 772511, 176970, 104524, 725925, 208943, 474797, 70441, -508033, 348633, 278084, 497671, 467905, 450318, 37059, 511299, 152217, -133124, 559904, 399599, 170109, 87030, 351431, 515877, 153259, 243390, 176464, -78573, -404728, 45239, 212774, 50960, -485713, -101543, -347486, -312988, 376888, 308208, 412785, -385321, 205055, -81322, -550564, -230697, 239983, -10740, -142156, -206602, -705699, 91265, -13301, 123541, -386870, -210706, -232158, -209215, -427070, -442450, -557381, -188178, 75535, -166433, -149399, -366780, -474287, -306198, -305620, 138885, 210433, 21085, -581708, -50393, -120994, -279295, -858286, -396890, -670449, -254572]
1132b54572l64423Q41175j49464k19550k09418p5747P80036m02747j95924K12057
1122c8577o30790j0422K09985J1319K72448r1280k34861L11624r100k0095l27074
1111e56823L30277L25540o03762j58274L09690l22149J8439N81497l31401K51416
1101a55550l2322j2999k41092L13233k06776q3212Q4134L3415q49981R17558J92942
1090d0650l84125J06158M91938p38890L68477K929m69041K85998J13515k96206
1080e59897K61453J0569k28733N82016m29947K4705K4877N7315J07112P3413n86113
1069f63230M09061n2283M02248L35187j57265K34198k91587J56363n06399k02489
1059c36196O37439m91086p5065l63577N30896k01383K41368l92785K50636N77157
$$ y = [-254572, -618995, 222180, 72716, -146834, -356252, -431999, 348037, -54710, -250634, -38577, -669367, -679789, -469804, -458485, -186037, -277317, -512178, -200554, -209654, -229749, -556823, -226546, 98994, -504768, -663042, -353352, -675501, -657062, -75565, -406966, -155550, -187872, -200871, -441963, -128730, -335506, -418718, -334584, -301169, -1151150, -233592, -40650, -424775, -318617, 173321, -565569, -197092, -194163, -663204, -377206, -263691, -559897, -298444, -287875, -516608, 65408, -364539, -339834, -314957, -257642, -150530, -77117, -663230, -254169, -306452, 95796, 430983, 273718, 507916, 216329, 372692, -133707, -336196, 301243, -189843, -264908, -628485, -97589, -298972, -57604, -450389, -199753, 377404]
1049C77404p15972J04098l1097L98822j272485L14481M91219K10769m81199K64022
1039c39938O3204j37244k23804K24437K63984q05353Q85851q13010J21584M50859
1029c09430J88351O6226n83784L00378m19519J3420M69592l12273P5099k10526
1019g22466K69463k0826K5473j4434K3396k40735m04674J181946k7024j80933
1009a10814q1094m7106k55481j35233k7067P32227M1922n21347J77927m70451
999f96517N70716o86474O61344K25375m57147k28749N7531M77600k34116J7642
989b92795R3083o253Q2759j4856k07436O83056r26506k1848l8686K48337j58655
978e59800J25240N76300k66066r26873O70533J45903m28410L70303J11152k85359
$$ y = [377404, -338568, -234470, -265567, 133255, -1139230, -824749, -333530, -122761, -603960, -339938, -276734, -413978, -637782, -413345, -149361, -954714, -68863, -881873, -760289, -309430, -121079, -54853, -638637, -338259, -757778, -744358, -274766, -587039, -511940, -722466, -453003, -473829, -448356, -462790, -439394, -680129, -1084803, 97143, 70119, -110814, -191908, -239014, -494495, -629728, -656795, 75432, 117354, -403993, -226066, -696517, -125801, -812275, -150931, 74444, -382703, -611452, -553921, -76321, -310437, -292795, -199712, -205965, -123206, -138062, -345498, 337558, -588948, -610796, -649482, -401145, -559800, -434560, 141740, -124326, -1051199, -380666, -234763, -663173, -292870, -181718, -467077]
968d67077k22954K46566j37086L93520k55918K31825j96612j90723L56156m57955
958g00258J45508R3331k44712L66568j22468j4344N71926n02748M56564n50024
948e00657J09274K56867m93089M06542n96830L38882K444O16691n32535q2508
938d74919l17026O26859o4650k35240n6986J90963M55505m72156l21494O35121
928c4023l01015l1020k14387N00469L93589r61915P74271o59997l66682M23981
918d76729k59435m07833L26898N98716K53813n15702J53645j90706N871J30950
908c80512o99491Q87404J38225j54418k84579J84191n30577p09555J021766M09508
898a18038M77649p59458K70894l63858Q6913j01959J20437k60731r6362N8786
$$ y = [-467077, -690031, -443465, -580551, -187031, -442949, -211124, -407736, -598459, -242303, -700258, -554750, -461419, -706131, -339563, -462031, -476375, 95551, -407197, 49367, -500657, -391383, -134516, -627605, -221063, -817893, -479011, -476567, 140124, -392411, -474919, -791945, -165086, -229736, -464976, -521962, -330999, 124506, -347650, -669144, -34023, -335038, -366058, -580445, -79976, 313613, -648302, 125969, -534028, -900710, -476729, -736164, -1143997, -817099, -218383, 35430, -480272, -326627, -517333, -511462, -380512, -1080003, -192599, -54374, -208792, -493371, -309180, -839757, -1549312, -527546, -118038, 359611, -399847, -128953, -492811, -405898, -507857, -387420, -648151, -744513, -685727]
888f85727K89278J57566o6510J91064k38899K01003n48179J2498P80789p80487
878f87604N273P30897l81110k25816K69570R4325p50129L06840K29026j26784
868e35512j79914L62320J16947M9318l84823n25482N86526J99112q1405j83076
858e75989N94089m49263K51973m55568J40118R3525P4642k65530o5291j89600
848h46894O30925j27453M0406k60883L83679J29935k36596L25682p18837M71304
838b08732j32504j87019J84212N49947o54922o7582J6931m41093N89573K48541
828a02648L29431R7946o44786j76751j22146o5615O52973M29185r32527J44477
818c90461M9301m32948P5229K58729j03174j11174L1930J98679O80017m88258
$$ y = [-685727, -396449, -238883, -305393, -114329, -353228, -152225, -700404, -687906, 92883, -687604, -682331, 48566, -332544, -558360, -288790, -194465, -944594, -637754, -408728, -535512, -715426, -353106, -236159, -186841, -571664, -1097146, -510620, -311508, -392913, -575989, 18100, -431163, -179190, -634758, -494640, -401115, -326473, -592003, -657294, -846894, -215969, -343422, -303016, -563899, -180220, -50285, -286881, 38801, -680036, -208732, -341236, -528255, -344043, 205904, -449018, -516600, -499669, -940762, -351189, -102648, 226783, 324729, -320057, -496808, -618954, -684569, -31596, 397589, -534938, -390461, -341160, -774108, -698879, -440150, -543324, -654498, -622568, -423889, 256128, -232130]
808b32130l10152N80042j028997P26612j9436j65859K78518l93005M4905K01272
798c18230P407L01314k86167l94849J79269j38159N9885j23978L8285J61559K35822
787b77842k30187R817J08448J60258j92742K91427K10455k49059j66350m54713
777g90488M39092M83726r08325N78471l82880l09393P603P04603q1756m30121
767f89468M11031n55278M15553M63258o10339K17669K86952q00348M33572J21285
757c06113m56281M94450l3368L0939l95269L26468m6751O19576m70782n48093
747g85224N17892J60473l45122j81269k79339P64534K70n18681O05747n68557
737f29276l97575Q98537j69028l89407O21692n14366R3369K25034K07499p98324
$$ y = [-232130, -542282, 37760, -991237, -264625, -284061, -449920, -171402, -564407, -519502, -318230, -310823, -9509, -295676, -690525, -511256, -649415, -589530, -713508, -675223, -513664, -277842, -508029, -498212, -389764, -229506, -422248, -130821, 79634, -169425, -335775, -790488, -351396, 132330, -775995, -197524, -580404, -889797, -882194, -177591, -259347, -689468, -278437, -833715, -418162, 45096, -565243, -347574, -60622, -860970, -427398, -306113, -762394, -267944, -301312, -270373, -665642, -339174, -385925, 233651, -237131, -785224, -267332, -106859, -451981, -633250, -912589, -148055, -147785, -666466, -60719, -629276, -1026851, -128314, -297342, -686749, -65057, -579423, -486054, -261020, -53521, -851845]
727h51845M34308n66240N38497M00605j0215n36412L49031k57363l19703P99214
717b0123j78139o3621l8127l81803L07208J39790m33220N88484m95742r2578M3536
706f24335k3132p2414M60566J40150m93533n9554N88506l40394K37207l1017l99441
695f17391l8847J65126L44766J40994n34261m43195K24487M94356N6665j57920
685c65220M04171K00332r89876J12873M41724l69580R7965L88247k21205J39822
675a60747k44001K97684j13168p9541l30957j00158L00406o5981J03837k58095
665f50721M15228l52146M06823J21111n36079L84123j16086j87196O9195j59598
655f05346K76503P21250n32622n05913L0912O84707p65320k9613K77837K42670
$$ y = [-851845, -417537, -983777, -445280, -44675, -54890, -591302, -242271, -499634, -819337, -20123, -198262, -261883, -300010, -681813, -374605, -234815, -668035, -79551, -575293, -667871, -624335, -647467, -719881, -259315, -119165, -612698, -672252, -83746, -424140, -186933, -217950, -617391, -656238, -491112, -146346, -5352, -539613, -982808, -758321, -263965, -207300, -365220, 38951, 239283, -750593, -637720, -195996, -565576, -467611, -79364, -300569, -160747, -404748, -107064, -220232, -299773, -630730, -730888, -430482, -496463, -392626, -650721, -235493, -587639, -180816, -59705, -595784, -211661, -327747, -514943, -445748, -605346, -328843, 392407, -140215, -646128, -615216, 69491, -695829, -725442, -447605, -204935]
645b04935k05213k53566L83656l1755j96586o7404j877K7760J33494L22373m73099
634e67152j5378M41340j17900r4942L23831m03984k87936q2026Q61638m22852
624c65361J17447J35379L27582l04599o10482M10185p20257N32029L55574l39600
614d62103m3677J62678q8161k07208O32607m72115m25256O68391l67071j01340
604g03255O78021Q1842o39218r2345N07662N7921J43229o38687K27918j21421
594d98333M6320N78210j014276M92332K05806k11423J47860j62163p0563K288
584d83942J24679J73041k59434L29308o08460O05596j85164J65816l39141M49474
574b8227k11049o30753N55596k56619k62407O25370k60894N6519l50461P33905
$$ y = [-204935, -410148, -663714, -280058, -311813, -508399, -575803, -577680, -549920, -416426, -94053, -567152, -582530, -141190, -259090, -354032, -30201, -434185, -722121, -804147, 57491, -365361, -247914, -112535, 215047, -89552, -700034, -289849, -1010106, -478077, -122503, -462103, -505780, -343102, -431263, -638471, -5864, -477979, -903235, -234844, -601915, -703255, -25234, 56608, -582610, -674955, -167293, -109372, 33857, -604830, -376912, -498333, -452013, 126197, -888079, -395747, -189941, -401364, -253504, -415667, -486230, -483942, -359263, -186222, -445656, -116348, -724808, -119212, -304376, -138560, -477701, -28227, -239276, -870029, -314433, -571052, -833459, -208089, -468983, -412464, -762925, -29020]
564b9020l88444M753l53790O29029j97380k53009J65453L68373k90124l51110
554f95269N42106m28989J49299m7909M69189n22943q780k81152L17611M5860j16092
543e77069J93015L34095o19573r396o5723N0266N52537R2677j31167r79102N07403
532f52037k18476O77867j90571K23641m47262J7672K26908M17217p09711K04236
522d50516J83839J55118p26010L67522L10035o49552N04351J78016n88539M27421
512b88315j792L0179l90081K00442L94469n58451M91255J37102n00713j54384
502f40289J53362M44824k95381m5348L43403k37173M57510j23275k95580n736
492b43683m3509j0492j73906J27014m18668K12010K21322k51026M02936J02009
$$ y = [-29020, -417464, -412711, -766501, -137472, -334852, -587861, -422408, -54035, -344159, -695269, -153163, -582152, -432853, -480762, -11573, -534516, -543296, -824448, -506837, -460977, -577069, -384054, -49959, -669532, -678928, -744651, -694385, -141848, -49171, -180338, -1159440, -652037, -870513, -192646, -383217, -159576, -606838, -589166, -362258, 54959, -654752, -450516, -266677, -111559, -837569, -470047, -160012, -809564, -305213, -127197, -715736, -288315, -290107, -259928, -650009, -449567, -55098, -613549, -122294, 14808, -485905, -640289, -486927, -42103, -337484, -382832, -39429, -276602, 180908, 57633, -237947, -243683, -287192, -297684, -471590, -344576, -763244, -551234, -329912, -580938, -178002, -75993]
482g5993l07454n11212N77865k1219l38084K53534J83717k89706M17879n19298
472f29971L04058j20699q0622L75127J25571J62864k95139o49426M22786K27482
462a57969o29731L88207j27544N04550l98266k44950K08706K84213j60040R4486
452b38338k78709J46615j49857j86341P24912m06791k7746k84462K08838Q9814
442d02065k3476l67874P73617o30724O47058k56536m12132N83875k40678k19484
432e48419L1076l86940K37909O86037m48342j7286N16333R8813l47122m23909
422f01850L64458K70398l87754M54610N9255n64253K56525j22794J20164l71092
412e22333j1922J03506J94194k06104M19740p26813R15384m74469j36066K2423
$$ y = [-75993, -383447, -894659, -316794, -338013, -676097, -422563, -238846, -528552, -110673, -629971, -325913, -446612, -527234, -152107, -26536, 136328, -158811, -808237, -385451, -157969, -787700, -399493, -527037, -22487, -420753, -665703, -456997, -172784, -332824, -238338, -517047, -370432, -520289, -706630, 18282, -388509, -416255, -700717, -491879, -402065, -425541, -793415, -19798, -650522, -3464, -260000, -672132, -88257, -328935, -548419, -517343, -904283, -666374, 19663, -428679, -445965, 70368, 169181, -177941, -601850, -237392, 33006, -354748, 99862, 159117, -405136, -148611, -271405, -151241, -522333, -534255, -430749, -236555, -442659, -22919, -749732, 165652, -308817, -444883, -422460]
402d22460m1563J99976l12456N21174L16766k92840m47786m29955M80054l20236
392g49326P20235k65723J76566k71769k17267L99477J36620k74411k71213K90370
382c26441k89006j10067J95623O08449n09890Q7994n39418N74169P7470l56551
372e87668J40533k5625k46117K50177n4113R60684o62661j75516K24859l38436
362e13883n56489N02082Q3697J08102J75362L32937o56237P3521N30704m36723
352c56927K11944q9776o10867M05433k70642K26437L13380J58250o40256O45066
342g958n86574L19800L6542j19805o9165k20970N68100l59709L9666n9047K54872
331b04248j88573L9395j57061J30415J79415j36951j50362Q6699o21668O16395
$$ y = [-422460, -464023, -264047, -576503, -55329, 261437, -31403, -479189, -909144, -429090, -749326, -29091, -294814, -118248, -390017, -607284, -207807, -71187, -345598, -616811, -326441, -615447, -725514, -529891, 78558, -431332, -343338, -882756, -308587, -231117, -587668, -447135, -472760, -718877, -468700, -522813, 437871, -224790, -400306, -175447, -513883, -1070372, -568290, -484593, -376491, -201129, 131808, -524429, -450908, 79796, -356927, -144983, -234759, -845626, -440193, -710835, -484398, -171018, -12768, -653024, -7958, -594532, -274732, -238190, -357995, -427160, -648130, -80030, -439739, -400073, -459120, -204248, -392821, -353426, -510487, -380072, -200657, -337608, -487970, -401271, -1022939, -406544]
321d06544j06938j15155R2400k8468L82502N0569l51492N61307j73334n78839
311f73992J97608L46205j29581k94033M12186j09663l33750p3024K51317m86359
301h93086Q59686l16369M87293o33996J06809J76599K84563k80099M5379k87791
291d51012M8892j02350J22958K07004k22092j54935J39963N0764L80230L19802
281C39224o97294N5013Q669l0722r6043Q7922M9212o0305k14741J52477j01582
270e08170l77004N39153k06926j12081N13795k0989k37869K10529r67186P14599
260d52149j46815J40563l80198M39503l2146J63956J51210o7266l7660l8475O0410
249a99067J67916l77354r8491J25345J97729k80908j53130L77151j37723k46848
$$ y = [-406544, -513482, -628637, -536237, -564705, -182203, -131634, -483126, 78181, -95153, -673992, -476384, -130179, -259760, -553793, -141607, -251270, -585020, -658044, -406727, -893086, -33400, -349769, 137524, -496472, -389663, -213064, 71499, -208600, -163221, -451012, -402120, -504470, -381512, -174508, -396600, -551535, -411572, -360808, 19422, 339224, -358070, -303057, -294388, -325110, -421153, -333231, -284019, -344324, -559065, -406588, -508170, -885174, -346021, -552947, -665028, -151233, -172222, -410091, -199562, -1166748, -452149, -598964, -458401, -838599, -399096, -431242, -267286, -116076, -183342, -221002, -259477, -199067, -31151, -408505, -506996, -381651, -183922, -464830, -617960, -240809, -378532, -625380]
239f25380O0930J31023k05108J97728j98631O10043r9846m64710J47879N66709
229A20637k55352o5753L50600q31539N63202O9265o97296K35996L85725l89386
219e13901K04416m2759K48695m87916l28396P09185K51874n81944K27198j06373
209d19921K51990k67430N40036m63978j53717L79640j38709K01027k05862k53030
199e29954K66493l18755N56860l47870K78493l05596M4189j32087j77766l7723
189g03716J3686M49307k96722O19739n34309K68897k34660P2486Q589j08139o4407
178e09249L58672k93098J03994N66668j112750L93750n19677M30546K75895j1844
168c17093R1976k0982L47189n57929L28943o07329J93083R2687j78307M80630
$$ y = [-625380, -564450, -433427, -638535, -440807, -639438, -29395, -129241, -593951, -446072, 120637, -134715, -200468, 150132, -681407, -118205, -48940, -746236, -510240, -124515, -513901, -309485, -352244, -103549, -591465, -919861, -210676, 41198, -540746, -313548, -419921, -167931, -435361, 104675, -359303, -513020, -133380, -272089, -71062, -276924, -529954, -263461, -582216, -25356, -373226, -94733, -400329, -356140, -488227, -665993, -703716, -690030, -240723, -537445, 82294, -452015, -183118, -417778, -345292, -336703, -444842, -509249, -150577, -443675, -339681, 226987, -885763, -492013, -1011690, -581144, -305249, -317093, -225117, -246099, 101090, -456839, -127896, -735225, -542142, -449455, -627762, -147132]
158a47132o18028O5644O09217M5091m27582N41048n05351L19472o45199J00842
148f61978J32641J81444R9657K02021k97238k10160J15230K08449k72035j62427
138f64396J82543J30491M1544k30321J29759o7059M77276m13296k10234N07330
128a16363L5497n89110O9500J50926J74652n44483Q07296p660l79414n4618K06000
117b47777K10566j08696J72840k74777m90317K73209n6412j50831K30401L46506
107i5288o92881K37953L12101R8781n73473M1884M84677q61110N17969K03692
97c25695L82247m04360r9165O1883p0874k1963K1600K80012m20961L84085J18851
86i4340n5936m10585Q9637k07309L45846J10029l92865j2476J94535k18643M48497
$$ y = [-147132, -765160, -699516, -90299, -45208, -472790, 68258, -437093, -117621, -762820, -661978, -529337, -347893, -248236, -46215, -343453, -553613, -438383, -229934, -501969, -664396, -481853, -351362, -309818, -540139, -410380, -477439, -163, -413459, -623693, -116363, -80866, -669976, -600476, -449550, -274898, -819381, -12085, -19745, -399159, -453777, -247777, -37211, -145907, 26933, -247844, -738161, -464952, -521364, -672195, -441794, -95288, -788169, -550216, -238115, -139334, -712807, -670923, -186246, -1047356, -529387, -325695, 56552, -347808, -446973, -385090, -455964, -477927, -456327, -176315, -597276, -213191, -94340, -150276, -560861, -471224, -678533, -332687, -222658, -615523, -627999, -433464, -652107, -203610]
75b03610l43412m5583M73590j42127l0837r740k81771q3300K44550J19497l23951
64f26694l26436O17624p6739R9192K4176j31357M3801j15305l132K58507j62453
53c98816p5705R3289O2277R0031j40999J97985l44107m2033J56434r0089k32585
42g24318m7914M22457j49571j95642K77249M01514n04170k20147r5479M25412
32d10609k91335J75594K80367j65087L3343o4144p2977M7265k25349J62319N16659
21a3954n18636O6206K66875m93713K34635K16787j78797l77665N32096L7863L0801
10a97502l20507J34521k6908J41025j03526o1382j3120K89406l1648q16921
0a006562
$$ y = [-203610, -547022, -592605, -119015, -261142, -291979, -301719, -583490, -666790, -422240, -302743, -626694, -953130, -335506, -412245, -313053, -288877, -420234, -376433, -491738, -494870, -236363, -398816, -474521, -381232, -318955, -228924, -369923, -171938, -516045, -558078, -401644, -491733, -724318, -772232, -349775, -499346, -694988, -417739, -16225, -520395, -740542, -836021, -410609, -701944, -526350, -245983, -411070, -377727, -441871, -514848, -467583, -692932, -530613, -13954, -532590, -466384, -199509, -693222, -458587, -241800, -420597, -798262, -266166, -228303, -197502, -518009, -383488, -410396, -269371, -372897, -434279, -447399, -157993, -189641, -1006562]
$$ Imaginary data points
##PAGE= N=2
##DATA TABLE= (X++(I..I)), XYDATA
16383b242869Q522q47127N85244L11814l72192J87422R1377J02389k20604L31520
16373b064504K53702k20009K4684K49049k78061K52957n37201Q8911L76840l15732
16363b169364J28993k32024J92807K70983L18565j02591k39720P3007M1567j56246
16353a874023n0215l1170M38231J5067M0217n2805q11l79771N25022j11775P6527
16342a405506k40498M22759J78925o39728O5130L58069Q2063J74197n71890P5435
16332a501044K87420q7383K14448l2798K39350m0653j34544p9671K52005j48778
16322a031648K34500j31628N2210o0834J88035J83708j22135k52823K82921k88859
16312i46553L15148K3482l40689L15679P5287O9412p089k38972J30241O1791L76135
$$ y = [-2242869, -2234347, -3081474, -2496230, -2184416, -2556608, -2369186, -2277809, -2175420, -2396024, -2064504, -1810802, -2030811, -2006127, -1757078, -2035139, -1782182, -2319383, -2230472, -1853632, -2169364, -2040371, -2272395, -2079588, -1808605, -1490040, -1592631, -1832351, -1759344, -1717777, -1874023, -1924238, -1955408, -1517177, -1502110, -1461893, -1514698, -1515509, -1895280, -1370258, -1482033, -1405506, -1646004, -1223245, -1044320, -1684048, -1618918, -1260849, -1178786, -1004589, -1576479, -1501044, -1213624, -1301007, -1086559, -1119357, -880007, -920660, -1055204, -1134875, -882870, -1031648, -797148, -928776, -876566, -937400, -749365, -565657, -687792, -940615, -657694, -946553, -631405, -607923, -948612, -632933, -557646, -488234, -495323, -734295, -604054, -542263, -166128]
16301a66128j01396N607J08153j0225J24123k15008M9935k13650J1764N0418K0281
16290c36126M1157j00146N46428N1865p2063l49264J84350N4441N93129p57090
16280a43319j3855P3639j41634J96998J00379K99484m91734j11333M39270k42633
16270c4738M60986j11522m14470l68424O58049J98189m4024p0844L42930l15896
16260C00236n43865O87029J56178J19281R7606l54501R0070k26232L97663k93327
16250D30138J03424N0382l86855M00399m6463L7827j62517k8140l7694R95776
16240A356277l39535n00157J44142r4445J62706j04539L24266k19350k57536L37086
16230H08915P8890k35591M85301L8303j24697j19062J23380n46694J20581J15841
$$ y = [-166128, -267524, -261917, -153764, -163989, -39866, -254874, -204939, -418589, -406825, -356407, -336126, -294969, -395115, 151313, 203178, 131115, -218149, -33799, 20642, 613771, -143319, -157174, -83535, -225169, -28171, 72208, 371692, -120042, -231375, 207895, -34738, 426248, 314726, -99744, -468168, 189881, 388070, 344046, 273202, 616132, 300236, -243629, 443400, 599578, 718859, 816465, 461964, 552034, 325802, 723465, 430138, 533562, 583944, 197089, 597488, 551025, 588852, 426335, 398195, 360501, 1356277, 1016742, 516585, 660727, 566282, 728988, 624449, 948715, 729365, 471829, 808915, 887805, 652214, 1137515, 1175818, 1051121, 932059, 1055439, 508745, 629326, 745167]
16220G45167L49842n98563R11022k59238k49915J41257k86143L27975p8594j3455
16210I89355j24665L17193m34858j82883K74925O13319m14205J13776M59497j84864
16200A426590j10589m72383K17289K86279k84092K0795O3724J47384l76324P49699
16190A668372j6946j45103o98463k10556M79637K41348p7985l11784L6589O29189
16180A594298n8677j23646J12756k0797l43745l56503M24052L14910o8194J05881
16170A580335j77827J96126J747q51888L98228K30798j71309J02102M53634n35981
16160A225965q3398l00571N27031K51994j14295r9850K16760k97694k85860J52202
16150A192284L94408m3944m56182P61091l44277O3750j79500j78581P20415m86098
$$ y = [745167, 1095009, 496446, 1407468, 1148230, 898315, 1039572, 753429, 1081404, 1002810, 989355, 864690, 1181883, 747025, 564142, 839067, 1452386, 1038181, 1151957, 1611454, 1426590, 1316001, 843618, 1060907, 1347186, 1063094, 1083889, 1147613, 1294997, 918673, 1668372, 1651426, 1506323, 807860, 597304, 1076941, 1318289, 1240304, 928520, 965109, 1594298, 1535621, 1411975, 1524731, 1503934, 1160189, 803686, 1227738, 1542648, 1474454, 1580335, 1402508, 1598634, 1600381, 748493, 1146721, 1377519, 1206210, 1308312, 1761946, 1225965, 1142567, 841996, 1369027, 1621021, 1506726, 1406876, 1623636, 1325942, 1040082, 1192284, 1586692, 1542748, 1086566, 1847657, 1503380, 1567130, 1387630, 1209049, 1929464, 1443366]
16140A443366k10394O46822n8458j53509k61097m4210L58146l28166J83220N34407
16130B110127p49652Q2405K16779o2044m27198L81507r4163k10382K81495l8805
16120A490069k13196k91000J092215k28746n24719J98675p9905M08843k79900
16111A572336J55608n21750O7582N15272K3905k55695L01564k68504j9859Q7744
16101A658203k74662M9960L54379L7040J47505k59526j82923K34100k5893L10123
16091B048306p10025K86070j06979r8371L15028k30342K55046N07513j097926
16082A168320K28587L01124j09584N66239q53431K53067K43244j64993k79045
16073A353528K89568L4061k23136M28523m51851J22208J31590J25961k72243K89067
$$ y = [1443366, 1232972, 1879794, 1821336, 1667827, 1406730, 1362520, 1720666, 1392500, 1575720, 2110127, 1360475, 1442880, 1659659, 1597615, 1170417, 1551924, 1457761, 1247379, 1528874, 1490069, 1276873, 985873, 2078088, 1849342, 1324623, 1523298, 1443393, 1852236, 1572336, 1727944, 1206194, 1273776, 1789048, 1812953, 1557258, 1858822, 1590318, 1570459, 1658203, 1383541, 1433501, 1787880, 1824920, 1972425, 1712899, 1529976, 1764076, 1738183, 2048306, 1338281, 1624351, 1517372, 1419001, 1734029, 1503687, 1758733, 2266246, 1168320, 1396907, 1698031, 1588447, 2154686, 1301255, 1554322, 1797566, 1632573, 1353528, 1643096, 1677157, 1454021, 1882544, 1430693, 1552901, 1684491, 1810452, 1538209, 1827276]
16063A827276P6694k64299r8670L89322m79668K61464M33545p28923N02207J2359
16053A931307j72896j85681O2116N0019k09367o6997O90810l89221j82806r809
16043A517475Q6926j68962N80788k64324N4078k79923j35508L46738l35043K73399
16033A675644M03610j14728K01396p12758n21356N11679K13994K07985K17271
16024B082737m86299M26496n10857J29792K67286P3534P7379o43862j88553P85937
16014B013590k74495j73801K45215M7639k62517K53033p17980P34469k92595J41350
16004A713908r19330N30514N90711R9176o21208N22331l21700K79226j26407L76714
15994B123935k00555k03128L07904l13385m18840O37523j00283P3017n15541L51686
$$ y = [1827276, 1903970, 1639671, 1541001, 1930323, 1450655, 1712119, 2145664, 1416741, 1918948, 1931307, 1758411, 1572730, 1634846, 1684865, 1475498, 1408501, 2099311, 1710090, 1527284, 1517475, 1604401, 1435439, 2016227, 1751903, 1805981, 1526058, 1390550, 1737288, 1402245, 1675644, 2079254, 1964526, 2165922, 1453164, 931808, 1443487, 1657481, 1865466, 2082737, 1596438, 2022934, 1512077, 1641869, 1909155, 1982689, 2060068, 1416206, 1227653, 2013590, 1739095, 1565294, 1810509, 1858148, 1595631, 1848664, 1130684, 1865153, 1572558, 1713908, 794578, 1325092, 1915803, 2014979, 1393771, 1916102, 1594402, 1873628, 1747221, 2123935, 1923380, 1720252, 2028156, 1714771, 1295931, 1933454, 1833171, 1906188, 1390647, 1742333]
15984A742333J9240Q9473n30291N74851K21728p79503r1236P18762J49509o85940
15974A428926P72731m90693l00341L35145L06519k1743r06303K21166L84784k00962
15964A529229N91338n93595M53085k04748n19673M24685K35128k61507L4940J56805
15954A845687j95812j72383M74070m54950j77442K80602L50675J23224k54130
15945A819541j31051p7097l34832L64780L1969l0990M53448N4198n87651M68784
15935B031099l03400l46380K06946L98154j15439l25306J20377M03155m41943
15926A627263j68237O40366k21995j56296N1813K21751R4982m05637k06223L02768
15916A780555o8851K26253J066q4510J65971l20734k35421M86335K03425j25710
$$ y = [1742333, 1761573, 1851046, 1320755, 1895606, 2117334, 1337831, 1246595, 1965357, 2114866, 1428926, 2201657, 1710964, 1410623, 1745768, 2052287, 2030544, 1124241, 1345407, 1730191, 1529229, 2120567, 1526972, 1980057, 1775309, 1255636, 1680321, 1915449, 1653942, 1688882, 1845687, 1649875, 1477492, 1951562, 1496612, 1319170, 1599772, 1950447, 2073671, 1819541, 1688490, 1611393, 1276561, 1641341, 1673310, 1642320, 2095768, 2149966, 1562315, 2031099, 1727699, 1381319, 1588265, 1986419, 1870980, 1545674, 1666051, 2069206, 1627263, 1459026, 2099392, 1877397, 1721101, 1772914, 1994665, 2089647, 1684010, 1477787, 1780555, 1711704, 1937957, 1939023, 1854513, 2020484, 1699750, 1464329, 1950664, 2154089, 2028379]
15906B028379l91117j8398j43964L42890K88980m77031j21921J58496q2758M8654
15896A632210K47229k20390J79595n7106m40748L80915K44601r3316m09557M42958
15886A906391N3420J89761n45552j19369J82230K3860k70395R7584m7239M16626
15876A887317j92157M30159p23006N46032n18775L89351M8974R4050n69071L53965
15866A746839j97604O79410q59421K53308K473L72306k99656J8881K49939K086
15856A968561q2544J71315j01638M111n36395j67591J97975O1621K38589k42563
15846A511441N5355m41643K79392Q4268L41273m4619k10488K7063l44964L49402
15836A606480K65686P8288l04925K33668j17416Q2514o54650M05317m40N15019
$$ y = [2028379, 1637262, 1618864, 1474900, 1817790, 2106770, 1629739, 1507818, 1666314, 1583556, 1632210, 1879439, 1659049, 1838644, 1781538, 1340790, 1721705, 1966306, 1872990, 1463433, 1906391, 1959811, 2149572, 1604020, 1484651, 1666881, 1690741, 1420346, 1517930, 1470691, 1887317, 1695160, 2125319, 1402313, 1948345, 1429570, 1818921, 1867895, 1961945, 1392874, 1746839, 1549235, 2228645, 1369224, 1622532, 1625005, 1997311, 1697655, 1716536, 1966475, 1968561, 1886017, 2057332, 1955694, 1959805, 1423410, 1255819, 1453794, 1515415, 1754004, 1511441, 1566796, 1125153, 1404545, 1488813, 1830086, 1785467, 1574979, 1602042, 1257078, 1606480, 1872166, 1950454, 1645529, 1879197, 1761781, 1844295, 1189645, 1594962, 1594522, 2109541]
15826B109541j94510n74602L65004O46719k46966j96084l64569J37430j2370p85387
15816H84206O34993J90822K74593l96516j28426M31239O6217L0543j63661l03045
15806A520965M22451n52950N24343l4478l10628L20291l85136N39253l07241L80361
15796B117231m05292p1304l18698O91901k63428K9265J54854p46839Q86275n91930
15786A482035R9461K40880j79610p2784n59918O32558N64668q29459P29149o17817
$$ y = [2109541, 1915031, 1340429, 1705433, 2352152, 2105186, 1909102, 1544533, 1681963, 1669593, 884206, 1519199, 1710021, 1984614, 1588098, 1459672, 1890911, 1957128, 1987671, 1824010, 1520965, 1943416, 1390466, 1914809, 1880331, 1569703, 1889994, 1504858, 2044111, 1736870, 2117231, 1711939, 1640635, 1321937, 2013838, 1750410, 1779675, 1934529, 1187690, 2073965, 1482035, 1581496, 1822376, 1642766, 1569982, 1010064, 1642622, 2207290, 1377831, 2106980, 1489163]
$$ [...]
##END NTUPLES=NMR SPECTRUM
##END=
