##TITLE=abcd
##JCAMPDX= 6.0         $$ Bruker NMR JCAMP-DX V2.0
##DATA TYPE= NMR SPECTRUM
##DATA CLASS= NTUPLES
##ORIGIN= UXNMR, Bruker Analytische Messtechnik GmbH
##OWNER= root
$$ XWIN-NMR		Version 3.5
$$ Sat Apr 18 11:05:38 2026 Russian Standard Time (UT+4h)  servis@DPX200
##.OBSERVE FREQUENCY= 200.131235884673
##.OBSERVE NUCLEUS= ^1H
##.ACQUISITION MODE= SIMULTANEOUS
##.ACQUISITION SCHEME= undefined
##.AVERAGES= 16
##.DIGITISER RES= 18
##SPECTROMETER/DATA SYSTEM= spect
##.PULSE SEQUENCE= zg
##.SOLVENT NAME= CDCl3
##.SHIFT REFERENCE= (INTERNAL, CDCl3, 0, 16.4885)
##AUDIT TRAIL= $$ (NUMBER, WHEN, WHO, WHERE, WHAT)
$$ ##TITLE= Audit trail, XWIN-NMR		Version 3.5
$$ ##JCAMPDX= 5.01
$$ ##ORIGIN= Bruker BioSpin GmbH
$$ ##OWNER= servis
$$ F:\spectra/data/av/nmr/H1/1/pdata/1/auditp.txt
$$ ##AUDIT TRAIL=  $$ (NUMBER, WHEN, WHO, WHERE, WHAT)
(   1,<2026-04-18 11:05:01.37 +0400>,<servis>,<DPX200>,
      <created by zg, POWCHK disabled, PULCHK disabled
       terminated by command 'halt'
       configuration hash MD5:
       00 E9 B6 7A A2 85 ED C7 34 08 36 98 17 FE 4E 26
       data hash MD5: 32K
       E2 E3 01 D2 37 E3 76 7A AC 7A 16 88 59 52 4B 8B>)
(   2,<2026-04-18 11:05:14.89 +0400>,<servis>,<DPX200>,
      <Start of raw data processing
       efp BC_mod = 2 LB = 0.05 FT_mod = 6 PKNL = 1 PHC0 = -262.6274 PHC1 = 3.101563 SI = 16K 
       data hash MD5: 16K
       31 E9 A1 F8 78 7E AB 0B FB 70 74 92 BB 36 65 91>)
$$ ##END=
$$ 
$$ hash MD5
$$ 0B 10 08 F0 D0 45 5C 5E D2 92 7A BE 03 48 F8 4B
##$RELAX= 
##$RELAX= 
##$RELAX= 
##$RELAX= 
##$RELAX= 
##$RELAX= 
##$RELAX= 
##$RELAX= 
$$ Bruker specific parameters
$$ --------------------------
##$DU= <F:\spectra>
##$EXPNO= 1
##$NAME= <H1>
##$PROCNO= 1
##$TYPE= <nmr>
##$USER= <av>
##$AMP= (0..31)
100 100 100 100 100 100 100 100 100 100 100 100 100 100 100 100 100 100 
100 100 100 100 100 100 100 100 100 100 100 100 100 100 
##$AQSEQ= 0
##$AQ_mod= 1
##$AUNM= <au_zg>
##$AUTOPOS= <>
##$BF1= 200.13
##$BF2= 200.13
##$BF3= 200.13
##$BF4= 200.13
##$BF5= 500.13
##$BF6= 500.13
##$BF7= 500.13
##$BF8= 500.13
##$BYTORDA= 1
##$CFDGTYP= 0
##$CFRGTYP= 5
##$CHEMSTR= <none>
##$CNST= (0..31)
1 1 145 1 1 1 1 1 1 1 1 1 1 1 1 1 1 1 1 1 1 1 1 1 1 1 1 1 1 1 1 1 
##$CPDPRG= <>
##$CPDPRG1= <>
##$CPDPRG2= <>
##$CPDPRG3= <>
##$CPDPRG4= <mlev>
##$CPDPRG5= <mlev>
##$CPDPRG6= <mlev>
##$CPDPRG7= <mlev>
##$CPDPRG8= <mlev>
##$CPDPRGB= <>
##$CPDPRGT= <>
##$D= (0..31)
0 2 0 0 0 0 0 0 0 0.06 0 0 0 0 0 0 0.0002 0 0 0 0 0 0 0 0 0 0 0 0 0 0 
0 
##$DATE= 1776495901
##$DBL= (0..7)
120 120 120 120 120 120 120 120 
##$DBP= (0..7)
150 150 150 150 150 150 150 150 
##$DBP07= 0
##$DBPNAM0= <>
##$DBPNAM1= <>
##$DBPNAM2= <>
##$DBPNAM3= <>
##$DBPNAM4= <>
##$DBPNAM5= <>
##$DBPNAM6= <>
##$DBPNAM7= <>
##$DBPOAL= (0..7)
0.5 0.5 0.5 0.5 0.5 0.5 0.5 0.5 
##$DBPOFFS= (0..7)
0 0 0 0 0 0 0 0 
##$DE= 6
##$DECBNUC= <off>
##$DECIM= 32
##$DECNUC= <off>
##$DECSTAT= 4
##$DIGMOD= 1
##$DIGTYP= 9
##$DL= (0..7)
0 120 120 120 120 120 120 120 
##$DP= (0..7)
$$ [...]
##$SUBNAM4= <"">
##$SUBNAM5= <"">
##$SUBNAM6= <"">
##$SUBNAM7= <"">
##$SUBNAM8= <"">
##$SUBNAM9= <"">
##$SW= 20.6817932712277
##$SWIBOX= (0..15)
0 0 3 0 0 0 0 0 0 0 0 0 0 0 0 0 
##$SW_h= 4139.07284768212
##$TD= 32768
##$TD0= 1
##$TE= 0
##$TE2= 300
##$TE3= 300
##$TEG= 300
##$TL= (0..7)
0 120 120 120 120 120 120 120 
##$TP= (0..7)
150 150 150 150 150 150 150 150 
##$TP07= 0
##$TPNAME0= <>
##$TPNAME1= <>
##$TPNAME2= <>
##$TPNAME3= <>
##$TPNAME4= <>
##$TPNAME5= <>
##$TPNAME6= <>
##$TPNAME7= <>
##$TPOAL= (0..7)
0.5 0.5 0.5 0.5 0.5 0.5 0.5 0.5 
##$TPOFFS= (0..7)
0 0 0 0 0 0 0 0 
##$TUNHIN= 0
##$TUNHOUT= 0
##$TUNXOUT= 0
##$USERA1= <user>
##$USERA2= <user>
##$USERA3= <user>
##$USERA4= <user>
##$USERA5= <user>
##$V9= 5
##$VALIST= <valist>
##$VCLIST= <CCCCCCCCCCCCCCC>
##$VD= 0
##$VDLIST= <DDDDDDDDDDDDDDD>
##$VPLIST= <PPPPPPPPPPPPPPP>
##$VTLIST= <TTTTTTTTTTTTTTT>
##$WBST= 1024
##$WBSW= 30
##$XGAIN= (0..3)
0 0 0 0 
##$XL= 0
##$YL= 0
##$YMAX_a= 806296
##$YMIN_a= -574145
##$ZGOPTNS= <>
##$ZL1= 120
##$ZL2= 120
##$ZL3= 120
##$ZL4= 120
##$ABSF1= 0
##$ABSF2= 0
##$ABSG= 0
##$ABSL= 0
##$ALPHA= 0
##$AQORDER= 0
##$ASSFAC= 0
##$ASSFACI= 0
##$ASSFACX= 0
##$ASSWID= 0
##$AUNMP= <proc_1d>
##$AZFE= 0.1
##$AZFW= 0.1
##$BCFW= 0
##$BC_mod= 2
##$BYTORDP= 0
##$COROFFS= 0
##$CY= 18.4799938201904
##$DATMOD= 1
##$DC= 0
##$DFILT= <>
##$DTYPP= 0
##$F1P= 9.9274215381318
##$F2P= -0.165520771350173
##$FCOR= 1
##$FTSIZE= 16384
##$FT_mod= 6
##$GAMMA= 0
##$GB= 0
##$INTBC= 1
##$INTSCL= 4.127829e-11
##$ISEN= 128
##$LB= 0.05
##$LEV0= 0
##$LPBIN= 0
##$MAXI= 10000
##$MC2= 0
##$MEAN= 0
##$ME_mod= 0
##$MI= 50
##$NCOEF= 0
##$NC_proc= -5
##$NLEV= 6
##$NOISF1= 3.799351
##$NOISF2= 2.8
##$NSP= 0
##$NTH_PI= 0
##$NZP= 0
##$OFFSET= 16.48848
##$PC= 4
##$PHC0= -262.6274
##$PHC1= 3.101563
##$PH_mod= 1
##$PKNL= yes
##$PPARMOD= 0
##$PSCAL= 4
##$PSIGN= 0
##$REVERSE= no
##$SF= 200.130005582386
##$SI= 16384
##$SIGF1= 3
##$SIGF2= 2
##$SINO= 400
##$SIOLD= 16384
##$SREGLST= <1H.CDCl3>
##$SSB= 0
##$STSI= 16384
##$STSR= 0
##$SW_p= 4139.07284768211
##$SYMM= 0
##$S_DEV= 0
##$TDeff= 32768
##$TDoff= 0
##$TI= <>
##$TILT= no
##$TM1= 0
##$TM2= 0
##$TOPLEV= 0
##$USERP1= <user>
##$USERP2= <user>
##$USERP3= <user>
##$USERP4= <user>
##$USERP5= <user>
##$WDW= 1
##$XDIM= 16384
##$YMAX_p= 390043242
##$YMIN_p= -930623
$$ End of Bruker specific parameters
$$ ---------------------------------
##NTUPLES= NMR SPECTRUM
##VAR_NAME=  FREQUENCY,     SPECTRUM/REAL,   SPECTRUM/IMAG
##SYMBOL=    X,             R,               I
##VAR_TYPE=  INDEPENDENT,   DEPENDENT,       DEPENDENT
##VAR_FORM=  AFFN,          ASDF,            ASDF
##VAR_DIM=   16384,         16384,           16384
##UNITS=     HZ,            ARBITRARY UNITS, ARBITRARY UNITS
##FACTOR=    0.252644378177508, 1,           1
##FIRST=     3299.83951724647, 0,            0
##LAST=      -839.233330435636, 0,           0
##MIN=       -839.233330435636, -930623,     0
##MAX=       3299.83951724647, 390043242,    0
$$ Real data points
##PAGE= N=1
##DATA TABLE= (X++(R..R)), XYDATA
$$ [...]
$$ plain form
7793 222262 229825 352953 248202 144003 227784 253394 168989 -31630 138042 203494 46616
7782 46616 300723 127249 259779 225340 114985 166795 160657 80239 180430 223309 167933
7771 167933 268574 360676 239203 158460 208673 250455 250869 152924 270837 251058 240843
7760 240843 69722 -50224 291311 462316 379948 66395 271705 341379 200247 421489
7750 421489 242427 104365 131428 239235 47447 159108 410918 216288 150056 28913
7740 28913 139952 313350 73401 230832 248036 297665 103899 -61003 8085 99424 147504
7729 147504 135981 391884 113238 -41333 367525 112475 28469 215958 199247 216755
7719 216755 44420 140866 359544 182171 124572 -66146 262908 112781 200864 253080
$$ packed form
7793B22262P563J23128j04751j04199Q3781K5610q4405k00619J69672O5452j56878
7782D6616K54107j73474J32530l4439j10355N1810o138q0418J00191M2879n5376
7771A67933J00641R2102j21473q0743N0213M1782M14r7945J17913j9779j0215
7760B40843j71121j19946L41535J71005q2368l13553K05310O9674j41132K21242
7750D21489j79062j38062K7063J07807j91788J11661K51810j94630o6232j21143
7740B8913J11039J73398k39949J57431J7204M9629j93766j64902O9088R1339M8080
7729A47504j1523K55903k78646j54571M08858k55050q4006J87489j6711J7508
7719B16755j72335R6446K18678j77373n7599j90718L29054j50127Q8083N2216
$$ plain form
7709 253080 86372 266859 -75429 111257 138350 298311 444606 171700 242118 -17951
7699 -17951 210137 198204 123112 299288 147501 187981 110405 229366 131825 163484 187748
7688 187748 49430 184214 287652 206014 105854 164038 300304 242133 163737 87501 -58018
7677 -58018 -6842 79113 263119 138837 -12126 236803 13625 -80577 83149 260785
7667 260785 452549 187144 130954 -35469 145908 19532 115450 235544 -13985 360440
7657 360440 287680 11567 244442 280517 412728 22780 194165 64272 181283 105608
7647 105608 119494 303197 98813 38806 74438 -12830 235510 125140 154333 240573 67716
7636 67716 -15409 88445 175720 120612 352253 348989 158149 109681 169199 298841 229441
$$ packed form
7709B53080j66708J80487l42288J86686K7093J59961J46295k72906P0418k60069
7699a7951K28088j1933p5092J76176j51787M0480p7576J18961r7541L1659K4264
7688A87748j38318J34784J03438q1638j00160N8184J36266n8171p8396p6236j45519
7677e8018N1176Q5955J84006j24282j50963K48929k23178r4202J63726J77636
7667B60785J91764k65405n6190j66423J81377j26376R5918J20094k49529L74425
7657C60440p2760k76113K32875L6075J32211l89948J71385j29893J17011p5675
7647A05608J3886J83703k04384o0007L5632q7268K48340j10370K9193Q6240j72857
7636F7716q3125J03854Q7275n5108K31641l264j90840m8468N9518J29642o9400
$$ plain form
7625 229441 302225 293783 132184 137261 212589 300482 188912 184090 248831 205497 364126 279902
7613 279902 58935 142229 157773 192922 107091 193004 238948 214437 211331 227190 319456 214553
7601 214553 225335 245234 442259 214708 147664 264176 291277 311963 292459 359656 391501
7590 391501 171634 229722 206360 148047 306429 143848 232058 313194 251358 122251 312525
7579 312525 478882 293357 388171 383956 274332 261394 358673 315334 284793 194336 363648
7568 363648 419874 344156 362022 411265 426830 267455 386744 379420 361442 455572 514852
7557 514852 447546 426483 488616 374884 475497 183540 469826 568610 304089 355475 450261
7546 450261 361767 442642 269564 388888 593145 130315 386726 544223 313340 591764
$$ packed form
7625B29441P2784q442j61599N077P5328Q7893j11570m822O4741m3334J58629q4224
7613B79902k20967Q3294J5544L5149q5831Q5913M5944k4511l106J5859R2266j04903
7601B14553J0782J9899J97025k27551o7044J16512K7101K0686j9504O7197L1845
7590C91501k19867N8088k3362n8313J58382j62581Q8210Q1136o1836j29107J90274
7579C12525J66357j85525R4814m215j09624j2938R7279m3339l0541r0457J69312
7568C63648N6226p5718J7866M9243J5565j59375J19289p324j7978R4130N9280
7557E14852o7306k1063O2133j13732J00613k91957K86286R8784k64521N1386R4786
7546D50261q8494Q0875j73078J19324K04257m62830K56411J57497k30883K78424
$$ plain form
7536 591764 430939 399904 531087 503256 310569 455579 555643 227730 596499 385922
7526 385922 402656 400567 396550 626268 450960 375764 501699 416266 501377 421776 472029
7515 472029 614130 468313 326190 286494 394529 328912 327332 393532 385397 343155 286373
7504 286373 429424 517792 246476 551039 279373 348861 371004 209284 347162 356279 325612
7493 325612 254780 501765 403292 394178 409171 307449 506327 342513 357177 417019 531480
7482 531480 347605 409163 619081 558094 535692 480704 659109 603900 351427 527665 476591
7471 476591 489059 557525 576909 647177 582206 726901 558242 437884 653541 631646 444356
7460 444356 442352 637796 314012 676019 746122 560812 591053 739315 654390 664136 759814
$$ packed form
7536E91764j60825l1035J31183k7831j92687J45010J00064l27913L68769k10577
7526C85922J6734k089m017K29718j75308p5196J25935q5433Q5111p9601N0253
7515D72029J42101j45817j42123l9696J08035o5617j580O6200q135m2242n6782
7504B86373J43051Q8368k71316L04563k71666O9488K2143j61720J37878R117l0667
7493C25612p0832K46985r8473r114J4993j01722J98878j63814J4664N9842J14461
7482E31480j83875O1558K09918o0987k2402n4988J78405n5209k52473J76238n1074
7471D76591J2468O8466J9384P0268o4971J44695j68659j20358K15657k1895j87290
7460D44356k004J95444l23784L62007P0103j85310L0241J48262q4925R746R5678
$$ plain form
7449 759814 541803 1014334 706914 548189 558180 666680 788787 787936 705646 679427 990537
7438 990537 750553 875197 956363 878846 982448 853532 783175 771256 956504 900205 899323
7427 899323 1065696 951102 1193696 1106149 804443 1007091 1031450 1123481 932163 947200
7417 947200 988710 915951 965658 843680 976429 1083718 968399 1065693 962105 798624
7407 798624 1165766 1079649 1059889 1133968 1069471 1176670 960482 954511 961456 1149407 867081
7396 867081 915959 961572 941207 1090363 990449 841663 903021 973763 896446 943941 765122
7385 765122 895790 876442 757247 933727 862039 952188 850682 858575 928762 756960 829900
7374 829900 677738 797630 956470 722677 772807 696326 690104 776956 775764 822484 633125
$$ packed form
7449G59814k18011M72531l07420j58725R991J08500J22107q51q2290k6219L11110
7438I90537k39984J24644Q1166p7517J03602j28916p0357j1919J85248n6299q82
7427H99323J66373j14594K42594q7547l01706K02648K4359R2031j91318J5037
7417I47200M1510p2759M9707j21978J32749J07289j15319R7294j03588j63481
7407G98624L67142q6117j9760P4079o4497J07199k16188n971O945J87951k82326
7396H67081M8878M5613k0365J49156r9914j48786O1358P0742p7317M7495j78819
7385G65122J30668j9348j19195J76480p1688R0149j01506P893P0187j71802P2940
7374H29900j52162J19892J58840k33793N0130p6481o222Q6852j192M6720j89359
$$ plain form
7363 633125 828422 606139 730863 769594 612331 711502 716941 771194 613163 745910 773246
7352 773246 681872 696291 628421 877342 717870 640220 648534 762570 827650 638264 686981
7341 686981 633901 657300 566654 766377 829532 720144 771141 827532 689733 612922 1020108
7330 1020108 599671 707079 713026 525484 773943 681626 672401 839205 860920 528095 582850
7319 582850 641774 546090 650341 523752 631864 601759 465757 480242 716208 490077
7309 490077 492482 530396 528962 597824 605655 554438 521279 678113 489294 785425 627654
7298 627654 338080 722166 578690 444248 672991 632190 626618 530831 685374 593534 650164
7287 650164 494974 366220 619111 580544 663704 605024 613722 771178 674865 585422 861566
$$ packed form
7363F33125J95297k22283J24724L8731j57263R9171N439N4253j58031J32747K7336
7352G73246r1374J4419o7870K48921j59472p7650Q314J14036O5080j89386M8717
7341F86981n3080K3399r0646J99723O3155j09388N0997N6391j37799p6811M07186
7330A020108m20437J07408N947j87542K48459r2317r225J66804K1715l32825N4755
7319E82850N8924r5684J04251j26589J08112l0105j36002J4485K35966k26131
7309D90077K405L7914j434O8862P831n1217l3159J56834j88819K96131j57771
7298F27654k89574L84086j43476j34442K28743m0801n572r5787J54543r1840N6630
7287F50164j55190j28754K52891l8567Q3160n8680Q698J57456r6313q9443K76144
$$ plain form
7276 861566 560456 588144 795620 610658 510776 533777 562739 714314 685264 608243 898954
7265 898954 925903 558887 609332 720876 647122 555974 481528 534984 609385 529359 811210
7254 811210 629029 378359 451977 755576 535747 571607 667353 614460 709841 561054 721554
7243 721554 749579 627132 636525 734326 614957 638974 705149 831861 713690 506348 929580
7232 929580 1037557 723936 922142 902597 874730 727192 782875 873000 953565 819432 670809
7221 670809 990680 808694 916414 1165463 908670 902364 787740 901691 945704 876362
7211 876362 869974 960921 996356 829160 1124514 926074 819023 943034 809551 718161 779323
7200 779323 777180 840139 744394 730517 719681 852708 759251 756646 907127 788243 764641
$$ packed form
7276H61566l01110K7688K07476j84962r9882K3001K8962J51575k9050p7021K90711
7265H98954K6949l67016N0445J11544p3754r1148p4446N3456P4401q0026K81851
7254H11210j82181k50670P3618L03599k19829L5860R5746n2893R5381j48787J60500
7243G21554K8025j22447R393R7801j19369K4017O6175J26712j18171k07342M23232
7232I29580J07977l13621J98206j9545k7867j47538N5683R0125Q0565j34133j48623
7221F70809L19871j81986J07720K49049k56793o306j14624J13951M4013o9342
7211H76362o388R0947L5435j67196K95354j98440j07051J24011j33483r1390O1162
7200G79323k143O2959r5745j3877j0836J33027r3457k605J50481j18884k3602
$$ plain form
7189 764641 750282 769813 891824 661728 847268 701846 706339 775367 675507 878045 876886
7178 876886 750470 840310 786170 702918 658935 832551 673893 833955 834171 707430 751732
7167 751732 634540 674975 933564 864921 893878 752904 841774 852106 882478 953953 1017303
7156 1017303 1069568 797092 939336 887680 1045095 1079124 1001910 1079189 1017661 1065321 1060638
7145 1060638 1034400 1105389 1095142 1233746 1007011 1023909 995470 1010722 1093855 1002871 898348
7134 898348 878220 963004 911359 891356 959562 868072 999579 873441 703114 999776 923878
7123 923878 924781 806571 762601 932356 950825 878339 749997 888559 891337 803154 917078
7112 917078 751728 837754 881906 838313 971944 870469 949291 1072460 862247 779140 782316
$$ packed form
7189G64641j4359J9531J22011k30096J85540j45422M493O9028r9860K02538j159
7178H76886j26416Q9840n4140q3252m3983J73616j58658J60062K16j26741M4302
7167G51732j17192M0435K58589o8643K8957j40974Q8870J0332L0372P1475O3350
7156A017303N2265k72476J42244n1656J57415L4029p7214P7279o1528M7660m683
7145A060638k6238P0989j0247J38604k26735J6898k8439J5252Q3133r0984j04523
7134H98348k0128Q4784n1645k0003O8206r1490J31507j26138j70327K96662p5898
7123I23878R03j18210m3970J69755J8469p2486j28342J38562K778q8183J13924
7112I17078j65350Q6026M4152m3593J33631j01475P8822J23169k10213q3107L176
$$ plain form
7101 782316 936115 638700 963002 1006242 927004 961618 837220 796058 764980 1139877 1085304
7090 1085304 853410 778410 876641 966278 860491 978727 1020080 866214 1046690 854418
7080 854418 870306 918137 934862 993361 1042344 967227 830833 1019198 868112 935721 927291
7069 927291 1053877 1180600 979154 1172385 978087 1213080 1182291 1055603 1001086 1034042
7059 1034042 1090863 1165971 1157111 1285031 1283629 1235461 1151991 1145911 1349387 1274869 1321364 1227075
7047 1227075 1376842 1478487 1389645 1781960 1628123 1397649 1512960 1500903 1303315 1070824
7037 1070824 1316368 1576192 1448591 1343166 1736549 1738927 1804565 1517909 1501063 1511537
7027 1511537 1371794 1366514 1393169 1240802 1293112 1269061 1398943 1285597 1308202 1278351 1196708
$$ packed form
7101G82316J53799k97415L24302M3240p9238L4614j24398m1162l1078L74897n4573
7090A085304k31894p5000R8231Q9637j05787J18236M1353j53866J80476j92272
7080H54418J5888M7831J6725N8499M8983p5117j36394J88365j51086O7609q430
7069I27291J26586J26723k01446J93231j94298K34993l0789j26688n4517L2956
7059A034042N6821P5108q860J27920j402m8168q3470o080K03476p4518M6495r4289
7047A227075J49767J01645q8842L92315j53837k30474J15311j2057j97588k32491
7037A070824K45544K59824j27601j05425L93383K378O5638k86656j6846J0474
7027A511537j39743n280K6655j52367N2310k4051J29882j13346K2605k9851q1643
$$ plain form
7016 1196708 1335127 1207151 1388376 1260975 1334189 1214368 1130638 1431498 1412770 1303165
7006 1303165 1414030 1477780 1474010 1502929 1447906 1592113 1485784 1514654 1739062 1660325 1563859
6995 1563859 1433366 1607204 1713219 1674999 1410815 1920367 1901199 1593417 1568302 1935051
6985 1935051 2089685 1767555 1936732 2339193 2188787 2204334 2141556 1718570 1676377 1744794
6975 1744794 1957177 1975506 1893865 2068442 2190991 2010769 2049272 2167976 2115242 1853109
6965 1853109 1612874 1742591 1818856 1559948 1723421 1549342 1532542 1475439 1587173 1480243
6955 1480243 1570930 1623263 1537327 1501109 1605290 1383560 1498018 1503066 1762736 1544361 1442981
6944 1442981 1625191 1758824 1646170 1631237 1949822 1918652 1768615 1883276 1945857 2148991
$$ packed form
7016A196708J38419j27976J81225j27401P3214j19821q3730L00860j8728j09605
7006A303165J10865O3750l770K8919n5023J44207j06329K8870K24408p8737r6466
6995A563859j30493J73838J06015l8220k64184N09552j9168l07782k5115L66749
6985A935051J54634l22130J69177M02461j50406J5547o2778m22986m2193O8417
6975A744794K12383J8329q1641J74577J22549j80222L8503J18704n2734k62133
6965A853109k40235J29717P6265k58908J63473j74079j6800n7103J11734j06930
6955A480243R0687N2333q5936l6218J04181k21730J14458N048K59670k18375j01380
6944A442981J82210J33633j12654j4933L18585l1170j50037J14661O2581K03134
$$ plain form
6934 2148991 1978666 1720701 2113434 2015814 1869499 1929560 2107075 1822573 1960825 2202496
6924 2202496 1867012 1950422 1879758 2036625 2070898 1693458 1870543 1778378 1919935 1966328
6914 1966328 1956212 2108048 2052516 2088446 1948725 2170222 2255890 2147276 2405800 2019159
6904 2019159 1959989 2166510 2053307 2048662 2290943 2275064 1997519 2098109 2195281 2288864 2251143
6893 2251143 2185836 2153305 2111653 1891974 2222019 2229792 2134239 2232877 2156564 2130564 2290480
6882 2290480 2344800 2375469 2490280 2392632 2225070 2450002 2358706 2545509 2734891 2591987
6872 2591987 2338365 2425408 2540594 2516342 2493567 2642372 2711177 2609540 2792917 2872267
6862 2872267 2889028 2849895 2963066 2894141 3016289 3011485 2964977 3150192 3397476 3237095 3353889
$$ packed form
6934B148991j70325k57965L92733r7620j46315O0061J77515k84502J38252K41671
6924B202496l35484Q3410p0664J56867L4273l77440J77085r2165J41557M6393
6914A966328j0116J51836n5532L5930j39721K21497Q5668j08614K58524l86641
6904B019159n9170K06521j13203m645K42281j5879k77545J00590R7172R3583l7721
6893B251143o5307l2531m1652k19679L30045P773r5553R8638p6313k6000J59916
6882B290480N4320L0669J14811r7648j67562K24932r1296J86803J89382j42904
6872B591987k53622Q7043J15186k4252k2775J48805O8805j01637J83377P9350
6862B872267J6761l9133J13171o8925J22148m804m6508J85215K47284j60381J16794
$$ plain form
6851 3353889 3447702 3471100 3431066 3413663 3538060 3561532 3474935 3384563 3839703 3888885 3835644
6840 3835644 3639603 3583430 3979745 3961337 3855474 4085199 4121624 3926419 3815750 3792842
6830 3792842 4083989 4161505 4320096 4193007 4366023 4544539 4581192 4889276 4738287 4781059
6820 4781059 5090559 5195237 5150132 5480759 5530365 5917169 5947080 6230013 6379936 6553786
6810 6553786 6881876 7178604 7421061 8119319 8740580 9174201 9783064 10759192 12133453
6801 12133453 13862111 16108781 19526293 23718609 27935901 29959877 29184237 26424952
6793 26424952 23001173 20414785 18524328 17840263 18037256 18998634 21135408 24568020 28348407
6784 28348407 30668667 30357526 27613630 23404247 19597717 16679161 14758224 13126944
$$ packed form
6851C353889R3813K3398m0034j7403J24397K3472q6597r0372M55140M9182n3241
6840C835644j96041n6173L96315j8408j05863K29725L6425j95205j10669k2908
6830C792842K91147P7516J58591j27089J73016J78516L6653L08084j50989M2772
6820D781059L09500J04678m5105L30627M9606L86804K9911K82933J49923J73850
6810F553786L28090K96728K42457O98258O21261M33621O08863R76128J374261
6801A2133453J728658K246670L417512M192316M217292K023976p75640k759285
6793B6424952l423779k586388j890457o84065J96993R61378K136774L432612L780387
6784B8348407K320260l11141k743896m209383l806530k918556j920937j631280
$$ plain form
6776 13126944 11676811 10632098 9885236 9097330 8554350 8423001 8265547 8157114 8029078
6767 8029078 7953006 7971191 8085829 8301245 8459395 8390153 8391393 8428279 8470508 8720915 8739414
6756 8739414 8644610 8668370 8856299 9020524 9008548 9571844 9769241 10093417 10329529 10801850
6746 10801850 11386432 12150587 12973236 14044451 15367572 16554222 18943988 21412498 25106821
6737 25106821 30857930 38198751 45817301 50525577 50219793 45849579 39848366 34583603
6729 34583603 30904498 28713651 28324281 29299394 32302179 37182572 43743508 48450789
6721 48450789 49018877 44977990 38226644 31246951 25549999 21268677 18229256 15624363
6713 15624363 13536171 11844053 10470302 9558779 8638900 8607241 8115363 7492057 7241001
$$ packed form
6776A3126944j450133j044713p46862p87906n42980j31349j57454j08433j28036
6767H029078p6072J8185J14638K15416J58150o9242J240L6886M2229K50407J8499
6756H739414r4804K3760J87929J64225j1976N63296J97397L24176K36112M72321
6746A0801850N84582P64155Q22649J071215J323121J186650K389766K468510L694323
6737B5106821N751109P340821P618550M708276l05784m370214o001213n264763
6729C4583603l679105k190847l89370R75113L002785M880393O560936M707281
6721D8450789N68088m040887o751346o979693n696952m281322l039421k604893
6713A5624363k088192j692118j373751r11523r19879l1659m91878o23306k51056
$$ plain form
6704 7241001 6977624 6867105 6623228 6515995 6311426 6267655 6017113 6167711 6319167 6134559
6694 6134559 5882839 5655879 5405642 5353025 5158243 5083313 5279452 4857811 4821681 4783439
6684 4783439 4624310 4768644 4776729 4859370 4748128 4613284 4606687 4346901 4627189 4597594 4516252
6673 4516252 4506306 4289393 4461482 4376417 4290142 4387425 4519839 4481410 4478205 4739446 4604680
6662 4604680 4497152 4411932 4287300 4562713 4519100 4323760 4385587 4391142 4497006 4523738 4617706
6651 4617706 4771195 4649808 4578548 4645943 4704936 4834375 4818798 4745633 4894699 4889178 5008043
6640 5008043 5133755 5171610 5268761 5325031 5203372 5464850 5617414 5523340 5623043 5827673
6630 5827673 6138592 5861412 5605482 5997949 5927908 5819159 5958080 6023868 6158062 6014163
$$ packed form
6704G241001k63377j10519k43877j07233k04569m3771k50542J50598J51456j84608
6694F134559k51720k26960k50237n2617j94782p4930J96139m21641l6130l8242
6684D783439j59129J44334Q085Q2641j11242j34844o597k59786K80288k9595q1342
6673D516252r946k16913J72089q5065q6275R7283J32414l8429l205K61241j34766
6662D604680j07528q5220j24632K75413m3613j95340O1827N555J05864K6732R3968
6651D617706J53489j21387p1260O7395N8993J29439j5577p3165J49066n521J18865
6640E008043J25712L7855R7151N6270j21659K61478J52564r4074R9703K04630
6630E827673L10919k77180k55930L92467p0041j08749J38921O5788J34194j43899
$$ plain form
6620 6014163 6187987 6264885 6270132 6586142 6637546 6763064 7018542 6975351 7027706 7395141 7314785
6609 7314785 7645950 7943469 8110614 8353734 8848875 9140993 9409931 10001731 10170701 10829702
6599 10829702 11507009 12131134 12894818 13773650 14808937 16371646 18188863 20476644 23970723
6590 23970723 29067262 35882658 43378120 48795701 49090977 44778012 37974429 31695330
6582 31695330 27085664 23871895 21688639 20041304 19401661 18936569 19475909 19849444 20852972
6573 20852972 23008275 25375992 29200642 35240470 42444468 49023053 51785836 49084930
6565 49084930 42499532 34572307 28438084 23738854 20150380 17691667 15741051 14226504
6557 14226504 13093426 11987084 11283745 10876805 10677628 10417931 10265882 10263141 10183586 10505393
$$ packed form
6620F014163J73824P6898N247L16010N1404J25518K55478m3191N2355L67435q0356
6609G314785L31165K97519J67145K43120M95141K92118K68938N91800J68970O59001
6599A0829702O77307O24125P63684Q78832J035287J562709J817217K287781L494079
6590B3970723N096539O815396P495462N417581K95276m312965o803583o279099
6582C1695330m609666l213769k183256j647335o39643m65092N39340L73535J003528
6573B0852972K155303K367717L824650O039828P203998O578585K762783k700906
6565D9084930o585398p927225o134223m699230l588474k458713j950616j514547
6557A4226504j133078j106342p03339m06940j99177k59697j52049k741p9555L21807
$$ plain form
6547 10505393 10531771 10706443 11088138 11594662 11827341 12013158 12241797 12209216 12025076 11900873
6537 11900873 11959197 11990043 11983713 12090829 12355293 12951173 13664450 14811665 16458562 18966404
6527 18966404 22573002 27034718 30795743 31794821 29725692 26001403 21838284 18624655
6519 18624655 16545957 14673879 13351494 12820091 12287970 12122168 12355531 12801774 13667736
6510 13667736 14467595 16239628 19394757 23108255 27511945 30277632 29528642 26029385
6502 26029385 21333023 17499403 14714777 12573552 10902472 9890880 8990007 8093915
6494 8093915 7463152 7008705 6701788 6159759 6007965 5815355 5578340 5460095 5537590 5323098
6484 5323098 5026170 4908446 4861847 4785478 4846283 4530923 4283306 4367414 4143776 3796217
$$ packed form
6547A0505393K6378J74672L81695N06524K32679J85817K28639l2581j84140j24203
6537A1900873N8324L0846o330J07116K64464N95880P13277J147215J646897K507842
6527A8966404L606598M461716L761025R99078k069129l724289m163119l213629
6519A8624655k078698j872078j322385n31403n32121j65802K33363M46243Q65962
6510A3667736P99859J772033L155129L713498M403690K765687p48990l499257
6502B6029385m696362l833620k784626k141225j671080j011592r00873q96092
6494H093915o30763m54447l06917n42029j51794j92610k37015j18245P7495k14492
6484E323098k96928j17724m6599p6369O0805l15360k47617Q4108k23638l47559
$$ plain form
6474 3796217 3853581 4075374 3802719 3888827 3890788 4049806 3952859 3897112 3874861 3928370 3947787
6463 3947787 3857124 3923019 3637628 3666071 3614666 3504545 3468040 3386928 3377983 3741003 3647419
6452 3647419 3395234 3387015 3414074 3480518 3482066 3475774 3362046 3209013 3132665 2943901 3164868
6441 3164868 2916001 2760180 2842496 2920995 2724664 2737159 2881050 2843563 2755252 2726793 2588882
6430 2588882 2792179 2471240 2441055 2302703 2293640 2567208 2122675 2219817 2305632 2151037
6420 2151037 2057198 2200288 1825381 2055198 1968724 1839053 2044428 1884653 1973782 2039849
6410 2039849 2088098 2138393 2016900 2090772 2173204 2065644 2006159 2309617 2044234 1935633
6400 1935633 2036917 1975379 1878812 2103038 2001085 1924499 1901330 1996914 1858716 1867999 1880740
$$ packed form
6474C796217N7364K21793k72655Q6108J961J59018r6947n5747k2251N3509J9417
6463C947787r0663O5895k85391K8443n1405j10121l6505q1112q945L63020r3584
6452C647419k52185q219K7059O6444J548o292j13728j53033p6348j88764K20967
6441C164868k48867j55821Q2316P8499j96331J2495J43891l7487q8311k8459j37911
6430B588882K03297l20939l0185j38352r063K73568m44533R7142Q5815j54595
6420B151037r3839J43090l74907K29817q6474j29671K05375j59775Q9129O6067
6410B039849M8249N0295j21493P3872Q2432j07560n9485L03458k65383j08601
6400A935633J01284o1538r6567K24226j01953p6586k3169R5584j38198R283J2741
$$ plain form
6389 1880740 1980239 1937894 1684318 1774734 1816886 1870410 1744391 1665436 1618890 1636391 1557291
6378 1557291 1637034 1776728 1824286 1686720 1863131 1853602 1522157 1942097 1935408 1683463 1716830
6367 1716830 1459154 1720045 1870021 1804059 1815015 1929571 1884197 1726828 1776023 1911172
6357 1911172 1870683 1905845 1982688 1995614 2191426 2332279 2244905 2455023 2578799 2283525
6347 2283525 2525105 2231418 2292281 2590981 2305596 2376493 2488599 2260597 2412722 2441802
6337 2441802 2470396 2648975 2175995 2157190 2493115 2151770 2142438 2119827 2183801 2250318 2108903
6326 2108903 2415366 2361766 2388021 2427928 2340790 2351069 2401951 2304421 2479291 2266211 2380762
6315 2380762 2664727 2459987 2508606 2394210 2405681 2488430 2172798 2040089 2104553 2137335
$$ packed form
6389A880740R9499m2345k53576R0416M2152N3524j26019p8955m6546J7501p9100
6378A557291P9743J39694M7558j37566J76411r529l31445M19940o689k51945L3367
6367A716830k57676K60891J49976o5962J0956J14556m5374j57369M9195J35149
6357A911172m0489L5162P6843J2926J95812J40853q7374K10118J23776k95274
6347B283525K41580k93687O0863K98700k85385P0897J12106k28002J52125K9080
6337B441802K8594J78579m72980j8805L35925l41345r332k2611O3974O6517j41415
6326B108903L06463n3600K6255L9907q7138J0279N0882r7530J74870k13080J14551
6315B380762K83965k04740M8619j14396J1471Q2749l15632j32709O4464L2782
$$ plain form
6305 2137335 2019397 1977328 2306422 2156936 1949204 1928952 2042278 2137930 2351534 2360204
6295 2360204 2433768 2287134 2197288 2240527 2275332 2371223 2225547 2231862 2255107 2003956 2185788
6284 2185788 2175102 2268091 2341422 2420943 2453032 2448033 2196386 2394659 2357493 2361211 2485450
6273 2485450 2075023 2171219 2155074 1923296 2068536 1969763 2001284 1970781 2058403 2022128 1932398
6262 1932398 1869223 1752860 1707000 1886983 1875139 1872117 2017369 1869119 1596904 1881185
6252 1881185 1793811 1871608 2026825 1864528 1893277 1581045 1959490 1800273 1721428 2075050
6242 2075050 1877566 1767067 1967842 1949200 1769874 1973609 1903204 1963948 2051546 2027872
6232 2027872 2182448 2118068 2189459 2119522 2212141 2128322 2308956 2157135 2269536 2439471
$$ packed form
6305B137335j17938m2069L29094j49486k07732k0252J13326R5652K13604Q670
6295B360204P3564j46634q9846M3239L4805R5891j45676O315K3245k51151J81832
6284B185788j0686R2989P3331P9521L2089m999k51647J98273l7166L718J24239
6273B485450m10427R6196j6145k31778J45240r8773L1521l0503Q7622l6275q9730
6262A932398o3175j16363m5860J79983j1844l022J45252j48250k72215K84281
6252A881185q7374P7797J55217j62297K8749l12232L78445j59217p8845L53622
6242B075050j97484j10499K00775j8642j79326K03735p0405O0744Q7598k3674
6232B027872J54576o4380P1391o9937R2619q3819J80634j51821J12401J69935
$$ plain form
6222 2439471 2365139 2415053 2376226 2408380 2462232 2397623 2406072 2497258 2575196 2453865 2569350
6211 2569350 2440013 2294608 2729944 2529046 2434258 2466651 2423024 2201031 2151814 2261174
6201 2261174 2171909 2394653 2182149 2055050 2238003 2093946 2121729 2181943 2031868 2031597 2110691
6190 2110691 1818086 1948189 1892607 1945349 2008846 1859677 1775025 1943673 1865901 1825376 1902233
6179 1902233 1769149 2002653 2014043 1798304 1863593 1759355 1879839 1905888 1889825 1848689
6169 1848689 1737415 1801958 1747050 1806026 1721115 1787741 1838806 1737474 1896403 1801125 1807746
6158 1807746 1794348 1714213 1761808 1820463 1898537 1702132 1743457 1680930 1783060 1789711 1612626
6147 1612626 1662293 1721975 1713317 1557156 1555770 1502969 1685056 1539869 1439660 1630726 1641002
$$ packed form
6222B439471p4332M9914l8827L2154N3852o4609Q449R1186P7938j21331J15485
6211B569350j29337j45405M35336k00898r4788L2393m3627k21993m9217J09360
6201B261174q9265K22744k12504j27099J82953j44057K7783O0214j50075k71P9094
6190B110691k92605J30103n5582N2742O3497j49169q4652J68648p7772m0525P6857
6179A902233j33084K33504J1390k15739O5289j04238J20484K6049j6063m1136
6169A848689j11274O4543n4908N8976q4911O6626N1065j01332J58929r5278O621
6158A807746j3398q0135M7595N8655P8074j96405M1325o2527J02130O651j77085
6147A612626M9667N9682q658j56161j386n2801J82087j45187j00209J91066J0276
$$ plain form
6136 1641002 1614854 1727572 1665638 1617502 1696615 1669480 1495616 1590687 1453951 1433666 1544948
6125 1544948 1430111 1666197 1790989 1587374 1653755 1863700 1599750 1815436 1852864 1483202
6115 1483202 1405101 1488570 1633169 1554556 1452733 1322806 1450128 1402533 1166380 1518847
6105 1518847 1636525 1338527 1377099 1260765 1188666 1527355 1338543 1358769 1487962 1489550
6095 1489550 1541658 1595757 1435464 1501502 1685365 1500880 1593083 1580792 1542353 1314197 1250208
6084 1250208 1544553 1505658 1508523 1500194 1627589 1474288 1363168 1505449 1405161 1533680
6074 1533680 1578523 1570157 1493995 1389411 1334689 1496402 1414518 1550230 1534138 1461994 1553062
6063 1553062 1462628 1459780 1323162 1441746 1552863 1586038 1677533 1481847 1552910 1512939 1389886
$$ packed form
6136A641002k6148J12718o1934m8136P9113k7135j73864R5071j36736k0285J11282
6125A544948j14837K36086J24792k03615O6381K09945k63950K15686L7428l69662
6115A483202p8101Q3469J44599p8613j01823j29927J27322m7595k36153L52467
6105A518847J17678k97998L8572j16334p2099L38689j88812K0226J29193J588
6095A489550N2108N4099j60293O6038J83863j84485R2203j2291l8439k28156o3989
6084A250208K94345l8895K865q329J27395j53301j11120J42281j00288J28519
6074A533680M4843q366p6162j04584n4722J61713q1884J35712j6092p2144R1068
6063A553062r0434k848j36618J18584J11117L3175R1495j95686P1063l9971j23053
$$ plain form
6052 1389886 1662231 1550990 1480433 1585961 1594784 1712550 1672679 1598607 1541338 1659432 1529203
6041 1529203 1703505 1730365 1526448 1707005 1706469 1720600 1642085 1898146 1757617 1718137 1704067
6030 1704067 1550260 1688558 1411033 1497224 1845374 1653488 1822943 1815714 1663059 1811959
6020 1811959 1718874 1785610 1743414 2122081 1789541 1884051 1951180 1778294 2075840 2022232 2137280
6009 2137280 1959775 2094423 2226069 2285527 2481892 2235465 2404686 2378836 2209274 2389958
5999 2389958 2504973 2556263 2483151 2486831 2742097 2501864 2680254 2820652 2861706 2953483 2658844
5988 2658844 2614259 2713989 2922291 2675881 2811982 2956424 2918004 2676420 2829529 3118047
5978 3118047 3038230 2883162 3164322 3110687 3108917 3229013 2807791 2951152 3136751 3229545
$$ packed form
6052A389886K72345j11241p0557J05528Q823J17766l9871p4072n7269J18094j30229
6041A529203J74302K6860k03917J80557n36J4131p8515K56061j40529l9480j4070
6030A704067j53807J38298k77525Q6191L48150j91886J69455p229j52655J48900
6020A811959r3085O6736m2196L78667l32540R4510O7129j72886K97546n3608J15048
6009B137280j77505J34648J31646N9458J96365k46427J69221k5850j69562J80684
5999B389958J15015N1290p3112L680K55266k40233J78390J40398M1054R1777k94639
5988B658844m4585R9730K08302k46410J36101J44442l8420k41584J53109K88518
5978C118047p9817j55068K81160n3635j770J20096m21222J43361J85599R2794
$$ plain form
5968 3229545 3017383 3195560 3082475 3132341 3311709 3001223 3187195 3292026 3083400 3047009
5958 3047009 3239367 3173747 3118137 3088634 3141929 3214278 3076712 3113871 3175906 3110718 3250065
5947 3250065 3278638 3282682 3473649 3284692 3051989 3363247 3098771 2991407 3219018 3317873
5937 3317873 3215076 3143464 3140918 3165890 3365275 3431686 3333368 3496558 3527909 3587916 3512706
5926 3512706 3350672 3779061 3768648 3600374 3811331 3950591 4017217 4075318 4294518 4609185
5916 4609185 4578589 4587960 4930587 5084941 5067280 5102926 5357783 5587302 5755189 6014647
5906 6014647 6401616 6846500 7051448 7827054 8820915 9372064 10643604 12431309 14177339
5897 14177339 15114527 15178013 14385418 13833373 13559049 13797887 14809890 16124836 18301474
$$ packed form
5968C229545k12162J78177j13085M9866J79368l10486J85972J04831k08626l6391
5958C047009J92358o5620n5610k9503N3295P2349j37566L7159O2035o5188J39347
5947C250065K8573M044J90967j88957k32703L11258k64476j07364K27611R8855
5937C317873j02797p1612k546K4972J99385O6411r8318J63190L1351O0007p5210
5926C512706j62034M28389j0413j68274K10957J39260O6626N8101K19200L14667
5916D609185l0596R371L42627J54354j7661L5646K54857K29519J67887K59458
5906F014647L86969M44884K04948P75606R93861N51149J271540J787705J746030
5897A4177339R37188O3486p92595n52045k74324K38838J012003J314946K176638
$$ plain form
5888 18301474 21452393 24359220 26487186 27524940 27617286 27966751 28430857 28353563 27949432
5879 27949432 28398847 29009768 29684811 30278374 30848691 31784210 32354105 33105304 34870006
5870 34870006 36563544 37350856 37372474 36690653 35217372 33246546 32290964 32094373 31646787
5861 31646787 30653789 29868811 29168036 27925269 26973843 26421598 26565719 26550195 26584103 27049882
5851 27049882 26797085 25344517 22460540 19360605 16527352 14427991 13106840 12254186
5843 12254186 12054255 12342328 13203044 14063606 13949171 12834780 10828495 9307377 8354934
5834 8354934 7381015 6465929 6122713 5950693 5425315 5173892 4859537 4516828 4497764 4495106
5824 4495106 4285905 4093116 4153183 3986296 3856168 3621936 3763816 3663661 3436538 3619210
$$ packed form
5888A8301474L150919K906827K127966J037754R2346L49465M64106p7294m04131
5879B7949432M49415O10921O75043N93563N70317R35519N69895P51199J764702
5870C4870006J693538P87312K1618o81821j473281j970826r55582j96591m47586
5861C1646787r92998p84978p00775j242767r51426n52245J44121j5524L3908M65779
5851B7049882k52797j452568k883977l099935k833253k099361j321151q52654
5843A2254186j99931K88073Q60716Q60562j14435j114391k006285j521118r52443
5834H354934r73919r15086l43216j72020n25378k51423l14355l42709j9064k658
5824D495106k09201j92789O0067j66887j30128k34232J41880j00155k27123J82672
$$ plain form
5814 3619210 3609268 3377008 3473008 3303118 3249982 3556508 3300125 3025331 3079816 2977326
5804 2977326 2915628 3084132 3092883 2915078 3144806 2818442 2827438 2974093 2734578 2454489
5794 2454489 2720969 3005834 2835809 2764158 2942475 2898126 2917550 2864906 2926569 2788329
5784 2788329 2756158 2854059 2826490 2790054 2634984 2779814 2727999 2891915 2941688 2775806 2658158
5773 2658158 2663973 2618687 2677854 2758801 2633089 2628295 2756143 2820572 2750283 2941247 2953246
5762 2953246 3032000 3106835 2999493 2990981 3293998 3111061 3322519 3467787 3420353 3373203 3279470
5751 3279470 3368954 3340081 3356029 3342488 3285336 3306817 3352478 3481087 3404943 3529782 3530169
5740 3530169 3507795 3366673 3306707 3197630 3140735 3233517 3444472 3338339 3302176 3417970
$$ packed form
5814C619210r942k32260R6000j69890n3136L06526k56383k74794N4485j02490
5804B977326o1698J68504Q751j77805K29728l26364Q996J46655k39515k80089
5794B454489K66480K84865j70025p1651J78317m4349J9424n2644O1663j38240
5784B788329l2171R7901k7569l6436j55070J44830n1815J63916M9773j65882j17648
5773B658158N815m5286N9167Q0947j25712m794J27848O4429p0289J90964J1999
5762B953246P8754P4835j07342q512L03017j82937K11458J45268m7434m7150r3733
5751C279470Q9484k8873J5948j3541n7152K1481M5661J28609p6144J24839L87
5740C530169k2374j41122n9966j09077n6895R2782K10955j06133l6163J15794
$$ plain form
5730 3417970 3383243 3472146 3556261 3689868 3739732 3502884 3360334 3643273 3631936 3665719 3844913
5719 3844913 3781307 3757196 3658556 3802662 4015320 4027200 3692980 4258876 4298209 4118174
5709 4118174 4496612 4380943 4185036 4270715 4130051 4034754 4045739 4085756 4127589 4353239
5699 4353239 4447822 4421166 4738052 4585795 4650070 5009975 4695912 4603139 4630144 4728286 4470861
5688 4470861 4589998 4681006 4685508 4560740 4696297 4805325 4745181 4868207 4952510 5048179 5103159
5677 5103159 4928325 5093608 5010083 5052155 5188347 5209918 5367308 4989605 5189645 5546975
5667 5546975 5813434 5461474 5481489 5631516 5424972 5452326 5670214 5565680 5563477 5488687
5657 5488687 5433501 5533597 5745396 5805013 5848676 5868942 5853625 5990895 5834432 6022047
$$ packed form
5730C417970l4727Q8903Q4115J33607M9864k36848j42550K82939j1337L3783J79194
5719C844913o3606k4111r8640J44106K12658J1880l34220N65896L9333j80035
5709D118174L78438j15669j95907Q5679j40664r5297J0985M0017M1833K25650
5699D353239R4583k6656L16886j52257O4275L59905l14063r2773K7005R8142k57425
5688D470861J19137R1008M502j24768J35557J09028o0144J23026Q4303R5669N4980
5677E103159j74834J65283q3525M2072J36192K1571J57390l77703K00040L57330
5667E546975K66459l51960K0015J50027k06544K7354K17888j04534k203p4790
5657E488687n5186J00096K11799N9617M3663K0266j5317J37270j56463J87615
$$ plain form
5647 6022047 6313790 6119877 6142446 6320915 6350224 6202484 6179943 6222023 6161017 6054510
5637 6054510 6048394 6282132 6033986 6090596 6281075 6269130 6106900 6200358 6409197 6481217 6253233
5626 6253233 6318840 6550641 6517104 6381321 6390093 6571918 6629004 6677778 6609627 6814675 6746578
5615 6746578 6596661 6644584 6880820 7064520 7116986 6928139 6919105 6886655 6997319 6993422 7033036
5604 7033036 7008433 6884083 7106044 7120216 7203516 7234494 7330499 7292607 7268115 7716507 7621489
5593 7621489 7908995 7869734 7900339 8295566 8361876 8303334 8572305 8699188 8684157 8598414 8570672
5582 8570672 8861461 8876604 8952303 9302108 9529910 9623552 9944813 10340569 10590739 10849767
5572 10849767 11211275 11115759 11059317 11123181 11360875 11788929 12016492 12656136 12604670 12838956
$$ packed form
5647F022047K91743j93913K2569J78469K9309j47740k2541M2080o1006j06507
5637F054510o116K33738k48146N6610J90479j1945j62230R3458K08839P2020k27984
5626F253233O5607K31801l3537j35783Q772J81825N7086M8774o8151K05048o8097
5615F746578j49917M7923K36236J83700N2466j88847r034l2450J10664l897L9614
5604G033036k4603j24350K21961J4172Q3300L0978R6005l7892k4492M48392r5018
5593G621489K87506l9261L0605L95227O6310n8542K68971J26883j5031q5743k7742
5582H570672K90789J5143P5699L49805K27802R3642L21261L95756K50170K59028
5572A0849767L61508r5516n6442O3864K37694M28054K27563O39644n1466K34286
$$ plain form
5562 12838956 13169202 13670153 14217690 14961055 15826191 16272096 17094726 17825187 18534363
5553 18534363 19308890 20002201 21253417 22791739 24928639 28098158 33571418 41060507
5545 41060507 49291056 53649887 51404450 45168917 39082878 35157289 32462627 30712772
5537 30712772 30087344 30186127 30878179 32392269 35418578 39739803 46410279 55802465 65516239
5528 65516239 72590854 76600412 78671687 76344779 68704671 58376946 49239710 43068349
5520 43068349 38805063 35889842 34870424 34482138 34765097 36179913 38780397 42825163
5512 42825163 49427034 58515912 65732784 66842677 62246095 55982784 51421475 48994093
5504 48994093 48016053 48356840 49252590 51214505 53349027 55545041 56845220 57748205 58311608
$$ packed form
5562A2838956L30246N00951N47537P43365Q65136M45905Q22630P30461P09176
5553A8534363P74527O93311J251216J538322K136900L169519N473260P489089
5545D1060507Q230549M358831k245437o235533o086039l925589k694662j749855
5537C0712772o25428R8783O92052J514090L026309M321225O670476R392186R713774
5528F5516239P074615M009558K071275k326908p640108j0327725r137236o171361
5520D3068349m263286k915221j019418l88286K82959J414816K600484M044766
5512D2825163O601871R088878P216872J109893m596582o263311m561309k427382
5504D8994093r78040L40787Q95750J961915K134522K196014J300179R02985N63403
$$ plain form
5495 58311608 58233629 58642617 58567249 58151750 57736031 56858008 56434676 56013381 56434617 57277454
5485 57277454 58693277 60734448 63693204 67427379 71171038 75305029 80029851 84756029
5477 84756029 90108616 95042594 99167317 101769110 102273471 102129999 101051387 99886181
5469 99886181 98014079 95892360 93181097 90598978 88177867 86373555 85093799 84813098
5461 84813098 85387457 86612500 88345609 89560728 90919239 92088564 93104377 93487404
5453 93487404 93271888 92569768 91757919 90429992 89482698 89055293 89168083 90802490 92896810
5444 92896810 95212002 97603829 99673288 101234840 102378917 103006244 103763873 104703884 104192754
5435 104192754 101771731 97468843 92023404 86248046 81391252 76686528 72508232 68931916
$$ packed form
5495E8311608p7979M08988p5368m15499m15719q78023m23332m21295M21236Q42837
5485E7277454J415823K041171K958756L734175L743659M133991M724822M726178
5477H4756029N352587M933978M124723K601793N04361j43472j078612j165206
5469I9886181j872102k121719k711263k582119k421111j804312j279756k80701
5461H4813098N74359J225043J733109J215119J358511J169325J015813L83027
5453I3487404k15516p02120q11849j327927r47294m27405J12790J634407K094320
5444I2896810K315192K391827K069459J561552J144077O27327P57629R40011n11130
5435A04192754k421023m302888n445439n775358m856794m704724m178296l576316
$$ plain form
5427 68931916 65852999 63272146 61141998 59703000 59316745 59152897 59604865 60744975 61842639
5418 61842639 62597130 62892014 63220931 63169398 63070774 62383908 60282924 56974657 53280558
5409 53280558 49366656 45560835 42271943 39000050 36504692 33839291 31499207 29049517
5401 29049517 27261132 25875683 24362571 23404727 22236146 21517755 20738666 20118754 19570339
5392 19570339 18972972 18464610 18199618 17823277 17147842 16857368 16312067 16166625 15722802
5383 15722802 15478567 15240117 14966774 14701671 14395290 14338096 13878376 13589354 13258143 12623315
5373 12623315 12520304 12349778 12220180 11926549 11672433 12006410 11674062 11531940 11424797
5364 11424797 11368749 11233019 11228429 11069322 10769852 11093043 10733445 10648848 10433571 10273833
$$ packed form
5427F8931916l078917k580853k130148j438998l86255j63848M51968J140110J097664
5418F1842639P54491K94884L28917n1533r8624o86866k100984l308267l694099
5409E3280558l913902l805821l288892l271893k495358k665401k340084k449690
5401B9049517j788385j385449j513112r57844j168581p18391p79089o19912n48415
5392A9570339n97367n08362k64992l76341o75435k90474n45301j45442m43823
5383A5722802k44235k38450k73343k65103l06381n7194m59720k89022l31211o34828
5373A2623315j03011j70526j29598k93631k54116L33977l32348j42122j07143
5364A1424797n6048j35730m590j59107k99470L23191l59598q4597k15277j59738
$$ plain form
5354 10273833 10021236 9877181 9834840 9515179 9660583 9908921 9742503 9600976 9429808 9097170
5344 9097170 9002859 8791333 8945596 9109888 9001305 8912679 8821731 8651000 8556156 8496291
5334 8496291 8394933 8287139 8287770 8222979 8279201 8361051 8050266 8041830 7791306 7527828 7407887
5323 7407887 7420104 7598980 7584819 7543765 7458286 7515986 7539770 7444689 7414577 7450488 7695731
5312 7695731 7347251 7639064 8050737 8061977 8288671 8457044 8534736 8546171 8741504 8888120
5302 8888120 8980048 9299351 9534931 9809823 10096280 10413137 10962355 11659533 12357537 13085881
5292 13085881 14171899 15579541 16873429 18731916 21594353 25550491 31257483 39191279
5284 39191279 47419531 51111280 48516451 42793860 37207367 33318976 31691209 32464687
$$ packed form
5354A0273833k52597j44055m2341l19661J45404K48338j66418j41527j71168l32638
5344I097170r4311k11526J54263J64292j08583q8626r0948j70731r4844n9865
5334H496291j01358j07794O31o4791N6222Q1850l10785q436k50524k63478j19941
5323G407887J2217J78876j4161m1054q5479N7700K3784r5081l0112L5911K45243
5312G695731l48480K91813M11673J1240K26694J68373P7692J1435J95333J46616
5302H888120R1928L19303K35580K74892K86457L16857N49218O97178O98004P28344
5292A3085881J086018J407642J293888J858487K862437L956138N706992P933796
5284C9191279Q228252L691749k594829n722591n586493l888391j627767P73478
$$ plain form
5276 32464687 35517226 41083531 48226282 53210942 52510121 47025342 41009213 36845510
5268 36845510 35760637 37993558 42736579 47679338 48371641 44705442 38460450 32768414
5260 32768414 29228297 27737426 27994239 29845445 34429569 40028667 42730462 39990270
5252 39990270 33854092 27181319 21825858 17888418 15509892 13474058 11609252 10513148
5244 10513148 9582740 9169705 8587688 7953962 7752824 7382902 6924871 6843791 6725903 6529448
5234 6529448 6278697 6337466 6011260 5953513 5877089 5825600 5702691 5575803 5458465 5468317 5479411
5223 5479411 5270917 5358085 5261912 5039721 5028283 4975761 5002104 4827813 4814841 4493774 4596169
5212 4596169 4524371 4476673 4618018 4437666 4395799 4227039 4214750 4251306 4320994 4312385 4062175
$$ packed form
5276C2464687L052539N566305P142751M984660p00821n484779o016129m163703
5268C6845510j084873K232921M743021M942759O92303l666199o244992n692036
5260C2768414l540117j490871K56813J851206M584124N599098K701795k740192
5252C9990270o136178o672773n355461l937440k378526k035834j864806j096104
5244A0513148r30408m13035n82017o33726k01138l69922m58031q1080j17888j96455
5234F529448k50751N8769l26206n7747p6424n1489j22909j26888j17338R852J1094
5223E479411k08494Q7168r6173k22191j1438n2522K6343j74291j2972l21067J02395
5212D596169p1798m7698J41345j80352m1867j68760j2289L6556O9688q609k50210
$$ plain form
5201 4062175 4314467 4152120 4089586 4248852 4417410 4328980 4354680 4452631 4489179 4404426 4177867
5190 4177867 4312031 4403268 4252103 4160252 4284105 4344968 4052533 4148001 4206009 4151560 4348351
5179 4348351 4379586 4686087 4596177 4595938 4724621 4833603 4986267 5500523 6141073 6020974
5169 6020974 5886872 5210176 4752343 4640501 4512104 4391193 4384200 4387540 4524067 4380586
5159 4380586 4215742 4259281 4425904 4344972 4312692 4427213 4166780 4033761 4168097 4299155
5149 4299155 4226342 4235431 4622545 4439624 4596371 4561093 4705564 4819220 4788210 4980065
5139 4980065 5022594 5015096 5267564 5191731 5114506 5350247 5254280 5291881 5346402 5470355 5411011
5128 5411011 5665385 5624503 5533329 5814069 5664067 5695297 5577546 5689693 5671869 5819259
$$ packed form
5201D062175K52292j62347o2534J59266J68558q8430K5700R7951L6548q4753k26559
5190D177867J34164R1237j51165r1851J23853O0863k92435R5468N8008n4449J96791
5179D348351L1235L06501q9910k39J28683J08982J52664N14256O40550j20099
5169F020974j34102o76696m57833j11842j28397j20911o993L340J36527j43481
5159D380586j64844M3539J66623q0932l2280J14521k60433j33019J34336J31058
5149D299155p2813R089L87114j82921J56747l5278J44471J13656l1010J91855
5139D980065M2529p498K52468p5833p7225K35741r5967L7601N4521J23953n9344
5128E411011K54374m0882r1174K80740j50002L1230j17751J12147j7824J47390
$$ plain form
5118 5819259 5842587 5835783 6134775 6010562 6009331 5950554 6082639 6267332 6029246 5994804 6105053
5107 6105053 5961025 5910378 6100271 6030599 5779310 5951082 5801927 5836123 5988609 5734043
5097 5734043 5948580 5955034 5903002 5845191 5826362 5870482 5981406 5912125 6023585 6002508 5679959
5086 5679959 5801862 5840518 5775555 5952445 5967514 5706088 5653668 5639273 5821185 6060728
5076 6060728 5802120 6010466 5908902 6124430 6043191 6144455 6560276 6617316 6544099 6814854
5066 6814854 7081929 7211818 7401896 7334584 7493208 7412613 7215701 7153102 7317176 7084464
5056 7084464 6790110 6779634 6825134 6622684 6392254 6546024 6736669 6596335 6651853 6859050
5046 6859050 6675937 6739929 6718915 6624980 6593960 6677501 6831595 6775821 6887167 6939360 7127145
$$ packed form
5118E819259K3328o804K98992j24213j231n8777J32085J84693k38086l4442J10249
5107F105053j44028n0647J89893o9672k51289J71772j49155L4196J52486k54566
5097E734043K14537O454n2032n7811j8829M4120J10924o9281J11460k1077l22549
5086E679959J21903L8656o4963J76890J5069k61426n2420j4395J81912K39543
5076F060728k58608K08346j01564K15528q1239J01264M15821N7040p3217K70755
5066F814854K67075J29889J90078o7312J58624q0595j96912o2599J64074k32712
5056G084464k94354j0476M5500k02450k30430J53770J90645j40334N5518K07197
5046F859050j83113O3992k1014r3935l1020Q3541J54094n5774J11346N2193J87785
$$ plain form
5035 7127145 6818863 6759594 6917807 7047529 6915033 7106231 7328681 7316996 7419291 7250743
5025 7250743 7392312 7374576 7052690 7307027 7349314 6978987 6852946 7107633 7138043 6981241
5015 6981241 7118481 7096398 7209315 7105790 7133792 7177492 7032340 7105338 7179106 7197303 7363557
5004 7363557 7427899 7546962 7563181 7665659 7684823 8133654 7887453 7935249 7950778 8153131
4994 8153131 8001478 8072533 8135594 7952212 8142302 8240800 8535678 8423007 8590127 8759141
4984 8759141 8636549 8711006 8885609 9009095 9122518 9363978 9232887 9422963 9474521 9385369
4974 9385369 9768880 10041386 10212812 10226331 10440889 10408087 10497334 10753189 10642638 10704442
4964 10704442 10826813 10951845 11083094 11122224 11363272 11496930 11578442 11756446 12097818 12297051
$$ packed form
5035G127145l08282n9269J58213J29722j32496J91198K22450j1685J02295j68548
5025G250743J41569j7736l21886K54337M2287l70327j26041K54687L0410j56802
5015F981241J37240k2083J12917j03525K8002M3700j45152P2998P3768J8197J66254
5004G363557O4342J19063J6219J02478J9164M48831k46201M7796J5529K02353
4994H153131j51653P1055O3061j83382J90090R8498K94878j12671J67120J69014
4984H759141j22592P4457J74603J23486J13423K41460j31091J90076N1558q9152
4974I385369L83511K72506J71426J3519K14558l2802Q9247K55855j10551O1804
4964A0704442J22371J25032J31249L9130K41048J33658Q1512J78004L41372J99233
$$ plain form
4954 12297051 12358248 12853865 12952807 13407035 13571766 13886828 14088075 14276697 14583407 14928553
4944 14928553 15042833 15050160 15732505 15907736 16572918 17197978 17608574 17885333 18029495 18615766
4934 18615766 19049152 19574748 20325684 20853583 21693859 22337435 23320959 24461926 25642343
4925 25642343 26935821 28539467 30437948 32191535 33851744 35015615 36200727 38285873
4917 38285873 40755318 44042662 47575131 51374502 55313746 60446560 65991469 73220164
4909 73220164 82767763 95785381 115049465 145754559 203866826 305847342 390043242
4902 390043242 373417869 292132853 207945311 156226750 125116697 102543085 86747676
4895 86747676 75303964 66235995 60872587 57792977 55401398 54085029 53133742 52173140
$$ packed form
4954A2297051O1197M95617R8942M54228J64731L15062K01247J88622L06710L45146
4944A4928553J14280P327O82345J75231O65182O25060M10596K76759J44162N86271
4934A8615766M33386N25596P50936N27899Q40276O43576R83524J140967J180417
4925B5642343J293478J603646J898481J753587J660209J163871J185112K085146
4917C8285873K469445L287344L532469L799371L939244N132814N544909P228695
4909G3220164R547599J3017618J9264084L0705094N8112267J01980516Q4195900
4902C90043242j6625373q1285016q4187542n1718561l1110053k2573612j5795409
4895H6747676j1443712r067969n363408l079610k391579j316369r51287r60602
$$ plain form
4887 52173140 51237141 50732583 50561481 50933689 51273103 50389959 49468210 48711045 49060909
4878 49060909 50355016 52488899 55361247 58254454 59884839 60040430 59534601 58589940 58311129
4869 58311129 58610307 58877859 59046706 59270218 59520232 59710890 59875524 60090321 60120417 59827934
4859 59827934 58840420 57931123 57303715 56866102 57228506 58399308 60602228 63783074 67264853
4850 67264853 70138178 72029006 73100731 73908502 75352835 77179187 78656231 79486775
4842 79486775 80120453 80518608 81023750 81209416 80438025 79149181 77675989 76541431 75914480
4833 75914480 76202023 77222934 79037406 81172189 83562242 85633720 87206474 87300404 85878189
4824 85878189 83980251 81665437 80113764 79533488 78976303 79537928 80514702 81393931 82405500
$$ packed form
4887E2173140r35999n04558j71102L72208L39414q83144r21749p57165L49864
4878D9060909J294107K133883K872348K893207J630385J55591n05829r44661k78811
4869E8311129K99178K67552J68847K23512K50014J90658J64634K14797L0096k92483
4859E9827934r87514r09297o27408m37613L62404J170802K202920L180846L481779
4850F7264853K873325J890828J071725Q07771J444333J826352J477044Q30544
4842G9486775O33678L98155N05142J85666p71391j288844j473192j134558o26951
4833G5914480K87543J020911J814472K134783K390053K071478J572754R3930j422215
4824H5878189j897938k314814j551673n80276n57185N61625R76774Q79229J011569
$$ plain form
4815 82405500 82667358 82053098 81229623 80517311 80427679 80369448 79787069 78518226 77392978
4806 77392978 76777759 76583615 75955393 73759746 70486963 66563590 63452208 60866062 59334985
4797 59334985 58636898 58782967 59282534 59748789 60402125 60708574 60777656 60568885 60176028 59189828
4787 59189828 57994933 56855312 55446765 54368987 53934942 53946556 54639065 55244896 54691221
4778 54691221 52916074 49958669 46876049 44347019 42722719 41528265 41015572 40672533
4770 40672533 40198961 39421364 38558405 37484171 36316650 35871919 35096394 34420374 33538616
4761 33538616 32939164 32304748 31378035 30788980 30393383 29850487 28333012 27187196 25656712
4752 25656712 24203121 23086037 22160316 21472225 21080660 20591612 20186286 19833670 19425328
$$ packed form
4815H2405500K61858o14260q23475p12312q9632n8231n82379j268843j125248
4806G7392978o15219j94144o28222k195647l272783l923373l111382k586146j531077
4797E9334985o98087J46069M99567M66255O53336L06449O9082k08771l92857r86200
4787E9189828j194895j139621j408547j077778m34045J1614O92509O05831n53675
4778E4691221j775147k957405l082620k529030j624300j194454n12693l43039
4770D0672533m73572p77597q62959j074234j167521m44731p75525o76020q81758
4761C3538616n99452o34416r26713n89055l95597n42896j517475j145816j530484
4752B5656712j453591j117084r25721o88091l91565m89048m05326l52616m08342
$$ plain form
4743 19425328 19333045 19079288 18651994 18210013 17760864 16627913 16005026 15183091 14460096
4734 14460096 13890607 13338546 12793295 12529096 11872835 11249733 11275374 10861694 10642107 10660896
4724 10660896 10418705 10155044 10021898 9719027 9548721 9407096 9047540 8942595 8540944
4715 8540944 8513475 8364696 8091189 7692508 7751248 7749038 7336122 7484072 7142889 7073453
4705 7073453 6932492 6413326 6478688 6259146 6043123 6054374 5912799 5908401 5774868 5783766 5588730
4694 5588730 5626542 5443616 5249470 5420106 5193706 5247586 5031879 4958424 5198987 4804505
4684 4804505 4839761 5054241 4993595 4922703 4886404 4720571 4643000 4820998 4562140 4400445
4674 4400445 4458618 4294730 4106773 4136810 3981944 4034530 4006290 3998864 3860165 3853964 3888256
$$ packed form
4743A9425328r2283k53757m27294m41981m49149j132951o22887q21935p22995
4734A4460096n69489n52061n45251k64199o56261o23102K5641m13680k19587J8789
4724A0660896k42191k63661j33146l02871j70306j41625l59556j04945m01651
4715H540944k7469j48779k73507l98681N8740k210m12916J47950l41183o9436
4705G073453j40961n19166O5362k19542k16023J1251j41575m398j33533Q898j95036
4694E588730L7812j82926j94146J70636k26400N3880k15707p3455K40563l94482
4684D804505L5256K14480o0646p0892l6299j65833p7571J77998k58858j61695
4674D400445N8173j63888j87957L0037j54866N2586k8240p426j38699o201L4292
$$ plain form
4663 3888256 3953894 3960813 3792163 3895983 3912517 3809811 3750015 3571672 3625465 3745893 3643848
4652 3643848 3582388 3787544 3735830 3648157 3590550 3403120 3458345 3364242 3326263 3447022 3357790
4641 3357790 3161509 3271406 3277100 3122289 3182005 3341727 3444649 3891569 4322423 4469383
4631 4469383 4290314 3883842 3481563 3096657 2929844 2781706 2635460 2181981 2503861 2455299
4621 2455299 2488199 2311120 2319988 2192088 2329641 2224507 2224641 2249737 1870120 2057748 1959342
4610 1959342 1868757 1782256 2088902 2060203 1946865 1998313 1913026 2041269 1937493 1717773
4600 1717773 1991442 1674743 1640688 1796101 1517497 1788246 1996015 1672609 1768144 1795263
4590 1795263 1681314 1713316 1741493 1498450 1678324 1626532 1333245 1476787 1499559 1526822
$$ packed form
4663C888256O5638O919j68650J03820J6534j02706n9796j78343N3793J20428j02045
4652C643848o1460K05156n1714q7673n7607j87430N5225r4103l7979J20759q9232
4641C357790j96281J09897N694j54811N9716J59722J02922M46920M30854J46960
4631D469383j79069m06472m02279l84906j66813j48138j46246m53479L21880m8562
4621B455299L2900j77079Q868j27900J37553j05134J34K5096l79617J87628r8406
4610A959342r0585q6501L06646k8699j13338N1448q5287J28243j03776k19720
4600A717773K73669l16699l4055J55413k78604K70749K07769l23406R5535K7119
4590A795263j13949L2002K8177k43043J79874n1792k93287J43542K2772K7263
$$ plain form
4580 1526822 1587886 1507681 1352619 1329210 1290385 1311388 1406300 1363242 1194245 1225030 1076642
4569 1076642 1281717 1290030 1310098 1355090 1266466 1216703 1495905 1593142 1269456 1341486 1293597
4558 1293597 1103843 1288855 1326875 1431157 1451639 1119779 1236672 1351428 1345647 1322391
4548 1322391 1219971 1380375 1388460 1233116 1182890 1213078 1317720 1236223 1341273 1316894 1424321
4537 1424321 1512766 1285482 1532254 1453954 1158023 1256262 1360055 1134723 1225201 1308380
4527 1308380 1182690 1189858 1008137 1232241 1311859 1060662 1161392 1365130 1238724 1289664
4517 1289664 1208126 1120525 1135760 1200231 943200 908692 1166399 991915 1148659 1164581 972395
4506 972395 1160754 1164273 1020560 1060103 1194049 1138857 1018489 939480 1155721 966165 1073545
$$ packed form
4580A526822O1064q0205j55062k3409l8825K1003R4912m3058j68997L0785j48388
4569A076642K05075Q313K0068M4992q8624m9763K79202R7237l23686P2030m7889
4558A293597j89754J85012L8020J04282K0482l31860J16893J14756n781k3256
4548A322391j02420J60404Q085j55344n0226L0188J04642q1497J05050k4379J07427
4537A424321Q8445k27284K46772p8300k95931R8239J03793k25332R0478Q3179
4527A308380j25690P168j81721K24104P9618k51197J00730K03738j26406N0940
4517A289664q1538q7601J5235O4471k57031l4508K57707j74484J56744J5922j92186
4506I72395J88359L519j43713L9543J33946n5192j20368p9009K16241j89556J07380
$$ plain form
4495 1073545 1016746 880995 990111 1073411 1048088 1042633 884518 839570 935187 951849 769852
4484 769852 677900 909645 738035 609328 648272 686175 798571 627234 671666 753067 718292
4473 718292 733697 583109 454528 736204 646230 854828 684425 665599 723616 795833 616717
4462 616717 428270 650363 623178 549883 658513 659054 546087 642884 558287 577450 595943
4451 595943 689382 679809 564665 476508 527200 624127 598392 625316 693975 788726 592191
4440 592191 549712 467769 450675 692669 615089 461022 580603 666546 716723 581734 480923
4429 480923 586098 632235 624993 622754 762294 744487 516515 568179 731413 850512 741395
4418 741395 756039 801505 687031 594208 803992 814810 762954 746539 875104 823378 747917
$$ packed form
4495A073545n6799j35751J09116Q3300k5323n455j58115m4948R5617J6662j81997
4484G69852r1952K31745j71610j28707L8944L7903J12396j71337M4432Q1401l4775
4473G18292J5405j50588j28581K81676q9974K08598j70403j8826N8017P2217j79116
4462F16717j88447K22093k7185p3295J08630N41j12967R6797q4597J9163J8493
4451E95943R3439r573j15144q8157N0692R6927k5735K6924O8659R4751j96535
4440E92191m2479q1943j7094K41994p7580j54067J19581Q5943N0177j34989j00811
4429D80923J05175M6137p242k239J39540j7807k27972N1664J63234J19099j09117
4418G41395J4644M5466j14474r2823K09784J0818n1856j6415J28565n1726p5461
$$ plain form
4407 747917 686232 784977 793856 869066 645817 771206 1011627 810507 1055118 992208 939532
4396 939532 982761 971196 1068708 1001062 1164496 1055703 838450 1060553 1239371 1362772
4386 1362772 1213841 1317730 1253010 1291813 1140696 1012104 1154269 1349457 1319849 1321064
4376 1321064 1379423 1342767 1458598 1423233 1519718 1655512 1582517 1714842 1806367 1687584 1829682
4365 1829682 1929390 1967968 2025694 2108407 2230681 2602340 2366355 2326138 2681971 2836203
4355 2836203 2823161 3133755 3316723 3535844 3794709 4053306 4350225 4864062 5014736 5359218
4345 5359218 5625685 5393766 5437497 5171855 4594108 4392398 3721525 3362735 3524707 2972749
4335 2972749 2743214 2726619 2547278 2283561 2183276 2174298 2122689 1973841 1776355 1654749
$$ packed form
4407G47917o1685R8745Q879P5210k23249J25389K40421k01120K44611o2910n2676
4396I39532M3229j1565R7512o7646J63434j08793k17253K22103J78818J23401
4386A362772j48931J03889o4720L8803j51117j28592J42165J95188k9608J215
4376A321064N8359l6656J15831l5365R6485J35794p2995J32325R1525j18783J42098
4365A829682R9708L8578N7726Q2713J22274L71659k35985m0217L55833J54232
4355B836203j3042L10594J82968K19121K58865K58597K96919N13837J50674L44482
4345E359218K66467k31919M3731k65642n77747k01710o70873l58790J61972n51958
4335B972749k29535j6595j79341k63717j00285q978n1609j48848j97486j21606
$$ plain form
4325 1654749 1602188 1556768 1698668 1625651 1633851 1698056 1422754 1341765 1495813 1550848 1273862
4314 1273862 1354864 1298691 1185561 1216417 1239598 1141284 1214299 1055533 972922 1149171 1129788
4303 1129788 863171 1046662 920417 798767 856990 913356 782507 772891 767520 679253 714007
4292 714007 666046 709997 787249 923998 800434 591963 776329 593523 581082 712109
4282 712109 574629 547489 484518 409119 519244 368967 590235 507478 350399 502994
4272 502994 538674 239747 123387 513354 259913 233773 232038 218855 447364 401802 376240
4261 376240 277043 418615 356398 399115 311025 369058 277285 79558 102783 157740 261681
4250 261681 369341 324969 369859 311446 212181 291861 392130 331612 133203 485428 242991
$$ packed form
4325A654749n2561m5420J41900p3017Q200O4205k75302q0989J54048N5035k76986
4314A273862Q1002n6173j13130L0856K3181r8314P3015j58766q2611J76249j9383
4303A129788k66617J83491j26245j21650N8223N6366j30849r616n371q8267L4754
4292G14007m7961M3951P7252J36749j23564k08471J84366j82806j2441J31027
4282G12109j37480k7140o2971p5399J10125j50277K21268q2757j57079J52595
4272E02994L5680k98927j16360L89967k53441k6140j735j3183K28509m5562k5562
4261C76240r9197J41572o2217M2717q8090N8033r1773j97727K3225N4957J03941
4250B61681J07660m4372M4890n8413r9265P9680J00269o0518j98409L52225k42437
$$ plain form
4239 242991 186023 228465 391913 273654 181026 250511 77196 237135 253012 134064 107893
4228 107893 108032 139243 285930 -8453 50455 114407 102547 5304 -94530 113632 65583
4217 65583 187663 156137 142014 172839 -43817 233981 226710 143903 197876 177326 23504
4206 23504 -82726 -188611 80672 -14875 22382 180897 120971 70891 27955 -185 48770
4195 48770 200986 3010 66099 -13947 -69798 101057 88798 53355 88457 161720 101344
4184 101344 -38876 -16601 -26419 -30416 -33649 -229187 43829 -126844 -143712 -140952 -204581 20703
4172 20703 -132575 -16834 9927 67647 173934 -81641 40250 -7800 14336 188651 168369
4161 168369 149576 210165 121826 181359 112744 223197 130708 195357 176533 112373 239169
$$ packed form
4239B42991n6968M2442J63448j18259r2628O9485j73315J59939J5877j18948k6171
4228A07893J39L1211J46687k94383N8908O3952j1860r7243r9834K08162m8049
4217F5583J22080l1526j4123L0825k16656K77798p271q2807N3973k0550j53822
4206B3504j06230j05885K69283r5547L7257J58515n9926n0080m2936k8140M8955
4195D8770J52216j97976O3089q0046n5851J70855j2259l5443L5102P3263o0376
4184A01344j40220K2275r818l997l233j95538K73016j70673j6868K760o3629K25284
4172B0703j53278J15741K6761N7720J06287k55575J21891m8050K2136J74315k0282
4161A68369j8793O0589q8339N9533o8615J10453r2489O4649j8824o4160J26796
$$ plain form
4150 239169 102239 254376 146119 137975 168576 184222 210508 92331 189661 83142 234443
4139 234443 248766 158839 272046 173413 231659 214340 3923 143275 145069 250395 145332
4128 145332 251963 141575 104763 207296 119649 178525 148364 433385 310297 412075
4118 412075 506080 525577 704636 596517 1050671 990505 1009381 853507 589884 489045
4108 489045 409158 681769 529793 554668 698203 697770 709865 560296 600176 626611 448879
4097 448879 222485 223383 168975 67219 185224 398330 219383 306517 271480 543795 491405
4086 491405 424094 769573 681305 620329 698523 601915 713239 517830 376337 620713 775507
4075 775507 765015 582867 924957 747107 863480 931437 710649 981966 632424 620616
$$ packed form
4150B39169j36930J52137j08257q144L0601J5646K6286j18177R7330j06519J51301
4139B34443J4323q9927J13207r8633N8246j7319k10417J39352J794J05326j05063
4128A45332J06631j10388l6812J02533q7647N8876l0161K85021j23088J01778
4118D12075R4005J9497J79059j08119M54154o0166J8876j55874k63623j00839
4108D89045p9887K72611j51976K4875J43535m33J2095j49569L9880K6435j77732
4097D48879k26394Q98n4408j01756J18005K13106j78947Q7134l5037K72315n2390
4086D91405o7311L45479q8268o0976P8194r6608J11324j95409j41493K44376J54794
4075G75507j0492j82148L42090j77850J16373O7957k20788K71317l49542j1808
$$ plain form
4065 620616 458493 574233 590136 607998 590767 650458 604018 547960 598256 783562 763320
4054 763320 836936 996945 741324 972534 974765 1189755 1218724 1091885 1145662 1294143 1041918
4043 1041918 895070 1119109 952239 983056 1003546 1043018 784284 749773 763997 1081624
4033 1081624 1046800 883322 1041920 815744 970460 1052743 1223068 948637 1079410 1083900
4023 1083900 1025682 1312185 1035359 1088710 1052637 746951 657751 854965 754118 721315
4013 721315 494064 579291 631634 656323 428223 537388 573856 562259 642991 402897 457926
4002 457926 450723 423046 280959 274140 209693 -5796 -53171 -35696 -80701 9682 8235 18666
3990 18666 -9725 -80650 23497 -120091 -102286 -125007 -129427 -120206 -175561 -174195 -287248 -132732
$$ packed form
4065F20616j62123J15740J5903J7862j7231N9691m6440n6058N0296J85306k0242
4054G63320P3616J60009k55621K31210K231K14990K8969j26839N3777J48481k52225
4043A041918j46848K24039j66870L0817K0490L9472k58734l4511J4224L17627
4033A081624l4824j63478J58598k26176J54716Q2283J70325k74431J30773M490
4023A083900n8218K86503k76826N3351l6073l05686q9200J97214j00847l2803
4013G21315k27251Q5227N2343K4689k28100J09165L6468j1597Q0732k40094N5029
4002D57926p203k7677j42087o819o4447k15489m7375J7475m5005R0383j447J0431
3990A8666k8391p0925J04147j43588J7805k2721m420R221n5355J366j13053J54516
$$ plain form
3978 -132732 -226427 -108282 -440011 -250329 -122918 -94004 -207476 -346814 -444620 -374056
3968 -374056 -458923 -363674 -354136 -561660 -485310 -340341 -468261 -349714 -309584 -533682 -288162
3957 -288162 -289317 -390759 -348170 -494493 -479907 -202396 -170777 -420069 -367727 -485928 -636693
3946 -636693 -470376 -314363 -274554 -331523 -623802 -288738 -340222 -729647 -590036 -440131
3936 -440131 -409868 -659789 -497225 -568080 -463996 -643762 -571956 -508942 -337379 -478387
3926 -478387 -604819 -518552 -473135 -261975 -456346 -397273 -257012 -473141 -459704 -409369 -560729
3915 -560729 -615710 -609307 -578830 -490314 -472308 -523847 -422064 -363998 -507771 -500216 -526721 -607227
3903 -607227 -597193 -582320 -399820 -595271 -611838 -766411 -491474 -423026 -552992 -436626
$$ packed form
3978a32732r3695J18145l31729J89682J27411K8914j13472j39338r7806P0564
3968c74056q4867R5249R538k07524P6350J44969j27920J18547M0130k24098K45520
3957b88162j155j01442M2589j46323J4586K77511L1619k49292N2342j18201j50765
3946f36693J66317J56013L9809n6969k92279L35064n1484l89425J39611J49905
3936d40131L0263k49921J62564p0855J04084j79766P1806O3014J71563j41008
3926d78387j26432Q6267M5417K11160j94371N9073J40261k16129J3437N0335j51360
3915e60729n4981O403L0477Q8516J8006n1539J01783N8066j43773P555k6505q0506
3903f07227J0034J4873J82500j95451j6567j54573K74937O8448j29966J16366
$$ plain form
3893 -436626 -708652 -624481 -346611 -480553 -443160 -564741 -595847 -611690 -558569 -478690 -625841
3882 -625841 -568398 -630378 -565867 -571569 -606206 -521315 -640480 -483784 -535097 -443009 -464482
3871 -464482 -551154 -532089 -417201 -514019 -495664 -391378 -508060 -443773 -492417 -478368 -421388
3860 -421388 -538396 -459673 -473801 -576252 -515093 -518596 -685092 -596623 -504605 -756447 -585868
3849 -585868 -525191 -626218 -408955 -577037 -522004 -505074 -622646 -407970 -192094 -393506
3839 -393506 -456735 -352719 -610131 -469130 -383558 -336391 -268477 -373881 -335119 -233677 -516229
3828 -516229 -375055 -329905 -694673 -425653 -374126 -530162 -479514 -474242 -386487 -299273 -152027
3817 -152027 -293793 -348726 -644213 -457921 -473177 -521507 -399654 -346090 -484428 -493769 -420959
$$ packed form
3893d36626k72026Q4171K77870j33942L7393j21581l1106j5843N3121P9879j47151
3882f25841N7443o1980O4511n702l4637Q4891j19165J56696n1313R2088k1473
3871d64482q6672J9065J14888r6818J8355J04286j16682O4287m8644J4049N6980
3860d21388j17008P8723j4128j02451O1159l503j66496Q8469R2018k51842J70579
3849e85868O0677j01027K17263j68082N5033J6930j17572K14676K15876k01412
3839c93506o3229J04016k57412J41001Q5572M7167O7914j05404L8762J01442k82552
3828e16229J41174M5150l64768K69020N1527j56036N0648N272Q7755Q7214J47246
3817a52027j41766n4933k95487J86292j5256m8330J21853N3564j38338r341P2810
$$ plain form
3806 -420959 -235526 -231095 -357080 -348097 -279156 -420610 -328666 -125772 -327947 -236259 -71403
3795 -71403 -408371 -356912 -193596 -171987 -316329 -321291 -218166 -256481 -281916 -229376 -139700
3784 -139700 -53046 -277555 -344449 1381 -353827 -328790 -382903 -366123 -480450 -494652 -396831
3773 -396831 -412940 -370353 -307103 -315202 -312345 -364086 -486340 -432235 -375177 -219005 -461281
3762 -461281 -435908 -261715 -554696 -368390 -225378 -302642 -383911 -319998 -680322 -297442
3752 -297442 -228793 -419637 -315400 -399736 -583473 -383489 -517043 -403496 -381046 -600426
3742 -600426 -541077 -436248 -496541 -445794 -401022 -631398 -397056 -334856 -594306 -388774 -587211
3731 -587211 -491273 -364065 -604749 -471763 -535464 -608776 -510834 -571047 -568686 -719043 -747493
$$ packed form
3806d20959J85433M431j25985Q983O8941j41454R1944K02894k02175R1688J64856
3795g1403l36968N1459J63316K1609j44342m962J03125l8315k5435N2540Q9676
3784a39700Q6654k24509o6894L45830l55208K5037n4113J6780j14327j4202R7821
3773c96831j6109M2587O3250q099K857n1741j22254N4105N7058J56172k42276
3762d61281K5373J74193k92981J86306J43012p7264q1269O3913l60324L82880
3752b97442O8649j90844J04237q4336j83737J99984j33554J13547K2450k19380
3742f00426N9349J04829o0293N0747M4772k30376K34342O2200k59450K05532j98437
3731e87211R5938J27208k40684J32986o3701p3312R7942o0213K361j50357k8450
$$ plain form
3720 -747493 -394762 -663259 -463098 -484672 -519683 -557066 -566228 -450262 -476300 -530654 -481708
3709 -481708 -559133 -845883 -535232 -811802 -673358 -403372 -371947 -574170 -564597 -684620
3699 -684620 -693142 -615135 -711176 -766450 -769814 -699200 -834392 -672457 -648721 -573326 -615441 -754771
3687 -754771 -515639 -559678 -583951 -688087 -440602 -677353 -606574 -698585 -654940 -590131 -599262
3676 -599262 -572444 -563086 -609439 -619753 -271980 -590628 -692230 -563535 -587234 -764663 -691863
3665 -691863 -831058 -524030 -482786 -579672 -590820 -515848 -462573 -713013 -793906 -476967 -491755
3654 -491755 -764088 -492008 -693262 -705256 -591682 -401390 -545109 -636783 -600252 -773450
3644 -773450 -551564 -661432 -466255 -614685 -629945 -607595 -687550 -451752 -638164 -517606
$$ packed form
3720g47493L52731k68497K00161k1574l5011l7383r162J15966k6038n4354M8946
3709d81708p7425k86750L10651k76570J38444K69986L1425k02223R573j20023
3699f84620q522P8007r6041n5274l364P0614j35192J61935K3736P5395m2115j39330
3687g54771K39132m4039k4273j04136K47485k36751P0779r2011M3645O4809r131
3676e99262K6818R358m6353j0314L47773l18648j01602J28695k3699j77429P2800
3665f91863j39195L07028M1244r6886j1148P4972N3275k50440q0893L16939j4788
3654d91755k72333K72080k01254j1994J13574J90292j43719r1674L6531j73198
3644g73450K21886j09868J95177j48430j5260K2350p9955K35798j86412J20558
$$ plain form
3634 -517606 -616228 -594631 -555767 -438056 -672675 -543042 -693773 -583596 -553039 -522034 -777918
3623 -777918 -584734 -543689 -622875 -425350 -654473 -610414 -512800 -520743 -445681 -606519 -564044
3612 -564044 -599400 -660168 -546613 -502035 -400359 -479489 -753246 -613712 -598314 -535053 -675965
3601 -675965 -508097 -585294 -812705 -748605 -502515 -623501 -597864 -520049 -702131 -457771
3591 -457771 -413439 -472962 -501424 -649058 -510893 -501342 -390891 -248938 -215149 -530258 -542494
3580 -542494 -195939 -340225 -473380 -446458 -480040 -500014 -765520 -552290 -495116 -714662
3570 -714662 -699592 -707561 -594981 -617873 -621376 -547987 -772402 -534277 -592731 -437604 -517805
3559 -517805 -637794 -334789 -558677 -575421 -553377 -527785 -576316 -624207 -388339 -473311 -487970
$$ packed form
3634e17606r8622K1597L8864J17711k34619J29633j50731J10177L0557L1005k55884
3623g77918J93184M1045p9186J97525k29123M4059R7614p943P5062j60838M2475
3612e64044l5356o0768J13555M4578J01676p9130k73757J39534J5398O3261j40912
3601f75965J67868p7197k27411O4100K46090j20986K5637P7815j82082K44360
3591d57771M4332n9523k8462j47634J38165R551J10451J41953L3789l15109j2236
3580e42494L46555j44286j33155K6922l3582j9974k65506K13230N7174k19546
3570g14662J5070p969J12580k2892l503P3389k24415K38125n8454J55127q0201
3559e17805j19989L03005k23888j6744K2044K5592m8531m7891K35868q4972j4659
$$ plain form
3548 -487970 -553445 -595717 -443468 -621820 -576840 -418046 -648474 -714233 -764098 -648569 -671769
3537 -671769 -614417 -436421 -463139 -542180 -478921 -503753 -482434 -641259 -300210 -313026 -582729
3526 -582729 -635971 -597798 -644909 -671493 -560308 -415183 -458208 -601986 -699593 -375263 -584500
3515 -584500 -524853 -464704 -523190 -532721 -567846 -647688 -472720 -374045 -526398 -472612 -485927
3504 -485927 -354301 -507579 -322700 -386700 -311523 -520382 -557988 -301788 -493898 -728180
3494 -728180 -566060 -580876 -452874 -674121 -383605 -394815 -492563 -250088 -412374 -416930 -547114
3483 -547114 -584590 -601759 -437415 -315875 -606456 -525002 -448375 -442856 -370062 -270104 -359794
3472 -359794 -411345 -402006 -282065 -463490 -461405 -366993 -554300 -204762 -281892 -366216 -429229
$$ packed form
3548d87970o5475m2272J52249j78352M4980J58794k30428o5759m9865J15529k3200
3537f71769N7352J77996k6718p9041O3259k4832K1319j58825L41049j2816k69703
3526e82729n3242L8173m7111k6584J11185J45125m3025j43778r7607L24330k09237
3515e84500N9647O0149n8486r531l5125p9842J74968R8675j52353N3786j3315
3504d85927J31626j53278J84879o4000P5177k08859l7606K56200j92110k34282
3494g28180J62120j4816J28002k21247K90516j1210r7748K42475j62286m556j30184
3483e47114l7476j7169J64344J21540k90581Q1454P6627N519P2794R9958q9690
3472c59794n1551R339J19941j81425K085R4412j87307L49538p7130q4324o3013
$$ plain form
3461 -429229 -290931 -295704 -503340 -283050 -272953 -229372 -378015 -460049 -242873 -497661 -395263
3450 -395263 -81521 -423065 -294762 -114606 -259015 -397204 -433777 -406134 -505527 -301382
3440 -301382 -81534 -362486 -257780 -210841 -438129 -391970 -272769 -1842 -358533 -253659
3430 -253659 -140459 -178945 -273477 -314924 -94438 -331881 -210259 -399223 -145004 -281051
3420 -281051 -309659 -81939 -301878 -153327 -37027 -203998 -220743 -246095 -374273 -249928
3410 -249928 -93602 -157676 -95562 -61179 -157169 -196111 -18020 -174152 -32767 208656 -99236
3399 -99236 55942 -5151 -148740 25362 -11769 46024 188666 281554 61045 103480 430966
3388 430966 79517 165229 291818 299380 349129 412828 289944 522254 461966 421488 683536
$$ packed form
3461d29229J38298m773k07636K20290J0097M3581j48643q2034K17176k54788J02398
3450c95263L13742l41544J28303J80156j44409j38189l6573K7643r9393K04145
3440c01382K19848k80952J04706M6939k27288M6159J19201K70927l56691J04874
3430b53659J13200l8486r4532m1447K20486k37443J21622j88964K54219j36047
3420b81051k8608K27720k19939J48551J16300j66971j6745k5352j28178J24345
3410b49928J56326o4074O2114L4383r5990l8942J78091j56132J41385K41423l07892
3399i9236J55178o1093j43589J74102l7131N7793J42642R2888k20509M2435L27486
3388D30966l51449Q5712J26589P562M9749O3699j22884K32310o0288m0478K62048
$$ plain form
3377 683536 690392 728567 770372 815801 892819 1082633 1141334 1191747 1428957 1427766 1820396
3366 1820396 1880612 2012699 2585286 3065094 3601543 3645957 3719694 3853473 3985603 4859190
3356 4859190 5650143 6904771 8377741 10479330 14591503 22484149 34665228 39392470
3348 39392470 34339391 23670067 16076592 11890485 8894188 6697559 5081087 3955978
3340 3955978 3204961 2620458 2487145 2685647 2357413 2177553 1949827 1250491 1187590 987337
3330 987337 720634 878204 737185 450206 308469 453129 279340 328266 209182 155527
3320 155527 350028 30467 105157 383507 237911 59184 148282 213364 139619 200455 -104070
3309 -104070 -7173 -81817 -122264 38632 19262 -65843 -60482 -24415 -48829 -113257 -239808
$$ packed form
3377F83536O856L8175M1805M5429P7018J89814N8701N0413K37210j191L92630
3366A820396O0216J32087N72587M79808N36449M4414P3737J33779J32130Q73587
3356D859190P90953J254628J472970K101589M112173P892646J2181079M727242
3348C9392470n053079j0669324p593475m186107k996297k196629j616472j125109
3340C955978p51017n84503j33313J98502l28234j79860k27726o99336o2901k00253
3330I87337k66703J57570j41019k86979j41737J44660j73789M8926j19084n3655
3320A55527J94501l19561P4690K78350j45596j78727Q9098O5082p3745O0836l04525
3309a04070R6897p4644m0447J60896j9370q5105N361L6067k4414o4428j26551
$$ plain form
3298 -239808 40515 4127 -453334 -55735 -138179 -441650 -425847 -258623 -184820 -430775
3288 -430775 -287149 -345592 -270968 -344328 -362845 -149038 -457277 -522321 -303672 -436333 -437766
3277 -437766 -509591 -663135 -340340 -431435 -394485 -549856 -415897 -549855 -585275 -283308
3267 -283308 -486436 -543011 -283167 -581489 -406450 -256973 -485888 -393953 -671925 -326704
3257 -326704 -262518 -428670 -414229 -410391 -477404 -642300 -359521 -436306 -280269 -433002 -587830
3246 -587830 -565617 -599672 -553753 -266491 -644437 -580579 -393217 -773862 -743719 -624884 -589175
3235 -589175 -482301 -576507 -481555 -572688 -619946 -717706 -631578 -678149 -683670 -549995 -620043
3224 -620043 -438919 -300314 -495088 -418295 -564582 -531628 -470495 -252887 -408870 -635406
$$ packed form
3298b39808K80323l6388m57461L97599q2444l03471J5803J67224P3803k45955
3288d30775J43626n8443P4624p3360j8517K13807l08239o5044K18649j32661j433
3277d37766p1825j53544L22795r1095L6950j55371J33959j33958l5420L01967
3267b83308k03128n6575K59844k98322J75039J49477k28915R1935k77972L45221
3257c26704O4186j66152J4441L838o7013j64896K82779p6785J56037j52733j54828
3246e87830K2213l4055M5919K87262l77946O3858J87362l80645L0143J18835L5709
3235e89175J06874r4206R4952r1133m7258r7760Q6128m6571n521J33675p0048
3224f20043J81124J38605j94774P6793j46287L2954O1133K17608j55983k26536
$$ plain form
3214 -635406 -415834 -593194 -635259 -562696 -493283 -407524 -628770 -446935 -580181 -749873
3204 -749873 -394340 -626453 -669847 -539813 -584085 -930623 -694778 -473064 -679701 -502752
3194 -502752 -504072 -581236 -428994 -697966 -488093 -367757 -744854 -566139 -468979 -724950
3184 -724950 -573941 -412012 -465498 -548262 -708598 -629194 -533075 -591452 -616824 -506373 -678103
3173 -678103 -534590 -437604 -642389 -491770 -454696 -439504 -628826 -790695 -600897 -481860
3163 -481860 -514819 -483072 -571926 -647009 -553074 -605359 -526823 -658004 -434915 -683752 -796268
3152 -796268 -669539 -561889 -482542 -643286 -692257 -827528 -748691 -664846 -659780 -670976 -651732
3141 -651732 -829551 -526099 -647440 -726265 -409540 -445038 -477841 -627671 -468687 -593731
$$ packed form
3214f35406K19572j77360m2065P2563O9413Q5759k21246J81835j33246j69692
3204g49873L55533k32113m3394J30034m4272l46538K35845K21714k06637J76949
3194e02752j320p7164J52242k68972K09873J20336l77097J78715R7160k55971
3184g24950J51009J61929n3486q2764j60336P9404R6119n8377k5372J10451j71730
3173f78103J43513R6986k04785J50619L7074J5192j89322j61869J89798J19037
3163d81860l2959L1747q8854p5083R3935n2285P8536j31181K23089k48837j12516
3152g96268J26729J07650P9347j60744m8971j35271P8837Q3845N066j1196J9244
3141f51732j77819L03452j21341p8825L16725l5498l2803j49830J58984j25044
$$ plain form
3131 -593731 -539097 -492086 -530832 -573620 -384189 -632175 -699139 -523846 -292645 -455044 -525616
3120 -525616 -467892 -524635 -321357 -568931 -412188 -450772 -543465 -584022 -536010 -527499 -568663
3109 -568663 -467956 -541926 -509195 -640738 -415750 -391216 -547343 -859737 -471492 -630239
3099 -630239 -851546 -590941 -552967 -594508 -527583 -615808 -503309 -604549 -709846 -472472
3089 -472472 -546426 -513485 -550112 -503608 -684009 -635720 -525942 -489973 -281581 -538348 -494764
3078 -494764 -495059 -581050 -560380 -599565 -574232 -671727 -510214 -587511 -491115 -349016 -549030
3067 -549030 -598974 -484698 -631487 -551130 -644862 -617673 -716752 -619913 -672484 -482044 -399153
3056 -399153 -623626 -724324 -411130 -660254 -740867 -379030 -625537 -567366 -609921 -534895
$$ packed form
3131e93731N4634M7011l8746m2788J89431k47986o6964J75293K31201j62399p0572
3120e25616N7724n6743K03278k47574J56743l8584r2693m0557M8012Q511m1164
3109e68663J00707p3970L2731j31543K24988K4534j56127l12394L88245j58747
3099f30239k21307K60605L7974m1541O6925q8225J12499j01240j05297K37374
3089d72472p3954L2941l6627M6504j80401M8289J09778L5969K08392k56767M3584
3078d94764k95q5991K0670l9185K5333r7495J61513p7297R6396J42099k00014
3067e49030m9944J14276j46789Q0357r3732K7189r9079R6839n2571J90440Q2891
3056c99153k24473j00698L13194k49124q0613L61837k46507N8171m2555P5026
$$ plain form
3046 -534895 -388350 -496596 -707684 -404603 -443605 -696351 -565607 -452699 -419038 -583082
3036 -583082 -513984 -345664 -411687 -608840 -627268 -395821 -539204 -581237 -598175 -568913 -448343
3025 -448343 -618390 -600173 -575186 -685219 -714453 -661452 -430620 -516584 -426481 -440038 -530787
3014 -530787 -757556 -726510 -430974 -607895 -648945 -382652 -303879 -456395 -732569 -769166
3004 -769166 -662458 -724920 -611509 -490639 -434892 -590213 -648265 -412874 -610576 -493605
2994 -493605 -650128 -584014 -651324 -663940 -637910 -602109 -506300 -575184 -702772 -662845 -489983
2983 -489983 -451625 -603462 -410218 -310000 -679241 -694108 -493448 -470574 -485944 -687994
2973 -687994 -560411 -601300 -677073 -633463 -492514 -563675 -580232 -606778 -592609 -592676 -574026 -546581
$$ packed form
3046e34895J46545j08246k11088L03081l9002k52746J30744J12908L3661j64044
3036e83082O9098J68320o6023j97153j8428K31447j43383m2033j6938K9262J20570
3025d48343j70047J8217K4987j10033k9234N3001K30832q5964R0103j3557r0749
3014e30787k26769L1046K95536j76921m1050K66293P8773j52516k76174l6597
3004g69166J06708o2462J13411J20870N5747j55321n8052K35391j97702J16971
2994d93605j56523O6114o7310j2616K6030L5801R5809o8884j27588L9927J72862
2983d89983L8358j51837J93244J00218l69241j4867K00660K2874j5370k02050
2973f87994J27583m0889p5773M3610J40949p1161j6557k6546J4169o7J8650K7445
$$ plain form
2961 -546581 -359321 -534116 -654138 -547955 -632800 -635322 -644582 -506626 -640261 -548925 -582684
2950 -582684 -486236 -545506 -493738 -496130 -605624 -638684 -495719 -512692 -738840 -326511 -474694
2939 -474694 -718748 -425915 -573350 -523479 -356924 -481377 -451643 -656220 -736387 -685452
2929 -685452 -502249 -446025 -395100 -542515 -626476 -346882 -716267 -611742 -314918 -488739
2919 -488739 -631836 -597469 -586003 -526885 -318145 -711891 -588813 -721919 -586731 -558533
2909 -558533 -423223 -418082 -554319 -464654 -614472 -735237 -357127 -482175 -815119 -617939
2899 -617939 -572450 -444046 -619251 -721872 -462673 -462501 -638604 -429383 -655357 -597251 -458382
2888 -458382 -550198 -529380 -467332 -654250 -618301 -333625 -608552 -716111 -435621 -542053
$$ packed form
2961e46581J87260j74795j20022J06183q4845k522r260J37956j33635R1336l3759
2950e82684R6448n9270N1768k392j09494l3060J42965j6973k26148M12329j48183
2939d74694k44054K92833j47435M9871J66555j24453K9734k04577q0167N0935
2929f85452J83203N6224N0925j47415q3961K79594l69385J04525K96824j73821
2919d88739j43097L4367J1466N9118K08740l93746J23078j33106J35188K8198
2909e58533J35310N141j36237Q9665j49818j20765L78110j25048l32944J97180
2899f17939M5489J28404j75205j02621K59199J72j76103K09221k25974N8106J38869
2888d58382r1816K0818O2048j86918L5949K84676k74927j07559K80490j06432
$$ plain form
2878 -542053 -720674 -658086 -474666 -684893 -742490 -718737 -520626 -480495 -537075 -419325 -724531
2867 -724531 -551850 -601447 -637804 -509994 -573475 -561920 -524341 -488722 -596374 -665171 -368771
2856 -368771 -586993 -578653 -527055 -517254 -479403 -618871 -454279 -488218 -588561 -587249 -564138
2845 -564138 -625318 -642689 -596446 -737426 -454409 -508284 -565915 -193385 -432394 -595849 -433473
2834 -433473 -611300 -411562 -515688 -572540 -453919 -541412 -524950 -492300 -488611 -529392 -468271
2823 -468271 -594535 -587734 -294692 -732703 -537032 -243852 -552440 -462122 -436767 -673549
2813 -673549 -556803 -497393 -566452 -539243 -621054 -585265 -753814 -557304 -393406 -397730 -562551
2802 -562551 -623180 -360471 -577387 -470940 -574708 -737492 -658697 -569872 -607689 -274063
$$ packed form
2878e42053j78621O2588J83420k10227n7597K3753J98111M0131n6580J17750l05206
2867g24531J72681m9597l6357J27810o3481J1555L7579L5619j07652o8797K96400
2856c68771k18222Q340N1598R801L7851j39468J64592l3939j00343J312K3111
2845e64138o1180j7371M6243j40980K83017n3875n7631L72530k39009j63455J62376
2834d33473j77827J99738j04126n6852J18621q7493J6462L2650L689m0781O1121
2823d68271j26264O801K93042m38011J95671K93180l08588R0318K5355k36782
2813f73549J16746N9410o9059K7209q1811L5789j68549J96510J63898m324j64821
2802e62551o0629K62709k16916J06447j03768j62784P8795Q8825l7817L33626
$$ plain form
2792 -274063 -319680 -620364 -401969 -357288 -553683 -377539 -668082 -338319 -396414 -799636
2782 -799636 -336229 -459621 -698776 -705217 -459206 -469728 -557695 -773359 -522332 -457395 -688657
2771 -688657 -486743 -364187 -585936 -784182 -358741 -439163 -737428 -487229 -480778 -404899
2761 -404899 -715379 -529825 -364066 -505269 -673451 -613667 -382081 -474042 -613071 -419532
2751 -419532 -643845 -464256 -511852 -727421 -634685 -683644 -507792 -404097 -465606 -257722
2741 -257722 -500356 -451009 -361330 -415301 -549633 -453652 -544349 -534028 -408695 -538609 -527574
2730 -527574 -502606 -571149 -502541 -433225 -564293 -639414 -578545 -611891 -623056 -478743 -609508
2719 -609508 -476096 -588818 -511940 -393819 -580265 -652366 -536898 -392018 -540607 -620282
$$ packed form
2792b74063m5617l00684K18395M4681j96395J76144k90543L29763n8095m03222
2782g99636M63407j23392k39155o441K46011j0522q7967k15664K51027O4937k31262
2771f88657K01914J22556k21749j98246M25441q0422k98265K50199O451P5879
2761d04899l10480J85554J65759j41203j68182N9784K31586r1961j39029J93539
2751d19532k24313J79589m7596k15569R2736m8959J75852J03695o1509K07884
2741b57722k42634M9347Q9679n3971j34332R5981r0697J0321J25333j29914J1035
2730e27574K4968o8543O8608O9316j31068p5121O0869l3346j1165J44313j30765
2719f09508J33412j12722P6878J18121j86446p2101J15468J44880j48589p9675
$$ plain form
2709 -620282 -674440 -542644 -491427 -609035 -452090 -301977 -653989 -777902 -399264 -554815
2699 -554815 -672769 -531784 -789286 -790775 -689902 -641858 -397091 -561208 -623094 -398545
2689 -398545 -789847 -569958 -346556 -716895 -685135 -602733 -460155 -583312 -571613 -487410
2679 -487410 -427559 -508406 -639982 -554459 -566629 -689227 -635250 -435322 -510770 -458566 -469738
2668 -469738 -663016 -635994 -418017 -656366 -521831 -466461 -700198 -329590 -286501 -753559
2658 -753559 -621624 -485640 -642269 -535133 -477550 -541528 -506686 -395954 -469692 -427090 -668326
2647 -668326 -789039 -563168 -546505 -468339 -413642 -474361 -521767 -634570 -494196 -551189 -389038
2636 -389038 -608399 -725057 -327029 -386803 -498247 -576029 -584520 -530979 -616544 -625673 -486155
$$ packed form
2709f20282n4158J31796N1217j17608J56945J50113l52012j23913L78638j55551
2699e54815j17954J40985k57502j489J00873M8044K44767j64117o1886K24549
2689c98545l91302K19889K23402l70339L1760Q2402J42578j23157J1699Q4203
2679d87410N9851q0847j31576Q5523j2170j22598N3977J99928p5448N2204j1172
2668d69738j93278K7022K17977k38349J34535N5370k33737L70608M3089m67058
2658g53559J31935J35984j56629J07136N7583o3978L4842J10732p3738M2602k41236
2647f68326j20713K25871J6663P8166N4697o0719m7406j12803J40374n6993J62151
2636c89038k19361j16658L98028n9774j11444p7782q491N3541q5565r129J39518
$$ plain form
2625 -486155 -495819 -472057 -316899 -323370 -572886 -435014 -674028 -649550 -410195 -262623 -447665
2614 -447665 -638293 -515114 -470318 -399588 -370523 -506729 -604464 -501584 -662288 -534827
2604 -534827 -356133 -514807 -534861 -544001 -650776 -571664 -688086 -564721 -406168 -481278 -522641
2593 -522641 -307546 -529118 -574581 -330497 -448307 -394118 -511110 -704352 -614436 -478131
2583 -478131 -425919 -421138 -456006 -544918 -502112 -592628 -451174 -352710 -579246 -540342 -681483
2572 -681483 -485909 -756912 -563770 -374542 -543422 -463661 -665763 -586340 -576802 -721785
2562 -721785 -406593 -484050 -507166 -642424 -476838 -274132 -430181 -406178 -591138 -671981
2552 -671981 -578228 -420572 -515185 -706713 -300951 -722996 -646637 -298377 -528764 -460424
$$ packed form
2625d86155r664K3762J55158o471k49516J37872k39014K4478K39355J47572j85042
2614d47665j90628J23179M4796P0730K9065j36206r7735J02880j60704J27461
2604e34827J78694j58674k0054r140j06775P9112j16422J23365J58553p5110m1363
2593e22641K15095k21572m5463K44084j17810N4189j16992j93242Q9916J36305
2583d78131N2212M781l4868q8912M2806r0516J41454R8464k26536L8904j41141
2572f81483J95574k71003J93142J89228j68880P9761k02102P9423R538j44983
2562g21785L15192p7457k3116j35258J65586K02706j56049K4003j84960q0843
2552f71981R3753J57656r4613j91528M05762m22045P6359L48260k30387O8340
$$ plain form
2542 -460424 -475782 -518761 -456271 -599599 -808115 -510139 -369608 -625236 -541864 -420867
2532 -420867 -451883 -627675 -646009 -711789 -482113 -558740 -495150 -319721 -561965 -573289 -499661
2521 -499661 -799196 -572894 -583817 -727390 -535847 -279113 -597417 -445428 -346130 -599940
2511 -599940 -396768 -492916 -498344 -484967 -598515 -561702 -451700 -468343 -515203 -368195 -584551
2500 -584551 -534414 -470885 -513846 -430442 -497968 -525168 -516981 -520450 -598412 -503574 -565336 -432690
2488 -432690 -652968 -565680 -575302 -598065 -509024 -451937 -452147 -504136 -471441 -406110 -356386 -624983
2476 -624983 -467390 -537762 -422669 -705762 -624061 -441792 -432869 -488627 -421830 -350225 -572146
2465 -572146 -610084 -498995 -532300 -571520 -417027 -532026 -626373 -599581 -421802 -471637 -532722
$$ packed form
2542d60424j5358m2979O2490j43328k08516K97976J40531k55628Q3372J20997
2532d20867l1016j75792j8334o5780K29676p6627O3590J75429k42244j1324P3628
2521d99661k99535K26302j0923j43573J91543K56734l18304J51989R9298k53810
2511e99940K03172r6148n428J3377j13548L6813J10002j6643m6860J47008k16356
2500e84551N0137O3529m2961Q3404o7526k7200Q187l469p7962R4838o1762J32646
2488d32690k20278Q7288r622k2763Q9041N7087k10n1989L2695O5331M9724k68597
2476f24983J57593p0372J15093k83093Q1701J82269Q923n5758O6797P1605k21921
2465e72146l7938J11089l3305l9220J54493j14999r4347K6792J77779m9835o1085
$$ plain form
2454 -532722 -297893 -542719 -564603 -459293 -577790 -564667 -482239 -414372 -384295 -408179 -569120
2443 -569120 -502735 -435458 -575755 -738191 -304087 -235374 -320952 -670770 -466624 -495822 -637476
2432 -637476 -426016 -292451 -397761 -528548 -453929 -593446 -486095 -467698 -437443 -524256
2422 -524256 -431148 -530810 -542741 -516420 -522143 -388312 -251535 -342471 -696409 -507101 -622719
2411 -622719 -556860 -512561 -743069 -423815 -468723 -555139 -462801 -311336 -346207 -554327 -585430
2400 -585430 -461284 -570094 -600199 -507107 -507763 -518487 -661179 -508683 -354860 -573570 -547541
2389 -547541 -363206 -482187 -529690 -586343 -526719 -660598 -695204 -710381 -349474 -482911 -539284
2378 -539284 -435289 -754085 -606086 -593007 -457371 -475554 -521823 -393121 -582245 -387732
$$ packed form
2454e32722K34829k44826k1884J05310j18497J3123Q2428O7867L0077k3884j60941
2443e69120O6385O7277j40297j62436M34104O8713q5578l49818K04146k9198j41654
2432f37476K11460J33565j05310j30787P4619j39517J07351J8397L0255q6813
2422e24256R3108r9662j1931K6321n723J33831J36777r0936l53938J89308j15618
2411f22719O5859M4299k30508L19254m4908q6416R2338J51465l4871k08120l1103
2400e85430J24146j08810l0105R3092o56j0724j42692J52496J53823k18710K6029
2389e47541J84335j18981m7503n6653N9624j33879l4606j5177L60907j33437n6373
2378e39284J03995l18796J47999J3079J35636j8183m6269J28702j89124J94513
$$ plain form
2368 -387732 -488921 -440680 -542978 -547652 -575785 -717847 -530896 -377249 -332790 -495524 -445646
2357 -445646 -356927 -588311 -551007 -610282 -600347 -469777 -612195 -653332 -424145 -572442 -567309
2346 -567309 -434761 -346339 -476622 -490692 -428256 -519710 -388240 -569648 -454522 -583578
2336 -583578 -674790 -416358 -466628 -407821 -543711 -434144 -498667 -559110 -387035 -504532 -440189
2325 -440189 -656792 -557553 -578904 -671388 -449412 -368524 -367209 -578743 -536023 -544335 -549245 -371373
2313 -371373 -498046 -400859 -653228 -744504 -410256 -658216 -315522 -422649 -513715 -497690
2303 -497690 -522926 -455183 -374406 -473104 -319496 -325008 -662457 -744963 -541490 -444952 -398669
2292 -398669 -400874 -512506 -503843 -587400 -533080 -280782 -316794 -267066 -506199 -703597 -547581
$$ packed form
2368c87732j01189M8241j02298m674k8133j42062J86951J53647M4459j62734M9878
2357d45646Q8719k31384L7304n9275R935J30570j42418m1137K29187j48297N133
2346e67309J32548Q8422j30283j4070O2436r1454J31470j81408J15126j29056
2336e83578r1212K58432n0270N8807j35890J09567o4523o0443J72075j17497O4343
2325d40189k16603R9239k1351r2484K21976Q0888J315k11534M2720q312m910J77872
2313c71373j26673R7187k52369r1276L34248k47960L42694j07127r1066J6025
2303d97690k5236O7743Q0777r8698J53608n512l37449q2506K03473R6538M6283
2292c98669k205j11632Q663q3557N4320K52298l6012M9728k39133j97398J56016
$$ plain form
2281 -547581 -542872 -648896 -398885 -407625 -573125 -631692 -598863 -450426 -257607 -450867 -567990
2270 -567990 -432110 -573903 -534335 -530838 -269608 -328643 -584503 -608148 -589172 -622061 -642379
2259 -642379 -495854 -269796 -432593 -639542 -407429 -488967 -407935 -543598 -505785 -424476
2249 -424476 -670991 -592342 -617508 -240172 -342627 -680576 -480363 -670422 -652711 -376279
2239 -376279 -563004 -444771 -258772 -619599 -714562 -512531 -646485 -656257 -362166 -518587
2229 -518587 -511234 -614566 -512062 -309395 -440845 -552948 -464690 -367823 -700503 -475620
2219 -475620 -454241 -496964 -545056 -441282 -446172 -547304 -633865 -449697 -421578 -639911 -414042
2208 -414042 -504091 -637167 -601728 -531223 -379377 -539612 -707777 -639051 -498791 -557331 -726162
$$ packed form
2281e47581M709j06024K50011q740j65500n8567L2829J48437J92819j93260j17123
2270e67990J35880j41793L9568L497K61230n9035k55860k3645J8976l2889k0318
2259f42379J46525K26058j62797k06949K32113q1538Q1032j35663L7813Q1309
2249d24476k46515P8649k5166L77336j02455l37949K00213j90059J7711K76432
2239c76279j86725J18233J85999l60827r4963K02031j33954r772K94091j56421
2229e18587P353j03332J02504K02667j31450j12103Q8258R6867l32680K24883
2219d75620K1379m2723m8092J03774m890j01132q6561J84168K8119k18333K25869
2208d14042r0049j33076L5439P0505J51846j60235j68165O8726J40260n8540j68831
$$ plain form
2197 -726162 -488723 -498659 -582501 -269390 -501404 -519036 -465737 -633778 -356955 -292504 -274920
2186 -274920 -497728 -422440 -426488 -457727 -473144 -574916 -270776 -416235 -594067 -358244 -319385
2175 -319385 -562531 -415429 -642771 -257659 -364050 -713364 -382546 -317066 -498836 -477154
2165 -477154 -508249 -644036 -558264 -449827 -609277 -410375 -422547 -384442 -455616 -600959 -251193
2154 -251193 -326065 -739352 -459906 -447746 -628769 -512006 -574322 -453411 -411334 -538901
2144 -538901 -451524 -333046 -402953 -675287 -494058 -220506 -397990 -154225 -504750 -425934
2134 -425934 -549045 -484534 -393845 -452863 -388331 -588725 -429650 -405335 -404089 -392460 -649133
2123 -649133 -393166 -581671 -653989 -503048 -454556 -494127 -624710 -356478 -560803 -625974
$$ packed form
2197g26162K37439r936q3842L13111k32014j7632N3299j68041K76823O4451J7584
2186b74920k22808P5288m048l1239j5417j01772L04140j45459j77832K35823L8859
2175c19385k43146J47102k27342L85112j06391l49314L30818O5480j81770K1682
2165d77154l1095j35787Q5772J08437j59450J98902j2172L8105p1174j45343L49766
2154b51193p4872m13287K79446J2160j81023J16763o2316J20911M2077j27567
2144e38901Q7377J18478o9907k72334J81229K73552j77484K43765l50525P8816
2134d25934j23111O4511R0689n9018O4532k00394J59075K4315J246J1629k56673
2123f49133K55967j88505p2318J50941M8492l9571j30583K68232k04325o5171
$$ plain form
2113 -625974 -415421 -456003 -442381 -552267 -677407 -598935 -530922 -543179 -682444 -343741 -545736
2102 -545736 -664010 -474872 -408269 -359594 -507355 -413314 -271850 -422725 -557164 -560859 -554038
2091 -554038 -664971 -355630 -478663 -374849 -470822 -630103 -313796 -284574 -557375 -485939
2081 -485939 -390314 -625593 -571377 -417014 -520826 -394969 -548169 -746344 -326780 -673507
2071 -673507 -539132 -487586 -491162 -429257 -441735 -446004 -415582 -402095 -540002 -637937 -297280
2060 -297280 -429743 -666233 -424014 -308590 -302266 -458813 -443933 -305899 -395743 -536874
2050 -536874 -547797 -258060 -631262 -654228 -311720 -445254 -495455 -461733 -413197 -411051 -531482
2039 -531482 -272012 -379433 -502900 -527896 -465596 -499436 -561346 -480976 -529203 -407772 -404157
$$ packed form
2113f25974K10553m0582J3622j09886j25140P8472O8013j2257j39265L38703k01995
2102e45736j18274J89138O6603M8675j47761R4041J41464j50875j34439l695O821
2091e54038j10933L09341j23033J03814r5973j59281L16307K9222k72801P1436
2081d85939R5625k35279N4216J54363j03812J25857j53200j98175M19564l46727
2071f73507J34375N1546l576O1905j2478m269L0422J3487j37907r7935L40657
2060b97280j32463k36490K42219J15424O324j56547J4880J38034q9844j41131
2050e36874j0923K89737l73202k2966L42508j33534n0201L3722M8536K146j20431
2039e31482K59470j07421j23467k4996O2300l3840o1910Q0370m8227J21431L615
$$ plain form
2028 -404157 -476749 -321646 -431233 -474458 -607995 -724665 -694275 -625418 -448523 -459012 -460153
2017 -460153 -659349 -622985 -490220 -474019 -392229 -227298 -415313 -459514 -462583 -602997 -352022
2006 -352022 -467616 -625484 -514226 -513449 -427985 -440139 -356742 -569758 -292245 -504831 -576650
1995 -576650 -405277 -639585 -543919 -532031 -576776 -546595 -601003 -399907 -562187 -532806 -458042
1984 -458042 -542121 -399659 -512171 -481039 -466332 -600736 -574194 -494277 -483792 -563557 -546944
1973 -546944 -373238 -641577 -655475 -509723 -522489 -417995 -363561 -461619 -489339 -587010 -548003
1962 -548003 -498676 -418381 -557543 -518236 -567529 -603579 -340542 -415391 -555801 -581949 -630909
1951 -630909 -571311 -522160 -694183 -557114 -387652 -449931 -324806 -329584 -714600 -560338 -385731
$$ packed form
2028d04157p2592J55103j09587m3225j33537j16670L0390O8857J76895j0489j141
2017d60153j99196L6364J32765J6201Q1790J64931j88015m4201l069j40414K50975
2006c52022j15594j57868J11258P77Q5464j2154Q3397k13016K77513k12586p1819
1995e76650J71373k34308R5666J1888m4745L0181n4408K01096j62280K9381P4764
1984d58042q4079J42462j12512L1132J4707j34404K6542P9917J0485p9765J6613
1973e46944J73706k68339j3898J45752j2766J04494N4434r8058k7720r7671L9007
1962e48003M9327Q0295j39162L9307m9293l6050K63037p4849j40410k6148m8960
1951f30909N9598M9151j72023J37069J69462o2279J25125m778l85016J54262J74607
$$ plain form
1940 -385731 -416920 -656167 -648760 -404963 -564650 -664498 -499647 -285835 -643623 -511808
1930 -511808 -405389 -473859 -509450 -399554 -386223 -487829 -564135 -499099 -400601 -462943 -561823
1919 -561823 -447083 -551703 -526283 -401001 -340073 -368726 -354030 -380007 -303690 -388694 -413256
1908 -413256 -253411 -357602 -552319 -449264 -486299 -559866 -531088 -601319 -411432 -317780 -612311
1897 -612311 -511265 -344992 -550350 -388157 -251447 -540624 -487835 -349784 -573410 -579828
1887 -579828 -599677 -528396 -368470 -390847 -435603 -321306 -688024 -348107 -167060 -383042
$$ packed form
1940c85731l1189k39247P407K43797j59687r9848J64851K13812l57788J31815
1930e11808J06419o8470l5591J09896J3331j01606p6306O5036R8498o2342r8880
1919e61823J14740j04620K5420J25282O0928k8653J4696k5977P6317q5004k4562
1908d13256J59845j04191j94717J03055l7035p3567K8778p0231J89887R3652k94531
1897f12311J01046J66273k05358J62193J36710k89177N2789J38051k23626o418
1887e79828j9849P1281J59926k2377m4756J14297l66718L39917J81047k15982
$$ [...]
##END NTUPLES=NMR SPECTRUM
##END=
