##TITLE=abcd
##JCAMPDX= 6.0         $$ Bruker NMR JCAMP-DX V2.0
##DATA TYPE= NMR SPECTRUM
##DATA CLASS= NTUPLES
##ORIGIN= UXNMR, Bruker Analytische Messtechnik GmbH
##OWNER= root
$$ XWIN-NMR		Version 3.5
$$ Sat Mar 14 09:07:51 2026 Russian Standard Time (UT+4h)  servis@DPX200
##.OBSERVE FREQUENCY= 200.131235884673
##.OBSERVE NUCLEUS= ^1H
##.ACQUISITION MODE= SIMULTANEOUS
##.ACQUISITION SCHEME= undefined
##.AVERAGES= 32
##.DIGITISER RES= 18
##SPECTROMETER/DATA SYSTEM= spect
##.PULSE SEQUENCE= zg
##.SOLVENT NAME= CDCl3
##.SHIFT REFERENCE= (INTERNAL, CDCl3, 0, 16.4885)
##AUDIT TRAIL= $$ (NUMBER, WHEN, WHO, WHERE, WHAT)
$$ ##TITLE= Audit trail, XWIN-NMR		Version 3.5
$$ ##JCAMPDX= 5.01
$$ ##ORIGIN= Bruker BioSpin GmbH
$$ ##OWNER= servis
$$ F:\spectra/data/av/nmr/H1/1/pdata/1/auditp.txt
$$ ##AUDIT TRAIL=  $$ (NUMBER, WHEN, WHO, WHERE, WHAT)
(   1,<2026-03-14 09:07:04.59 +0400>,<servis>,<DPX200>,
      <created by zg, POWCHK disabled, PULCHK disabled
       configuration hash MD5:
       00 E9 B6 7A A2 85 ED C7 34 08 36 98 17 FE 4E 26
       data hash MD5: 32K
       60 3B 50 38 CF 53 FD D7 95 AC 18 47 0A F4 7D AA>)
(   2,<2026-03-14 09:07:08.20 +0400>,<servis>,<DPX200>,
      <Start of raw data processing
       efp BC_mod = 2 LB = 0.05 FT_mod = 6 PKNL = 1 PHC0 = -254.5951 PHC1 = -0.898437 SI = 16K 
       data hash MD5: 16K
       5A 89 49 22 94 83 E0 29 EE 1A CF D3 36 5B 75 2C>)
$$ ##END=
$$ 
$$ hash MD5
$$ D7 1A F0 91 31 97 63 AD 56 64 0E 57 CC FC 92 1A
##$RELAX= 
##$RELAX= 
##$RELAX= 
##$RELAX= 
##$RELAX= 
##$RELAX= 
##$RELAX= 
##$RELAX= 
$$ Bruker specific parameters
$$ --------------------------
##$DU= <F:\spectra>
##$EXPNO= 1
##$NAME= <H1>
##$PROCNO= 1
##$TYPE= <nmr>
##$USER= <av>
##$AMP= (0..31)
100 100 100 100 100 100 100 100 100 100 100 100 100 100 100 100 100 100 
100 100 100 100 100 100 100 100 100 100 100 100 100 100 
##$AQSEQ= 0
##$AQ_mod= 1
##$AUNM= <au_zg>
##$AUTOPOS= <>
##$BF1= 200.13
##$BF2= 200.13
##$BF3= 200.13
##$BF4= 200.13
##$BF5= 500.13
##$BF6= 500.13
##$BF7= 500.13
##$BF8= 500.13
##$BYTORDA= 1
##$CFDGTYP= 0
##$CFRGTYP= 5
##$CHEMSTR= <none>
##$CNST= (0..31)
1 1 145 1 1 1 1 1 1 1 1 1 1 1 1 1 1 1 1 1 1 1 1 1 1 1 1 1 1 1 1 1 
##$CPDPRG= <>
##$CPDPRG1= <>
##$CPDPRG2= <>
##$CPDPRG3= <>
##$CPDPRG4= <mlev>
##$CPDPRG5= <mlev>
##$CPDPRG6= <mlev>
##$CPDPRG7= <mlev>
##$CPDPRG8= <mlev>
##$CPDPRGB= <>
##$CPDPRGT= <>
##$D= (0..31)
0 2 0 0 0 0 0 0 0 0.06 0 0 0 0 0 0 0.0002 0 0 0 0 0 0 0 0 0 0 0 0 0 0 
0 
##$DATE= 1773464824
##$DBL= (0..7)
120 120 120 120 120 120 120 120 
##$DBP= (0..7)
150 150 150 150 150 150 150 150 
##$DBP07= 0
##$DBPNAM0= <>
##$DBPNAM1= <>
##$DBPNAM2= <>
##$DBPNAM3= <>
##$DBPNAM4= <>
##$DBPNAM5= <>
##$DBPNAM6= <>
##$DBPNAM7= <>
##$DBPOAL= (0..7)
0.5 0.5 0.5 0.5 0.5 0.5 0.5 0.5 
##$DBPOFFS= (0..7)
0 0 0 0 0 0 0 0 
##$DE= 6
##$DECBNUC= <off>
##$DECIM= 32
##$DECNUC= <off>
##$DECSTAT= 4
##$DIGMOD= 1
##$DIGTYP= 9
##$DL= (0..7)
0 120 120 120 120 120 120 120 
##$DP= (0..7)
150 150 150 150 150 150 150 150 
##$DP07= 0
$$ [...]
##$SUBNAM4= <"">
##$SUBNAM5= <"">
##$SUBNAM6= <"">
##$SUBNAM7= <"">
##$SUBNAM8= <"">
##$SUBNAM9= <"">
##$SW= 20.6817932712277
##$SWIBOX= (0..15)
0 0 3 0 0 0 0 0 0 0 0 0 0 0 0 0 
##$SW_h= 4139.07284768212
##$TD= 32768
##$TD0= 1
##$TE= 0
##$TE2= 300
##$TE3= 300
##$TEG= 300
##$TL= (0..7)
0 120 120 120 120 120 120 120 
##$TP= (0..7)
150 150 150 150 150 150 150 150 
##$TP07= 0
##$TPNAME0= <>
##$TPNAME1= <>
##$TPNAME2= <>
##$TPNAME3= <>
##$TPNAME4= <>
##$TPNAME5= <>
##$TPNAME6= <>
##$TPNAME7= <>
##$TPOAL= (0..7)
0.5 0.5 0.5 0.5 0.5 0.5 0.5 0.5 
##$TPOFFS= (0..7)
0 0 0 0 0 0 0 0 
##$TUNHIN= 0
##$TUNHOUT= 0
##$TUNXOUT= 0
##$USERA1= <user>
##$USERA2= <user>
##$USERA3= <user>
##$USERA4= <user>
##$USERA5= <user>
##$V9= 5
##$VALIST= <valist>
##$VCLIST= <CCCCCCCCCCCCCCC>
##$VD= 0
##$VDLIST= <DDDDDDDDDDDDDDD>
##$VPLIST= <PPPPPPPPPPPPPPP>
##$VTLIST= <TTTTTTTTTTTTTTT>
##$WBST= 1024
##$WBSW= 30
##$XGAIN= (0..3)
0 0 0 0 
##$XL= 0
##$YL= 0
##$YMAX_a= 2856384
##$YMIN_a= -2251924
##$ZGOPTNS= <>
##$ZL1= 120
##$ZL2= 120
##$ZL3= 120
##$ZL4= 120
##$ABSF1= 0
##$ABSF2= 0
##$ABSG= 0
##$ABSL= 0
##$ALPHA= 0
##$AQORDER= 0
##$ASSFAC= 0
##$ASSFACI= 0
##$ASSFACX= 0
##$ASSWID= 0
##$AUNMP= <proc_1d>
##$AZFE= 0.1
##$AZFW= 0.1
##$BCFW= 0
##$BC_mod= 2
##$BYTORDP= 0
##$COROFFS= 0
##$CY= 18.4799938201904
##$DATMOD= 1
##$DC= 0
##$DFILT= <>
##$DTYPP= 0
##$F1P= 9.9274215381318
##$F2P= -0.165520771350173
##$FCOR= 1
##$FTSIZE= 16384
##$FT_mod= 6
##$GAMMA= 0
##$GB= 0
##$INTBC= 1
##$INTSCL= 4.127829e-11
##$ISEN= 128
##$LB= 0.05
##$LEV0= 0
##$LPBIN= 0
##$MAXI= 10000
##$MC2= 0
##$MEAN= 0
##$ME_mod= 0
##$MI= 50
##$NCOEF= 0
##$NC_proc= -4
##$NLEV= 6
##$NOISF1= 3.799351
##$NOISF2= 2.8
##$NSP= 0
##$NTH_PI= 0
##$NZP= 0
##$OFFSET= 16.48848
##$PC= 4
##$PHC0= -254.5951
##$PHC1= -0.898437
##$PH_mod= 1
##$PKNL= yes
##$PPARMOD= 0
##$PSCAL= 4
##$PSIGN= 0
##$REVERSE= no
##$SF= 200.130005582386
##$SI= 16384
##$SIGF1= 3
##$SIGF2= 2
##$SINO= 400
##$SIOLD= 16384
##$SREGLST= <1H.CDCl3>
##$SSB= 0
##$STSI= 16384
##$STSR= 0
##$SW_p= 4139.07284768211
##$SYMM= 0
##$S_DEV= 0
##$TDeff= 32768
##$TDoff= 0
##$TI= <>
##$TILT= no
##$TM1= 0
##$TM2= 0
##$TOPLEV= 0
##$USERP1= <user>
##$USERP2= <user>
##$USERP3= <user>
##$USERP4= <user>
##$USERP5= <user>
##$WDW= 1
##$XDIM= 16384
##$YMAX_p= 407478943
##$YMIN_p= -1400364
$$ End of Bruker specific parameters
$$ ---------------------------------
##NTUPLES= NMR SPECTRUM
##VAR_NAME=  FREQUENCY,     SPECTRUM/REAL,   SPECTRUM/IMAG
##SYMBOL=    X,             R,               I
##VAR_TYPE=  INDEPENDENT,   DEPENDENT,       DEPENDENT
##VAR_FORM=  AFFN,          ASDF,            ASDF
##VAR_DIM=   16384,         16384,           16384
##UNITS=     HZ,            ARBITRARY UNITS, ARBITRARY UNITS
##FACTOR=    0.252644378177508, 1,           1
##FIRST=     3299.83951724647, 0,            0
##LAST=      -839.233330435636, 0,           0
##MIN=       -839.233330435636, -1400364,    0
##MAX=       3299.83951724647, 407478943,    0
$$ Real data points
##PAGE= N=1
##DATA TABLE= (X++(R..R)), XYDATA
$$ [...]
6750E564164K8661J5571N082n2458k7605N5412J5760P6922K62040K73732K31857
6739F449138L03396L39461M90614N02093O08300Q13837J035981J196347J451130
6730A3190297K106798L140009M769287O735484P956515P041734L643480j060074
6722D7523530m856449o092527n293479l627809j888212j95155J775822M022431
6714C1368152N872173O371590M307438L5907m424435p008720p063029n780045
6706B3679031m306101l210615k364404j880387j522844j186703r46961o94325
6698G566691n84428l94898l72693l19656k75514k92355k35294j42515k81828l9516
6688D627994r9298n5397j27014n308j50325j51871j04078q3153o8617j09625p1106
$$ y = [5564164, 5592825, 5608396, 5613478, 5561020, 5533415, 5588827, 5604587, 5681509, 5943549, 6217281, 6449138, 6752534, 7091995, 7582609, 8084702, 8693002, 9506839, 10542820, 11739167, 13190297, 15297095, 18437104, 23206391, 29941875, 37898390, 44940124, 48583604, 47523530, 42667081, 36574554, 31281075, 27653266, 25765054, 25569899, 27345721, 31368152, 37240325, 43611915, 47919353, 47955260, 43530825, 36522105, 29459076, 23679031, 19372930, 16162315, 13797911, 11917524, 10394680, 9207977, 8261016, 7566691, 6982263, 6587365, 6214672, 5895016, 5619502, 5327147, 5091853, 4949338, 4667510, 4627994, 4528696, 4473299, 4346285, 4340977, 4190652, 4038781, 3934703, 3851550, 3782933, 3673308, 3602202]
6677C602202o6667R876n8537m9820L1426j0850n227J0089j691P431m6353j434
6665C420445m2655K9099L4761j4362N4671N2881j103k3269J09815J7898j1814
6654C626367m168P5241K0828k2156N0471l5723N8187R310Q6262P2675K3238O0604
6642D021136k5120N7206o3124N5316j030k4892R8929l4733N0113K8382K8845O2044
6630D253072R3144O4761M87O2478N1365R6540M6822J58117R2340J82291R9932
6619E201349J53516J42764J42951K02071J25034K31566L64516K62342K84173J80044
6609G290326J30627J43069J19772J18687J96380J81456K59600L41107M71999M51310
6599I704333M81277N60709N95262P94470Q10130J053730J355627J543411J737695
$$ y = [3602202, 3535535, 3545411, 3486874, 3437054, 3468480, 3457630, 3452403, 3462492, 3460801, 3468232, 3421879, 3420445, 3377790, 3406889, 3441650, 3427288, 3481959, 3534840, 3533737, 3510468, 3620283, 3638181, 3626367, 3622199, 3697440, 3718268, 3696112, 3746583, 3710860, 3769047, 3778357, 3864619, 3937294, 3960532, 4021136, 3996016, 4053222, 3990098, 4045414, 4044384, 4019492, 4118421, 4083688, 4133801, 4162183, 4191028, 4253072, 4346216, 4410977, 4411464, 4473942, 4525307, 4621847, 4668669, 4826786, 4919126, 5101417, 5201349, 5354865, 5497629, 5640580, 5842651, 5967685, 6199251, 6563767, 6826109, 7110282, 7290326, 7420953, 7564022, 7683794, 7802481, 7998861, 8180317, 8439917, 8781024, 9253023, 9704333, 10185610, 10746319, 11341581, 12136051, 12946181, 13999911, 15355538, 16898949, 18636644]
6590A8636644K034983K636733L904410N774329P425171P423178M908856K35800
6582E2980104m311744o428608o103944m696564l237015k188410j243110o14595
6574B4156114k11868K43055O95012J240202J999990L420531N317237P477188Q380021
6565E2717482O829088K445455k534336n722238n937696m485643k461172p24825
6557D0126115P19116K085691L238069L744376L648800L107807K825803L417364
6549F2913141M577515N418869N022767L108869M57325j864983l396408l984542
6541G2252553l851747l063392j926676p62969O24865J891402L217806M094438
6533G2476280M184770L251988J879324R78447J486744L554342O577845R425263
$$ y = [18636644, 20671627, 23308360, 27212770, 32987099, 40412270, 47835448, 52744304, 52980104, 48668360, 42239752, 36135808, 31439244, 28202229, 26013819, 24770709, 24156114, 23944246, 24187301, 24882313, 26122515, 28122505, 31543036, 36860273, 44337461, 52717482, 59546570, 61992025, 59457689, 53735451, 47797755, 43312112, 40850940, 40126115, 40845231, 42930922, 46168991, 49913367, 53562167, 56669974, 59495777, 62913141, 67490656, 72909525, 77932292, 81041161, 81498486, 79633503, 76237095, 72252553, 68400806, 65337414, 63410738, 62647769, 63272634, 65164036, 68381842, 72476280, 76661050, 79913038, 81792362, 82770809, 84257553, 87811895, 94389740, 103815003]
6525A03815003J0782557R066496M030149k739756r104194j2802680j3502639j1845409
6517G7699527r578814p484019n979485m566888l231173k028097j006246m91260
6509D3333545m39035o92904q24637j62680J015959K088160J838260J17182k683157
6500D3590693m627021n148594m354122l359766k545709j903423j579548j345410
6492A8727100j108082j024469p76588p33961o48908m91215m83962l97787l33304
6483A2728824l34299k20331k50384j80905j60085j20049r6084l0799K5532L7674
6473A1399094N4122J92533J62012K68440M37604N87929Q34761P36325M43151n469
6463A5110502k53457l13681r5386R1427L38768L08998J52838J26896L154J77888
$$ y = [103815003, 114597560, 123664056, 127694205, 124954449, 115850255, 103047575, 89544936, 77699527, 68120713, 60636694, 54657209, 50090321, 46859148, 44831051, 43824805, 43333545, 42894510, 42201606, 41376969, 41214289, 42230248, 44318408, 46156668, 46273850, 43590693, 38963672, 33815078, 29460956, 26101190, 23555481, 21652058, 20072510, 18727100, 17619018, 16594549, 15817961, 15084000, 14435092, 13943877, 13459915, 13062128, 12728824, 12394525, 12174194, 11923810, 11742905, 11582820, 11462771, 11366687, 11335888, 11361420, 11399094, 11453216, 11645749, 11807761, 12076201, 12513805, 13101734, 13936495, 14672820, 15115971, 15110502, 14857045, 14543364, 14447978, 14539405, 14878173, 15187171, 15340009, 15466905, 15470059, 15647947]
6453A5647947K94893J14173J84066k5017j26429k624K55067N08734P37830O99987
6443A8288627Q50313O62652N18109M10055K75039K05193r504q6681k34061r9266
6433B0780476R281K44743N18507O62186P35245O35034L31001J77991K24041L58363
6423B4676868O67461P56853O55865K78026O1905j23402k0993R924J65049J23466
6413B7251022J20111J48322J08013M59163O21364N71937K75142j26470n68822
6404B8859782q41137q94655q54718o12968m70479k66322k01874r1566k17J14504
6394B4740350L18141N21196M07331J59594l96215q93177j090484j087456j047432
6385B1631848j002972r51472r55135r17201p15624n57911l69403j57764q0116
$$ y = [15647947, 15942840, 16057013, 16241079, 16216062, 16089633, 16087009, 16342076, 16850810, 17588640, 18288627, 19138940, 19801592, 20319701, 20729756, 21004795, 21209988, 21200484, 21113803, 20879742, 20780476, 20789757, 21034500, 21553007, 22215193, 22950438, 23585472, 23916473, 24094464, 24318505, 24676868, 25344329, 26101182, 26757047, 27035073, 27096978, 26973576, 26952583, 26962507, 27127556, 27251022, 27371133, 27519455, 27627468, 28086631, 28707995, 29279932, 29555074, 29428604, 28859782, 28018645, 27123990, 26269272, 25656304, 25185825, 24919503, 24717629, 24626063, 24625846, 24740350, 25058491, 25579687, 25987018, 26146612, 25750397, 24857220, 23766736, 22679280, 21631848, 20628876, 19677404, 18722269, 17805068, 17089444, 16531533, 16162130, 16004366, 15924250]
6376A5924250j64042k24372k42393m50144m89152m27695m64528m96192o24293
6367A2341439p55916p08945o80722o87649n84343n43198m79967m10083l00868
6358G189748k59305j83714j82728r4017j48920k06155l43224m13815l81163l01965
6348D674742k17266k92699j69094j46812j91679j26945j51354j93780k18521j47858
6338B818734j44206j90902q8112p2102o8941j20697k1918l5763j01567m9600l2011
6327A892915o1594p804o1417l2450o3608k9471m8797k8189K369q7037J3025j3946
6315A473996r4925O9330m7068K3838k5866J1099l9816m5644j4690r0235r634l5908
6303A174477J5209n2451M787k7160j8891k7201q586N5350n4870K7060J4897Q678
$$ y = [15924250, 15760208, 15535836, 15293443, 14843299, 14354147, 13926452, 13461924, 12965732, 12341439, 11585523, 10876578, 10195856, 9508207, 8923864, 8380666, 7900699, 7490616, 7189748, 6930443, 6746729, 6564001, 6469984, 6321064, 6114909, 5771685, 5357870, 4976707, 4674742, 4457476, 4164777, 3995683, 3848871, 3657192, 3530247, 3378893, 3185113, 2966592, 2818734, 2674528, 2483626, 2395514, 2323412, 2254471, 2133774, 2111856, 2076093, 1974526, 1924926, 1892915, 1831321, 1823517, 1762100, 1729650, 1666042, 1636571, 1587774, 1559585, 1561954, 1474917, 1487942, 1473996, 1379071, 1448401, 1401333, 1425171, 1399305, 1410404, 1370588, 1324944, 1310254, 1220019, 1210385, 1174477, 1189686, 1137235, 1142022, 1114862, 1095971, 1068770, 1060184, 1115534, 1060664, 1087724, 1102621, 1111299]
6291A111299l1554L0889o0228l918l8003k2768l0230M2816p290k1141Q3762J7499
6279A071133j8058m02J0823N4927n53K3592J1086O903L2761l7625j2162J5719
6267A158144p2285M1228k6707r837N735m2524J8706J0347m6949j7011M0631j4756
6255A044722n7272L1823K632p10O0748O6703J8958m2093N7042p5757k2806m1687
6243A042303q0716k1045m3610k3204j5171j6341j0249j0226N8247Q481J3695J7828
6231I19992l5656O1628k3987l8321K182l4420j6265n5165L3933q914L0403Q282
6219H43692j0096o0300j4975n6913N2033m9652K417m5758K7929r79j6684M1487
6207G12201k6656J0031n828K1348J2408R787j6489o7550M6839j2325k1358L8251
$$ y = [1111299, 1079745, 1110634, 1050406, 1046488, 1008485, 985717, 955487, 998303, 991013, 969872, 1053634, 1071133, 1053075, 1052673, 1063496, 1118423, 1117870, 1141462, 1152548, 1159451, 1192212, 1154587, 1142425, 1158144, 1085859, 1127087, 1100380, 1090543, 1096278, 1053754, 1072460, 1082807, 1035858, 1018847, 1059478, 1044722, 987450, 1019273, 1021905, 1021195, 1081943, 1148646, 1167604, 1125511, 1182553, 1106796, 1083990, 1042303, 961587, 940542, 896932, 873728, 858557, 842216, 831967, 821741, 879988, 888469, 902164, 919992, 884336, 945964, 921977, 883656, 885838, 851418, 835153, 779988, 813921, 805007, 835410, 843692, 833596, 773296, 758321, 701408, 753441, 703789, 706206, 660448, 688377, 687398, 670714, 712201, 685545, 695576, 689748, 711096, 723504, 733291, 716802, 649252, 696091, 683766, 662408, 700659]
6195G00659O960J7966p6011J10586o460o338k1544O3746j0952N588m716m2226
6183G37258P960q0982J5752m7404J4756R01K1571L4730P493P756M0388Q9514L3927
6170H83620M2744R5567R3696k46j4680J7379L4421P49j25428p8892n2915n6373
6158H39642l6994o1489k729m6385M9471j1784R822M4479Q5637K4412O6550K729
6146I63361O9388j3648K6896m0467J6316o9508r534m1979J6162k9244n0982k0283
6134H16478l2471j4374q9766l684l1699l8237Q1419k4935n776P5279Q429N7022
6122G97685o6213m1855q562n5051r596k6977l8105K614O692m4157K3250k4260
6110E15465K2371L6601N812N8255p3734l3217K544k408M264m4608j9999K272m6491
$$ y = [700659, 707619, 725585, 649574, 760160, 753700, 747362, 725818, 789564, 778612, 784200, 779484, 737258, 745218, 664236, 679988, 632584, 647340, 648241, 669812, 704542, 712035, 719791, 760179, 849693, 883620, 926364, 1021931, 1115627, 1115381, 1100701, 1118080, 1152501, 1153250, 1027822, 948930, 896015, 839642, 802648, 741159, 738430, 692045, 741516, 729732, 739554, 784033, 869670, 894082, 960632, 963361, 1032749, 1019101, 1045997, 1005530, 1021846, 952338, 942804, 900825, 916987, 887743, 836761, 816478, 784007, 769633, 679867, 676183, 644484, 606247, 687666, 662731, 656955, 732234, 740663, 797685, 731472, 689617, 681055, 626004, 616408, 589431, 551326, 553940, 560632, 516475, 539725, 515465, 537836, 574437, 580249, 638504, 564770, 531553, 534097, 531689, 535953, 491345, 471346, 473618, 427127]
6097D27127J6051l4667K4219Q107N8301M566K555m898K7594k2272J9268k7721
6085D98230O437l3439m6604O8094l0664j7976j8417J4922K6016l35o4223r471
6073C92570j09k0540k5847l9672Q3609n8044K1597J7771K718O2542l9122N2285
6061D49758L11P591p5076K0216k9696M6153j6667p125M1628j0182j8980j3976
6049C93955M0644K2264O615L446N2932N5458m8040k7598P023Q29K0687j0599j184
6036E16432L3504K2137J5683j02140K0149K5520r4049Q6879K4673l1200R626k2067
6024E05147N2110j4336m855N204k5390j2702O636k9248R9593p3810N09K9216J8292
6011E56366o898M679m128L6143j8897Q290M7056M1033J6291j5026J7163L9015
$$ y = [427127, 443178, 408511, 432730, 440837, 499138, 503704, 506259, 501361, 528955, 506683, 525951, 498230, 504667, 471228, 424624, 492718, 462054, 444078, 425661, 440583, 466599, 466264, 402041, 392570, 392461, 371921, 346074, 306402, 390011, 331967, 353564, 371335, 374053, 436595, 397473, 449758, 450069, 457660, 382584, 402800, 373104, 419257, 402590, 395465, 437093, 426911, 407931, 393955, 434599, 456863, 463478, 466924, 519856, 575314, 527274, 499676, 506699, 507528, 528215, 517616, 516432, 549936, 572073, 587756, 485616, 505765, 531285, 437236, 524115, 548788, 517588, 527214, 505147, 557257, 542921, 538066, 543270, 517880, 505178, 511814, 482566, 582159, 508349, 508858, 538074, 556366, 549468, 554147, 550019, 586162, 567265, 575555, 622611, 663644, 679935, 664909, 682072, 721087]
5999G21087l1825K4398R324j5545m6386P2613P983m447k490R9904J2842j9656
5987H27802J705L2391M2303J8429j3817P6775O7634l2106Q4747k5206n6164P1772
5975A096265l1756J5577j0266k1272J11353q758K2927k4184L4549R93O3138q059
5963A240507N9616L9106k7380J2302R011m886M2602q982l5154J8337J8313k6306
5951A337086N0224k1512l8801J16959P54J3617J02061l9279L3953M428l1334K7463
5939A555619K4714K0215M2768k2544M6822M7703L7806j7363Q904k9354J2909j4694
5927A713505J8022P4795o197Q9949l2376Q8598O8012L0104K3769N8924k3684J4906
5915B118327L0665P1311N6907N4072L289J16757O6786J36728K8960J17903R986
$$ y = [721087, 689262, 713660, 722984, 707439, 661053, 733666, 741649, 737202, 734712, 834616, 847458, 827802, 829507, 861898, 904201, 922630, 908813, 985588, 1053222, 1021116, 1105863, 1080657, 1024493, 1096265, 1064509, 1080086, 1069820, 1048548, 1159901, 1151143, 1174070, 1149886, 1184435, 1185428, 1248566, 1240507, 1300123, 1339229, 1311849, 1324151, 1333162, 1328276, 1370878, 1361896, 1326742, 1345079, 1363392, 1337086, 1387310, 1365798, 1326997, 1443956, 1444710, 1458327, 1560388, 1521109, 1555062, 1559490, 1528156, 1555619, 1580333, 1600548, 1643316, 1620772, 1667594, 1715297, 1753103, 1735740, 1744644, 1715290, 1728199, 1713505, 1731527, 1806322, 1800125, 1890074, 1857698, 1946296, 2014308, 2044412, 2068181, 2127105, 2103421, 2118327, 2148992, 2220303, 2277210, 2331282, 2334571, 2451328, 2518114, 2654842, 2683802, 2801705, 2811691]
5904B811691J22836J47041J19479Q8486J75537Q1235J65938K07287J97083K30957
5894D347570K92556K95880M44126N25617Q54625J123318J553441J795198J484127
5885A2716458O18447l78751p29343n38589j81267M14029J009018J775135K639165
5876A7344302K853968K777295J764306R88230N28233Q5638P0075m8013k3476K43962
5866B6584520N97816N23983M40938R41458R47034J017186J357641J685035J382021
5857C5477632P78880l17930j317327j821328j278083q70975n94302n25238q69540
5848B8661789r32930o28628p91895o85785k11329J94190L21380J87296p089j165475
5838B4941524k159496k879299k962093k511156j649376j059915m74104K31176
$$ y = [2811691, 2934527, 3081568, 3201047, 3289533, 3465070, 3546305, 3712243, 3919530, 4116613, 4347570, 4640126, 4936006, 5380132, 5905749, 6760374, 7883692, 9437133, 11232331, 12716458, 13334905, 12956154, 12226811, 11688222, 11506955, 11920984, 12930002, 14705137, 17344302, 20198270, 22975565, 24739871, 25728101, 26256334, 26341972, 26412047, 26364034, 26340558, 26584520, 27182336, 27706319, 28147257, 29088715, 30035749, 31052935, 32410576, 34095611, 35477632, 36256512, 35938582, 34621255, 32799927, 31521844, 30650869, 30056567, 29531329, 28661789, 27728859, 27100231, 26308336, 25622551, 25411222, 25605412, 25926792, 26114088, 26106999, 24941524, 22782028, 19902729, 16940636, 14429480, 12780104, 11720189, 11246085, 11477261]
5830A1477261P56285P86403L94282o51317j555326j659503j371306j051218p35455
5821F390106o46349m54063l38717k83869j86606j98311j85006j08471j20036p1794
5811C796884j31166j17168m7734j05865m3436j07091r2907l5816m9238m3247k8782
5800B994434m9841N3750m5262n526M2362l1254L853J5026j5536k5056J1108L5618
5788B983676m0929J4156m8565l2692M5854l9870K3864o6892P7958K8472J4707
5777B959739J3147j17002k2087j22775j4116K2341L623J3696L4480J9786k6836
5766B763996N8029N1297M1633J9341M7217J0386L5142J2897L1711K38P0744O3943
5754C206574Q6201R1712J19797K05552J16561J03683j2594p1789n8533j1274j33638
$$ y = [11477261, 12233546, 13019949, 13414231, 12762914, 11207588, 9548085, 8176779, 7125561, 6390106, 5743757, 5289694, 4950977, 4667108, 4480502, 4282191, 4097185, 3988714, 3868678, 3796884, 3665718, 3548550, 3500816, 3394951, 3351515, 3244424, 3151517, 3115701, 3066463, 3023216, 2994434, 2944593, 2998343, 2953081, 2947555, 2989917, 2958663, 2962516, 2977542, 2962006, 2936950, 2948058, 2983676, 2942747, 2956903, 2908338, 2875646, 2921500, 2881630, 2905494, 2838602, 2916560, 2945032, 2959739, 2972886, 2855884, 2833797, 2711022, 2696906, 2719247, 2722870, 2736566, 2771046, 2790832, 2763996, 2822025, 2873322, 2914955, 2934296, 2981513, 2991899, 3027041, 3039938, 3071649, 3071887, 3142631, 3206574, 3292775, 3384487, 3504284, 3709836, 3826397, 3930080, 3917486, 3845697, 3787164, 3775890, 3642252]
5743C642252O1140J3914P5307P6702R9061J05352J68423N7748O9059l3934m188
5732D330836l4519K7113r5112J0648r605n6691N3657k6388j2334L2593J35858
5721D356056L6313J12517O6889J64346J60282J30312J02725L1217O0466R1589
5711E312712Q5903J00789J50286J33460J73315J92442N6960j6819r0616o6798
5701F031634j52283n8159m7676K5721q2286m5040j5460M8756L7603O7430J04447
5690E914687M9378q5079m7787j2732M0006j7745K4979K1055J2604k1522l1831
5679E846013r8195p1491o0788p2018m6177J6293J768P2188L3707P5762J30073
5668E827135J87127Q5296J35993K16196J91543J15185K14850K08745J39490J73203
$$ y = [3642252, 3703392, 3717306, 3792613, 3869315, 3968376, 4073728, 4242151, 4299899, 4368958, 4335024, 4330836, 4296317, 4323430, 4228318, 4238966, 4229361, 4172670, 4226327, 4199939, 4187605, 4220198, 4356056, 4392369, 4504886, 4571775, 4736121, 4896403, 5026715, 5129440, 5160657, 5221123, 5312712, 5398615, 5499404, 5649690, 5783150, 5956465, 6148907, 6205867, 6189048, 6098432, 6031634, 5879351, 5821192, 5773516, 5799237, 5716951, 5671911, 5656451, 5705207, 5742810, 5810240, 5914687, 5964065, 5878986, 5831199, 5818467, 5858473, 5840728, 5865707, 5886762, 5899366, 5877844, 5846013, 5747818, 5676327, 5615539, 5543521, 5497344, 5513637, 5515405, 5587593, 5621300, 5697062, 5827135, 6014262, 6099558, 6235551, 6451747, 6643290, 6758475, 6973325, 7182070, 7321560, 7494763]
5658G494763K05835K69754K88109L47628M74185O56285Q35239J132356J461743
5649A3165897J609859J563624R72014M8790p46302j213690j090813q57010o11338
5640A2841031l92843p7582J17773L28688M67514R17001J193260J640107J633655
5631A8668604J169101M32471m85903r82356j142609p85834m89875j57333L8741
5622A6265007J58073L2108p9336k17766l75085k52202k61781K7005M8452K22841
5612A5567316M28424N21637P06387R28781R89292J168688J215031J288294J215274
5603B4029124J389950J583884J848138J748396J020571r6711j307863j806907
5595B8408582j892368j442763j057186o63370k80871K7552M86549P70246J272099
$$ y = [7494763, 7700598, 7970352, 8258461, 8606089, 9080274, 9736559, 10571798, 11704154, 13165897, 14775756, 16339380, 17311394, 17360184, 16613882, 15400192, 14309379, 13452369, 12841031, 12448188, 12370606, 12488379, 12817067, 13284581, 14201582, 15394842, 17034949, 18668604, 19837705, 20270176, 19784273, 18801917, 17659308, 16873474, 16383599, 16226266, 16265007, 16423080, 16455188, 16375852, 16158086, 15783001, 15530799, 15269018, 15296023, 15344475, 15567316, 15995740, 16517377, 17223764, 18152545, 19141837, 20310525, 21525556, 22813850, 24029124, 25419074, 27002958, 28851096, 30599492, 31620063, 31523352, 30215489, 28408582, 26516214, 25073451, 24016265, 23352895, 23072024, 23099576, 23586125, 24356371, 25628470]
5586B5628470J633431K065189J950648J280447K26198p36439j459467j389930
5578B9198547r80181p10181j36544K51669O14912P52654O53530N43241M74892
5569C0662539N14112P39654R55874J147645J406572J573527J794101J748535J735772
5560D2278331J683441J519392J233141Q07271M96402K83406J83536M19236P53080
5551D9657236J120524J556242J922435K359037K776954L185053L662376M043054
5543G0282911M409999M863366N765621P353113R080567R220045O142719N41799
5535A17660140n297781p131081o143414m511799l012808j924077q36511J28982
5527H8931651J481521L006045N178415P873410J0633138J1523750J0818918Q304117
$$ y = [25628470, 27261901, 29327090, 31277738, 32558185, 32784383, 32047944, 30588477, 29198547, 28218366, 27508185, 27371641, 27623310, 28238222, 28990876, 29644406, 30187647, 30662539, 31176651, 31916305, 32872179, 34019824, 35426396, 36999923, 38794024, 40542559, 42278331, 43961772, 45481164, 46714305, 47521576, 48017978, 48301384, 48484920, 48904156, 49657236, 50777760, 52334002, 54256437, 56615474, 59392428, 62577481, 66239857, 70282911, 74692910, 79556276, 85321897, 92675010, 101755577, 110975622, 117118341, 117660140, 112362359, 105231278, 99087864, 94576065, 91563257, 89639180, 88802669, 88931651, 90413172, 93419217, 98597632, 106471042, 117104180, 128627930, 139446848, 147750965]
5519A47750965N200285J821525l277714q487193r358771p293672m516735k245580
5511A19593110m82118K72509M43208O09627J101386K659939N294796P566680O928611
5502A43987748K949861l781290q339799q362638o179310l725045j509282L64453
5494A15404698J749362K804604L553943M142297M867866N693125O718017P580950
5486A52514862P824055P167648N664531L663775J613709k43815j844134l226113
5478A73134518m349713m863052m698008m134587k869428r40995J401983L440400
5470A56121118M571988M436699L634778K857384K908343L819423N193829O582759
5462A90126321P564405P741614P115462N549583L520872J378528m83010j793554
$$ y = [147750965, 152951250, 154772775, 151495061, 143007868, 133649097, 126355425, 121838690, 119593110, 119110992, 119383501, 119826709, 120436336, 121537722, 124197661, 129492457, 137059137, 143987748, 146937609, 143156319, 134816520, 126453882, 120274572, 116549527, 115040245, 115404698, 117154060, 119958664, 123512607, 127654904, 132522770, 138215895, 144933912, 152514862, 160338917, 167506565, 173171096, 176834871, 178448580, 178204765, 176360631, 173134518, 168784805, 163921753, 159223745, 155089158, 152219730, 151278735, 152680718, 156121118, 160693106, 165129805, 168764583, 171621967, 174530310, 178349733, 183543562, 190126321, 197690726, 205432340, 212547802, 218097385, 221618257, 222996785, 222513775, 220720221]
5454B20720221k829757m546105p091757r819357j1599638j1630960j0259623q352309
5446A54590715o578098n164833m022965k928125j761018n34498L49256P17996
5438A34668430R9981j398517l043507m363419n069169n211732m986186m663128
5430A06032753m437446m795175n364750o001880o063867n627511m908850m097986
5422F4735288l661451l343043l321486l239622k924601k590463j945375j463714
5414D2245533r08316l12236K99163R42253J176083R80668Q0187j134227k200535
5405D1168573k678410k567049k151175j741897j277018r91783o66629l71160j19243
5396B8604209K25237O21296Q88512J144766J102929P79526J44415n74206j293080
$$ y = [220720221, 217890464, 213344359, 206252602, 196433245, 184833607, 173202647, 162943024, 154590715, 148012617, 142847784, 138824819, 135896694, 134135676, 133601178, 133950434, 134668430, 134768411, 133369894, 130326387, 125962968, 120893799, 115682067, 110695881, 106032753, 101595307, 96800132, 91435382, 85433502, 79369635, 73742124, 68833274, 64735288, 61073837, 57730794, 54409308, 51169686, 48245085, 45654622, 43709247, 42245533, 41337217, 41024981, 41324144, 42266397, 43442480, 44423148, 44503335, 43369108, 41168573, 38490163, 35923114, 33771939, 32030042, 30753024, 29761241, 29094612, 28723452, 28604209, 28829446, 29450742, 30339254, 31484020, 32586949, 33366475, 33510890, 32936684, 31643604]
5387C1643604j565400j450857j159316p21442l22256J73981P05972J201399J618941
5378C0124626J624023R74691Q079r96025j558383j636197j454485j285441j139534
5369B4661354r75614p10285m56290k24950J48668M51731P92715R74766Q31959
5360B5494054L77576k99981r02988j126435j031760p27432m33657M9585L94749
5351B1793711R87950J421402J765030J809799J327479L84842m38986j122040j480581
5342B6448606j534104j586199j527128j402374j102729p85697m57651k01110K38502
5333A8090116N13802Q52019J067469J112449P04823j19549r06290j390895j564497
5324A8359447j302295j071718p80805n71698n96363l59958k25083q1530R6861
$$ y = [31643604, 30078204, 28627347, 27468031, 26746589, 26424333, 26598314, 27304286, 28505685, 30124626, 31748649, 32723340, 32731419, 31735394, 30177011, 28540814, 27086329, 25800888, 24661354, 23685740, 22975455, 22519165, 22294215, 22442883, 22894614, 23687329, 24662095, 25494054, 25871630, 25571649, 24668661, 23542226, 22510466, 21783034, 21349377, 21398962, 21793711, 22781661, 24203063, 25968093, 27777892, 29105371, 29490213, 29051227, 27929187, 26448606, 24914502, 23328303, 21801175, 20398801, 19296072, 18510375, 18052724, 17851614, 18090116, 18603918, 19455937, 20523406, 21635855, 22340678, 22221129, 21314839, 19923944, 18359447, 17057152, 15985434, 15204629, 14632931, 14036568, 13676610, 13451527, 13369997, 13466858]
5315A3466858K29473K28187K68316J4385j15927j92018k33171j8268l8446K72638
5305A3882027M57271O91762R57912J199789J363416J197571P41262j38299r16418
5296A9436293j287698j245919j073361o71147o08130l94482p5807J6761K22614
5287A4319124L33753M31416N95313O70000Q22789R55581J157461J478829K466730
5278B3230996M018015O196364Q258411P876829M493647r98721n373156o138123
5270D1564262m466911k105532M44523L349694N938410O816823M444615j47306
5262E5838578n019198o418242m638915j493916J882254M634018M948031K439495
5254E2172105k208502n733002o102211m420892k390446o7899K379863M617958
$$ y = [13466858, 13696331, 13924518, 14192834, 14207219, 14091292, 13899274, 13666103, 13647835, 13609389, 13882027, 14339298, 15031060, 15988972, 17188761, 18552177, 19749748, 20491010, 20352711, 19436293, 18148595, 16902676, 15829315, 15158168, 14550038, 14155556, 14079749, 14096510, 14319124, 14652877, 15084293, 15679606, 16349606, 17172395, 18127976, 19285437, 20764266, 23230996, 27249011, 33445375, 41703786, 49580615, 54074262, 53075541, 47702385, 41564262, 37097351, 34991819, 35436342, 38786036, 44724446, 51541269, 55985884, 55838578, 50819380, 44401138, 39762223, 38268307, 40150561, 44784579, 49732610, 52172105, 49963603, 44230601, 38128390, 33707498, 31317052, 31249153, 33629016, 38246974]
5246C8246974N274735L139180j007774n328202o864996n811309m258316k997638
5238B0392654k120730j621480j343515j160445q33575p07400n14811n04899m02476
5229A1183323l58975k75120l23187k42654k30853j58550j81493j47323j46948
5220I118220j17653q5916o219l5086j7686p1002j55870j38647q1296j57308o9856
5209H181681n3792M816l8761k9641l9222m3493o9046p423j14110r6363o0168o3896
5197G570582p0556n4470l8408p9870R91n2485j4437O80L3816P8753m0727M6820
5185G380689p6186o4645o4466k7904m0442j5819m2642k1710K4857k9038J7974
5174G040668N3682k031R7720R8178l7205O1574k4719L834l4190k319R5997J08427
$$ y = [38246974, 43521709, 46660889, 45653115, 40324913, 33459917, 27648608, 23390292, 20392654, 18271924, 16650444, 15306929, 14146484, 13312909, 12605509, 12090698, 11585799, 11183323, 10824348, 10549228, 10226041, 9983387, 9752534, 9593984, 9412491, 9265168, 9118220, 9000567, 8914651, 8908432, 8873346, 8855660, 8784658, 8628788, 8490141, 8408845, 8251537, 8181681, 8127889, 8132705, 8093944, 8064303, 8025081, 7981588, 7912542, 7905119, 7791009, 7694646, 7634478, 7570582, 7500026, 7445556, 7407148, 7327278, 7328269, 7275784, 7261347, 7262027, 7295843, 7374596, 7333869, 7380689, 7304503, 7239858, 7175392, 7147488, 7107046, 7091227, 7048585, 7026875, 7051732, 7022694, 7040668, 7094350, 7092319, 7190039, 7288217, 7251012, 7312586, 7287867, 7291701, 7257511, 7255192, 7351189, 7459616]
5162G459616P3340P4961m2494l0442m842k8792M8466J4230J14622N9224Q0939
5151G818828J890O3523o0824M7974l7712P6029M3380J15658P0519L7017J14293
5140H290575J0826M0505J4728P0886K9682O2416J52685J42138J34120J92214K03284
5129I344059J25741J78786J15462J72487J08918J68983K09530J27773J54512K10450
5119A0916701K04605K18063L65574K93355M10702M32121M23661M38098M65372
5110A4168252M48175M84027O78330Q13534R76256J332700J786658K550888L730205
5101B6969025N178333O002070N454592L379005N73164j435218j436901K5816J610283
5092D6320169J991160L62807k441978m764036n848513n381049m286471l178113
$$ y = [7459616, 7532956, 7607917, 7565423, 7534981, 7530139, 7501347, 7549813, 7564043, 7678665, 7737889, 7818828, 7820718, 7884241, 7823417, 7871391, 7833679, 7909708, 7953088, 8068746, 8139265, 8176282, 8290575, 8301401, 8341906, 8356634, 8427520, 8457202, 8519618, 8672303, 8814441, 8948561, 9140775, 9344059, 9469800, 9648586, 9764048, 9936535, 10045453, 10214436, 10423966, 10551739, 10706251, 10916701, 11121306, 11339369, 11704943, 11998298, 12409000, 12841121, 13264782, 13702880, 14168252, 14616427, 15100454, 15778784, 16592318, 17568574, 18901274, 20687932, 23238820, 26969025, 32147358, 38149428, 43604020, 46983025, 47556189, 46120971, 44684070, 44709886, 46320169, 48311329, 48674136, 46232158, 41468122, 35619609, 30238560, 25952089, 22773976]
5084B2773976k345957j770315j243701j021312q21898p12507n61705l73172l16267
5075A3607142k03884k55839j85017j23560j15090p7191n9464m7412K5125l5341
5065A2529469J5636l3596J0075M956o0765l5066N251L0356M6207L6979R8549K56867
5053A2904918K46717K79007K27888J39267M5656K567L4549P8457J16864J57152
5043A4233042J74739J79973J63801J59514K8639l9754j4646K6369J49432K25643
5033A5286752L21648L39746L47978K49374K73546L38070M18913N54630O22455
5024A8753112P20473R10685J062019J278000J395881J617737J987680K494033
5016C0219620L152898M377002N993710P779670Q911557Q560726O353481K967084
$$ y = [22773976, 20428019, 18657704, 17414003, 16392691, 15570793, 14858286, 14296581, 13923409, 13607142, 13403258, 13147419, 12962402, 12838842, 12723752, 12646561, 12587097, 12539685, 12564810, 12529469, 12545105, 12511509, 12521584, 12526540, 12465775, 12430709, 12435960, 12466316, 12512523, 12549502, 12648051, 12904918, 13151635, 13430642, 13658530, 13797797, 13843453, 13846020, 13880569, 13959026, 14075890, 14233042, 14407781, 14587754, 14751555, 14911069, 14939708, 14899954, 14885308, 14911677, 15061109, 15286752, 15608400, 15948146, 16296124, 16545498, 16819044, 17157114, 17576027, 18130657, 18753112, 19473585, 20384270, 21446289, 22724289, 24120170, 25737907, 27725587, 30219620, 33372518, 37749520, 43743230, 51522900, 60434457, 68995183, 75348664, 78315748]
5008G8315748J61997p75835O249J159105J037400r80704m359126p449857q837871
4999E8277106q530850p172655n529147m259753l287041k594314k012362j639410
4991B3251574j233911j116968q26774p02981o06526n42123l98997m17807k57147
4982A7148340k33174k27414j65002j85868o3629n4924j37408l4027j5138n6627
4972A5975129L433q330k5216M2495K6822K884M1994Q3491m3564R1328P5967J10228
4960A6376661P3218J12958J75236O7915J32250R1310O4478J24206K00847J73062
4950A7592141K36718K04967K43181L36190K48270L46806L86250L33258M08735
4941B0336516M79451M73370O77821O74762P46380R11962R74762J113079J272805
$$ y = [78315748, 78477745, 77701910, 77708159, 78867264, 79904664, 78923960, 74564834, 67114977, 58277106, 49746256, 42573601, 37044454, 32784701, 29497660, 26903346, 24890984, 23251574, 22017663, 20900695, 20073921, 19370940, 18764414, 18222291, 17823294, 17405487, 17148340, 16915166, 16687752, 16522750, 16336882, 16273253, 16218329, 16080921, 16046894, 16031756, 15975129, 15978562, 15970232, 15945016, 15987511, 16014333, 16017217, 16059211, 16142702, 16099138, 16190466, 16266433, 16376661, 16449879, 16562837, 16738073, 16805988, 16938238, 17029548, 17094026, 17218232, 17419079, 17592141, 17828859, 18033826, 18277007, 18613197, 18861467, 19208273, 19594523, 19927781, 20336516, 20815967, 21289337, 21967158, 22641920, 23388300, 24300262, 25275024, 26388103, 27660908]
4932B7660908J422006J500877J493590J486566J411475J258210J215644R85139
4924C8434415Q91439P00315P80092Q87113J153069J428788J863707K193153K305510
4915E0637601K192301J996834J841147J606381J670403J633756J600882J566782
4907F4746087J585145J679110J875057K314525K597603K897059L105060L838859
4899H4638505N370809Q643482J5098749J7912123J3583127M972785r227794r163209
4891A31828577o320817m087997k656618j345314o90891l32310m05066o15009q90485
4882A14484070r06763p86305n48829k81594j68846j18567k29669k01698j82304
4873A11059495K00540Q24083J854653K924299M035631M724346N029751M791525
$$ y = [27660908, 29082914, 30583791, 32077381, 33563947, 34975422, 36233632, 37449276, 38434415, 39325854, 40026169, 40806261, 41693374, 42846443, 44275231, 46138938, 48332091, 50637601, 52829902, 54826736, 56667883, 58274264, 59944667, 61578423, 63179305, 64746087, 66331232, 68010342, 69885399, 72199924, 74797527, 77694586, 80799646, 84638505, 90009314, 98652796, 113751545, 131663668, 145246795, 150219580, 140991786, 131828577, 125507760, 121419763, 118763145, 117417831, 116726940, 116394630, 115989564, 115374555, 114484070, 113577307, 112791002, 112242173, 111960579, 111791733, 111673166, 111443497, 111241799, 111059495, 111260035, 112084118, 113938771, 116863070, 120898701, 125623047, 130652798, 135444323]
4865A35444323M708774M596975M623020M358490L596558L003811K447527K065521
4857A64844999J578499Q88429L3345o59537r91629j158205j071263m58330L99482
4848A63405790J180149J744822J821956J259545L11203q51824j761499k062845
4840A65047297j627942p75913J67902J115903J832969J975737J607355O96235
4832A70039543k29041q81976j211065j396507j918892k363486k864234k775913
4824A56398429k537429k958183m008226n122575n573910n063443m093783l037351
4816A24003529j981206r93513k47385K52465K06762m4009n35651r25193j211140
4807A18524659j451634j638987j600598j492764j260236o91983j80657J67005
$$ y = [135444323, 140153097, 144750072, 149373092, 153731582, 157328140, 160331951, 162779478, 164844999, 166423498, 167311927, 167345272, 166685735, 165694106, 164535901, 163464638, 163006308, 163405790, 164585939, 166330761, 168152717, 169412262, 169723465, 168871641, 167110142, 165047297, 163419355, 162643442, 162811344, 163927247, 165760216, 167735953, 169343308, 170039543, 169810502, 168928526, 167717461, 166320954, 164402062, 162038576, 159174342, 156398429, 153861000, 150902817, 146894591, 141772016, 136198106, 131134663, 127040880, 124003529, 122022323, 121028810, 120781425, 121033890, 121240652, 121196643, 120660992, 119735799, 118524659, 117073025, 115434038, 113833440, 112340676, 111080440, 110388457, 110207800, 110374805]
4799A10374805j83950j293322k983064m646045n477752n351529m574025l508113
4791H2357005k839210k324935k257523k243973k328290k356840k167169j902704
4783F3936361j642187j334425j194148j009186q82295q47084j001846j057487
4775E4967703j417295j863390k099964k233345k183214j986915j543507j410075
4767D0229998j176914r85543r35830q85276p98329o79852o56765n73700p52172
4758C2785617q43038j066243j103952j119181j061236r72023q98330p71367n49626
4749B4400621n73608n60640m59349l62341k35245j45282j33090j76956j35588
4740B1618522k83467k32140k04396j29933j19734j57161q1193j53257j43708j80281
$$ y = [110374805, 110190855, 108897533, 105914469, 101268424, 95790672, 90439143, 85865118, 82357005, 79517795, 77192860, 74935337, 72691364, 70363074, 68006234, 65839065, 63936361, 62294174, 60959749, 59765601, 58756415, 57874120, 57027036, 56025190, 54967703, 53550408, 51687018, 49587054, 47353709, 45170495, 43183580, 41640073, 40229998, 39053084, 38067541, 37131711, 36246435, 35448106, 34768254, 34111489, 33537789, 32785617, 31942579, 30876336, 29772384, 28653203, 27591967, 26619944, 25721614, 24950247, 24400621, 23827013, 23266373, 22807024, 22444683, 22209438, 22064156, 21931066, 21754110, 21618522, 21335055, 21102915, 20898519, 20768586, 20648852, 20491691, 20410498, 20257241, 20113533, 19933252]
4730A9933252j35818j74320j67649j88030k33505j80732j59435j51468q6126k28796
4720A8227373j91351j28584j30627r8228n5651j09351j05845o9626j80041k5548
4710A7132521j09902l6666j1343o6246p4336k5372m9329J7682J28213J20795J12483
4699A7138500N1060J63411Q2251N5903J24664J06981K794J18243O4707K66833
4689A8175347L22198L67527M39869K84554L67143K01187K43163J94504M12845
4680B1008337N36178O20071O26210P57086O86839Q09149R49446R20119J210629
4671B8124064J325130J376657J376592J362249J381842J424238J411450J446647
4663C9228869J368708J284268R00946Q08224N52916N20272O83941Q95147J140162
$$ y = [19933252, 19797434, 19623114, 19455465, 19267435, 19033930, 18853198, 18693763, 18542295, 18456169, 18227373, 18036022, 17907438, 17776811, 17678583, 17622932, 17513581, 17407736, 17338110, 17158069, 17132521, 17022619, 16985953, 16974610, 16908364, 16834028, 16808656, 16759327, 16777009, 16905222, 17026017, 17138500, 17189560, 17352971, 17435222, 17491125, 17615789, 17722770, 17725564, 17843807, 17908514, 18175347, 18497545, 18865072, 19304941, 19589495, 19956638, 20157825, 20400988, 20595492, 21008337, 21544515, 22164586, 22790796, 23547882, 24234721, 25043870, 25993316, 26913435, 28124064, 29449194, 30825851, 32202443, 33564692, 34946534, 36370772, 37782222, 39228869, 40597577, 41881845, 42782791, 43591015, 44143931, 44664203, 45348144, 46243291, 47383453]
4654D7383453J381289J325274J401167J700244J975117K165149K337387K361722
4646F2030802K146863K087534J881679J503633J139276Q29434O74824P71169Q05745
4637G3870959Q36457P78348P49099Q32799R98709J051110R09300M38764K7355
4628H0492900n67285q21636r93945j028569j116215j233247j516133j574596j825111
4619F9816163k067985k267589k311062k217445j985116j661929j508828j169984
4611E4626225r45649p81074p10619o28533p56469o41613p26227m57502q0163L36847
4601D9235223P25914R43595J341266J448381J393663J257280R92402O16453L00080
4592E8254257J80061J42014L36086N99040R72749J172176J310456J209157R01420
$$ y = [47383453, 48764742, 50090016, 51491183, 53191427, 55166544, 57331693, 59669080, 62030802, 64177665, 66265199, 68146878, 69650511, 70789787, 71619221, 72294045, 73065214, 73870959, 74707416, 75485764, 76234863, 77067662, 78066371, 79117481, 80026781, 80465545, 80492900, 79925615, 79103979, 78110034, 77081465, 75965250, 74732003, 73215870, 71641274, 69816163, 67748178, 65480589, 63169527, 60952082, 58966966, 57305037, 55796209, 54626225, 53680576, 52899502, 52188883, 51560350, 50803881, 50162268, 49436041, 48978539, 48898376, 49235223, 49961137, 50904732, 52245998, 53694379, 55088042, 56345322, 57337724, 57954177, 58254257, 58434318, 58576332, 58912418, 59511458, 60484207, 61656383, 62966839, 64175996, 65077416]
4583F5077416K66280k59701p64251j094605j311044j189184r17458m31356J7006
4574E9393103L92780J58715p5567o11558j106104j632921j995474k144911k046066
4565E0331997j625663j107557o43244k79243o9499o0849j24555j83531n0389K04887
4555D6392354L78906O26587R79867J097090J017335P47288K85355m2569k13048
4546E1269165j31237l975K83823O19688J090439J325089J325311R75178L73036
4537E7126517m53349p98333j033509r26320q06032n99733o08751q36859j145366
4528D9918265j323030j509129j341389j111620q10112m07687q2533J35219K06003
4519D3673987K69765J45484K39137M74557O77733Q15512P55312Q14383Q79008
$$ y = [65077416, 65343696, 65083995, 64319744, 63225139, 61914095, 60724911, 59807453, 59376097, 59393103, 59785883, 59944598, 59869031, 59257473, 58151369, 56518448, 54522974, 52378063, 50331997, 48706334, 47598777, 46955533, 46676290, 46606791, 46545942, 46421387, 46237856, 46187467, 46392354, 46771260, 47397847, 48377714, 49474804, 50492139, 51239427, 51524782, 51482213, 51269165, 51137928, 51133953, 51417776, 52037464, 53127903, 54452992, 55778303, 56753481, 57126517, 56673168, 55874835, 54841326, 53915006, 53108974, 52509241, 51900490, 51063631, 49918265, 48595235, 47086106, 45744717, 44633097, 43822985, 43415298, 43332765, 43467984, 43673987, 43943752, 44089236, 44328373, 44802930, 45480663, 46296175, 47051487, 47865870, 48744878]
4510D8744878J436546J820225J977620J872006J613036J281327J088950Q58224
4502F0692812R31222J084569J314353J191724R48955M90076J85597r9912l71254
4493F6368142o81047p33147q98865r10430r15715j056598j114424j321237j469867
4484E7266812j754539j800005j439820j102968q03567l01472J38038M86002Q15059
4475E1503540R83605R59672J017907J405146J668601J595138J304141P48470N20564
4466F1706784M84716P74398Q87161N97687P9592n01828n30145k65022m7264n3950
4456F3132129l12080o25295r10612p12893q6198P68819J445342J457711O59721
4447F4816644p48814j960133k611702k346412j753226j190397q43676k49196R3958
$$ y = [48744878, 50181424, 52001649, 53979269, 55851275, 57464311, 58745638, 59834588, 60692812, 61624034, 62708603, 64022956, 65214680, 66163635, 66653711, 66839308, 66739396, 66368142, 65687095, 64953948, 64055083, 63144653, 62228938, 61172340, 60057916, 58736679, 57266812, 55512273, 53712268, 52272448, 51169480, 50365913, 50064441, 50202479, 50688481, 51503540, 52487145, 53446817, 54464724, 55869870, 57538471, 59133609, 60437750, 61186220, 61706784, 62191500, 62965898, 63853059, 64450746, 64530338, 64028510, 63498365, 63233343, 63186079, 63132129, 62820049, 62194754, 61284142, 60571249, 60485051, 61253870, 62699212, 64156923, 64816644, 64067830, 62107697, 59495995, 57149583, 55396357, 54205960, 53362284, 53113088, 53207046]
4438E3207046M221p59162j610415k131908j765960r26767k99898J27816M78099
4429D6323072P87108J206383J569468J756938K116617K304343K141505J530228
4421E9735662M79370m57469r06823o53919o4253K0638m47086j122843j416561
4412E5166716r75566j99992M11059M76019M2950o03064r99173j262239j307394
4403E0749316j150754o83195o38832j220913k193530k830274k817426k281714
4395C6932678j621029j042924o13066j32333M39984J008545J690710K163833K496220
4386D1322618K184304J525757Q71471M20932P68913J422473J941179K068018J584133
4377E4109798R56766M27556L15747M91032N52015N85148L37293l13363j072039
$$ y = [53207046, 53211267, 52452105, 50841690, 48709782, 46943822, 46017055, 45717157, 45844973, 46323072, 47110180, 48316563, 49886031, 51642969, 53759586, 56063929, 58205434, 59735662, 60215032, 59757563, 58850740, 58196821, 58132568, 58153206, 57706120, 56583277, 55166716, 54191150, 53991158, 54402217, 54878236, 54921186, 54318122, 53318949, 52056710, 50749316, 49598562, 48915367, 48276535, 47055622, 44862092, 42031818, 39214392, 36932678, 35311649, 34268725, 33655659, 33523326, 33963310, 34971855, 36662565, 38826398, 41322618, 43506922, 45032679, 45904150, 46325082, 47093995, 48516468, 50457647, 52525665, 54109798, 55066564, 55494120, 55809867, 56300899, 56852914, 57438062, 57775355, 57461992, 56389953]
4368E6389953j760694j763524j401209q63988j17394M30918P71269J039481J357308
4359E4082120J336415J504377R83963K564j328687k323284k690842k515335j925143
4350D7126148j206129n89273l44593n35094q90416j204305j331174j200487r30468
4341C8894209o00446l94612k61476j21654J41232L52746P73953Q66530P43862
4332D0394344K86375k64525p37584q38137p19433k51662K62278O45993Q29751
4323C9607400O71328M56127K00060l01151p14461j105337j140287r84556n78837
4314C6110286j36907L47815N53414M64046K08894o6450n03489p54018q67828q21521
4304C4534242n60188k20636J84762O14626Q06801Q75320N89468J50452m95954
$$ y = [56389953, 54629259, 52865735, 51464526, 50600538, 50483144, 50914062, 51685331, 52724812, 54082120, 55418535, 56922912, 57906875, 57909439, 56580752, 54257468, 51566626, 49051291, 47126148, 45920019, 45330746, 44986153, 44451059, 43560643, 42356338, 41025164, 39824677, 38894209, 38293763, 37899151, 37637675, 37516021, 37657253, 38009999, 38783952, 39650482, 40394344, 40680719, 40416194, 39678610, 38840473, 38121040, 37869378, 38131656, 38777649, 39607400, 40278728, 40734855, 40934915, 40633764, 39919303, 38813966, 37673679, 36689123, 36110286, 35973379, 36321194, 36874608, 37338654, 37547548, 37481098, 36977609, 36223591, 35355763, 34534242, 33974054, 33753418, 33938180, 34552806, 35359607, 36234927, 36824395, 36974847, 36478893]
4295C6478893q36889j057768q90261n99462j76176j0442K06031L7488q3363j31664
4285C2936387j04735k18907j69954l42188k51270j80287Q1015L34929N17807N19925
4275C3122722M12223L29043J36035K01345J81519K98043M97275O47291R55814
4266C6781310J323098K099331K821575L294281L156334K202306Q24020n84027
4258E1918228j601444j859376j267046J97614J640930K545175K476961J412765
4250E5463807n1065m84889j42612R23879J430526R22635m86881j861307k454317
4241E3259776k438628j849573j416018r77056o43043j78441K02780N73137J032137
4232D7565071J592022K174979K882688L273783L174858K696487J974998J840183
$$ y = [36478893, 35642004, 34584236, 33693975, 33094513, 32918337, 32907895, 33113926, 33151414, 33068051, 32936387, 32831652, 32612745, 32442791, 32100603, 31849333, 31669046, 31750061, 32084990, 32602797, 33122722, 33534945, 33863988, 34000023, 34201368, 34382887, 34680930, 35178205, 35825496, 36781310, 38104408, 40203739, 43025314, 46319595, 49475929, 51678235, 52502255, 51918228, 50316784, 48457408, 47190362, 47387976, 49028906, 51574081, 54051042, 55463807, 55412742, 54927853, 54785241, 55709120, 57139646, 58062281, 57575400, 55714093, 53259776, 50821148, 48971575, 47555557, 46578501, 45935458, 45757017, 45959797, 46532934, 47565071, 49157093, 51332072, 54214760, 57488543, 60663401, 63359888, 65334886, 67175069]
4224F7175069K522823L377513L986824L573738K368973P41997k21275o0889J245754
4215H4710527K711668L517875K869832J313287k2211l28727P10712J949516K732817
4206A00165296L007516L287742M729587Q097959J4006507K1099627K6351957K5120598
4198B05866789J5113655j001055j5753638k2636912k1741484j7074732j1667793
4191A31104830p182323l868095j731885k85137Q36355K422266L865758M894505
4183A30056274M907356L865668K407141J461037J757692M167731Q483094J4890857
4175A71996850K2536519K8465130K8159023J8571043J981208j3900167k1708250
4168B36101356k0247187j4059183q058290m726468m282679n386417o636501o771959
$$ y = [67175069, 69697892, 73075405, 77062229, 80635967, 83004940, 83746937, 83525662, 83464773, 84710527, 87422195, 90940070, 93809902, 95123189, 95100978, 94772251, 95482963, 97432479, 100165296, 103172812, 106460554, 111190141, 119288100, 133294607, 154394234, 180746191, 205866789, 220980444, 219979389, 204225751, 181588839, 159847355, 142772623, 131104830, 123922507, 120054412, 118322527, 118037390, 118873745, 121296011, 125161769, 130056274, 134963630, 138829298, 141236439, 142697476, 144455168, 148622899, 157105993, 171996850, 194533369, 222998499, 251157522, 269728565, 271709773, 257809606, 236101356, 215854169, 201794986, 193736696, 189010228, 184727549, 179341132, 172704631, 165932672]
4160A65932672n559901l091545l51914J847555K650260K257790P17368j823752
4152A62578533m562772o887684p686967p021244n335179l180216q49254J516630
4144A28571847L823971O130407Q345290J0819943J3345713J5855460J8365902
4137B05258533K1393861K5211084K8848055K9687516K6228929J9575383J3255297
4130C69458658J0084093Q536774P429345O618299N351774l65413j3727476l0851350
4122C62534704m2711847m4294434l7720643k8262665j9511218j2286764o749987
4115A70997146l222418j630689k156785m334248p087725r344906j0168419r723182
4107A23328774q357429o708024m902430l220572j822417n43972M20328J112939
$$ y = [165932672, 160372771, 157281226, 156929312, 158776867, 161427127, 163684917, 164402285, 162578533, 158015761, 151128077, 143441110, 136419866, 131084687, 127904471, 127055217, 128571847, 132395818, 138526225, 146871515, 157691458, 171037171, 186892631, 205258533, 226652394, 251863478, 280711533, 310399049, 336627978, 356203361, 369458658, 379542751, 388079525, 395508870, 402127169, 407478943, 407113530, 393386054, 362534704, 319822857, 275528423, 237807780, 209545115, 190033897, 177747133, 170997146, 167774728, 166144039, 163987254, 159653006, 152565281, 143220375, 133051956, 123328774, 114971345, 108263321, 103360891, 100140319, 98317902, 97773930, 98194258, 99307197]
4099I9307197K021065L202213M938363P978872J2620595J9484652K7352367L3214338
4091B10119662L2286529K2124467M573680j2130734k2045682k3871309k1768768
4084A89287845j9434236j7845865j6327166j4195205j1979255r662003p822624
4077I2021491o273162n223439m561148m265023m192608l840927l305807k738549
4069E7620828k183854j538112j161779q49074n23261l66004k14056j78361j97096
4060E0409231j88363O2478K68027O16102J016694J401341J721836K153022K886813
4051F0347181M173995O249259Q790990J1419360J2312852R957955M310733l096551
4043A14465774r202924j1952321j1617271r750471p545966n655831m243201l360584
$$ y = [99307197, 101328262, 104530475, 109468838, 117447710, 130068305, 149552957, 176905324, 210119662, 242406191, 264530658, 269104338, 256973604, 234927922, 211056613, 189287845, 169853609, 152007744, 135680578, 121485373, 109506118, 99844115, 92021491, 85748329, 80524890, 75963742, 71698719, 67506111, 63665184, 60359377, 57620828, 55436974, 53898862, 52737083, 51888009, 51364748, 50998744, 50784688, 50606327, 50409231, 50220868, 50283346, 50551373, 51167475, 52184169, 53585510, 55307346, 57460368, 60347181, 64521176, 70770435, 79561425, 90980785, 103293637, 113251592, 117562325, 114465774, 105262850, 93310529, 81693258, 71942787, 64396821, 58740990, 54497789, 51137205]
4035E1137205k583542j945119j289582p43017n2663N55098J160377J890854K432506
4026E0562117L263550M214987N455133O154021N356925K837263r48733m281033
4018G2614230o180531o256694n219967l918639k635681j716418r86001m91275
4010D5209024l6845M28892P79615J235376J765342K331145K889137L695127M623196
4001F2920009N736344P544558R869222J3176203J6877190J9965296K0303395J6195461
3993A72587678P948235k178801j0425912j4429529j4102803j0966733o379465
3986A22052670j095666M488886R888425J3870367J4527960J0482471K304939p515574
3978A69004478j5414561j9287864j9361996j7139741j4080749j1254222q807626
$$ y = [51137205, 48553663, 46608544, 45318962, 44575945, 44523282, 45078380, 46238757, 48129611, 50562117, 53825667, 58040654, 63495787, 69649808, 75006733, 77843996, 76895263, 72614230, 66433699, 60177005, 54957038, 51038399, 48402718, 46686300, 45700299, 45209024, 45172179, 45601071, 46380686, 47616062, 49381404, 51712549, 54601686, 58296813, 62920009, 68656353, 76200911, 86070133, 99246336, 116123526, 136088822, 156392217, 172587678, 180535913, 178357112, 167931200, 153501671, 139398868, 128432135, 122052670, 120957004, 125445890, 135334315, 149204682, 163732642, 174215113, 176520052, 169004478, 153589917, 134302053, 114940057, 97800316, 83719567, 72465345, 63657719]
3971F3657719o932415n526460m349096l419366k643134k078395j548028j236073
3963C5924752j014520r47202p06036p23167n43376m18835k59496j22712M7168
3954C1236576K24937L02840O34658Q68505R70564J264939J443230J697240K059366
3945D0702855K389155K922231L803545N083470P057341J0572426J5632293K1720939
3937A09884255K6355973K6304993J9357383O015824r042356k0916055k6123368
3930A31836649k5269929k1026683j6050136j1869405q751843o668685n317170
3923C6882798m331216l476699k883399k400820j930751j599201j370125j173611
3915A7716976j044607r68065p85903p05170n62440n05974m38818l86146l83243
$$ y = [63657719, 56725304, 51198844, 46849748, 43430382, 40787248, 38708853, 37160825, 35924752, 34910232, 33963030, 33256994, 32533827, 31990451, 31571616, 31312120, 31189408, 31236576, 31461513, 31764353, 32399011, 33267516, 34238080, 35503019, 36946249, 38643489, 40702855, 43092010, 46014241, 49817786, 54901256, 61958597, 72531023, 88163316, 109884255, 136240228, 162545221, 181902604, 187918428, 178876072, 157960017, 131836649, 106566720, 85540037, 69489901, 57620496, 48868653, 42199968, 36882798, 32551582, 29074883, 26191484, 23790664, 21859913, 20260712, 18890587, 17716976, 16672369, 15704304, 14918401, 14213231, 13650791, 13144817, 12705999, 12319853, 11936610]
3906A1936610l42013l70671l65516l54623l58556l48655k75075k70122k58636
3897H992743k31980k31730k00368j57638j55183j68671j41252r3306j35481l2381
3887G444753Q146n1154k9556p9608o8875q4222o5091m2783q4689j07915k22926
3876F616080l33245l32719k87237l63064k36814k16899j46739j39141n2024j26075
3866D382123m9693l9522r9850p0671j41423q8904j67284J5522j96158o2108m9166
3855C432866o6980n9181j4801n9835p1425N0063p6303J8041m3023N8634Q6764
3844C254820J22436J51921O0588R219m7124j42664k22951j58319j94373q3601
3834B749952k01907o4909j23153j18309k4011m7628o4151o6626j6586l9634n0560
$$ y = [11936610, 11594597, 11223926, 10858410, 10503787, 10145231, 9796576, 9521501, 9251379, 8992743, 8760763, 8529033, 8328665, 8171027, 8015844, 7847173, 7705921, 7612615, 7477134, 7444753, 7452899, 7401745, 7372189, 7292581, 7223706, 7139484, 7074393, 7031610, 6946921, 6839006, 6616080, 6282835, 5950116, 5662879, 5299815, 5063001, 4846102, 4699363, 4560222, 4508198, 4382123, 4332430, 4292908, 4193058, 4122387, 3980964, 3892060, 3724776, 3740298, 3544140, 3482032, 3432866, 3365886, 3306705, 3291904, 3232069, 3160644, 3210707, 3134404, 3152445, 3109422, 3168056, 3254820, 3377256, 3529177, 3589765, 3598984, 3551860, 3409196, 3186245, 3027926, 2833553, 2749952, 2548045, 2483136, 2359983, 2241674, 2217663, 2170035, 2105884, 2039258, 2022672, 1983038, 1932478]
3823A932478q649j3584n6699l1741o8209k7269o1573k4498l6553j6041J2696K902
3811A603260n21L464o5767J04762l8379k1077r176m4541P5714q5479J3924L8710
3799A574894P9387J6696n603l9688l7521l0361m5657q4547p7444l8648J265p3217
3787A239556n6991L2247n0228o2548j8514M5852L2174p2844j1360O2003j0626
3776A128721p432J449l1694k2116K9704k7253o7537R508n3294j4909n4086k4283
3764H66778m0257j4054N0251j9926j043l4434L8568n5809l2683O4997K814J5133
3752H40335O9391L7308P1327R5810N7573J26617L8816Q0491n4290K013p1533o8347
3740A225511j12142n828q2490N2001J1746k4804O7506L8810L9443o8489n3402
$$ y = [1932478, 1923829, 1910245, 1853546, 1821805, 1753596, 1726327, 1664754, 1640256, 1603703, 1587662, 1600358, 1603260, 1602739, 1606203, 1540436, 1645198, 1606819, 1585742, 1576566, 1532025, 1607739, 1522260, 1536184, 1574894, 1654281, 1670977, 1665374, 1625686, 1588165, 1557804, 1512147, 1427600, 1350156, 1311508, 1312773, 1239556, 1182565, 1214812, 1164584, 1102036, 1083522, 1129374, 1161548, 1088704, 1077344, 1139347, 1128721, 1121289, 1122738, 1091044, 1068928, 1098632, 1071379, 1003842, 1013350, 960056, 945147, 891061, 866778, 826521, 812467, 862718, 842792, 841749, 807315, 845883, 790074, 757391, 822388, 825202, 840335, 909726, 947034, 1018361, 1114171, 1171744, 1298361, 1337177, 1417668, 1363378, 1365391, 1293858, 1225511, 1113369, 1107541, 1025051, 1077052, 1088798, 1063994, 1131500, 1170310, 1209753, 1141264, 1087862]
3729A087862q9768j40268n9484l1014q6818r2300l6437j3283k4094n2444n8981
3718D02971m8437M1667k5418J9257n2200J2318r287j601J796k0303m0073J9389
3706C00079n0881l831L1322n364N061N201K3498m2168L2416L106J5712N3582l1833
3693C35900M9649O7587N8030J22239J36095J26238J18722N723k9356p6779r1373
3682H22675j76712q9867n2526j40900P085r1561k0308k7106K4319p9942j1109
3671A64048m8611L372m251L9471n1363O9990p1323p0730N2845l2119J7180j874
3659F6635j3171n936k0657J0113K0032l8265k5409O1114l9163P164R918k2111
3647A0264K2801m4446k8082J9227N4661l6572M0400k164o4170P809N940k3827
$$ y = [1087862, 998094, 857826, 798342, 767328, 680510, 588210, 551773, 538490, 514396, 461952, 402971, 354534, 396201, 370783, 390040, 337840, 350158, 340871, 339270, 341066, 320763, 280690, 300079, 249198, 245367, 276689, 271325, 276386, 281587, 305085, 262917, 295333, 298439, 314151, 367733, 335900, 385549, 453136, 511166, 633405, 769500, 895738, 1014460, 1020183, 990827, 914048, 822675, 645963, 556096, 503570, 362670, 369755, 278194, 257886, 230780, 255099, 175157, 164048, 115437, 118809, 114558, 154029, 102666, 172656, 101333, 30603, 83448, 51329, 68509, 66635, 53464, 47528, 26871, 36984, 57016, 18751, -6658, 54456, 15293, 22457, 32375, 10264, 33065, -11381, -39463, -20236, 34425, -2147, 38253, 36089, -28081, -20272, -14332, -38159]
3635c8159L4690l7643K5571O8878j2258J4872j0108q006j4516J5140j9029O5860
3623H5292R21O4604J2656j2274L9784Q538L2250o9771k1717K480L411l7292M9516
3610A58398m1688k1215N3269o1399N8p9536L6240M874L0528l8774J00560N0472
3598A91787K3987j612l5084k6727n6505k4139n4170P298j4024j9904m314l2119
3586d5526r454O79j3609Q092k1638L9227n4115j0012M298l068l5157J6776R14
3573a22593j8229O7756l6248k1308L6669j7089J1936k8367m479l5619M0662k034
3561a28943o5832M9534k8718J342K4025n0247p640M9646q0457N6037p685m113
3549a93051K7221j0014o8222L8329m564l41k8527M5413J6311m6406M681J1058
$$ y = [-38159, -3469, -41112, -15541, 53337, 41079, 55951, 45843, 37837, 23321, 38461, 19432, 85292, 86213, 150817, 163473, 151199, 190983, 199521, 231771, 162000, 140283, 142763, 146174, 108882, 158398, 116710, 95495, 148764, 87365, 87423, 7887, 44127, 49001, 79529, 40755, 141315, 191787, 215774, 214162, 179078, 152351, 95846, 71707, 17537, 24835, 10811, -9093, -13407, -45526, -54980, -54301, -67910, -59818, -81456, -42229, -96344, -106356, -102058, -105126, -140283, -123507, -122593, -140822, -73066, -109314, -130622, -93953, -111042, -99106, -127473, -131952, -167571, -126909, -128943, -194775, -145241, -173959, -172617, -148592, -198839, -206479, -156833, -237290, -181253, -188938, -193051, -165830, -175844, -244066, -205737, -210301, -210642, -239169, -193756, -177445, -223851, -219170, -208112]
3537b08112m2951O8497n4264J3988P493J9573m5758K4449k4943j8495J8408j9365
3525b61480N822L2033k0860J7689j6520k2874K2962K1148K0985j4464m0577k5791
3513b81927L8424l1888M6364J2162p2487Q8187n9736p291M7144K1074j0489k9475
3501b39938q593j5634J3604M3253k4672L7616N668j4568j9640n60j3521J8299
3489b18686N067j4264M0470l6074n182j934M3093o4472O0809K10M1909l7160m8302
3476b34516M2732l6721k0056J8121l790k2340R149J2487l3497N8014L0444k7768
3464b07741K4012n2819Q1683K823l5474r641m8498N5062j6904K4550P214J976
3452a73757p474R252o032j8936J8287j0121J9361k4622P8132n3140l967O6663
$$ y = [-208112, -251063, -182566, -236830, -222842, -215349, -195776, -241534, -217085, -242028, -260523, -242115, -261480, -255658, -223625, -244485, -226796, -243316, -266190, -243228, -222080, -201095, -215559, -256136, -281927, -243503, -275391, -229027, -216865, -289352, -201165, -260901, -268192, -221048, -199974, -210463, -239938, -248531, -264165, -250561, -207308, -231980, -194364, -188696, -203264, -222904, -223464, -236985, -218686, -213619, -227883, -187413, -223487, -228669, -230603, -187510, -251982, -191173, -190963, -149054, -186214, -234516, -191784, -228505, -248561, -230440, -234230, -256570, -247421, -234934, -268431, -210417, -179973, -207741, -183729, -236548, -154865, -152042, -187516, -197157, -245655, -190593, -207497, -182947, -175733, -173757, -181231, -171979, -178011, -196947, -178660, -188781, -169420, -194042, -115910, -169050, -173017, -106354]
3440a06354j9781J1913m4443Q1672K5840l321M2993N0938p8399M5510k8498n9976
3428h1906P684N652o0138K1573J0345l830J2933j2948N0337M89j5814L857J9328
3415d2438K2792j8947R6137j6960l1738L9697m260K1196j4906L5649J0686N8078
3403A54986o1409M9048J0654J173M7125J02706k3925O1168m358L7894J3880J10646
3391D99588L85P0042J13865P3194J8895M8618J02406J48714J23169K60557K89406
3380A748839L46284K69330K79040O7365J17775K69051L28783N70007O09132R31412
3370E537018J580796K880231N579014Q103765O428105K753101o286432p997605
3362A8577993n484247l479477k430396j697235j136425q24170n63878l13135j78477
$$ y = [-106354, -126135, -114222, -158665, -76993, -51153, -54474, -11481, 39457, -38942, 6568, -21930, -81906, -74222, -68570, -128708, -107135, -96790, -100620, -87687, -100635, -50298, -49809, -65623, -61766, -42438, -19646, -38593, 57544, 40584, 8846, 48543, 44283, 65479, 50573, 86222, 96908, 154986, 93577, 142625, 153279, 154452, 201577, 304283, 280358, 341526, 337168, 375062, 388942, 499588, 499973, 570015, 683880, 757074, 775969, 824587, 926993, 1075707, 1198876, 1459433, 1748839, 2095123, 2364453, 2643493, 2710858, 2828633, 3097684, 3426467, 3996474, 4605606, 5537018, 7117814, 9998045, 15577059, 23680824, 30108929, 32862030, 26575598, 18577993, 13093746, 9614269, 7183873, 5486638, 4350213, 3526043, 2962165, 2649030, 2470553]
3353B470553o3251o4453l33214l60087k55199k12186j38183j22067j77182k5850
3343G18881j11696l8202o0971r5200J5248j0253P782o9170l3501J7968n7385n2467
3331B31034n9429N6443m7361k7148j20l3467m3581J4210o3580L7438j2888l7534
3319A4017J4688j08070q03J1815n9748K461k3378k9595O1942l8575J077l0970
3307a85139L2955J4567j16803M9879n8978K9619K184R359k3828j6540l642K8702
3295b37665k5660m9779K651p658k7267L713L6992k4302k2849J0818n647j863P671
3282c40845J8855j2033M9119l2980k1145l6081N430L3897k2875m3798K6114J1691
3270c64651p2776M0122M327l3923O3170k2912l0107l0019M782J7968m9536N1003
$$ y = [2470553, 2407302, 2342849, 2009635, 1649548, 1394349, 1182163, 1043980, 921913, 744731, 718881, 607185, 568983, 508012, 412812, 428060, 417807, 425589, 356419, 322918, 340886, 283501, 231034, 171605, 228048, 180687, 153539, 153419, 119952, 76371, 90581, 27001, 64439, 51551, 14017, 28705, -79365, -80168, -68353, -128101, -125640, -149018, -178613, -116671, -155246, -154169, -185139, -152184, -137617, -254420, -204541, -263519, -233900, -231716, -222357, -246185, -262725, -266367, -237665, -263325, -313104, -310453, -318111, -345378, -341665, -304673, -328975, -351824, -341006, -346653, -348516, -340845, -321990, -334023, -284904, -317884, -339029, -375110, -369680, -335783, -358658, -402456, -376342, -364651, -437427, -397305, -392978, -426901, -363731, -386643, -416750, -446769, -441987, -424019, -473555, -422552]
3258d22552j6124k903M4200k1562P203k8375J5775j100k5935m0114O2150m2091
3246d71428O266K6242j0925l9955J5565k5422K1038K492j7237M341K5034j4137
3234d78126J2438O802p9685N9974j909P561j9460k8365M8848n666J646o678K1161
3221d61459m5866l7433L0249k3852O1419k8439p020k97J7887k7889l7927N8497
3209e02130K9490k8413M471o152m6650n350N9114m2660n502K9169k9907j5204
3197e59724O379n4341R6426m099l5706J8565k3130O2253P796m2672m5883M5315
3185e28821m6229J4687P4199k8511l1773L194K602O0377p6149O763l7050N6711
3173e30000l4713M3152n6945M5871l6249M9919q621k9998k0984K3341k3728l3229
$$ y = [-422552, -438676, -441579, -397379, -418941, -411738, -440113, -424338, -425438, -451373, -491487, -429337, -471428, -465162, -438920, -449845, -489800, -474235, -499657, -478619, -476127, -493364, -489023, -463989, -478126, -465688, -458886, -538571, -478597, -480506, -472945, -492405, -520770, -471922, -477588, -475942, -482620, -461459, -507325, -544758, -514509, -538361, -476942, -505381, -512401, -512698, -494811, -522700, -560627, -502130, -472640, -501053, -496582, -502734, -549384, -554734, -495620, -538280, -543782, -514613, -544520, -559724, -553345, -607686, -511260, -515359, -551065, -532500, -555630, -493377, -485581, -528253, -574136, -528821, -575050, -560363, -486164, -514675, -546448, -543254, -540652, -480275, -556424, -549661, -586711, -530000, -564713, -521561, -578506, -532635, -568884, -518965, -527586, -557584, -578568, -555227, -578955, -612184]
3161f12184O6996n69o2262M6964l0172M3130j4550K4431m1307l2664N5310M386
3149e52491n3706R282R644J2245Q897j79l6037K5608k1340j1214P4355p0843k0568
3136f26347J8948K1059O6089M5084j6672N8758k506K0426m8600J0724l4690k1438
3124e09165o9617K9266k0196L1423k9363j6518J5473L5719k4962j0914m572n433
3112e78859K9603k3224k9551M2241o2858J8557k8957N6977N55N7802q7274M8160
3100e56828j5443j4770J4149o743o9368K8397P3920o5647L3892k6443k891O6255
3088e41520n1553M8082r7823P4672K170l6989j8550J4074l018K2063j4766L541
3076e99617L065R67l6703j1587L5182n091o5919M1833J6154L5192k9232j8079
$$ y = [-612184, -545188, -545757, -608019, -561055, -591227, -548097, -562647, -538216, -579523, -612187, -556877, -552491, -606197, -596915, -587271, -575026, -566129, -566308, -602345, -576737, -598077, -609291, -534936, -605779, -626347, -607399, -586340, -520251, -475167, -491839, -433081, -435587, -415161, -463761, -453037, -487727, -509165, -578782, -549516, -569712, -538289, -567652, -584170, -568697, -532978, -557940, -568854, -573426, -578859, -549256, -572480, -602031, -559790, -622648, -604091, -633048, -576071, -575516, -517714, -604988, -556828, -572271, -587041, -572892, -579635, -649003, -620606, -546686, -612333, -578441, -604884, -607775, -541520, -593073, -544991, -642814, -568142, -565972, -602961, -621511, -607437, -610455, -588392, -603158, -599617, -596552, -595585, -632288, -643875, -608693, -613784, -679703, -637870, -621716, -586524, -615756, -633835]
3064f33835P1084o5360N5026m9849J4943j7250K4137Q11j2360k444L387q441K568
3051f17583j5381M7045k9767l22m4452K6835J0576n004J3134m6557M5035k8303
3039f44744J5886J4045p955L1967l8490l9470M2785j6978K2351J6977p7797M1962
3027f39461j5488K3248K4509m807k3885N6608l8248k7250l122k6825K1481j4728
3015f67968K9657J1485k1091L0555m5133L0021O2497j9645l9214l287o7725P8298
3003f21550j4427q962o490L750p460J4539k3707Q9720m4605k2203M608m923j7502
2990f59212P172L4643J7277m2702k9492L5180K638l8508J0612o387N9580p6191
2978f85390k58K3336M293L5226n5627O4159k0764l1764J8734J7059k7326R3K2807
$$ y = [-633835, -562751, -628111, -573085, -622934, -607991, -625241, -601104, -600293, -612653, -615097, -611710, -620151, -617583, -632964, -585919, -615686, -616008, -660460, -633625, -623049, -628053, -614919, -661476, -616441, -644744, -628858, -614813, -622768, -590801, -629291, -668761, -625976, -642954, -620603, -603626, -681423, -639461, -654949, -631701, -607192, -611999, -635884, -579276, -617524, -644774, -647896, -674721, -653240, -667968, -638311, -626826, -647917, -617362, -662495, -632474, -569977, -589622, -628836, -632123, -699848, -621550, -635977, -644939, -651429, -647679, -655139, -640600, -664307, -574587, -619192, -641395, -636787, -641710, -659212, -652040, -617397, -600120, -642822, -672314, -637134, -634496, -673004, -662392, -668779, -609199, -685390, -685648, -662312, -658019, -622793, -678420, -614261, -635025, -666789, -648055, -630996, -658322, -658229, -635422]
2965f35422n908m7277L433O7446n0656K6641n0337L0495J4825J12j765J8466k7752
2952f57699j0193K9156j5700j6998k1502N0193J1205m6597J8568J2433l1565N9786
2940f18913l3505K0996j7263k4216M397K2697k6663J9126J8487j6718l2752K0920
2928f63407k0360j5807j6006J4451J4516J4729K3181J3304Q89k1276n6477Q1339
2916f30924r6036M773J6026L2000O323j8578M3980j3628n495l8851Q6040j20084
2904g34454O4979l271n7022J1903K4995M4811p1003O6494r737L78k7158L0478
2892f58607K528N629j2138j3372J4603k2970N3690m3245J972q2313P9853N330
2880f69040o949j025J6778l0456l59k2357J0423L1888K1584o2729P5715k3660
$$ y = [-635422, -641330, -688607, -685174, -617728, -668384, -641743, -692080, -661585, -646760, -646648, -648413, -629947, -657699, -667892, -638736, -654436, -671434, -692936, -642743, -631538, -678135, -659567, -647134, -678699, -618913, -652418, -631422, -648685, -672901, -668504, -645807, -672470, -653344, -634857, -651575, -684327, -663407, -683767, -699574, -715580, -701129, -686613, -671884, -648703, -635399, -634510, -655786, -712263, -630924, -726960, -722187, -706161, -674161, -667838, -686416, -642436, -656064, -661559, -700410, -614370, -734454, -669475, -672746, -729768, -717865, -692870, -648059, -719062, -652568, -662305, -661927, -689085, -658607, -656079, -650450, -662588, -675960, -661357, -684327, -630637, -673882, -671910, -754223, -674370, -669040, -675989, -677014, -660236, -690692, -691051, -713408, -702985, -671097, -649513, -712242, -636527, -660187]
2868f60187k4590Q761K469p5762O4242K8357r5467N7990J6559K4752l0815o935
2856f90626Q284j8445J1152k0529K2819k3952q666L5348m6935P6807l2874l6491
2844g24108K4273j3293p395N226l5131P9183m8610M4681k7484n920r82k4289O3101
2831f70748l5913l340j1847N1295p2418M7814L6349n0318J4355J6297L3763J0453
2819f34258o0801J2990k2629r480m149K9783m2377m360O2276K1084k9645J7586
2807f63980j2082L8886p2002K2918m5117L7523J3680j2830L4653J7447o6182L4803
2795f72283p3238k350M0788J9745n637l9097P3902k6353j9225q183k3689L1499
2783g04121M576q749K0877J9185l8589L2927l8801J1506Q788J3595j448m6986
$$ y = [-660187, -684777, -676016, -673547, -749309, -685067, -656710, -752177, -694187, -677628, -652876, -683691, -690626, -682342, -700787, -689635, -710164, -687345, -711297, -719963, -684615, -731550, -654743, -687617, -724108, -699835, -713128, -720523, -715297, -750428, -671245, -719855, -675174, -702658, -708578, -709560, -733849, -670748, -706661, -710001, -721848, -670553, -742971, -695157, -658808, -709126, -694771, -678474, -644711, -634258, -695059, -682069, -704698, -714178, -718327, -688544, -730921, -735281, -673005, -651921, -681566, -663980, -676062, -637176, -709178, -686260, -731377, -693854, -680174, -693004, -658351, -640904, -707086, -672283, -745521, -747871, -707083, -687338, -692975, -732072, -658170, -684523, -703748, -711931, -735620, -704121, -699545, -708294, -687417, -668232, -706821, -673894, -712695, -701189, -692401, -678806, -680254, -727240]
2771g27240p339O440K1375J0851j6595J1507O0935j0649l8010k3877j7380K8960
2759g01022j5060R002N688K4677q545k5891J2321j3435l1892j3495L0957j3796
2747g40491q273K4471m149J3922l1038N7309j6657n2674O3682M554p5079P6382
2735f88041j1024M2860m7304L5837m7791J6204P782k0566j6957N7434m0374p757
2723g19697M9191l0147q349j0778q958m2028N2191j4172J7884p304K5607N197
2711f91363m3965M0638l7239K7600J620l3617N8122q1913J2249K0655l0864K9018
2699g29059P5510p4824r870L3347l7064N1353l0690k3140O0369p3537q48J7225
2687g41228j0021n7672O9038M2567n874J2250J2321q5773Q7767k333m1326K1105
$$ y = [-727240, -734579, -728139, -706764, -695913, -712508, -701001, -640066, -650715, -688725, -712602, -729982, -701022, -716082, -707080, -701392, -676715, -685260, -711151, -698830, -712265, -744157, -757652, -726695, -740491, -748764, -724293, -728442, -714520, -745558, -688249, -704906, -757580, -693898, -689344, -764423, -688041, -699065, -656205, -703509, -667672, -715463, -699259, -691477, -712043, -729000, -671566, -711940, -719697, -670506, -700653, -709002, -719780, -728738, -770766, -718575, -732747, -714863, -722167, -696560, -691363, -735328, -694690, -731929, -704329, -702709, -736326, -678204, -760117, -747868, -727213, -758077, -729059, -653549, -728373, -738243, -704896, -741960, -690607, -721297, -744437, -684068, -757605, -758453, -741228, -751249, -808921, -739883, -697316, -703190, -690940, -678619, -764392, -676625, -678958, -720284, -699179]
2675f99179k1265l7043M0729k0173Q1862j04779N6553J9657q6754p365J08869
2664f68888n8538l1997j9552K5655L0325J7134k1933K766J0566l2429M899N006
2652g36986p772M2978o7759P2964j5383J2278o8016P181Q980j493m135J6377L9693
2639g01093n8502L6001k5226Q16j6653j360J3130k2243M1800m210J0579l9800
2627g66761O9319n3412J1325j9601M7607n0652K4126j902P73N7420n9127J6748
2615g24137l6221j104K2490j0839K1001k121l7694K2521K6764p631p33j0106n453
2602g43263K0680N5428n5484J0505k9967J4871M0094l1051j4857j550J0583n2332
2590g76343k2812K6343k249J2752M2125o006k3332j7067P6678m9366j7120J3534
$$ y = [-699179, -720444, -757487, -716758, -736931, -655069, -759848, -703295, -683638, -770392, -777757, -668888, -727426, -759423, -778975, -753320, -722995, -705861, -727794, -725028, -714462, -746891, -741992, -736986, -744758, -701780, -769539, -696575, -711958, -699680, -767696, -760515, -751535, -753028, -757163, -740786, -701093, -759595, -723594, -748820, -748004, -764657, -766017, -752887, -775130, -733330, -737540, -726961, -766761, -697442, -750854, -739529, -759130, -711523, -762175, -738049, -739951, -739178, -681758, -740885, -724137, -760358, -761462, -738972, -749811, -728810, -730931, -768625, -746104, -719340, -726971, -727704, -737810, -743263, -722583, -667155, -722639, -712134, -742101, -727230, -687136, -718187, -733044, -734594, -724011, -776343, -799155, -772812, -775061, -762309, -720184, -726190, -749522, -766589, -689911, -739277, -756397, -742863]
2578g42863J5309M497k9165M6212m3769J1697k1521K0041p2921M8795Q621n581
2566g60648j0126R853K9934l8803q256J8127j2071j9030Q033K0807J9199j8034
2554g61015M454j7538L1375l0296L4917k6982L876j1928K6964m189N657l2777
2542g77482J8215o439K4755l4083M47K7942j2350j8365L285M2182o0727K2062
2530g70558M9489n4621J085Q912J4560l3445M0548l9910K2082J0999M9827r9743
2518h00775M7983l5359M4514m9219N3132O8182o0819q356L2485k649k8063m8875
2506g87819P013M3236k5778K5644l2911Q482j3357L2874n5558K7890j5858M1035
2494g45107l7946J6573J9005M0491k8155K0017m7055k5203M7153m0881N0147n131
$$ y = [-742863, -727554, -723057, -752222, -706010, -749779, -738082, -759603, -739562, -812483, -763688, -755067, -760648, -770774, -760921, -730987, -769790, -778046, -759919, -771990, -791020, -782987, -762180, -742981, -761015, -756561, -774099, -742724, -773020, -738103, -765085, -761209, -773137, -746173, -750362, -744705, -777482, -759267, -765706, -740951, -775034, -774587, -746645, -758995, -777360, -774075, -731893, -792620, -770558, -721069, -775690, -774605, -765693, -751133, -784578, -744030, -783940, -761858, -750859, -701032, -800775, -752792, -788151, -743637, -792856, -739724, -671542, -732361, -740717, -708232, -710881, -738944, -787819, -780806, -737570, -763348, -737704, -770615, -762133, -775490, -742616, -798174, -770284, -786142, -745107, -783053, -766480, -747475, -706984, -735139, -715122, -762177, -787380, -740227, -781108, -730961, -736092]
2482g36092n114k4929j690J292k900K0376l1834P575j6547L5487k010M2910k4874
2469g38350J0802k8263j211K4050m4897K1972k7278P4719k2498j2917m1877L1158
2457g54590k7555l1090M9063o657J6781l505J0601l5596O1408m1521l938K1303
2445g45296P201j1812m4861r680J6153M010K7332q795l3109m744O3864j6536l1173
2432g87446K5449j6695L6944l6286O4103m4923n6331K5574K8833l4334M3053q8284
2420h40343N3543P66j068R331q571M754N9334n0083m0560M9070L8830p2709K5259
2407g72447j4892K4945M9161p3076j5062J2506j5280M4585l3635o808J129K1482
2395g77392l7562L0359J8331k1444L2236o562l1639L1033M299K4104k9469N609
$$ y = [-736092, -741206, -766135, -767825, -766533, -769433, -749057, -780891, -773316, -789863, -754376, -756386, -713476, -738350, -727548, -755811, -757022, -732972, -777869, -755897, -783175, -708456, -730954, -743871, -785748, -754590, -782145, -813235, -764172, -770829, -754048, -757553, -746952, -782548, -721140, -762661, -766599, -745296, -738095, -749907, -794768, -804448, -788295, -784285, -756953, -765748, -798857, -803601, -739737, -756273, -787446, -761997, -778692, -741748, -778034, -713931, -758854, -815185, -789611, -760778, -795112, -752059, -840343, -786800, -786034, -787102, -777771, -786342, -781588, -722254, -772337, -812897, -763827, -724997, -797706, -772447, -787339, -762394, -713233, -786309, -801371, -788865, -804145, -759560, -793195, -800003, -798874, -777392, -814954, -784595, -766264, -787708, -755472, -762034, -793673, -762640, -758341, -734237, -763706, -758097]
2383g58097o056k9412K4880m2041J3734J2716K1778r090K9356q9009R0743l3841
2371g74339J2125l7366q625K3200p519m4474N2661K4266J5982l6114K4008m2269
2359g98464k958N0499q2970K8509J428J7976L5853j4840j2727N574k2038K0935
2347g73223j4913j9805j0368L3681J7387j4810q808j3577k7011O133N0777o2847
2335h37384Q167J6922Q18J8983M6742k4771j4536l5215J9745p052O9155j8920
2323g57346o1100N9789l1099j8558j7632j6747K0980K048L7012k5315J6012J9686
2311g72270J196j9305j0896j2586J8394J7125k3220L066j4100J6273m322O07J729
2298g98309l6190L5797M298o1561L1982o731J5220J7750N194K141j3737J6250
$$ y = [-758097, -764153, -793565, -768685, -810726, -796992, -784276, -762498, -771588, -742232, -831241, -740498, -774339, -762214, -799580, -808205, -785005, -792524, -836998, -784337, -760071, -744089, -780203, -756195, -798464, -801422, -750923, -833893, -805384, -803956, -785980, -750127, -764967, -777694, -772120, -794158, -773223, -788136, -807941, -818309, -784628, -767241, -782051, -790859, -804436, -831447, -825314, -774537, -837384, -829217, -812295, -811477, -792494, -745752, -770523, -785059, -820274, -800529, -807581, -738426, -757346, -818446, -758657, -789756, -808314, -825946, -842693, -821713, -819665, -782653, -807968, -791956, -772270, -771074, -790379, -801275, -813861, -795467, -778342, -801562, -798496, -812596, -796323, -800645, -800038, -798309, -834499, -798702, -794404, -855965, -823983, -830714, -815494, -797744, -792550, -790409, -804146, -787896]
2286g87896L213p3473P0355K015j6332K2271m2954O6114k0999l8663L7394j1359
2274g90314k5553K8195l4489o581M8884k2566O6520p8184L9300n1307l034o850
2262h35979L7623Q338l4778K4769J5665N122k4008K6824n1134M3286J8198o3300
2250h29374L8757K7306n6703P1214j6719n844m0800M7397l0985n655L566k3897
2238h21737j2417N1595J0787m0096q010o954P546m368N9636o8606K0775J8969
2226g92880j4270m8326N4251l8284M2997k9311N8380k2080n337K243l771r588
2214h05976J9815l6287j1001N4963K0926o7754k4939P1634j2850O463j7747j3676
2202h16429L2170q5694J00084k8903n3004O7346m9242O4961j830m2337L3165j0901
$$ y = [-787896, -784683, -858156, -787801, -785786, -802118, -779847, -822801, -756687, -777686, -816349, -778955, -790314, -815867, -787672, -822161, -828742, -779858, -802424, -735904, -814088, -774788, -826095, -829129, -835979, -798356, -790018, -824796, -800027, -784362, -779240, -803248, -776424, -827558, -784272, -766074, -829374, -790617, -763311, -820014, -748800, -765519, -771363, -812163, -764766, -795751, -801406, -797840, -821737, -834154, -782559, -771772, -811868, -819878, -826832, -819286, -823654, -764018, -832624, -811849, -792880, -807150, -855476, -801225, -839509, -796512, -825823, -767443, -789523, -794860, -792617, -796388, -805976, -786161, -822448, -833449, -778486, -757560, -825314, -850253, -778619, -791469, -785006, -802753, -816429, -784259, -869953, -769869, -798772, -851776, -784430, -833672, -768711, -770541, -812878, -779713, -790614]
2190g90614n2001M7665k9683l863K1514L2418k195m3701K3486L7215k9023Q029
2178g80753j9278J5763n0110M730M2113n790m3387K8060k7005J5111k2417J00525
2166g42438n9390j0148k3767O1569l0531q083j753L9508n0607J3271p712L111
2154h16970K3032k1608P822L846l2759j246RN0318l2403J7934m8494N8486m0490
2141h32523J7196j2499L6016o2240J2118J9876o901o680L5463j113J9336j1746
2129g93697l0716P194J345K0418l3361N936J6247j7244K9398k1339p371O9277
2117g53913j00091O2688o3570N3651P83L7501n6789M0068m5357k58J8514Q062
2105g98711K1284k1593k5869J8179J092K7025J1852o7824o1824O3677o603p970
$$ y = [-790614, -842615, -794950, -824633, -828496, -806982, -774564, -776759, -820460, -796974, -759759, -788782, -780753, -800031, -784268, -834378, -829648, -787535, -793325, -836712, -808652, -835657, -820546, -842963, -742438, -801828, -811976, -835743, -774174, -804705, -812788, -814541, -775033, -825640, -812369, -820081, -816970, -793938, -815546, -807724, -803878, -836637, -837883, -837874, -787556, -819959, -802025, -850519, -792033, -832523, -815327, -827826, -791810, -854050, -841932, -822056, -828957, -835637, -800174, -801287, -781951, -793697, -824413, -817219, -815874, -795456, -828817, -822881, -806634, -823878, -794480, -815819, -823190, -753913, -854004, -791316, -854886, -801235, -800452, -762951, -819740, -779672, -825029, -825287, -806773, -798711, -777427, -799020, -824889, -806710, -805618, -778593, -766741, -834565, -896389, -832712, -839315, -847285]
2093h47285L5647R423l3017j2480P734J7152j5222j4515K8751l053M920k1671
2081h43616Q1063o5644L2322n9959J5253J3814L0760k3638j9613k2517N2537l1185
2069h40423N0621p6441N6449k5164K6593o2672M9712j3623j0601M5816L5832q3426
2057h47327M355M2522n5530K950K5333o37n707m138P750k4399O7098j3038j754
2044h02522l1352J3904L5287l1288j9658J8502q347M034p194J6454k1779L5962
2032g97997k1030O796o940m08m1873M3959j0541J1311l1280K7568m1925L5966
2020h26394J9435o5432N4584j3783k3610L6909K2328Q053k1090Q232j3551p290
2008h21609P624k7012J5115j4355J1489M2057m4716N0181l2826m821k1565O550
$$ y = [-847285, -811638, -802215, -835232, -847712, -839978, -822826, -838048, -852563, -823812, -826865, -821945, -843616, -762553, -828197, -795875, -855834, -840581, -826767, -796007, -819645, -839258, -861775, -809238, -840423, -789802, -866243, -809794, -834958, -808365, -871037, -821325, -834948, -845549, -799733, -763901, -847327, -842972, -800450, -855980, -853030, -827697, -828334, -834041, -838179, -830429, -854828, -787730, -800768, -802522, -833874, -819970, -784683, -815971, -835629, -817127, -825474, -821440, -828634, -812180, -833959, -797997, -819027, -812231, -819171, -819579, -861452, -817493, -828034, -816723, -848003, -820435, -862360, -826394, -806959, -872391, -817807, -831590, -855200, -818291, -795963, -787910, -809000, -800768, -814319, -821609, -813985, -840997, -825882, -840237, -828748, -786691, -831407, -781226, -814052, -818873, -840438, -833888]
1996h33888M3462L2282q0654L1832n413L0867n8537l6519J08355r8452M0999Q091
1984h17575k9402P14k4963Q5774n1710P476k925K993l6674M2361j3682K5599p6385
1971h88399M3406r124J1123J9010m3713K5246k7576K9959Q3295o5478l8419m368
1959h65038K1098L5312L3028m1247k7660K669O763K5351k314K3868k669j6149
1947h06988l0855M2919m4242K6430l5807q031M3493l1327q039n2881J00255j4873
1935h19946K548k1215K8351o067k633k5793k3395K5815K6760l0874M8088p0633
1923h68994N0652k552l6935N256N2484j7982j3279k3421J7688j6116L6452R666
1911h07081l3684M9950k8398l086n9612N9230k010M5453k2751j072k6466k1015
$$ y = [-833888, -790426, -758144, -838798, -806966, -812379, -781512, -840049, -876568, -768213, -866665, -825666, -817575, -846977, -846263, -871226, -785452, -837162, -829686, -832611, -829618, -866292, -823931, -837613, -812014, -888399, -844993, -854117, -842994, -823984, -867697, -842451, -870027, -840068, -756773, -822251, -860670, -865038, -843940, -808628, -775600, -816847, -844507, -841838, -835075, -809724, -812038, -788170, -790839, -806988, -837843, -794924, -839166, -812736, -848543, -856574, -813081, -844408, -852447, -905328, -805073, -819946, -817398, -838613, -810262, -816329, -818962, -844755, -868150, -842335, -815575, -846449, -798361, -868994, -818342, -820894, -857829, -852573, -800089, -818071, -831350, -854771, -837083, -853199, -816747, -807081, -840765, -790815, -819213, -822299, -881911, -822681, -824691, -779238, -801989, -803061, -829527, -850542]
1899h50542K3686K1722l6965L833K706L0837p6955J7154N487o410j6617N9332
1887h22732J6081j7838N9987q5526N1900l540k2697J2727k2901L3919n4058L5165
1875h19513m909L925l3875J6134L5982k3171m2828k7271L0365l159M6026k4830
1863h47124L7601n6246k27P4056m3602O2975q2846L6307J1410N479m036k439m0482
1850h49174K7680L711j0717L7039l6544k3291j5431j9454J1264L6553j6005K279
1838h52090o211L4007l2785K4247R322L9733k4998k0684k9845M5971k2147k2636
1826h58116L3933j1505j4939M4785k8279o9403O4482j9357k828L7903l1893m257
1814h59474k047L5836L4546n9095n289L180J6619l434p486R776m2296J3624Q152
$$ y = [-850542, -826856, -805134, -842099, -838266, -835560, -804723, -881678, -864524, -859037, -865447, -882064, -822732, -806651, -824489, -764502, -850028, -798128, -801668, -824365, -811638, -834539, -800620, -854678, -819513, -824422, -820497, -854372, -838238, -802256, -825427, -868255, -895526, -865161, -868320, -822294, -847124, -809523, -865769, -865996, -791940, -835542, -772567, -855413, -819106, -807696, -802217, -806253, -808692, -849174, -821494, -817783, -828500, -791461, -828005, -851296, -866727, -886181, -874917, -838364, -854369, -852090, -858301, -824294, -857079, -832832, -823510, -783777, -808775, -829459, -859304, -813333, -835480, -858116, -824183, -835688, -850627, -805842, -834121, -903524, -839042, -858399, -861227, -823324, -855217, -859474, -861521, -825685, -791139, -850234, -855523, -852343, -835724, -839158, -846644, -836868, -879164, -865540, -857388]
1801h57388M1167l7133m6951M6455J7598O291n1689N3265j3690M1135r1039N9677
1789h32302j4145k0063K514L3235k3744l2837M04k779J5750J6788k5494O0089
1777h22584o625L494j1958l1740k934J2730J7286K2695k8332M714O003J315O817
1764h29119p0918M7444n553J6675J9765J213l5007J0159l1745L5165K5144K0820
1752g95957m4414j3989l3055M8155J457l2008J7827m6764O6882K6417m6827m1278
1740h93554Q5797k8988j4314l5071Q1763k8303l0353L5392N0159o1931k7887l368
1728h70658L3101J776K4806J2865n0014j3026n425Q628K1555k9003K7645K7033
1716h10717m5639L6320j5342j490r191l6272O2658J2467q0556M0334J9038j2606
$$ y = [-857388, -816221, -853354, -900305, -853850, -836252, -829961, -881650, -828385, -842075, -800940, -891979, -832302, -846447, -866510, -863996, -830761, -854505, -887342, -886938, -889717, -873967, -857179, -882673, -822584, -829209, -825715, -837673, -869413, -872347, -859617, -842331, -819636, -847968, -843254, -837251, -835936, -829119, -900037, -852593, -858146, -841471, -821706, -820493, -855500, -845341, -877086, -841921, -816777, -795957, -840371, -854360, -887415, -839260, -837803, -869811, -851984, -898748, -831866, -805449, -852276, -893554, -807757, -836745, -851059, -886130, -804367, -832670, -863023, -827631, -777472, -839403, -867290, -870658, -837557, -835781, -810975, -798110, -848124, -861150, -866575, -857947, -836392, -865395, -837750, -810717, -856356, -820036, -835378, -836868, -846059, -882331, -819673, -807206, -887762, -847428, -828390, -840996]
1704h40996l1909K8501k4969K3746r303M5333l6797P406O067j1028K4149J2550
1692h07250o210q136n9814J9888j3145J4115K5270l5839J8868m3542K2128o2426
1680i36093J9637N7284Q142J7779L2212l3843j7134K3040j2111j5202J0478K368
1668h43443n3051M5573k9523J0144N1543q3872L5541K1847j5771l1678J6979K1041
1656h54670o988Q5077n8417j5222L8517n6824n393k2090P7185o5793J4613N8643
1644h11362q340n6861M0086N9189n2320m1087L7772o0373N7386j7626j3638J6807
1632h50367R289j4373K454l6288j006N5998k2018k0308l0319N2918Q081j1305
1620h57244j6643K5549J2712k0998L8831p411Q526q0630N6971J7391n7321M4678
$$ y = [-840996, -872905, -844404, -869373, -845627, -854930, -809597, -846394, -838988, -832921, -843949, -819800, -807250, -813460, -821596, -881410, -861522, -874667, -860552, -835282, -871121, -852253, -895795, -873667, -936093, -916456, -859172, -851030, -833251, -801039, -834882, -852016, -828976, -841087, -856289, -845811, -843443, -896494, -850921, -880444, -870300, -818757, -902629, -867088, -845241, -861012, -892690, -875711, -854670, -861658, -776581, -834998, -850220, -811703, -868527, -873920, -896010, -818825, -884618, -870005, -811362, -819702, -876563, -836477, -777288, -829608, -870695, -832923, -893296, -835910, -853536, -867174, -850367, -841078, -855451, -852997, -889285, -890291, -834293, -856311, -876619, -906938, -854020, -845939, -857244, -873887, -848338, -835626, -856624, -817793, -825204, -816678, -897308, -840337, -822946, -880267, -835589]
1608h35589l6333k0353N6499o2953M1641K7727k5125J0556k755o340L7998l6242
1596h51269K7054J364j2832Q674m4261N847K6177j9153K1052p193K8123k8047
1584h44464l4417J1660J3496j7968J4268r330K0892m4932R3412o0534L5575J1118
1572h11224m1884k103J0778l3251k6041N6843K3057k8873k01k8m94m8803N4941
1559h47283k7695K7882r090k9808J5290m962N5153k3734k2197j783m6643O5210
1547h49660j5111l7296N2795j4446J4478m744K2134l0349M818K1228O242J4085
1535h15826p7432P8112o6606L4775J3139m5130K2913l2642L9636m5194M0719K1913
1523h31623m0258K6300K437j10j8600j1437L0488q349K2631n3236L4366j0211
$$ y = [-835589, -871922, -892275, -835776, -898729, -857088, -829361, -854486, -843930, -846685, -853025, -815027, -851269, -824215, -822851, -835683, -827009, -871270, -865423, -839246, -858399, -837347, -844540, -816417, -844464, -878881, -867221, -853725, -871693, -857425, -866755, -845863, -890795, -797383, -857917, -822342, -811224, -853108, -855211, -844433, -877684, -903725, -846882, -823825, -852698, -852899, -852927, -853421, -902224, -847283, -874978, -847096, -856186, -885994, -870704, -875666, -820513, -844247, -866444, -868227, -914870, -849660, -864771, -902067, -849272, -863718, -849240, -853984, -831850, -862199, -857381, -836153, -829911, -815826, -893258, -815146, -881752, -846977, -833838, -878968, -856055, -888697, -849061, -894255, -853536, -831623, -871881, -845581, -843144, -843254, -861854, -873291, -842803, -851152, -828521, -881757, -847391, -857602]
1511h57602n6800O5473r898j589J3210M9195j24638O9253j0748M07N0265l9739
1499h53211K3195n9305L4222M4694n7030k0612N01K5307K516k1645J0681k3795
1487h94482N3361K644j2125J264K520k9757O6855n1931K5804J0087k1137J451
1475h45446k8492K1825o2918N1624k3707k800N1421J1718p785n0714j2474K6960
1463h70788L5352n499n4878K4119j9116M3009j1654M2307l8108o9349L3564R171
1451h81870L280m557j1806J6837j3578M4959J9000m5833o3901L8444P0663l5254
1439h63616o383L7716j5431j2995K6671l0604P823M6967q2191K3258K6923m532
1427h46394j144j7447k5303J1253k1159J1414K5145M878j5208m6080N7544K2662
$$ y = [-857602, -914402, -848929, -858827, -860416, -847206, -798011, -922649, -853396, -864144, -863737, -813472, -853211, -830016, -889321, -855099, -810405, -867435, -888047, -887546, -862239, -859723, -881368, -870687, -894482, -841121, -838477, -850602, -849338, -846818, -876575, -809720, -861651, -835847, -825760, -846897, -845446, -873938, -852113, -915031, -863407, -887114, -889914, -838493, -826775, -834560, -885274, -897748, -870788, -835436, -840935, -895813, -871694, -890810, -847801, -859455, -817148, -855256, -924605, -891041, -881870, -878590, -883147, -894953, -878116, -891694, -846735, -827735, -873568, -937469, -899025, -828362, -863616, -869999, -832283, -847714, -860709, -834038, -864642, -856819, -809852, -892043, -868785, -841862, -846394, -847538, -864985, -890288, -879035, -900194, -888780, -863635, -858757, -873965, -920045, -862501, -839839]
1415h39839k8373l8231j6476L4206L2883k3185P119l180K3071k3475m2566N0490
1403h67556k5236K5577N367K305J5541P477j1784m0557M3248k2775J0511m8101
1391i05983M1245m5216K7159J8559l3489L0485m6397M3360J2919l1539p172M0022
1379h56047m616j3215K2613J2906J1007m365l2470K8606l6742m1398L5515k8534
1367i06740J2982L5672n1318M9595M368K1347l0961K4471P311o3439J4835J310
1355h80567n1692J04210k5929l8072M2894j3082Q594k0914o742j722L4483r874
1343h58413j7848K9099Q0k2474m1127L8541k183L259K3935r884J2061k1766k0872
1330h87592K014L3427M274k5670J5706N0144o1427O337L3209k3058k5069J1977
$$ y = [-839839, -868212, -906443, -922919, -888713, -855830, -879015, -871896, -875076, -852005, -875480, -918046, -867556, -892792, -867215, -861848, -859543, -844002, -836525, -848309, -888866, -845618, -868393, -857882, -905983, -864738, -909954, -882795, -864236, -897725, -867240, -913637, -870277, -857358, -888897, -896069, -856047, -860663, -873878, -851265, -838359, -827352, -831717, -864187, -835581, -872323, -913721, -878206, -906740, -893758, -858086, -909404, -859809, -855441, -834094, -865055, -840584, -833273, -896712, -881877, -880567, -932259, -828049, -853978, -892050, -849156, -862238, -853644, -874558, -881300, -883022, -848539, -858413, -876261, -847162, -847082, -869556, -910683, -872142, -874325, -871066, -847131, -857015, -844954, -866720, -887592, -885578, -852151, -847877, -873547, -857841, -807697, -869124, -862787, -829578, -852636, -877705, -865728]
1318h65728k5984L8161o3274L1909m1536M4004J9966J1869J0355k3725l918M64
1306h67437K583R942j9514j2215l277k1452L6094o683N2648l5795R50l7245L6653
1293h64748J0146k8904J3017j366j0482J3868J3307K1685j1444k0027J4491l2954
1281h83411j4865L7887k794j1723j5858K3697M187J4877k2692J8426k6357K0365
1269h58261n4921P1018j4944J4731m3623J5210K3580p7129M513N9235j478n9369
1257i21438L4158Q480m2556P0171k3920p157J2340n995L8261o865N939M325k7429
1244h61686K1542p3806J4336O211r617K7026r557j2170K3640k931l4014L2391
1232h78635L2244m1016J3661M0243J0358j1557q7846N0423j5097R879J8967J3054
$$ y = [-865728, -891712, -853551, -916825, -884916, -926452, -882448, -862482, -850613, -840258, -863983, -867901, -867437, -864854, -854912, -874426, -886641, -889918, -911370, -875276, -881959, -829311, -865106, -864156, -901401, -864748, -854602, -883506, -870489, -871855, -882337, -868469, -855162, -833477, -844921, -864948, -850457, -883411, -898276, -860389, -863183, -874906, -890764, -867067, -862880, -848003, -870695, -852269, -878626, -858261, -913182, -842164, -857108, -842377, -886000, -870790, -847210, -924339, -919826, -860591, -862069, -921438, -887280, -878800, -921356, -851185, -875105, -882262, -869922, -875917, -837656, -844521, -838582, -834257, -861686, -840144, -913950, -899614, -893403, -903020, -875994, -885551, -897721, -874081, -877012, -911026, -878635, -846391, -887407, -873746, -833503, -823145, -834702, -922548, -872125, -887222, -877343, -858376, -845322]
1220h45322k9324J4547n0140R077R309K1735j3542p241J4533Q691j3946k791L4046
1207h50368l4206k6669Q909M8576n7529J6381K9217n226r722P736j3719P148K850
1194h76622j5000r026O7332L030o9367K4168K9171o9514P4700n3271o980J4833
1182h86546l2778L6619k8605P2745q1585O4379K7695k6023K728j2159Q071O810
1170h48649o2640K1843K2524k4732K1937j7813P6260p2055K262r334Q117J0243
1158h72037M1285p1481j787k3533L9461o809J0992k3468K1723K7239j3890j5897
1146h88202j7257o884O3022m9488O3582p551k2569l6697N4026k929k4667L0428
1134h45186m2542j4327O2492q4429J1853J8657j5635L9555k7218L4321M8413j10802
$$ y = [-845322, -874646, -860099, -910239, -901162, -891853, -870118, -883660, -890901, -876368, -867677, -881623, -884414, -850368, -884574, -911243, -902334, -853758, -911287, -894906, -865689, -870915, -880637, -872901, -886620, -879472, -876622, -891622, -900648, -833316, -830286, -899653, -875485, -846314, -915828, -841128, -894399, -901379, -886546, -919324, -882705, -911310, -838565, -920150, -855771, -828076, -854099, -851371, -863530, -855459, -848649, -911289, -889446, -866922, -891654, -869717, -887530, -811270, -883325, -881063, -890397, -882280, -872037, -830752, -902233, -904020, -927553, -888092, -894901, -883909, -907377, -885654, -858415, -872305, -888202, -905459, -912343, -849321, -898809, -835227, -842778, -865347, -902044, -848018, -850947, -875614, -845186, -887728, -902055, -839563, -923992, -912139, -893482, -909117, -869562, -896780, -862459, -814046, -924848]
1122i24848M0328l2277K8167J2601K280Q503l1232L0319l197K1172m4792J0000
1110h82976O545k0275r683K0915j0647M1000k2305J2347m2001q143J7438j2987
1098i10772m60K7461J064n854P580J66r141j1900K7082K2504m0678M9474r439
1085h52913k8541q889J6976j20l0528K595K2953j9217J6623k7099J5847K5299
1073h67014n7273P2816k4846j1166l4696L3991j9156K0925q628M5145m8199o63
1061h98764M187J4319J532K0477k4228J6083J8128o2036P176j7987J7849l199
1049i06463J4726K3720k0068M589K3388m7701Q0732m1269j6752j0742q350j0673
1037i14863J7759j7437R9634q8803L1706j7039L3912n756l1860P4456n6324L5995
$$ y = [-924848, -884520, -916797, -888630, -876029, -873749, -865246, -896478, -866159, -869356, -848184, -892976, -882976, -876431, -896706, -906389, -885474, -896121, -855121, -877426, -865079, -907080, -915223, -897785, -910772, -911232, -883771, -882707, -888561, -880981, -880815, -889956, -901856, -874774, -852270, -892948, -843474, -852913, -881454, -890343, -873367, -873487, -904015, -901420, -878467, -897684, -881061, -908160, -892313, -867014, -924287, -851471, -876317, -887483, -922179, -888188, -907344, -886419, -895047, -849902, -898101, -898764, -894577, -880258, -878726, -858249, -882477, -866394, -848266, -910302, -903126, -921113, -903264, -906463, -891737, -868017, -888085, -883496, -860108, -907809, -827077, -868346, -885098, -895840, -904190, -914863, -897104, -914541, -814907, -903710, -872004, -889043, -855131, -860887, -892747, -818291, -874615, -838620]
1025h38620n6773R86J7960J5312m9046j4500K3540l2899N11N5758K894K4950k1901
1012h71828l1828O2349j5222p2958P6872r704m1872j8330J9777o994J8117l158
1000h94779n3453N6235l001J7909k3231N6305l2250n582M1786n2903Q759k9664
988i13869N332L4407o6886O6580r270j0678m0497J9085N8554n7495L0435k6795
976i11097n0501M7595L6548n1229O623J6784K1385M2440o2846R334j8716L8951
964h74729M3158o1388k1313M865p447N922J111L0921K5837m9298J17N7815l1527
951h75956k6664O3944r0876K0548K5838m8935K6217m508L3230n4580N4653k8608
939i05697J7366L7620l3247m5275K1809J6468k2852q251L4394j5379k0823L3886
$$ y = [-838620, -895393, -894407, -876447, -861135, -910181, -924681, -901141, -934040, -933529, -877771, -874877, -849927, -871828, -903656, -841307, -856529, -929487, -852615, -862319, -904191, -922521, -902744, -909738, -891621, -894779, -948232, -891997, -894998, -877089, -900320, -844015, -876265, -881847, -840061, -892964, -884205, -913869, -908537, -874130, -941016, -874436, -883706, -894384, -934881, -915796, -857242, -914737, -884302, -911097, -961598, -914003, -877455, -928684, -922061, -905277, -883892, -841452, -904298, -894964, -913680, -874729, -831571, -892959, -914272, -909407, -916854, -910932, -909821, -878900, -853063, -902361, -902244, -844429, -875956, -902620, -838676, -929552, -909004, -883166, -932101, -905884, -910392, -877162, -931742, -877089, -905697, -888331, -850711, -883958, -929233, -907424, -890956, -913808, -922059, -887665, -903044, -923867, -889981]
927h89981J1078J0331m3914K6155j7964Q911r649k573L0200k0399J5053o6406
$$ y = [-889981, -878903, -868572, -912486, -886331, -904295, -895384, -905033, -907606, -877406, -897805, -882752, -949158]
$$ [...]
##END NTUPLES=NMR SPECTRUM
##END=
