##TITLE=abcd
##JCAMPDX= 6.0         $$ Bruker NMR JCAMP-DX V2.0
##DATA TYPE= NMR SPECTRUM
##DATA CLASS= NTUPLES
##ORIGIN= UXNMR, Bruker Analytische Messtechnik GmbH
##OWNER= root
$$ XWIN-NMR		Version 3.5
$$ Sat Feb 28 11:27:12 2026 Russian Standard Time (UT+4h)  servis@DPX200
##.OBSERVE FREQUENCY= 200.131235884673
##.OBSERVE NUCLEUS= ^1H
##.ACQUISITION MODE= SIMULTANEOUS
##.ACQUISITION SCHEME= undefined
##.AVERAGES= 16
##.DIGITISER RES= 18
##SPECTROMETER/DATA SYSTEM= spect
##.PULSE SEQUENCE= zg
##.SOLVENT NAME= DMSO
##.SHIFT REFERENCE= (INTERNAL, DMSO, 0, 16.4885)
##AUDIT TRAIL= $$ (NUMBER, WHEN, WHO, WHERE, WHAT)
$$ ##TITLE= Audit trail, XWIN-NMR		Version 3.5
$$ ##JCAMPDX= 5.01
$$ ##ORIGIN= Bruker BioSpin GmbH
$$ ##OWNER= servis
$$ F:\spectra/data/av/nmr/H1/1/pdata/1/auditp.txt
$$ ##AUDIT TRAIL=  $$ (NUMBER, WHEN, WHO, WHERE, WHAT)
(   1,<2026-02-28 11:26:28.98 +0400>,<servis>,<DPX200>,
      <created by zg, POWCHK disabled, PULCHK disabled
       terminated by command 'halt'
       configuration hash MD5:
       00 E9 B6 7A A2 85 ED C7 34 08 36 98 17 FE 4E 26
       data hash MD5: 32K
       84 45 F9 E5 FD 9D 93 9B A1 B4 74 DB 53 8A EA 53>)
(   2,<2026-02-28 11:26:31.90 +0400>,<servis>,<DPX200>,
      <Start of raw data processing
       efp BC_mod = 2 LB = 0.05 FT_mod = 6 PKNL = 1 PHC0 = -258.2463 PHC1 = 6.301564 SI = 16K 
       data hash MD5: 16K
       1D 81 BD DE 1D DA FF 29 05 51 A6 44 CE C0 90 7E>)
(   3,<2026-02-28 11:26:44.71 +0400>,<servis>,<DPX200>,
      <abs ABSG = 5 
       data hash MD5: 16K
       34 CD 16 63 F8 DE 2B 9C DD 69 10 08 05 4D E1 19>)
$$ ##END=
$$ 
$$ hash MD5
$$ 99 91 AA 32 A1 D7 15 AD D7 40 B5 CA BA AE 82 0C
##$RELAX= 
##$RELAX= 
##$RELAX= 
##$RELAX= 
##$RELAX= 
##$RELAX= 
##$RELAX= 
##$RELAX= 
$$ Bruker specific parameters
$$ --------------------------
##$DU= <F:\spectra>
##$EXPNO= 1
##$NAME= <H1>
##$PROCNO= 1
##$TYPE= <nmr>
##$USER= <av>
##$AMP= (0..31)
100 100 100 100 100 100 100 100 100 100 100 100 100 100 100 100 100 100 
100 100 100 100 100 100 100 100 100 100 100 100 100 100 
##$AQSEQ= 0
##$AQ_mod= 1
##$AUNM= <au_zg>
##$AUTOPOS= <>
##$BF1= 200.13
##$BF2= 200.13
##$BF3= 200.13
##$BF4= 200.13
##$BF5= 500.13
##$BF6= 500.13
##$BF7= 500.13
##$BF8= 500.13
##$BYTORDA= 1
##$CFDGTYP= 0
##$CFRGTYP= 5
##$CHEMSTR= <none>
##$CNST= (0..31)
1 1 145 1 1 1 1 1 1 1 1 1 1 1 1 1 1 1 1 1 1 1 1 1 1 1 1 1 1 1 1 1 
##$CPDPRG= <>
##$CPDPRG1= <>
##$CPDPRG2= <>
##$CPDPRG3= <>
##$CPDPRG4= <mlev>
##$CPDPRG5= <mlev>
##$CPDPRG6= <mlev>
##$CPDPRG7= <mlev>
##$CPDPRG8= <mlev>
##$CPDPRGB= <>
##$CPDPRGT= <>
##$D= (0..31)
0 2 0 0 0 0 0 0 0 0.06 0 0 0 0 0 0 0.0002 0 0 0 0 0 0 0 0 0 0 0 0 0 0 
0 
##$DATE= 1772263588
##$DBL= (0..7)
120 120 120 120 120 120 120 120 
##$DBP= (0..7)
150 150 150 150 150 150 150 150 
##$DBP07= 0
##$DBPNAM0= <>
##$DBPNAM1= <>
##$DBPNAM2= <>
##$DBPNAM3= <>
##$DBPNAM4= <>
##$DBPNAM5= <>
##$DBPNAM6= <>
##$DBPNAM7= <>
##$DBPOAL= (0..7)
0.5 0.5 0.5 0.5 0.5 0.5 0.5 0.5 
##$DBPOFFS= (0..7)
0 0 0 0 0 0 0 0 
##$DE= 6
$$ [...]
##$SUBNAM5= <"">
##$SUBNAM6= <"">
##$SUBNAM7= <"">
##$SUBNAM8= <"">
##$SUBNAM9= <"">
##$SW= 20.6817932712277
##$SWIBOX= (0..15)
0 0 3 0 0 0 0 0 0 0 0 0 0 0 0 0 
##$SW_h= 4139.07284768212
##$TD= 32768
##$TD0= 1
##$TE= 0
##$TE2= 300
##$TE3= 300
##$TEG= 300
##$TL= (0..7)
0 120 120 120 120 120 120 120 
##$TP= (0..7)
150 150 150 150 150 150 150 150 
##$TP07= 0
##$TPNAME0= <>
##$TPNAME1= <>
##$TPNAME2= <>
##$TPNAME3= <>
##$TPNAME4= <>
##$TPNAME5= <>
##$TPNAME6= <>
##$TPNAME7= <>
##$TPOAL= (0..7)
0.5 0.5 0.5 0.5 0.5 0.5 0.5 0.5 
##$TPOFFS= (0..7)
0 0 0 0 0 0 0 0 
##$TUNHIN= 0
##$TUNHOUT= 0
##$TUNXOUT= 0
##$USERA1= <user>
##$USERA2= <user>
##$USERA3= <user>
##$USERA4= <user>
##$USERA5= <user>
##$V9= 5
##$VALIST= <valist>
##$VCLIST= <CCCCCCCCCCCCCCC>
##$VD= 0
##$VDLIST= <DDDDDDDDDDDDDDD>
##$VPLIST= <PPPPPPPPPPPPPPP>
##$VTLIST= <TTTTTTTTTTTTTTT>
##$WBST= 1024
##$WBSW= 30
##$XGAIN= (0..3)
0 0 0 0 
##$XL= 0
##$YL= 0
##$YMAX_a= 1235788
##$YMIN_a= -773316
##$ZGOPTNS= <>
##$ZL1= 120
##$ZL2= 120
##$ZL3= 120
##$ZL4= 120
##$ABSF1= 16.48848
##$ABSF2= -4.193441
##$ABSG= 5
##$ABSL= 3
##$ALPHA= 0
##$AQORDER= 0
##$ASSFAC= 0
##$ASSFACI= 0
##$ASSFACX= 0
##$ASSWID= 0
##$AUNMP= <proc_1d>
##$AZFE= 0.1
##$AZFW= 0.1
##$BCFW= 0
##$BC_mod= 2
##$BYTORDP= 0
##$COROFFS= 0
##$CY= 18.4799938201904
##$DATMOD= 1
##$DC= 0
##$DFILT= <>
##$DTYPP= 0
##$F1P= 9.9274215381318
##$F2P= -0.165520771350173
##$FCOR= 1
##$FTSIZE= 16384
##$FT_mod= 6
##$GAMMA= 0
##$GB= 0
##$INTBC= 1
##$INTSCL= 4.127829e-11
##$ISEN= 128
##$LB= 0.05
##$LEV0= 0
##$LPBIN= 0
##$MAXI= 10000
##$MC2= 0
##$MEAN= 0
##$ME_mod= 0
##$MI= 50
##$NCOEF= 0
##$NC_proc= -6
##$NLEV= 6
##$NOISF1= 3.799351
##$NOISF2= 2.8
##$NSP= 0
##$NTH_PI= 0
##$NZP= 0
##$OFFSET= 16.48848
##$PC= 4
##$PHC0= -258.2463
##$PHC1= 6.301564
##$PH_mod= 1
##$PKNL= yes
##$PPARMOD= 0
##$PSCAL= 4
##$PSIGN= 0
##$REVERSE= no
##$SF= 200.130005582386
##$SI= 16384
##$SIGF1= 3
##$SIGF2= 2
##$SINO= 400
##$SIOLD= 16384
##$SREGLST= <1H.CDCl3>
##$SSB= 0
##$STSI= 16384
##$STSR= 0
##$SW_p= 4139.07284768211
##$SYMM= 0
##$S_DEV= 0
##$TDeff= 32768
##$TDoff= 0
##$TI= <>
##$TILT= no
##$TM1= 0
##$TM2= 0
##$TOPLEV= 0
##$USERP1= <user>
##$USERP2= <user>
##$USERP3= <user>
##$USERP4= <user>
##$USERP5= <user>
##$WDW= 1
##$XDIM= 16384
##$YMAX_p= 415948801
##$YMIN_p= -775674
$$ End of Bruker specific parameters
$$ ---------------------------------
##NTUPLES= NMR SPECTRUM
##VAR_NAME=  FREQUENCY,     SPECTRUM/REAL,   SPECTRUM/IMAG
##SYMBOL=    X,             R,               I
##VAR_TYPE=  INDEPENDENT,   DEPENDENT,       DEPENDENT
##VAR_FORM=  AFFN,          ASDF,            ASDF
##VAR_DIM=   16384,         16384,           16384
##UNITS=     HZ,            ARBITRARY UNITS, ARBITRARY UNITS
##FACTOR=    0.252644378177508, 1,           1
##FIRST=     3299.83951724647, 0,            0
##LAST=      -839.233330435636, 0,           0
##MIN=       -839.233330435636, -775674,     0
##MAX=       3299.83951724647, 415948801,    0
$$ Real data points
##PAGE= N=1
##DATA TABLE= (X++(R..R)), XYDATA
$$ [...]
$$ plain form
8267 372518 600766 611041 789915 637216 646991 990067 1037154 1108111 1331791 1383383 1333770
8256 1333770 1223691 1200520 1108365 1153887 1177499 1073896 1110060 861871 845844 735241 760268
8245 760268 652037 551116 557303 636512 417527 455221 427191 418685 513285 450724 462226
8234 462226 428787 486854 360220 504944 474373 510988 604881 449232 564438 659325 548397
8223 548397 498427 465880 461078 488380 561336 739073 839861 909579 738089 986845 1236291
8212 1236291 1353649 1490739 1736366 2055451 2055454 2022087 1829591 1801148 1634258 1557174 1147872
8201 1147872 1073286 1047891 947801 916997 803212 752312 940626 1109334 1386026 2274175
8191 2274175 1281796 1521249 1583093 1968808 2491750 3389845 4479638 5759013 6559457
$$ packed form
8267C72518K28248J0275J78874j52699R775L43076M7087P0957K23680N1592m9613
8256A333770j10079k3171r2155M5522K3612j03603L6164k48189j6027j10603K5027
8245G60268j08231j00921O187P9209k18985L7694k8030q506R4600o2561J1502
8234D62226l3439N8067j26634J44724l0571L6615R3893j55649J15206R4887j10928
8223E48397m9970l2547m802K7302P2956J77737J00788O9718j71490K48756K49446
8212A236291J17358J37090K45627L19085Ll3367j92496k8443j66890p7084m09302
8201A147872p4586k5395j00090l0804j13785n0900J88314J68708K76692Q88149
8191B274175r92379K39453O1844L85715N22942Q98095J089793J279375Q00444
$$ plain form
8182 6559457 6954483 6819870 5947493 4921981 3794297 3215187 2364930 1890652 1594204
8173 1594204 1294572 1225527 1021072 933605 812945 828371 749765 744429 786924 603558 549987
8162 549987 581052 631520 674490 593420 479187 322696 512880 544890 501774 432879 333739
8151 333739 395316 404324 284944 546673 643028 475467 333930 344239 393531 307754 343049
8140 343049 294543 245201 408776 402338 344056 327098 369753 358817 348604 554160 143303
8129 143303 304436 262330 218264 257924 240920 348693 398594 320027 359569 232614 364250
8118 364250 335900 487917 358691 442534 271126 415336 482605 477706 517641 674058 535630
8107 535630 706500 763776 537468 414012 465560 561921 377079 548642 461207 522787 596149
$$ packed form
8182F559457L95026j34613q72377j025512j127684n79110q50257m74278k96448
8173A594204k99632o9045k04455q7467j20660J5426p8606n336M2495j83366n3571
8162E49987L1065N0468M2970q1070j14233j56491J90184L2010m3116o8895r9140
8151C33739O1577R008j19380K61729R6355j67561j41537J0309M9292q5777L5295
8140C43049m8506m9342J63575o438n8282j6958M2655j0936j0213K05556m10857
8129A43303J61133m2106m4066L9660j7004J07773M9901p8567L9542j26955J31636
8118C64250k8350J52017j29226Q3843j71408J44210O7269m899L9935J56417j38428
8107E35630J70870N7276k26308j23456N1548R6361j84842J71563q7435O1580P3362
$$ plain form
8096 596149 623216 578915 711359 622510 798148 756712 903661 1138958 1226504 1497609 1691204
8085 1691204 1881775 2244875 2511481 2809172 3178772 3260910 3265284 3080292 2863074 2408040
8075 2408040 2227903 1890862 1590704 1430047 1239191 1157041 1056848 1013168 878121 945680
8065 945680 854338 892211 911354 856004 912462 821014 878968 982728 938488 974940 991537
8054 991537 1038715 1102426 1255232 1155150 1116317 1101453 1100274 1054554 1110182 1308927 1212856
8043 1212856 1264999 1434174 1662837 2101048 2557112 2764228 2748296 2917950 2939733 3077325
8033 3077325 3260378 3404366 3379427 3096581 3000387 2742821 2373362 2234725 1826166 1622994
8023 1622994 1301184 1150242 961290 863169 918673 670193 739634 550881 548494 430006
$$ packed form
8096E96149K7067m4301J32444q8849J75638m1436J46949K35297Q7546K71105J93595
8085A691204J90571L63100K66606K97691L69600Q2138M374j84992k17218m55034
8075B408040j80137l37041l00158j60657j90856q2150j00193m3680j35047O7559
8065I45680r1342L7873J9143n5350N6458r1448N7954J03760m4240L6452J6597
8054I91537M7178O3711J52806j00082l8833j4864j179m5720N5628J98745r6071
8043A212856N2143J69175K28663M38211M56064K07116j5932J69654K1783J37592
8033C077325J83053J43988k4939k82846r6194k57566l69459j38637m08559k03172
8023A622994l21810j50942j88952r8121N5504k48480O9441j88753k387j18488
$$ plain form
8013 430006 479315 503560 448096 403724 535135 355046 332886 393372 423014 352295 378656
8002 378656 385557 326714 379446 219221 281497 235456 270295 165429 87522 108654 209126
7991 209126 168748 114927 1842 173830 244218 220099 258444 107665 141152 11114 193
7980 193 -72145 -19978 51236 -89211 83009 -6877 40332 -93756 -47223 171529 64578
7969 64578 -11655 -54468 112480 -35676 7142 -83250 -7386 -82436 65364 120834 -39950
7958 -39950 -13205 120574 90809 -60334 -70268 -122486 -134044 -33853 68424 -55063 154598
7947 154598 76854 -3298 33664 76043 41414 -121857 -52236 -86031 -195254 -43832 -132897
7936 -132897 -134751 -174053 -68570 -109092 -74443 -223572 -4973 -64183 -88207 -189400 -154159
$$ packed form
8013D30006M9309K4245n5464m4372J31411j80089k2160O0486K9642p0719K6361
8002C78656O901n8843N2732j60225O2276m6041L4839j04866p7907K1132J00472
7991B09126m0378n3821j13085J71988P0388k4119L8345j50779L3487j30038j0921
7980A93p2338N2167P1214j40447J72220q9886M7209j34088M6533K18752j06951
7969F4578p6233m2813J66948j48156M2818r0392P5864p5050J47800N5470j60784
7958c9950K6745J33779k9765j51143r934n2218j1558J00191J02277j23487K09661
7947A54598p7744q0152L6962M2379l4629j63271O9621l3795j09223J51422q9065
7936a32897j854l9302J05483m0522L4649j49129K18599n9210k4024j01193L5241
$$ plain form
7925 -154159 -40066 -15450 -75170 -120541 -55233 -106375 -6543 8773 -1510 12886 57362
7914 57362 95183 5505 230635 278217 293023 311657 413943 535871 490729 500245 457319
7903 457319 353444 400877 121747 177236 73285 11014 243282 -23491 126158 86490
7893 86490 32431 -82918 -52556 119458 158554 93585 133434 -18198 74090 -98551 -76081
7882 -76081 -82209 -138949 -109385 13470 -159932 -143163 -141308 -111725 -54203 7576 -132557 -136487
7870 -136487 -244464 -241656 -189340 -139300 -211430 -162061 -238338 -118541 -122244 -186648 -156634 -282343
7858 -282343 -159242 -159947 -208416 -116333 7653 -332885 -390492 -420935 -324258 -296718 -290974 -302468
7846 -302468 -197950 -343554 -234165 -336266 -144414 -135051 -147779 -53388 -233678 -268043 -174499
$$ packed form
7925a54159J14093K4616n9720m5371O5308n1142R9832J5316j0283J4396M4476
7914E7362L7821q9678K25130M7582J4806J8634J02286J21928m5142R516m2926
7903D57319j03875M7433k79130N5489j03951o2271K32268k66773J49649l9668
7893H6490n4059j15349L0362J72014L9096o4969L9849j51632R2288j72641K2470
7882g6081o128n6740K9564J22855j73402J6769J855K9583N7522O1779j40133l930
7870a36487j07977K808N2316N0040p2130M9369p6277J19797l703o4404L0014j25709
7858b82343J23101p05m8469R2083J23986l40538n7607l0443R6677K7540N744j1494
7846c02468J04518j45604J09389j02101J91852R363j2728R4391j80290l4365R3544
$$ plain form
7835 -174499 -314335 -252494 -264092 -216782 -199482 -61917 -173522 -43263 1098 -39590 -154790
7824 -154790 11813 -119839 -157796 -159988 -152819 -167148 -130540 -125672 -142116 -49171 15875 -3319
7812 -3319 1578 49412 -52451 -145194 -32292 -217070 -19484 -34776 56073 27714 142278
7801 142278 101508 73370 -101937 27637 -78419 23394 57066 54600 119792 72615 47628
7790 47628 89306 133390 33135 23279 101910 155773 263348 90889 135338 258332 215147
7779 215147 195390 225916 280260 230171 329481 438391 379001 396106 290726 415173 178878
7768 178878 148318 260971 266507 243885 376937 428541 435629 532746 605001 596867 619564 843922
7756 843922 779913 943471 1018582 1047847 1187476 906260 900840 998205 778165 818223 663322
$$ packed form
7835a74499j39836O1841j1598M7310J7300J37565j11605J30259M4361m0688j15200
7824a54790J66603j31652l7957k192P169j4329L6608M868j6444R2945O5046j9194
7812c319M897M7834j01863r2743J12902j84778J97586j5292R0849k8359J14564
7801A42278m0770k8138j75307J29574j06056J01813L3672k466O5192m7177k4987
7790D7628M1678M4084j00255r856P8631N3863J07575j72459M4449J22994m3185
7779B15147j9757L0526N4344n0089R9310J08910n9390J7105j05380J24447k36295
7768A78878l0560J12653N536k2622J33052N1604P088R7117P2255q134K2697K24358
7756H43922o4009J63558P5111K9265J39629k81216n420R7365k20040M0058j54901
$$ plain form
7745 663322 735282 924812 730301 1011035 1002702 1140475 1257813 1060441 1002454 1188017
7735 1188017 1015881 1035675 1222842 1257833 1319397 1461303 1330559 1404895 1388947 1501679
7725 1501679 1559248 1797563 1773060 1976968 1995575 2233861 2534551 2836539 3010252 3022119
7715 3022119 3152190 3100529 3042672 3135669 3251744 3586468 4068739 4444809 4919033 5401994
7705 5401994 5959495 6604572 7550676 8177618 8810942 9608248 10631283 11838989 13150123
7696 13150123 14832369 16638173 18386704 20697460 24139874 29605423 39063193 58064169
7688 58064169 101337834 148870907 172913816 157699553 117856771 92607736 68518957
7681 68518957 50704340 38400354 28473708 20879222 16569817 13930058 11978591 10580634
$$ packed form
7745F63322P1960J89530j94511K80734q333J37773J17338j97372n7987J85563
7735A188017j72136J9794J87167L4991O1564J41906j30744P4336j5948J12732
7725A501679N7569K38315k4503K03908J8607K38286L00690L01988J73713J1867
7715C022119J30071n1661n7857R2997J16075L34724M82271L76070M74224M82961
7705E401994N57501O45077R46104O26942O33324P97306J023035J207706J311134
7696A3150123J682246J805804J748531K310756L442414N465549R457770J9000976
7688E8064169M3273665M7533073K4042909j5214263l9842782k5249035k4088779
7681F8518957j7814617j2303986r926646p594486m309405k639759j951467j397957
$$ plain form
7673 10580634 9614094 8937510 8501983 7923463 7698985 7194552 6972861 7041400 6552109 6427841
7663 6427841 6357117 6250580 6163913 5987436 5711348 5287576 4921606 4392603 4224253 4055349
7653 4055349 3942086 3847639 3886669 3756530 3759383 3844339 3917977 3896661 3642061 3544346 3431479
7642 3431479 3343181 3233877 3192992 3160883 3072653 2832752 2705242 2476686 2272839 2235733
7632 2235733 2167335 2182182 2230592 2199275 2269350 2187349 2124384 2012427 1921454 1690461 1708500
7621 1708500 1557276 1546318 1400857 1381365 1362521 1300713 1380698 1317505 1436851 1372893 1416450
7610 1416450 1497451 1524590 1476800 1520039 1408579 1630430 1521892 1436471 1498489 1456326 1447166
7599 1447166 1440647 1189210 1395295 1346543 1153199 1262011 1101559 1313835 1263607 1344304
$$ packed form
7673A0580634r66540o76584m35527n78520k24478n04433k21691O8539m89291j24268
7663F427841p0724j06537q6667j76477k76088m23772l65970n29003j68350j68904
7653D055349j13263r4447L9030j30139K853Q4956P3638k1316k54600r7715j12867
7642C431479q8298j09304m0885l2109q8230k39901j27510k28556k03847l7106
7632B235733o8398J4847M8410l1317P0075q2001o2965j11957r0973k30993J8039
7621A708500j51224j0958j45461j9492j8844o1808P9985o3193J19346o3958M3557
7610A416450Q1001K7139m7790M3239j11460K21851j08538q5421O2018m2163r160
7599A447166o519k51437K06085m8752j93344J08812j60452K12276n0228Q0697
$$ plain form
7589 1344304 1299738 1227933 1296875 1271561 1217178 1212692 1300200 1316048 1299722 1384720 1198047
7578 1198047 1322752 1399805 1443611 1315280 1303451 1355823 1369289 1395632 1279021 1201269 1284397
7567 1284397 1343891 1391478 1428425 1493388 1389314 1383196 1437637 1578573 1471541 1493835 1511720
7556 1511720 1525305 1594098 1647229 1759715 1776947 1746846 1714192 1641301 1865870 1793571 1880212
7545 1880212 1857294 2030242 2121863 2258071 2328865 2231054 2456318 2492404 2469270 2505661 2520257
7534 2520257 2454598 2638379 2617651 2589321 2748483 2690447 2783786 2813460 2902920 2967651 2927919
7523 2927919 2961860 3122406 3276018 3232183 3275907 3332023 3514845 3534038 3568288 3638645 3689475
7512 3689475 3614375 3622966 3623249 3771371 3723787 3766226 3776891 3928304 3958490 3877967 3963126 3961436
$$ packed form
7589A344304m4566p1805O8942k5314n4383m486Q7508J5848j6326Q4998j86673
7578A198047J24705P7053M3806j28331j1829N2372J3466K6343j16611p7752Q3128
7567A284397N9494M7587L6947O4963j04074o118N4441J40936j07032K2294J7885
7556A511720J3585O8793N3131J12486J7232l0101l2654p2891K24569p2299Q6641
7545A880212k2918J72948R1621J36208P0794r7811K25264L6086k3134L6391J4596
7534B520257o5659J83781k0728k8330J59162n8036R3339K9674Q9460O4731l9732
7523B927919L3941J60546J53612m3835M3724N6116J82822J9193L4250P0357N0830
7512C689475p5100Q591K83J48122m7584M2439J0665J51413L0186q0523Q5159j690
$$ plain form
7500 3961436 4113110 4025057 4026995 4072784 4105415 4080671 4093127 4105714 4148631 4116791 4157314
7489 4157314 3994270 4066671 3968328 3843336 3742037 3794127 3695701 3770775 3664476 3619428 3619300
7478 3619300 3543579 3435580 3471014 3375120 3212218 3236720 3322635 3134376 2977225 3030326 2974609
7467 2974609 2983369 2717448 2757954 2829226 2562989 2506549 2559357 2509018 2337209 2446635 2342848
7456 2342848 2314252 2212435 2275351 2218132 2141286 2062361 1977445 1968517 1934980 1947310 1817459
7445 1817459 1730465 1783792 1744636 1648866 1620787 1609469 1630062 1468679 1513942 1391257 1279026
7434 1279026 1287172 1227576 1283731 1150371 1256637 1049124 1201489 1112752 1156581 1066872 1041419
7423 1041419 972192 759407 923973 893913 1006347 1024685 950594 832866 849881 781366 911557
$$ packed form
7500C961436J51674q8053J938M5789L2631k4744J2456J2587M2917l1840M0523
7489D157314j63044P2401r8343j24992j01299N2090r8426P5074j06299m5048j28
7478C619300p5721j07999L5434r5894j62902K4502Q5915j88259j57151N3101n5717
7467B974609Q760k65921M0506P1272k66237n6440N2808n0339j71809J09426j03787
7456B342848k8596j01817O2916n7219p6846p8925q4916q928l3537J2330j29851
7445A817459q6994N3327l9156r5770k8079j1318K0593j61383M5263j22685j12231
7434A279026Q146n9596N6155j33360J06266k07513J52365q8737M3829q9709k5453
7423A041419o9227k12785J64566l0060J12434J8338p4091j17728J7015o8515J30191
$$ plain form
7412 911557 707440 709224 673319 823942 697737 680271 765325 577482 666576 469122 507105
7401 507105 489643 518103 467328 467935 423976 419469 498280 527649 510693 412444 501097 484253
7389 484253 407988 408700 390358 453808 392136 378795 311005 284413 220667 198844 187382 148443
7377 148443 130814 146289 239674 291220 323554 145458 154617 247403 240910 116423 115955 146187
7365 146187 94359 103900 98611 62283 -59704 -16869 281062 120917 200632 37246 90817
7354 90817 67368 76608 14359 255207 10776 60574 209973 37562 101000 252510 138534
7343 138534 122886 84577 152762 81723 77852 182853 170085 287281 294933 264041 286462 352375
7331 352375 496110 911357 1135703 1059173 953023 769245 393378 331271 290905 257623
$$ packed form
7412I11557k04117J784l5905J50623j26205j7466Q5054j87843Q9094j97454L7983
7401E07105j7462K8460n0775O07m3959m507P8811K9369j6956r8249Q8653j6844
7389D84253p6265P12j8342O3450o1672j3341o7790k6592o3746k1823j1462l8939
7377A48443j7629J5475R3385N1546L2334j78096R159R2786o493j24487m68L0232
7365A46187n1828R541n289l6328j21987M2835K97931j60145P9715j63386N3571
7354I0817k3449R240o2249K40848k44431M9798J49399j72411O3438J51510j13976
7343A38534j5648l8309O8185p1039l871J05001j2768J17196P652l0892K2421O5913
7331C52375J43735M15247K24346p6530j06150j83778l75867o2107m0366l3282
$$ plain form
7321 257623 105464 71844 -61412 -43102 -28955 30362 -5146 20968 -47734 -118834 26607
7310 26607 -68833 8938 -3770 -7844 12192 -76400 -132878 -34760 -141194 -131140 -17646 -95635
7298 -95635 -36179 3908 -104347 -111110 -137633 -129044 -92187 -85745 -156497 -123223 -49143 -80684
7286 -80684 -80781 -118963 54972 5244 -49548 -69277 58772 2843 -104512 -73431 -111104 35427
7274 35427 -29114 83512 -83623 123045 104132 98364 103657 48740 77317 139426 170627 151068
7262 151068 311083 395835 336323 391251 553182 606226 664517 754128 654977 660915 469614
7251 469614 532789 379181 434760 186862 194196 146740 240111 152455 198670 196142 281288 204083
7239 204083 236677 380428 396578 276328 376510 343837 648357 688441 728715 923522 1224140
$$ packed form
7321B57623j52159l3620j33256J8310J4147N9317l5508K6114o8702p1100J45441
7310B6607r5440P7771j2708m074K0036q8592n6478R8118j06434J0054J13494p7989
7298i5635N9456M0087j08255o763k6523Q589L6857O442p0752L3274P4080l1541
7286h0684r7l8182J73935m9728n4792j9729J28049n5929j07355L1081l7673J46531
7274C5427o4541J12626j67135K06668j8913n768N293n4917K8577O2109L1201j9559
7262A51068J60015Q4752n9512N4928J61931N3044N8291Q9611r9151N938j91301
7251D69614O3175j53608N5579k47898P334m7456R3371q7656M6215k528Q5146p7205
7239B04083L2594J43751J6150j20250J00182l2673L04520M0084M0274J94807L00618
$$ plain form
7228 1224140 1591918 1632865 1357201 1352429 975966 961596 786578 762776 799799 616190 724642
7217 724642 638879 652148 645990 676419 649827 757762 841547 749683 907399 1038562 1060571
7206 1060571 1176137 1180760 1236183 1472226 1227668 1377160 1277855 1244051 1221087 1140669 1072640
7195 1072640 931396 1087998 933034 920417 902515 846745 842212 865319 861561 1040182 1034605
7184 1034605 1025878 1170260 1268355 1445475 1615193 1674869 1883290 1728024 1601834 1496342
7174 1496342 1284506 1231307 1136813 983690 1242899 1310750 1289542 1256269 1167272 1442163 1316178
7163 1316178 1427311 1413156 1566044 1660134 1596746 1576119 1713074 1953053 1991728 2170780
7153 2170780 2301949 2504080 2404669 2334650 2321376 2194223 2251070 2190974 2101330 2314141 2258322
$$ packed form
7228A224140L67778M0947k75664m772l76463j4370j75018k3802L7023j83609J08452
7217G24642q5763J3269o158L0429k6592J07935Q3785r1864J57716J31163K2009
7206A060571J15566M623N5423K36043k44558J49492r9305l3804k2964q0418o8029
7195A072640j41244J56602j54964j2617j7902n5770m533K3107l758J78621n577
7184A034605q727J44382R8095J77120J69718N9676K08421j55266j26190j05492
7174A496342k11836n3199r4494j53123K59209O7851k1208l3273q8997K74891j25985
7163A316178J11133j4155J52888R4090o3388k0627J36955K39979L8675J79052
7153B170780J31169K02131r9411p0019j3274j27153N6847o0096q9644K12811n5819
$$ plain form
7142 2258322 2535285 2848188 2833738 3001533 2998135 2895660 2810390 2800548 2783287 2807954 2951472
7131 2951472 2900823 2860761 2848943 2926630 2806850 2658589 2733577 2535523 2565794 2561170 2723174
7120 2723174 2792847 2895114 3004391 2869517 2618212 2323492 2302781 2043507 2202980 2022955
7110 2022955 1978562 1967367 2075953 2237493 2082992 2237599 2089143 1968054 1886267 1783321
7100 1783321 1711187 1596049 1617999 1607295 1610121 1673495 1854581 1646608 1807795 1877282 1648696
7089 1648696 1643419 1740673 1837141 1812422 1751546 1786775 1831044 1711661 1587042 1706582 1558679
7078 1558679 1614628 1609053 1725439 1710605 1692917 1566417 1821041 1693527 1824572 1622662
7068 1622662 1709715 1724053 1827128 1892086 1804621 1884659 1803865 1871325 1797297 1825309 1907206
$$ packed form
7142B258322K76963L12903j4450J67795l398j02475q5270r842j7261K4667J43518
7131B951472n0649m0062j1818P7687j19780j48261P4988j98054L0271m624J62004
7120B723174O9673J02267J09277j34874k51305k94720k0711k59274J59473j80025
7110B022955m4393j1195J08586J61540j54501J54607j48456j21089q1787j02946
7100A783321p2134j15138K1950j0704K826O3374J81086k07973J61187O9487k28586
7089A648696n277R7254R6468k4719o0876L5229M4269j19383j24619J19540j47903
7078A558679N5949n575J16386j4834j7688j26500K54624j27514J31045k01910
7068A622662Q7053J4338J03075O4958q7465Q0038q0794O7460p4028K8012Q1897
$$ plain form
7057 1907206 1901661 1926367 1819528 1806135 1791505 1956443 1792134 1911313 1930135 2055625 1975008
7046 1975008 2215450 2227961 2363204 2380097 2323525 2455834 2640589 2618241 2634639 2626783 2744766
7035 2744766 2600419 2566327 2807553 2583632 2826284 2994377 2916226 3053929 2974069 3013254
7025 3013254 3039998 3099077 3095198 3065581 3158736 3188115 3089341 3226842 3281073 3378194 3381462 3487336
7013 3487336 3419682 3384324 3499751 3498157 3581816 3664345 3678074 3665541 3876704 3837966 4059675
7002 4059675 4094897 4025905 4009795 4026687 4034102 4175741 4213634 4237427 4193989 4249632 4364396
6991 4364396 4353121 4277853 4309188 4207457 4260859 4426597 4407640 4392579 4449399 4315768 4238431
6980 4238431 4309420 4318346 4383599 4208594 4338979 4333479 4326332 4282812 4323198 4338906 4385848 4457155
$$ packed form
7057A907206n545K4706j06839j3393j4630J64938j64309J19179J8822J25490q0617
7046A975008K40442J2511J35243J6893n6572J32309J84755k2348J6398p856J17983
7035B744766j44347l4092K41226k23921K42652J68093p8151J37703p9860L9185
7025C013254K6744N9079l879k9617R3155K9379r8774J37501N4231R7121L268J05874
7013C487336o7654l5358J15427j594Q3659Q2529J3729j2533K11163l8738K21709
7002D059675L5222o8992j6110J6892P415J41639L7893K3793m3438N5643J14764
6991D364396j1275p5268L1335j01731N3402J65738j8957j5061N6820j33631p7337
6980D238431P0989Q926O5253j75005J30385n500p147m3520M0386J5708M6942P1307
$$ plain form
6968 4457155 4536289 4530996 4427209 4414840 4525391 4464614 4384988 4330201 4255596 4353001 4293892
6957 4293892 4362227 4102356 4296981 4272534 4178891 4229724 4216210 4315735 4199498 4111233 4315693
6946 4315693 4303010 4273331 4428930 4400658 4285336 4356743 4321009 4332875 4233975 4302876 4308363
6935 4308363 4353889 4292077 4521761 4423080 4449996 4369716 4368177 4435291 4402464 4377552 4471188
6924 4471188 4393202 4514360 4555065 4524836 4523590 4578337 4562130 4369977 4537535 4479112 4614412
6913 4614412 4526415 4454008 4519746 4623984 4517366 4514266 4583372 4702573 4817281 4734101 4734787
6902 4734787 4903726 4789804 5001972 5172293 5034555 5135257 5262542 5086851 5187106 5200247
6892 5200247 5240414 5132502 5285963 5256216 5360139 5432315 5272358 5333115 5457523 5349140
$$ packed form
6968D457155P9134n293j03787j2369J10551o0777p9626n4787p4605R7405n9109
6957D293892O8335k59871J94625k4447r3643N0833j3514R9525j16237q8265K04460
6946D315693j2683k9679J55599k8272j15322P1407l5734J1866r8900O8901N487
6935D308363M5526o1812K29684r8681K6916q0280j539O7114l2827k4912R3636
6924D471188p7986J21158M0705l0229j246N4747j6207j92153J67558n8423J35300
6913D614412q7997p2407O5738J04238j06618l100O9106J19201J14708q3180O86
6902D734787J68939j13922K12168J70321j37738J00702J27285j75691J00255J3141
6892E200247M0167j07912J53461k9747J03923P2176j59957O0757J24408j08383
$$ plain form
6882 5349140 5238765 5246288 5320983 5265687 5497364 5528436 5477099 5597931 5640710 5612988 5421928
6871 5421928 5673830 5650987 5756742 5779181 5895957 6051288 6114400 6163172 6303158 6529492
6861 6529492 6389193 6615111 6679277 6712150 7006397 7254357 7525056 7679941 7926393 8185459
6851 8185459 8522518 8945249 9218170 9664145 10207947 10894814 11464652 12274599 13139587 14041276
6841 14041276 15364726 16647186 18372600 20550888 23799653 28287879 34741548 42823161
6833 42823161 50942691 56862371 58693561 56342643 51660669 46807026 42724312 40070152
6825 40070152 39708426 41562632 46255424 52867094 58660802 61158900 58982449 53070139
6817 53070139 46005070 38939098 32914625 28180189 24122685 21097488 18693730 17018827
$$ packed form
6882E349140j10375P523P4695n5296K31677L1072n1337J20832M2779k7722j91060
6871E421928K51902k2843J05755K2439J16776J55331O3112M8772J39986K26334
6861F529492j40299K25918O4166L2873K94247K47960K70699J54885K46452K59066
6851H185459L37059M22731K72921M45975N43802O86867N69838Q09947Q64988R01689
6841A4041276J323450J282460J725414K178288L248765M488226O453669Q081613
6833D2823161Q119530N919680J831190k350918m681974m853643m082714k654160
6825D0070152l61726J854206M692792O611670N793708K498098k176451n912310
6817E3070139p065069p065972o024473m734436m057504l025197k403758j674903
$$ plain form
6809 17018827 15691754 14796355 14082359 13500283 13284820 12974262 12911834 12774648 12796776 12956367
6799 12956367 12912491 12887562 12940431 12915666 13011127 12982490 13092207 13419562 13612928 13804923
6789 13804923 14461523 14916057 15396106 15927290 16541099 17379860 18206701 19386618 20510923
6780 20510923 22159578 24018014 26034651 28696705 32029705 36633697 43468399 53171877
6772 53171877 65436723 78832678 88958246 93159806 90730498 84032847 76276874 69429466
6764 69429466 64833179 63243177 65261469 71120597 79826244 88347150 92558957 90584745
6756 90584745 83269728 73258628 62812545 53770495 46065248 39807457 34705476 30617092
6748 30617092 27191435 24769057 22790400 21322128 20120140 19321095 18537390 17836076 17257082
$$ packed form
6809A7018827j327073q95399p13996n82076k15463l10558o2428j37186K2128J59591
6799A2956367m3876k4929N2869k4765R5461k8637J09717L27355J93366J91995
6789A3804923O56600M54534M80049N31184O13809Q38761Q26841J179917J124305
6780B0510923J648655J858436K016637K662054L333000M603992O834702R703478
6772E3171877J2264846J3395955J0125568M201560k429308o697651p755973o847408
6764F9429466m596287j590002K018292N859128Q705647Q520906M211807j974212
6756I0584745p315017j0011100j0446083r042050p705247o257791n101981m088384
6748C0617092l425657k422378j978657j468272j201988p99045p83705p01314n78994
$$ plain form
6739 17257082 16731438 16304491 16233026 15998003 15529105 15363115 15198690 15197151 14993782 14847402
6729 14847402 14670880 14506839 14336090 14213612 13935346 14090022 13913540 13954451 13938419 13893677
6719 13893677 13975672 14100385 14253773 14328756 14606096 14787288 14888796 15073662 15364293 15609568
6709 15609568 15782537 16006223 16108213 16188964 16177871 16388942 16413844 16446424 16521110 16703834
6699 16703834 16991255 17266889 17738013 18111274 18808249 19269322 19857183 20462684 20881478
6690 20881478 21422705 21372823 21406320 21507332 21221751 21142256 21118424 21129668 21150925 21400554
6680 21400554 21542101 21932376 22304864 22559598 22954183 23473449 23994959 24761578 25348541
6671 25348541 26322809 27458560 28955198 30749701 32594339 34348715 35470653 35985251
$$ packed form
6739A7257082n25644m26947p1465k35023m68898j65990j64425j539k03369j46380
6729A4847402j76522j64041j70749j22478k78266J54676j76482M0911j6032m4742
6719A3893677Q1995J24713J53388P4983K77340J81192J01508J84866K90631K45275
6709A5609568J72969K23686J01990Q0751j1093K11071K4902L2580P4686J82724
6699A6703834K87421K75634M71124L73261O96975M61073N87861O05501M18794
6690B0881478N41227m9882L3497J01012k85581p9495k3832J1244K1257K49629
6680B1400554J41547L90275L72488K54734L94585N19266N21510P66619N86963
6671B5348541R74268J135751J496638J794503J844638J754376J121938N14598
$$ plain form
6663 35985251 35977406 35864954 35535992 35308240 35164240 35132524 35063359 35110388 35402207 35668191
6653 35668191 36216171 36935737 38124251 39241306 40380095 41263331 42106660 42843191 43057702
6644 43057702 43252357 43516777 43561907 43837385 44050245 44402685 44750756 45416744 46137790 47117242
6634 47117242 48575581 50267456 52126324 54182686 56150153 57917972 59469573 61053166
6626 61053166 62605318 64008944 65644418 67342267 68434990 68845550 68420659 67258225
6618 67258225 65427295 63528987 61575990 59968871 58622265 57556034 56959620 56915571 57219118
6609 57219118 57896370 59054114 60858449 62839842 64994821 67143408 69677670 71920065
6601 71920065 73643277 75010444 76053956 76276400 76328596 75542941 74274249 72812121 70774097
$$ packed form
6663C5985251p845j12452l28962k27752j44000l1716o9165M7029K91819K65984
6653C5668191N47980P19566J188514J117055J138789Q83236Q43329P36531K14511
6644D3057702J94655K64420M5130K75478K12860L52440L48071O65988P21046R79452
6634D7117242J458339J691875J858868K056362J967467J767819J551601J583593
6626F1053166J552152J403626J635474J697849J092723M10560m24891j162434
6618F7258225j830930j898308j952997j607119j346606j066231n96414m4049L03547
6609E7219118O77252J157744J804335J981393K154979K148587K534262K242395
6601G1920065J723212J367167J043512K22444N2196p85655j268692j462128k038024
$$ plain form
6592 70774097 68759466 66923009 65303112 63992441 63242708 62811440 63004356 63771836 64841195
6583 64841195 66673911 69088082 72071701 75998191 81771498 89413450 100183223 113806395
6575 113806395 127990532 138860639 142660009 139492356 131455438 122077609 112779387 104359411
6567 104359411 96958242 90793409 85747068 81763134 78987038 77024371 76240785 76311327
6559 76311327 77596684 80969376 86915938 96135547 108138879 119479860 125660766 124359742
6551 124359742 116342302 105546830 94671916 84900023 76621726 69865952 64703128 60512652
6543 60512652 57505719 55264355 53745707 52535315 51474351 50822930 50105664 49672973 49207152
6534 49207152 49150163 49135278 49360747 49862589 50481802 51553022 52844770 54129297 55687278
$$ packed form
6592G0774097k014631j836457j619897j310671p49733m31268J92916P67480J069359
6583F4841195J832716K414171K983619L926490N773307P641952J0769773J3623172
6575A13806395J4184137J0870107L799370l167653q036918r377829r298222q419976
6567A04359411p401169o164833n046341l983934k776096j962667p83586P0542
6559G6311327J285357L372692N946562R219609J2003332J1340981O180906j301024
6551A24359742q017440j0795472j0874914r771893q278297o755774n162824m190476
6543F0512652l006933k241364j518648j210392j060964o51421p17266m32691m65821
6534D9207152n6989j4885K25469N01842O19213J071220J291748J284527J557981
$$ plain form
6525 55687278 57471648 59601907 62115945 65027388 67702600 70357442 72671726 74732983
6517 74732983 77029694 80182482 84719842 91110337 98393999 104188313 105579660 102166366
6509 102166366 96198568 89272494 83463724 78897348 75553360 73650503 72697710 72476885
6501 72476885 73321919 74805561 76680711 79144245 81809171 84919913 89232067 95125868
6493 95125868 102748074 110182692 114273707 113045988 107117376 98723481 90197874 82158198
6485 82158198 75574638 70086461 65648188 62136122 59226133 57070068 55391292 53951080
6477 53951080 52832678 51717438 50821007 50050700 49137200 48299208 47307908 46608465 45987873
6468 45987873 45591993 45211589 45102427 44908773 44761066 44192340 43280427 42264107 40998688
$$ packed form
6525E5687278J784370K130259K514038K911443K675212K654842K314284K061257
6517G4732983K296711L152788M537360O390495P283662N794314J391347l413294
6509A02166366n967798o926074n808770m566376l343988j902857r52793k20825
6501G2476885Q45034J483642J875150K463534K664926L110742M312154N893801
6493I5125868P622206P434618M091015j227719n928612q393895q525607q039676
6485H2158198o583560n488177m438273l512066k909989k156065j678776j440212
6477E3951080j118402j115240q96431p70307r13500q37992r91300o99443o20592
6468D5987873l95880l80404j09162j93654j47707n68726r11913j016320j265419
$$ plain form
6459 40998688 39840105 38636438 37543712 36779925 36150605 35703363 35475970 35584837 35670527
6450 35670527 35840992 36360456 36780253 37402838 38288089 39173027 40319210 41318337 42686014
6441 42686014 44285946 45915605 47835287 49979999 52377547 54778550 56724908 58172098
6433 58172098 58512236 57374700 55146290 52147180 48862240 45614413 42733180 40349070
6425 40349070 38113921 36496815 35248009 34396696 33858407 33549511 33472507 33880555 34268271
6416 34268271 34802932 35539448 36281955 36914235 37294098 37511292 37535889 37354784 36863824 36013962
6406 36013962 34743493 33646324 32309615 31455842 30811833 30409352 30534339 31179821 32066321
6397 32066321 33560887 35263256 36811608 38099688 38847863 39032621 39138618 38510796 37631379
$$ packed form
6459D0998688j158583j203667j092726p63787o29320m47242k27393J08867Q5690
6450C5670527J70465N19464M19797O22585Q85251Q84938J146183R99127J367677
6441D2686014J599932J629659J919682K144712K397548K401003J946358J447190
6433E8172098L40138j137536k228410k999110l284940l247827k881233k384110
6425D0349070k235149j617106j248806q51313n38289l08896p7004M08048L87716
6416C4268271N34661P36516P42507O32280L79863K17194K4597j81105m90960q49862
6406C6013962j270469j097169j336709q53773o44009m02481J24987O45482Q86500
6397C2066321J494566J702369J548352J288080P48175J84758J05997o27822q79417
$$ plain form
6388 37631379 36128207 34321539 32109887 30173215 28078266 26347319 24768057 23313073
6380 23313073 22233386 21349253 20485661 19863070 19260722 18658577 18282131 18007259 17678727
6371 17678727 17569835 17573210 17799682 17893380 18066931 18283032 18463021 18435331 18224031 17859651
6361 17859651 17351636 17092574 16606603 16253268 15883974 15518273 15410186 15326502 15111093 14926759
6351 14926759 14868259 14884607 14926619 14855609 14783483 15045001 15204407 15511205 15629563 16139861
6341 16139861 16386961 16499539 16646427 16939789 17195462 17906021 19358676 22095611 28808340
6332 28808340 39294539 46716715 47517489 39281101 33262643 28002788 23630401 20499525
6324 20499525 18116605 16367618 15129265 14303309 13757564 13188340 13154588 13024485 12913170
$$ packed form
6388C7631379j503172j806668k211652j936672k094949j730947j579262j454984
6380B3313073j079687q84133q63592o22591o02348o02145l76446k74872l28532
6371A7678727j08892L375K26472R3698J73551K16101J79989k7690k11300l64380
6361A7859651n08015k59062m85971l53335l69294l65701j08087q3684k15409j84334
6351A4926759n8500J6348M2012p1010p2126K61518J59406L06798J18358N10298
6341A6139861K47100J12578J46888K93362K55673P10559J452655K736935O712729
6332B8808340J0486199P422176Q00774q236388o018458n259855m372387l130876
6324B0499525k382920j748987j238353q25956n45745n69224l3752j30103j11315
$$ plain form
6315 12913170 13005300 12913717 13002913 12893422 12847968 12562654 12413658 12455503 12445615 12626378 12828740
6304 12828740 12764106 13137226 13157863 13304583 13235858 13420838 13839020 14243585 14502608 14964687
6294 14964687 15520491 16029051 16298657 16779860 16983870 17217128 17051878 17214690 17144611 17490435
6284 17490435 17854168 17888719 17239130 16536881 16053394 15511272 15107934 14703461 14341512 14043248
6274 14043248 13682557 13660409 13587065 13429724 13512932 13798215 14371042 15072641 15600481 15592128
6264 15592128 15141334 14770575 14293974 14088432 13752078 13581487 13424067 13187910 13100534 12819643
6254 12819643 12788610 12611724 12595420 12195464 12100623 11778289 11680986 11544971 11370955 11434625
6244 11434625 11483454 11692217 11794425 12199580 12786678 14030186 15604416 16388101 16293557
$$ packed form
6315A2913170R2130r1583Q9196j09491m5454k85314j48996M1845r888J80763K02362
6304A2828740o4634L73120K0637J46720o8725J84980M18182M04565K59023M62079
6294A4964687N55804N08560K69606M81203K04010K33258j65250J62812p0079L45824
6284A7490435L63733L4551o49589p02249m83487n42122m03338m04473l61949k98264
6274A4043248l60691k2148p3344j57341Q3208K85283N72827P01599N27840q353
6264A5592128m50794l70759m76601k05542l36354j70591j57420k36157q7376k80891
6254A2819643l1033j76886j6304l99956r4841l22334r7303j36015j74016O3670
6244A1434625M8829K08763J02208M05155N87098J243508J574230P83685r4544
$$ plain form
6235 16293557 15555527 14688667 14112726 13568459 13336525 13009536 12754029 12529431 12385574
6226 12385574 12444722 12345016 12573948 13003809 13734786 15150965 16182314 16398004 15698566
6217 15698566 14507603 13520183 13038792 12524363 12205590 11978238 11866428 11834033 12007039
6208 12007039 12156149 12278401 12358873 12464648 12560470 12634840 12480526 12342208 12100134 11840802
6198 11840802 11467602 11427272 11096025 10752998 10537880 10536697 10117208 10014445 9937047 9703114
6188 9703114 9769851 9729356 9738923 9747705 9812491 9891527 9931369 10022399 9930762 9758908 9974728
6177 9974728 10119933 9954557 10077080 10193932 10116745 10186991 10168388 10472145 10462837 10633579
6167 10633579 10894434 11108056 11161113 11351944 11626117 11721458 11830387 12105404 12482060 12787889
$$ packed form
6235A6293557p38030q66860n75941n44267k31934l26989k55507k24598j43857
6226A2385574N9148r9706K28932M29861P30977J416179J031349K15690o99438
6217A5698566j190963r87420m81391n14429l18773k27352j11810l2395J73006
6208A2007039J49110J22252Q0472J05775R5822P4370j54314j38318k42074k59332
6198A1840802l73200m0330l31247l43027k15118j183m19489j02763p7398k33933
6188I703114O6737m0495R567Q782O4786P9036L9842R1030r1637j71854K15820
6177I974728J45205j65376J22523J16852p7187P0246j8603L03757r308J70742
6167A0633579K60855K13622N3057J90831K74173R5341J08929K75017L76656L05829
$$ plain form
6157 12787889 13358919 14309493 15472567 16663955 16883513 16584961 15689264 14908919 14237061
6148 14237061 13363783 12958202 12500574 12136051 11686874 11652942 11417976 11444842 11307412 11219143
6138 11219143 11077393 10952054 10871103 10764649 10882653 10716326 11188297 11810039 12893022
6129 12893022 13680782 14232980 13687621 12730962 11787093 10962845 10444145 9883978 9511981
6120 9511981 9422681 9116146 9051019 8886948 8989933 8882225 8942269 8893234 9068151 9071836 9321435
6109 9321435 9578490 9847917 10068821 9809309 9288213 8961513 8483276 8065918 7786869 7416804
6099 7416804 7467294 7332685 7332237 7289171 7167145 7049664 7245040 7221608 7288097 7244700 7277401
6088 7277401 7214612 7218711 7523940 7884914 8563284 9248884 9538738 9734357 9227440 8744791
$$ packed form
6157A2787889N71030R50574J163074J191388K19558k98552q95697p80345o71858
6148A4237061q73278m05581m57628l64523m49177l3932k34966K6866j37430q8269
6138A1219143j41750j25339q0951j06454J18004j66327M71971O21742J082983
6129A2893022P87760N52198n45359r56659r43869q24248n18700n60167l71997
6120I511981q9300l06535o5127j64071J02985j07708O0044m9035J74917L685K49599
6109I321435K57055K69427K20904k59512n21096l26700m78237m17358k79049l70065
6099G416804N0490j34609m48m3066j22026j17481J95376k3432O6489m3397L2701
6088G277401o2789M099L05229L60974O78370O85600K89854J95619n06917m82649
$$ plain form
6078 8744791 8242192 8087764 7902924 7729570 7520100 7423325 7315153 7160376 7065870 6918376
6068 6918376 6691939 6620045 6351218 6224046 6364494 6396367 6424049 6550484 6722033 6919272
6058 6919272 7285037 7479319 7648567 7749490 7725085 7600523 7423556 7218956 7333756 7130619
6048 7130619 7095912 7004628 6880551 6949106 6829451 6626603 6637262 6586023 6499938 6691862 6676904
6037 6676904 6678291 6882747 6807584 6736464 6605007 6572616 6364115 6323713 6221802 6048971 6212799
6026 6212799 6091923 6060829 6027048 6007052 5903137 5769581 5753562 5727644 5595182 5639578 5692330
6015 5692330 6013704 5957210 6109685 6404544 6437789 6340014 6426936 6416980 6265045 6297535 6252859
6004 6252859 6452965 6450067 6493993 6787062 6896342 7149091 7309145 7517842 7748258 8004460
$$ packed form
6078H744791n02599j54428j84840j73354k09470r6775j08172j54777r4506j47494
6068F918376k26437p1894k68827j27172J40448L1873K7682J26435J71549J97239
6058F919272L65765J94282J69248J00923k4405j24562j76967k04600J14800k03137
6048G130619l4707r1284j24077O8555j19655k02848J0659n1239q6085J91924j4958
6037F676904J387K04456p5163p1120j31457l2391k08501m0402j01911j72831J63828
6026F212799j20876l1094l3781j9996j03915j33556j6019k5918j32462M4396N2752
6015E692330L21374n6494J52475K94859L3245r7775Q6922r956j51935L2490m4676
6004F252859K00106k898M3926K93069J09280K52749J60054K08697K30416K56202
$$ plain form
5994 8004460 8256727 8288404 8281873 8264712 8164114 8133660 8020926 8050287 8008875 8220347 8160196
5983 8160196 8251514 8317179 8539573 8645722 8604247 8895940 8936056 9326121 9458640 9540616
5973 9540616 9810358 9931370 9875275 10016389 10326526 10467810 10730881 10939026 11172264 10946833
5963 10946833 10806517 10598880 10262042 10063730 9870608 9727843 9717462 9591528 9541014 9449336
5953 9449336 9548405 9415342 9355162 9128171 8919221 8712157 8646972 8547310 8521652 8261550
5943 8261550 8251624 8182146 8340283 8186527 8159781 8052645 7997305 7985839 7911907 7927395 7951610
5932 7951610 7753704 7631705 7449279 7270420 7140765 7204862 7082182 7185157 7365519 7534162
5922 7534162 7492331 7900490 8178399 8308254 8436464 8337606 8142985 7763627 7544194 7143461
$$ packed form
5994H004460K52267L1677o531j7161j00598l0454j12734K9361m1412K11472o0151
5983H160196R1318O5665K22394J06149m1475K91693M0116L90065J32519Q1976
5973I540616K69742J21012n6095J41114L10137J41284K63071K08145K33238k25431
5963A0946833j40316k07637l36838j98312j93122j42765j0381j25934n0514r1678
5953I449336R9069j33063o0180k26991k08950k07064o5185r9662k5658k60102
5943H261550r926o9478J58137j53756k6746j07136n5340j1466p3932J5488K4215
5932G951610j97906j21999j82426j78859j29655O4097j22680J02975J80362J68643
5922G534162m1831M08159K77909J29855J28210r8858j94621l79358k19433m00733
$$ plain form
5912 7143461 6999174 6880108 6830600 6681978 6521495 6281875 6399904 6275794 6455125 6114823
5902 6114823 6243525 6238192 6389932 6375864 6245199 6399477 6370388 6353904 6287044 6575583 6737248
5891 6737248 6796603 7025752 7101194 7253269 7179395 7138451 7017982 7175473 7335192 7454250
5881 7454250 7862679 8334921 8615172 8958112 9323867 9604740 10121868 10900719 11417293 11571892
5871 11571892 11614391 11554839 11563948 11747096 12018649 12716128 13432975 14760581 15822182 17025842
5861 17025842 18812934 21304735 24655519 27434969 29514256 30048084 29818944 29199133 28993027
5852 28993027 29629254 31407209 34906882 40276207 46339108 51774713 54638178 55411844
5844 55411844 55368564 55891036 56200751 56563380 56869265 59117007 63138695 67362258 69896037
$$ packed form
5912G143461j44287j19066m9508j48622j60483k39620J18029j24110J79331l40302
5902F114823J28702n333J51740j4068j30665J54278k9089j6484o6860K88539J61665
5891F737248N9355K29149P5442J52075p3874m0944j20469J57491J59719J19058
5881G454250M08429M72242K80251L42940L65755K80873N17128P78851N16574J54599
5871A1571892M2499n9552R109J83148K71553O97479P16847J327606J061601J203660
5861A7025842J787092K491801L350784K779450K079287N33828k29140o19811k06106
5852B8993027O36227J777955L499673N369325O062901N435605K863465P73666
5844E5411844m3280N22472L09715L62629L05885K247742M021688M223563K533779
$$ plain form
5835 69896037 69884770 69526039 70811414 73128233 75243631 75647069 75272905 75568222 75816524
5826 75816524 74995073 72586816 70790412 71362528 73404092 74142272 71809154 67287466 62896561
5817 62896561 59920805 58255921 56994402 56235806 56614799 58243670 58989621 57332878 52995268
5808 52995268 47388911 42006820 37469166 34080019 31978957 30940508 31100690 31930990
5800 31930990 32549797 31835975 29723929 27088686 24445294 22119618 20394985 19034768
5792 19034768 17753188 16985439 16005297 15421947 14976420 14575340 14244064 13852385 13705152
5783 13705152 13508124 13195817 13064908 12996211 12993476 12892286 12845342 12906505 12751305 12658682
5773 12658682 12319043 12222091 12163383 11955858 11920914 11884274 11857229 11724192 11720793 11728718 11865357
$$ packed form
5835F9896037j1267l58731J285375K316819K115398M03438l74164K95317K48302
5826G5816524q21451k408257j796404N72116K041564P38180k333118m521688m390905
5817F2896561k975756j664884j261519p58596L78993J628871P45951j656743m337610
5808E2995268n606357n382091m537654l389147k101062j038449J60182Q30300
5800C1930990O18807p13822k112046k635243k643392k325676j724633j360217
5792A9034768j281580p67749r80142n83350m45527m01080l31276l91679j47233
5783A3705152j97028l12307j30909o8697k735j01190m6944O1163j55200r2623
5773A2658682l39639r6952n8708k07525l4944l6640k7045j33037l399P925J36639
$$ plain form
5762 11865357 11744309 11430625 11649480 11516616 11447056 11436441 11400216 11347035 11410643 11336348
5752 11336348 11320560 10987832 11013476 10841551 10829544 10811996 10607182 10766570 10637171 10471181
5742 10471181 10394299 10431336 10255533 10138460 10310833 10305265 10376978 10387311 10143974 10210925 10291809
5731 10291809 10030179 10010524 9926147 9951478 9991754 10074812 10123833 10189215 10171516 10158916 10293852
5720 10293852 10498628 10619289 10774973 11139496 11250183 11413249 11454730 11708190 11580900 11659398
5710 11659398 11516243 11741201 11785790 11964257 12043471 12150838 12286502 12702915 12878071 13164983
5700 13164983 13602861 13822725 14025252 14326305 14819112 15163039 15779746 16232704 16814614
5691 16814614 17146660 17425725 17702382 18292604 18655165 19044918 19483544 20026653 20465024
$$ packed form
5762A1865357j21048l13684K18855j32864o9560j0615l6225n3181O3608p4295
5752A1336348j5788l32728K5644j71925j2007j7548k04814J59388j29399j65990
5742A0471181p6882L7037j75803j17073J72373n568P1713J0333k43337O6951Q0884
5731A0291809k61630j9655q4377K5331M0276Q3058M9021O5382j7699j2600J34936
5720A0293852K04776J20661J55684L64523J10687J63066M1481K53460j27290P8498
5710A1659398j43155K24958M4589J78467P9214J07367J35664M16413J75156K86912
5700A3164983M37878K19864K02527L01053M92807L43927O16707M52958N81910
5691A6814614L32046K79065K76657N90222L62561L89753M38626N43109M38371
$$ plain form
5682 20465024 21047068 21735947 22192738 22570895 22929665 23028986 23399137 23920688 24380876 25024540
5672 25024540 26190254 27367053 28450767 29635573 30888622 32185808 33571127 35024075
5664 35024075 36346974 37553474 39057413 40671646 42770861 45304422 48364616 51733826
5656 51733826 55805198 60636902 67726998 79079338 100852162 141154790 196014937 250284096
5648 250284096 278809075 270315443 237023035 192758581 155840644 126538136 103648443
5641 103648443 86554846 73941802 64551077 58350245 53929769 51095292 49217737 48069802
5633 48069802 47454330 47201356 47334104 47649122 48080967 48363279 48892133 49439092 49987138
5624 49987138 50469659 51049243 51387057 51748196 52099553 52314036 52245385 51673325 50850464 49739650
$$ packed form
5682B0465024N82044O88879M56791L78157L58770R9321L70151N21551M60188O43664
5672B5024540J165714J176799J083714J184806J253049J297186J385319J452948
5664C5024075J322899J206500J503939J614233K099215K533561L060194L369210
5656E1733826M071372M831704P090096J1352340K1772824M0302628N4860147N4269159
5648B50284096K8524979q493632l3292408m4264454l6917937k9302508k2889693
5641A03648443j7093597j2613044r390725o200832m420476k834477j877555j147935
5633D8069802o15472k52974J32748L15018M31845K82312N28854N46959N48046
5624D9987138M82521N79584L37814L61139L51357K14483o8651n72060q22861j110814
$$ plain form
5614 49739650 49311521 48875492 49078983 49377000 50263861 51537570 53297618 55047939 57152591
5605 57152591 58751124 59517599 59747655 59704613 59320195 58784476 58170393 57316389 56472337
5596 56472337 55722748 55268142 55007817 55012388 55478149 56262867 57205616 57807405 58336869 58388065
5586 58388065 58586885 58971514 59414292 60012931 60722916 61744361 63161101 64925372 67041882
5577 67041882 69362281 72693651 76287304 79787568 82404654 84054154 84954630 85271365
5569 85271365 85239629 84880509 84860486 85558082 87206976 90186678 94553326 100664045 109098789
5560 109098789 121349509 142563785 175707613 212038134 242770974 256309374 251875321
5553 251875321 229714639 195501951 167326087 145434619 128015477 115580001 106996023
$$ packed form
5614D9739650m28129m36029K03491K98017Q86861J273709J760048J750321K104652
5605E7152591J598533P66475K30056m3042l84418n35719o14083q54004q44052
5596E6472337p49589m54606k60325M571M65761P84718R42749O01789N29464N1196
5586E8388065J98820L84629M42778N98639P09985J021445J416740J764271K116510
5577F7041882K320399L331370L593653L500264K617086J649500R00476L16735
5569H5271365l1736l59120k0023O97596J648894K979702M366648O110719Q434744
5560A09098789J2250720K1214276L3143828L6330521L0732840J3538400m434053
5553B51875321k2160682l4212688k8175864k1891468j7419142j2435476q583978
$$ plain form
5546 106996023 101030975 97473807 95680365 94948690 94956590 95568916 96741141 98775346 101706160
5537 101706160 106554528 115619789 125208911 131461079 132482449 131449306 133047160 135119990
5529 135119990 138584738 142986903 147404139 151515563 155082574 158193618 160334698 162060275
5521 162060275 163090794 163720152 164058520 164239989 164272479 164542472 165102989 166564703 168620156
5512 168620156 171704343 175778626 180872581 187049524 193821170 201283073 209253219 217550495
5504 217550495 225862603 233153355 238685810 241782179 242511378 240822753 237667024 233291624
5496 233291624 228509135 224628531 222218020 224022935 232461500 245306232 254109580 252923586
5488 252923586 243054922 232833673 225246302 220551433 219067783 220513306 224394554 230570468
$$ packed form
5546A06996023n965048l557168j793442p31675P900O12326J172225K034205K930814
5537A01706160M848368R065261R589122O252168J021370j033143J597854K072830
5529A35119990L464748M402165M417236M111424L567011L111044K141080J725577
5521A62060275J030519O29358L38368J81469L2490K69993N60517J461714K055453
5512A68620156L084187M074283N093955O176943O771646P461903P970146Q297276
5504B17550495Q312108P290752N532455L096369P29199j688625l155729m375400
5496B33291624m782489l880604k410511J804915Q438565J2844732Q803348j185994
5488B52923586r868664j0221249p587371m694869j483650J445523L881248O175914
$$ plain form
5480 230570468 238788810 248001751 258457253 272305604 290188683 308884895 322816173
5473 322816173 330798075 339151009 349574056 354030064 347844350 333515542 320354310 310010532
5465 310010532 303004131 299313859 297937217 298640835 301451202 306478521 313610061 323554064
5457 323554064 338969548 359634331 377745640 384399309 377271245 364732867 354398927
5450 354398927 346803897 342645314 342300350 345147546 351081523 358711767 367127626 375963523
5442 375963523 384571443 392197446 398744701 403971802 407643394 409753682 409007922 404715822
5434 404715822 396571167 385515010 372910042 360187070 347829902 336356532 325825841
5427 325825841 316837978 309187547 302251951 296245871 291299743 287015110 283476618 280063282
$$ packed form
5480B30570468Q218342R212941J0455502J3848351J7883079J8696212J3931278
5473C22816173P981902Q352934J0423047M456008o185714j4328808j3161232j0343778
5465C10010532p006401l690272j376642P03618K810367N027319P131540R944003
5457C23554064J5415484K0664783J8111309O653669p128064j2538378j0333940
5450C54398927p595030m158583l44964K847196N933977P630244Q415859Q835897
5442C75963523Q607920P626003O547255N227101L671592K110288p45760m292100
5434D04715822q144655j1056157j2604968j2722972j2357168j1473370j0530691
5427C25825841q987863p650431o935596o006080m946128m284633l538492l413336
$$ plain form
5419 280063282 277015148 273572837 269834256 265941110 261202080 256072828 249576927 241748697
5411 241748697 232221662 221481842 209951156 198518395 187857496 177663606 168179957
5404 168179957 159110105 150824264 143386254 137170445 131765283 126802613 122710401 119193243
5396 119193243 115827153 112743136 109709772 106323060 103377855 100675486 98021561 95637808
5388 95637808 93596582 91664154 90035411 88271125 86337823 84486389 82392438 80615493
5380 80615493 78992910 77535294 76440789 75352215 74483603 73623409 72468108 70946344
5372 70946344 69343015 67757060 66117256 64606254 63230230 61604922 60252482 59059172
5364 59059172 58006169 57183221 56326024 55454973 54619360 53832545 52636594 51400140 50283042
$$ packed form
5419B80063282l048134l442311l738581l893146m739030n129252o495901p828230
5411B41748697r527035j0739820j1530686j1432761j0660899j0193890r483649
5404A68179957r069852q285841p438010o215809n405162m962670m092212l517158
5396A19193243l366090l084017l033364l386712k945205k702369k653925k383753
5388I5637808k041226j932428j628743j764286j933302j851434k093951j776945
5380H0615493j622583j457616j094505j088574q68612q60194j155301j521764
5372G0946344j603329j585955j639804j511002j376024j625308j352440j193310
5364E9059172j053003q22948q57197q71051q35613p86815j195951j236454j117098
$$ plain form
5355 50283042 49186703 47987839 46937067 46154778 45155200 44361920 43966088 43349549 42837566
5346 42837566 42089360 41395647 40508937 39550126 38831104 38216517 37447953 36734091 36098894
5337 36098894 36046838 36231588 37514016 38716706 39501190 38757690 37024004 35547089 34294474
5328 34294474 32938228 32287583 31727338 31332994 31107662 30786677 30737842 30847901 31001608
5319 31001608 31132451 31180775 30979591 31114402 31127414 31609965 31934185 32520604 33040165 33172853
5309 33172853 33202836 33000639 33194010 33524072 33777363 34101696 33738452 33166134 32247728 31705731
5299 31705731 31437178 31298042 31206161 30976733 30333827 29646974 28971243 28505494 28297010 28293810
5289 28293810 28206804 27895769 27544659 27476882 27233353 27377403 27406046 27806820 27919371 28241378
$$ packed form
5355E0283042j096339j198864j050772p82289r99578p93280l95832o16539n11983
5346D2837566p48206o93713q86710r58811p19022o14587p68564p13862o35197
5337C6098894n2056J84750J282428J202690P84484p43500j733686j476915j252615
5328C4294474j356246o50645n60245l94344k25332l20985m8835J10059J53707
5319C1001608J30843M8324k01184J34811J3012M82551L24220N86419N19561J32688
5309C3172853K9983k02197J93371L30062K53291L24333l63244n72318r18406n41997
5299C1705731k68553j39136r1881k29428o42906o86853o75731m65749k08484l200
5289B8293810q7006l11035l51110o7777k43529J44050K8643M00774J12551L22007
$$ plain form
5279 28241378 28544367 28880898 29357402 29980943 30453191 30811665 31327351 31561028 31999614
5270 31999614 32343097 32695520 33259805 33827566 34759238 35757916 36974385 38248740 39870920
5261 39870920 41722860 44090520 47444417 52448947 60261339 72366162 90083521 108905261
5253 108905261 120663601 120966804 112622283 102631961 94593664 89599463 88826618 93634285
5245 93634285 104619526 118855120 128016514 127148984 117730040 106676635 97397083 91660971
5237 91660971 90437954 95006597 105440236 117360764 123642652 120384539 110930546 101045165
5229 101045165 92972372 87821723 86948728 91353132 101466737 113087642 119514082 116460736
5221 116460736 106348327 95256979 85455074 76848299 69599657 63815855 59155045 55858152
$$ packed form
5279B8241378L02989L36531M76504O23541M72248L58474N15686K33677M38586
5270C1999614L43483L52423N64285N67761R31672R98678J216469J274355J622180
5261C9870920J851940K367660L353897N004530P812392J2104823J7717359J8821740
5253A08905261J1758340L03203q344521r990322q038297m994201p72845M807667
5245I3634285J0985241J4235594R161394q67530r418944j1053405r279552n736112
5237I1660971j223017M568643J0433639J1920528O281888l258113r453993r885381
5229A01045165q072793n150649q72995M404404J0113605J1620905O426440l053346
5221A16460736j0112409j1091348r801905q606775p248642n783802m660810l296893
$$ plain form
5213 55858152 53549461 52118195 51713188 52194017 52532532 52693846 52262622 51685760 51194071
5204 51194071 51051404 51359405 52265510 53745616 55817355 58833950 62208092 65890896 69619065
5195 69619065 73660876 77780271 82471239 87260018 91602052 94582489 95938983 95688159
5187 95688159 94965065 94014167 93168801 91954439 90927538 90121918 90103655 91181151 93671462
5178 93671462 98260841 104921129 114072089 124739953 135604257 144663472 152040794 158280260
5170 158280260 163394475 167660282 171737560 178130120 189109084 207631944 236739054 279178720
5162 279178720 332103691 384000828 415948801 414813960 383250908 336238824 287292809
5155 287292809 243347155 205901957 174757418 149169012 128685491 112959308 100726953
$$ packed form
5213E5858152k308691j431266m05007M80829L38515J61314m31224n76862m91689
5204E1194071j42667L08001R06105J480106K071739L016595L374142L682804L728169
5195F9619065M041811M119395M690968M788779M342034K980437J356494k50824
5187I5688159p23094r50898q45366j214362j026901q05620j8263J077496K490311
5178I3671462M589379O660288R150960J0667864J0864304R059215P377322O239466
5170A58280260N114215M265807M077278O392560J0978964J8522860K9107110M2439666
5162B79178720N2924971N1897137L1947973j134841l1563052m7012084m8946015
5155B87292809m3945654l7445198l1144539k5588406k0483521j5726183j2232355
$$ plain form
5148 100726953 91420768 83729374 77772448 72618967 68614105 65253899 62369227 60196139
5140 60196139 58341358 57133806 56301795 55501708 54992110 54486453 53928732 52936591 51306057
5131 51306057 49590470 47431633 45740131 44529397 43468099 43040350 43364184 44867328
5123 44867328 48540904 53765340 58229068 59032643 55650434 50902812 46696446 42961378
5115 42961378 40124516 37721544 35870711 34297715 32796234 31388837 30434367 29562727
5107 29562727 28784488 28036616 27720087 27601762 27555491 27514194 27193540 26682897 25790901 24949619
5097 24949619 24033835 23214782 22501024 21795281 21365187 20957116 20499069 20130245 19829183
5088 19829183 19740018 19436032 19236350 19074357 19070864 18817966 18718126 18519174 18467270 18429954
$$ packed form
5148A00726953r306185p691394n956926n153481m004862l360206k884672k173088
5140F0196139j854781j207552q32011q00087n09598n05657n57721r92141j630534
5131E1306057j715587k158837j691502j210734j061298m27749L23834J503144
5123D4867328L673576N224436M463728Q03575l382209m747622m206366l735068
5115D2961378k836862k402972j850833j572996j501481j407397r54470q71640
5107B9562727p78239p47872l16529j18325m6271m1297l20654n10643q91996q41282
5097B4949619r15784q19053p13758p05743m30094m08071m58047l68824l01062
5088A9829183q9165l03986j99682j61993l493k52898r9840j98952n1904l7316
$$ plain form
5078 18429954 18278792 18088363 17914376 17762412 17563768 17262950 17116233 16937735 16750996
5069 16750996 16687421 16581362 16361752 16263804 16226887 16149563 16019383 15756044 15907116 15794595
5059 15794595 15611653 15654896 15665462 15747289 16045370 16007682 15814699 15828090 15515698 15366468
5049 15366468 15309301 15325649 15194719 15142553 14911491 14815231 14782783 14731960 14851191 14623422
5039 14623422 14753755 14673849 14660074 14750972 14603809 14848071 14924204 14993012 15089084 15293200
5029 15293200 15745480 15820642 16167473 16408888 16611566 17305070 17883983 18148813 18038199 17614375
5019 17614375 17166370 16671672 16264172 16083166 16018351 15802719 15703660 15649351 15784329 15609360
5009 15609360 15568011 15453686 15471238 15585601 15740484 16085054 16262534 16490555 16682457 16818245
$$ packed form
5078A8429954j51162j90429j73987j51964j98644l00818j46717j78498j86739
5069A6750996o3575j06059k19610r7948l6917p7324j30180k63339J51072j12521
5059A5794595j82942M3243J0566Q1827K98081l7688j92983J3391l12392j49230
5049A5366468n7167J6348j30930n2166k31062r6260l2448n0823J19231k27769
5039A4623422J30333p9906j3775R0898j47163K44262P6133O8808R6072K04116
5029A5293200M52280P5162L46831K41415K02678O93504N78913K64830j10614m23824
5019A7614375m48005m94698m07500j81006o4815k15632r9059n4309J34978j74969
5009A5609360m1349j14325J7552J14363J54883L44570J77480K28021J91902J35788
$$ plain form
4999 16818245 16937736 17057714 16979342 16884964 16981528 16953335 16975568 17220485 17387009 17667267
4989 17667267 17923717 18173611 18284320 18528822 18525506 18737542 18988194 19392360 19623401 20213622
4979 20213622 20845264 21258001 21687676 22209912 22541388 22995764 23492621 23975094 24667538
4970 24667538 25519254 26407117 27429029 28859458 30914103 33475382 37187431 42051271
4962 42051271 48057352 54240272 58908183 61155228 59777823 56105759 51316827 46523261
4954 46523261 42861026 39848762 37494566 36111292 35283029 35211041 35612250 36738755 38828832
4945 38828832 42090913 45263332 47247244 47417644 46407150 45516512 44960902 45157746 45958189
4936 45958189 48028571 51107259 55443846 58998391 61254153 61821384 61967010 61960520 62754805
$$ packed form
4999A6818245J19491J19978p8372r4378R6564k8193K2233K44917J66524K80258
4989A7667267K56450K49894J10709K44502l316K12036K50652M04166K31041N90221
4979B0213622O31642M12737M29675N22236L31476M54376M96857M82473O92444
4970B4667538Q51716Q87863J021912J430429K054645K561279L712049M863840
4962D2051271O006081O182920M667911K247045j377405l672064m788932m793566
4954D6523261l662235l012264k354196j383274q28263p1988M01209J126505K090077
4945C8828832L262081L172419J983912J70400j010494q90638n55610J96844Q00443
4936D5958189K070382L078688M336587L554545K255762N67231J45626o490P94285
$$ plain form
4927 62754805 64272569 66659621 69888240 73362553 75700907 76881057 77225004 77669338
4919 77669338 78811019 80738292 83349093 86769583 90898002 95547329 99713882 102450865
4911 102450865 103782386 104939248 106138391 107367245 108920951 110967799 113081142 115507345
4903 115507345 118217792 121255996 124333685 127563110 130679386 134376923 138313160 143240151
4895 143240151 148923242 155343493 161645848 167212170 171512488 174623128 177196838 179819450
4887 179819450 182146586 185185802 188076697 191189594 194595158 198194926 201659234 204443518
4879 204443518 207063364 209845583 212635144 215617823 218905672 222982872 227502716 232816013
4871 232816013 239376264 246618170 254911994 263327472 271668722 278880992 286117972 293337998
$$ packed form
4927F2754805J517764K387052L228619L474313K338354J180150L43947M44334
4919G7669338J141681J927273K610801L420490M128419M649327M166553K736983
4911A02450865J331521J156862J199143J228854J553706K046848K113343K426203
4903A15507345K710447L038204L077689L229425L116276L697537L936237M926991
4895A43240151N683091O420251O302355N566322M300318L110640K573710K622612
4887A79819450K327136L039216K890895L112897L405564L599768L464308K784284
4879B04443518K619846K782219K789561K982679L287849M077200M519844N313297
4871B32816013O560251P241906Q293824Q415478Q341250P212270P236980P220026
$$ plain form
4863 293337998 300790295 308204762 314980531 321317618 326945880 331769683 335871190 338972673
4855 338972673 341152140 342942958 344853577 347356265 350613256 354729332 359340656 363693329
4847 363693329 367605143 370231961 371860531 372654254 372951202 373229389 373954565 375028411 377328745
4838 377328745 379874135 382444574 384149740 384501585 384151612 383130499 382006331 380255719
4830 380255719 377889372 374825215 371685748 368691044 365388953 360841513 354430733 347095048
4822 347095048 338779900 330602947 323195488 317127839 311857499 307597929 303922495 300368161
4814 300368161 296922503 293259640 289583347 285950753 282206181 278329868 274599594 270771273
4806 270771273 267480322 264805411 262718703 261419546 260314118 258712821 255925696 251505276
$$ packed form
4863B93337998P452297P414467O775769O337087N628262M823803M101507L101483
4855C38972673K179467J790818J910619K502688L256991M116076M611324M352673
4847C63693329L911814K626818J628570P93723K96948K78187P25176J073846K300334
4838C77328745K545390K570439J705166L51845l49973j021113j124168j750612
4830C80255719k366347l064157l139467k994704l302091m547440o410780p335685
4822C47095048q315148q176953p407459o067649n270340m259570l675434l554334
4814C00368161l445658l662863l676293l632594l744572l876313l730274l828321
4806B70771273l290951k674911k086708j299157j105428j601297k787125m420420
$$ plain form
4798 251505276 245846143 239692321 233644295 227791271 222657703 217760826 213107535 208340120
4790 208340120 203444948 198488670 193467472 188667665 183994821 179535455 175256710 171143636
4782 171143636 167338001 163915943 160693453 157515830 154386133 151203573 148087480 145073883
4774 145073883 141794087 137842646 133177372 128782329 124812675 120851321 117303831 113629580
4766 113629580 110351053 107208980 104151396 101530465 98814360 96421152 93612090 90747642
4758 90747642 88078820 85044291 82568531 80154735 77586067 75487667 73417244 71603759
4750 71603759 69881533 68554236 67820384 67388526 66118366 64152369 61949588 60143585
4742 60143585 58103341 56692063 55231680 53997726 52934670 51657967 50695313 49746933
$$ packed form
4798B51505276n659133o153822o048026n853024n133568m896877m653291m767415
4790B08340120m895172m956278n021198m799807m672844m459366m278745m113074
4782A71143636l805635l422058l222490l177623l129697l182560l116093l013597
4774A45073883l279796l951441m665274m395043l969654l961354l547490l674251
4766A13629580l278527l142073l057584k620931k716105k393208k809062k864448
4758I0747642k668822l034529k475760k413796k568668k098400k070423j813485
4750G1603759j722226j327297p33852m31858j270160j965997k202781j806003
4742F0143585k040244j411278j460383j233954j063056j276703r62654r48380
$$ plain form
4734 49746933 48970737 48082512 47384423 46685739 45977012 45320684 44597750 43953553 43249891
4725 43249891 42632898 41824521 41328221 40403334 39844112 39119979 38610791 37804067 37255270
4716 37255270 36764927 36303323 35714935 35362008 35045677 34695974 34207833 33770848 32993466
4707 32993466 32700151 32143081 31694211 31178251 30650255 30226343 29962063 29425069 29210121
4698 29210121 29000471 28523910 28157254 28017167 27696050 27360949 27217765 27054140 26734078
4689 26734078 26574172 26360364 26342954 26346990 26223847 26168885 26097456 25921115 25671304 25392001
4679 25392001 24984580 24669137 24260503 23882922 23492788 23054544 22770376 22471740 22044440
4670 22044440 21758075 21350288 21238875 21028400 20936098 20750484 20772153 20415233 20290324 20164749
$$ packed form
4734D9746933p76196q88225o98089o98684p08727o56328p22934o44197p03662
4725D3249891o16993q08377m96300r24887n59222p24133n09188q06724n48797
4716C7255270m90343m61604n88388l52927l16331l49703m88141m36985p77382
4707C2993466k93315n57070m48870n15960n27996m23912k64280n36994k14948
4698B9210121k09650m76561l66656j40087l21117l35101j43184j63625l20062
4689B6734078j59906k13808j7410M036j23143n4962p1429j76341k49811k79303
4679B5392001m07421l15443m08634l77581l90134m38244k84168k98636m27300
4670B2044440k86365m07787j11413k10475r2302j85614K1669l56920j24909j25575
$$ plain form
4660 20164749 20056241 19792380 19554850 19305023 18997524 18676469 18409856 18154414 17803585
4651 17803585 17599017 17322248 17069164 16807779 16791697 16525000 16439461 16247374 16165891 15999332
4641 15999332 15863028 15697626 15559700 15436839 15341056 15173250 15227157 15196797 15088844 14960692
4631 14960692 15120610 14841763 14790840 14757170 14640346 14466922 14337038 14252219 14217013 14019633
4621 14019633 14005863 13833990 13798511 13693153 13679501 13473697 13418552 13383510 13224407 13209477
4611 13209477 13112634 13099617 13006829 12975759 12892826 12750099 12782532 12694340 12447023 12381831 12343660
4600 12343660 12296740 12287174 12058365 12111296 12079921 11784518 11909946 11750699 11663982 11600227 11423015
4589 11423015 11461977 11414172 11407833 11379879 11382666 11272536 11267496 11108903 11188557 11018578 10859184
$$ packed form
4660B0164749j08508k63861k37530k49827l07499l21055k66613k55442l50829
4651A7803585k04568k76769k53084k61385j6082k66697q5539j92087q1483j66559
4641A5999332j36304j65402j37926j22861r5783j67806N3907l0360j07953j28152
4631A4960692J59918k78847n0923l3670j16824j73424j29884q4819l5206j97380
4621A4019633j3770j71873l5479j05358j3652k05804n5145l5042j59103j4930
4611A3209477r6843j3017r2788l1070q2933j42727L2433q8192k47317o5192l8171
4600A2343660m6920r566k28809N2931l1375k95403J25428j59247q6717o3755j77212
4589A1423015L8962m7805o339k7954K787j10130n040j58593P9654j69979j59394
$$ plain form
4578 10859184 10916706 10906485 10831606 10895268 10769417 10680409 10573651 10608147 10582331 10569955 10543568
4567 10543568 10436993 10353705 10272377 10245589 10305692 10191046 10220705 9956820 10013735 9766548
4557 9766548 9667097 9684611 9665884 9513717 9567174 9485166 9468776 9451949 9413160 9264680 9292237
4546 9292237 9081166 9066309 8984993 8943900 8785752 8818288 8765780 8735769 8587630 8408993 8608937
4535 8608937 8530847 8310708 8356611 8291358 8186988 8120158 7973845 7784440 7866886 7956526 7817406
4524 7817406 7894016 7864772 7725697 7672844 7741945 7620113 7629540 7536549 7484814 7529962 7478222
4513 7478222 7535549 7368957 7263321 7388078 7235664 7307513 7235041 7013020 7195699 6939741
4503 6939741 7035290 6958577 6909557 6843892 6904560 6906623 6915869 6827392 6719301 6734431 6733059 6756576
$$ packed form
4578A0859184N7522j0221p4879O3662j25851q9008j06758L4496k5816j2376k6387
4567A0543568j06575q3288q1328k6788O0103j14646K9659k63885N6915k47187
4557I766548r9451J7514j8727j52167N3457q2008j6390j6827l8789j48480K7557
4546I292237k11071j4857q1316m1093j58148L2536n2508l0011j48139j78637J99944
4535H608937p8090k20139M5903o5253j04370o6830j46313j89405Q2446Q9640j39120
4524G817406P6610k9244j39075n2853O9101j21832R427r2991n1735M5148n1740
4513G478222N7327j66592j05636J24757j52414P1849p2472k22021J82679k55958
4503F939741R5549p6713m9020o5665O0668K063R246q8477j08091J5130j372K3517
$$ plain form
4491 6756576 6648388 6654504 6636838 6511719 6665022 6409718 6498982 6474961 6542922 6510289 6487917
4480 6487917 6431196 6483625 6372906 6291754 6373428 6383088 6237379 6384975 6214035 6324482 6295350
4469 6295350 6142494 6220715 6148034 6147363 6116725 6043608 6041372 6020938 5980793 6042925 5929082 6016574
4457 6016574 5978362 5988554 6015399 5923435 5940312 5908368 5994397 5957028 5991013 5927893 6018160
4446 6018160 5996996 5931737 5866405 5960710 5887842 5880660 5916197 5850444 5916650 5905822 5922568 5913324
4434 5913324 5840198 5772147 5643057 5745067 5847888 5831150 5813537 5741445 5748004 5789156 5895864
4423 5895864 5761460 5899656 5856481 5859879 5826710 5693148 5843332 5804683 5851644 5846344 5727170
4412 5727170 5931372 5934045 5904063 5939893 6035526 6036644 6065560 6088524 6147120 6121326 6258517
$$ packed form
4491F756576j08188O116j7666j25119J53303k55304Q9264k4021O7961l2633k2372
4480F487917n6721N2429j10719q1152Q1674R660j45709J47596j70940J10447k9132
4469F295350j52856P8221p2681o71l0638p3117k236k0434m0145O2132j13843Q7492
4457F016574l8212J0192K6845r1964J6877l1944Q6029l7369L3985o3120R0267
4446F018160k1164o5259o5332R4305p2868p182L5537o5753O6206j0828J6746r244
4434E913324p3126o8051j29090J02010J02821j6738j7613p2092O559M1152J06708
4423E895864j34404J38196m3175L398l3169j33562J50184l8649M6961n300j19174
4412E727170K04202K673k9982L5830R5633J118K8916K2964N8596k5794J37191
$$ plain form
4401 6258517 6150705 6188473 6351739 6299591 6325548 6395538 6509023 6549826 6631804 6752744 6668184
4390 6668184 6851326 6890144 7056911 7180364 7215589 7543922 7730834 7927971 8229998 8447455
4380 8447455 8622453 8987100 9217662 9657745 10016913 10312700 11050225 11475918 11823393 12280417
4370 12280417 12603860 12734579 12660806 12374320 12058588 11486396 10892378 10340498 9771638 9435753
4360 9435753 9128006 8603735 8304638 8225021 7883093 7522723 7464709 7109361 7045163 6814475
4350 6814475 6712769 6703409 6533167 6351995 6296774 6254546 6032245 6144571 6027084 5968012
4340 5968012 5988745 5811134 5775847 5989021 5953874 5826191 5982931 5629631 5575019 5672841
4330 5672841 5492541 5224677 5307965 5174919 5290022 5155116 5268091 5240503 5078701 4996804
$$ packed form
4401F258517j07812L7768J63266n2148K5957O9990J13485M0803Q1978J20940q4560
4390F668184J83142L8818J66767J23453L5225L28333J86912J97137L02027K17457
4380H447455J74998L64647K30562M40083L59168K95787P37525M25693L47475M57024
4370A2280417L23443J30719p3773k86486l15732n72192n94018n51880n68860l35885
4360I435753l07747n24271k99097p9617l41928l60370n8014l55348o4198k30688
4350F814475j01706r360j70242j81172n5221m2228k22301J12326j17487n9072
4340E968012K0733j77611l5287K13174l5147j27683J56740l53300n4612R7822
4330E672841j80300k67864Q3288j33046J15103j34906J12975k7588j61802q1897
$$ plain form
4320 4996804 5081470 5027994 4904677 4760219 4783199 4914104 4779777 4661617 4714949 4672016
4310 4672016 4634921 4608790 4683199 4601332 4637964 4591022 4483358 4370121 4399807 4298709 4371049
4299 4371049 4271242 4143824 4335102 4351864 4384274 4276076 4183296 4091413 4247420 4219703 4221405
4288 4221405 4000741 4030955 4000161 4125525 3901313 3880807 3920745 3980856 3885523 3876528 3852131
4277 3852131 3757408 3959531 4121909 4219921 4087915 4127131 4270754 4131166 4144142 3995193
4267 3995193 3905060 3805096 3823557 3696311 3623367 3561300 3569305 3519709 3536640 3477841 3457847
4256 3457847 3570270 3422180 3518575 3332064 3444294 3544472 3608707 3599598 3853139 3868559
4246 3868559 3928235 3753764 3690109 3820419 3949776 3856391 3820325 3581053 3548711 3376350
$$ packed form
4320D996804Q4666n3476j23317j44458K2980J30905j34327j18160N3332m2933
4310D672016l7095k6131P4409q1867L6632m6942j07664j13237K9686j01098P2340
4299D371049r9807j27418J91278J6762L2410j08198r2780r1883J56007k7717J702
4288D221405k20664L0214l0794J25364k24212k0506L9938O0111r5333q995k4397
4277C852131r4723K02123J62378R8012j32006L9216J43623j39588J2976j48949
4267C995193r0133r9964J8461j27246p2944o2067Q005m9596J6931n8799j9994
4256C457847J12423j48090R6395j86511J12230J00178O4235r109K53541J5420
4246C868559N9676j74471o3655J30310J29357r3385l6066k39272l2342j72361
$$ plain form
4236 3376350 3397648 3340004 3171611 3246872 3115242 3129407 3154178 3057184 3033085 3018109 3063837
4225 3063837 3063273 2893536 3088253 3093764 2963197 3117898 3158401 3174180 2988451 3016199 3046166
4214 3046166 3113648 3102364 3110699 2898753 2894914 2850945 2838748 2783402 2705358 2775687 2748699 2627593
4202 2627593 2596879 2592992 2545412 2699714 2543405 2536648 2652281 2507900 2603981 2592255 2519172
4191 2519172 2514199 2481852 2471429 2417438 2540464 2481340 2598063 2450679 2599635 2430656 2569642
4180 2569642 2406691 2392624 2327586 2533105 2451181 2608477 2509223 2577778 2491618 2725064 2675644
4169 2675644 2650781 2538180 2665412 2720816 2676622 2686705 2783816 2687796 2569219 2727409 2758779
4158 2758779 2610686 2631962 2590869 2554524 2598253 2536119 2440959 2574858 2650147 2725425 2733847
$$ packed form
4236C376350K1298n7644j68393P5261j31630J4165K4771r6994k4099j4976M5728
4225C063837n64j69737J94717N511j30567J54701M0503J5779j85729K7748K9967
4214C046166O7482j1284Q335k11946l839m3969j2197n5346p8044P0329k6988j21106
4202B627593l0714l887m7580J54302j56309o757J15633j44381R6081j1726p3083
4191B519172m973l2347j0423n3991J23026n9124J16723j47384J48956j68979J38986
4180B569642j62951j4067o5038K05519q1924J57296r9254O8555q6160K33446m9420
4169B675644k4863j12601J27232N5404m4194J0083R7111r6020j18577J58190L1370
4158B758779j48093K1276m1093l6345M3729o2134r5160J33899P5289P5278Q422
$$ plain form
4147 2733847 2571405 2641514 2831212 2888493 2961470 3021521 3060927 3158113 3249146 3433740 3398252
4136 3398252 3398646 3308947 3054948 3071413 3138628 2965061 2953067 3137333 3069684 3076071 3135831
4125 3135831 3016783 3004832 2866054 2919190 2870830 2771845 2729019 2872241 2976171 3160238
4115 3160238 3080877 3096513 3178099 3234849 3197235 3270294 3304332 3286792 3530932 3386027 3239243
4104 3239243 3419032 3342084 3257858 3276800 3217393 3199298 3424229 3325077 3332822 3423758 3523655
4093 3523655 3424255 3346937 3355141 3327918 3171580 3304984 3462598 3567984 3809370 3808685 3773007
4082 3773007 3786229 3821635 3816942 3545741 3457398 3383548 3328287 3265332 3176220 3051997 3065760
4071 3065760 3110813 3142852 3214776 3174332 3129640 3380650 3356001 3348628 3427111 3376654 3413150
$$ packed form
4147B733847j62442P0109J89698N7281P2977O0051L9406R7186R1033J84594l5488
4136C398252L94q9699k53999J6465O7215j73567j1994J84266o7649O387N9760
4125C135831j19048j1951j38778N3136m8360r8985m2826J43222J03930J84067
4115C160238p9361J5636Q1586N6750l7614P3059L4038j7540K44140j44905j46784
4104C239243J79789p6948q4226J8942n9407j8095K24931r9152P745R0936R9897
4093C523655r9400p7318Q204k7223j56338J33404J57614J05386K41386o85l5678
4082C773007J3222L5406m693k71201q8343p3850n5261o2955q9112j24223J3763
4071C065760M5053L2039P1924m0444m4692K51010k4649p373P8483n0457L6496
$$ plain form
4060 3413150 3452084 3657026 3617758 3588180 3518544 3559555 3484599 3395729 3304569 3141047 3067125
4049 3067125 3148154 3040568 2815865 2858334 3011000 2981266 2996954 2940347 3017653 2820234 2832817
4038 2832817 2897267 2955552 2750206 2747965 2682832 2764813 2707036 2516295 2477924 2530227 2314067
4027 2314067 2433582 2313671 2239601 2115743 2135333 2039764 1940193 2042810 1856147 1952269
4017 1952269 1925915 1796068 1897777 1767498 1739990 1769824 1754170 1646580 1541845 1705510
4007 1705510 1735219 1736202 1652019 1755449 1526693 1631014 1615299 1579119 1356147 1439641 1367015
3996 1367015 1486357 1479923 1583590 1535139 1411177 1371197 1314816 1279315 1235387 1224743 1343714
3985 1343714 1269109 1419408 1356737 1272867 1282770 1148543 1245224 1300919 1145584 1149960 1216012
$$ packed form
4060C413150L8934K04942l9268k9578o9636M1011p4956q8870r1160j63522p3922
4049C067125Q1029j07586k24703M2469J52666k9734J5688n6607P7306j97419J2583
4038B832817O4450N8285k05346k241o5133Q1981n7777j90741l8371N2303k16160
4027B314067J19515j19911p4070j23858J9590r5569r9571J02617j86663R6122
4017A952269k6354j29847J01709j30279k7508K9834j5654j07590j04735J63665
4007A705510K9709R83q4183J03430k28756J04321j5715l6180k22972Q3494p2626
3996A367015J19342o434J03667m8451j23962l9980n6381l5501m3928j0644J18971
3985A343714p4605J50299o2671q3870R903j34227R6681N5695j55335M376O6052
$$ plain form
3974 1216012 1226539 1147616 1183713 1099830 1242475 1182439 1168022 1061653 1264633 1293134 1049336
3963 1049336 1226136 1117474 1122140 1148022 1092137 1018709 1081252 1194068 1153179 1149357 1052797
3952 1052797 1010336 978398 977205 972181 1038669 1087258 1089574 974226 1036415 933421 1047081
3941 1047081 946323 980969 945088 1008817 1044853 965219 986283 885573 1025412 907523 912920
3930 912920 917548 882163 839368 944830 892268 815787 912108 896347 998628 869200 709118
3919 709118 879717 945190 801842 826449 821471 790850 794650 801425 783205 878021 812997 704331
3907 704331 862746 834125 826861 885200 806681 858231 884242 801156 861778 885514 826467 711193
3895 711193 891666 774956 757996 800942 867724 749812 804406 799630 789543 911953 809357
$$ packed form
3974A216012J0527p8923L6097q3883J42645o0036j4417j06369K02980K8501k43798
3963A049336J76800j08662M666K5882n5885p3428O2543J12816m0889l822r6560
3952A052797m2461l1938j193n024O6488M8589K316j15348O2189j02994J13660
3941A047081j00758L4646l5881O3729L6036p9634K1064j00710J39839j17889N397
3930I12920M628l5385m2795J05462n2562p6481R6321j5761J02281j29428j60082
3919G09118J70599O5473j43348K4607m978l0621L800O775j8220R4816o5024j08666
3907G04331J58415k8621p264N8339p8519N1550K6011q3086O0622K3736n9047j15274
3895G11193J80473j16710j6960M2946O6782j17912N4594m776j0087J22410j02596
$$ plain form
3884 809357 796698 693517 818398 823791 689135 737154 735077 838513 817397 886151 895916
3873 895916 845808 713719 768846 752521 838771 908408 713014 890595 928439 823556 678189
3862 678189 835300 822687 915369 793182 876390 980781 987310 868727 841964 905108 732975
3851 732975 901518 907172 820339 881611 902816 966923 850921 895279 1021918 896009 893804
3840 893804 881840 942436 993538 968544 1059908 944955 999960 952308 852374 1021880 1022622 1043440
3828 1043440 988344 1019324 902458 927084 1054390 1111769 962714 1047738 952732 985770 875660
3817 875660 907838 942044 1053087 992174 1042420 1114993 1046406 867786 978400 1027662 1060202
3806 1060202 1103373 1184306 1020519 1210407 1176589 1204240 1221682 1118554 1031119 1042311 1017414
$$ packed form
3884H09357j2659j03181J24881N393j34656M8019k077J03436k1116O8754R765
3873H95916n0108j32089N5127j6325Q6250O9637j95394J77581L7844j04883j45367
3862F78189J57111j2613R2682j22187Q3208J04391O529j18583k6763O3144j72133
3851G32975J68543N654q6833O1272K1205O4107j16002M4358J26639j25909k205
3840H93804j1964O0596N1102k4994R1364j14953N5005m7652r9934J69506P42K0818
3828A043440n5096L0980j16866K4626J27306N7379j49055Q5024r5006L3038j10110
3817H75660L2178L4206J11043o0913N0246P2573o8587j78620J10614M9262L2540
3806A060202M3171Q0933j63787J89888l3818K7651J7442j03128q7435J1192k4897
$$ plain form
3795 1017414 1109642 996553 971667 999198 997358 911712 938471 897486 1009580 968730 1059571
3784 1059571 960996 952790 952669 1084849 954349 925908 900786 989519 911655 1073386 1167091
3773 1167091 1017448 980495 1068524 1163583 1220417 1020743 1038022 1013702 1063630 1014579 903423
3762 903423 926646 810479 828847 854032 785742 902719 853277 845791 873873 771797 852123
3751 852123 851084 721620 702326 762110 783232 665809 735185 657066 676481 690601 701616
3740 701616 651646 731944 735305 790646 718206 698056 876745 730178 739307 634187 670517
3729 670517 639827 625550 571122 458049 522047 729960 529757 666555 563004 586831 615278
3718 615278 539507 556500 519492 633746 524603 414285 515487 469146 610264 554846 477309
$$ packed form
3795A017414R2228j13089k4886K7531j840q5646K6759m0985J12094m0850R0841
3784A059571r8575q206j21J32180j30500k8441k5122Q8733p7864J61731R3705
3773A167091j49643l6953Q8029R5059N6834j99674J7279k4320M9928m9051j11156
3762I03423K3223j16167J8368K5185o8290J16977m9442p486K8082j02076Q0326
3751H52123j039j29464j9294N9784K1122j17423O9376p8119J9415J4120J1015
3740G01616m9970Q0298L361N5341p2440k0150J78689j46567R129j05120L6330
3729F70517l0690j4277n4428j13073O3998K07913k00203J36798j03551K3827K8447
3718F15278p5771J6993l7008J14254j09143j10318J01202m6341J41118n5418p7537
$$ plain form
3707 477309 521922 384025 544681 539784 525647 493430 455989 431843 569577 430729 457511
3696 457511 521774 498491 465278 568638 497322 616585 545968 516392 467923 413264 412079
3685 412079 458763 393604 510538 523446 459811 327165 407629 296013 357169 426259 533494
3674 533494 315462 438391 573648 404263 358449 443563 355571 400465 360418 398883 285966
3663 285966 373243 380097 506183 394988 371680 423272 397933 264868 495988 474743 407266
3652 407266 365541 601146 499110 246900 427045 464163 394719 282184 493839 507037
3642 507037 424440 454309 429644 424204 421866 292992 308226 466901 436324 361342 415038 342948
3630 342948 306701 354265 614588 428219 395432 409675 483396 401552 639607 705266 694399
$$ packed form
3707D77309M4613j37897J60656m897j4137l2217l7441k4146J37734j38848K6782
3696D57511O4263k3283l3213J03360p1316J19263p0617k9576m8469n4659j185
3685D12079M6684o5159J16934J2908o3635j32646Q0464j11616O1156O9090J07235
3674E33494k18032J22929J35257j69385m5814Q5114q7992M4894m0047L8465j12917
3663B85966Q7277O854J26086j11195k3308N1592k5339j33065K31120k1245o7477
3652D07266m1725K35605j02036k52210J80145L7118o9444j12535K11655J3198
3642E07037q2597K9869k4665n440k338j28874J5234J58675l0577p4982N3696p2090
3630C42948l6247M7564K60323j86369l2787J4243P3721q1844K38055O5659j0867
$$ plain form
3619 694399 785292 926565 1157336 1031568 927318 903204 667675 480732 613503 495228
3609 495228 568818 523906 360118 534053 563223 605214 383328 375666 373257 313965 475728
3598 475728 437106 358672 513192 396066 413668 422031 361053 575064 308044 537296 459247
3587 459247 427715 442685 382176 573896 478510 408226 433816 377335 315083 321890 446563
3576 446563 372375 410426 502800 441029 411613 511362 413109 549139 508835 394064 435496
3565 435496 330739 332178 440817 305406 419621 381533 439331 437069 327177 471988 241799
3554 241799 374455 421915 354422 256221 261027 401118 422986 447282 388364 357975 305318
3543 305318 345701 329743 372646 473489 323346 444867 460746 447297 285631 391608 299268
$$ packed form
3619F94399R0893J41273K30771j25768j04250k4114k35529j86943J32771j18275
3609D95228P3590m4912j63788J73935K9170M1991k21886p662k409n9292J61763
3598D75728l8622p8434J54520j17126J7602Q363o0978K14011k67020K29252p8049
3587D59247l1532J4970o0509J91720r5386p0284K5590n6481o2252O807J24673
3576D46563p4188L8051R2374o1771k9416R9749r8253J36030m0304j14771M1432
3565D35496j04757J439J08639j35411J14215l8088N7798k262j09892J44811k30189
3554B41799J32656M7460o7493r8201M806J40091K1868K4296n8918l0389n2657
3543C05318M0383j5958M2903J00843j50143J21521J5879j3449j61666J05977r2340
$$ plain form
3532 299268 270942 392884 367880 376281 472069 413413 353579 329534 474169 425198 526611
3521 526611 554900 563840 422499 515482 378019 395550 505802 544683 534416 605199 586506
3510 586506 440598 538676 466619 406179 501904 499304 441682 438483 688010 446859 623985
3499 623985 446543 564176 560938 442858 405403 501221 577348 545894 619684 603046 523732
3488 523732 528220 488369 536150 626090 628895 730418 633243 729350 659839 753124 637560 656986
3476 656986 713859 794335 763477 763289 916189 925336 785829 773404 712926 738613 633095 613742
3464 613742 781593 739805 881217 822905 871890 861917 851616 950321 1029305 1162979 1254101
3453 1254101 1236963 1208129 1260800 1340677 1327381 1192549 1204058 1157755 1138761 1067834 930531
$$ packed form
3532B99268k8326J21942k5004Q401R5788n8656n9834k4045J44635m8971J01413
3521E26611K8289Q940j41341R2983j37463J7531J10252L8881j0267P0783j8693
3510E86506j45908R8078p2057o0440R5725k600n7622l199K49527k41151J77126
3499F23985j77442J17633l238j18080l7455R5818P6127l1454P3790j6638p9314
3488E23732M488l9851M7781Q9940K805J01523r7175R6107o9511R3285j15564J9426
3476F56986N6873Q0476l0858j88J52900R147j39507j2425o0478K5687j05518j9353
3464F13742J67851m1788J41412n8312M8985r973j0301R8705P8984J33674R1122
3453A254101j7138k8834N2671P9877j3296j34832J1509m6303j8994p0927j37303
$$ plain form
3442 930531 1132044 1095816 1234586 1334080 1339464 1440477 1585940 1362306 1436770 1494138 1491761
3431 1491761 1590813 1717812 1799962 1799502 1794284 1828790 1839686 1861706 2054288 2098162 2251713
3420 2251713 2197770 2592351 2575848 2879290 3074829 3253634 3281433 3347403 3295157 3349564 3323586
3409 3323586 3818856 3965755 4432776 4806894 5239773 5902318 6446429 7252429 8128222 9075724
3399 9075724 10822041 12619404 14021531 14719255 15154490 15941210 17202368 18621856 20489226
3390 20489226 24070241 29357752 37991282 55535896 96719136 141260199 161074321 142778675
3382 142778675 109050841 86161281 64992544 49526336 38228514 28853994 21947028
3375 21947028 18014635 15731432 14724985 14520775 14050424 13116472 11647063 10582613 9669449
$$ packed form
3442I30531K01513l6228J38770R9494N384J01013J45463k23634P4464N7368k377
3431A491761R9052J26999Q2150m60n218L4506J0896K2020J92582M3874J53551
3420B251713n3943L94581j6503L03442J95539J78805K7799O5970n2246N4407k5978
3409C323586M95270J46899M67021L74118M32879O62545N44111Q06000Q75793R47502
3399I075724J746317J797363J402127O97724M35235P86720J261158J419488J867370
3390B0489226L581015N287511Q633530J7544614M1183240M4541063J9814122j8295646
3382A42778675l3727834k2889560k1168737j5466208j1297822r374520o906966
3375B1947028l932393k283203j006447k04210m70351r33952j469409j064450r13164
$$ plain form
3366 9669449 8819079 8405921 7667790 7336179 6922671 6883817 6784697 6717977 6337913 6265192
3356 6265192 5860217 5474039 5018558 4715948 4623606 4427211 4481937 4382704 4283201 4393921
3346 4393921 4224076 4347377 4266100 4086434 4089213 3988971 3923173 3792777 3664234 3525922
3336 3525922 3541080 3253169 3070454 2992731 2872983 2813623 2803574 2758756 2720081 2658996 2812180
3325 2812180 2661949 2485683 2620946 2367529 2264638 2094528 1934112 1946535 1851036 1781680
3315 1781680 1810490 1545647 1780762 1754846 1878953 1728704 1703929 1763102 1725472 1863260
3305 1863260 1638144 1919802 1739180 1670467 1595787 1482159 1593742 1481200 1374894 1318941
3295 1318941 1310908 1338764 1420118 1327653 1195754 1228386 1218675 1127232 1329014 1111537 1190155
$$ packed form
3366I669449q50370m13158p38131l31611m13508l8854r9120o6720l80064p2721
3356F265192m04975l86178m55481l02610r2342j96395N4726r9233r9503J10720
3346D393921j69845J23301q1277j79666K779j00242o5798j30396j28543j38312
3336C525922J5158k87911j82715p7723j19748n9360j0049m4818l8675o1085J53184
3325B812180j50231j76266J35263k53417j02891j70110j60416J2423r5499o9356
3315A781680K8810k64843K35115k5916J24107j50249k4775N9173l7630J37788
3305A863260k25116K81658j80622o8713p4680j13628J11583j12542j06306n5953
3295A318941q033K7856Q1354r2465j31899L2632r711r1443K01782k17477P8618
$$ plain form
3284 1190155 1118051 1206893 1158803 1097066 970087 1005048 1142202 1186455 1142098 979502 1179342
3273 1179342 1006487 1109465 1082759 1009769 895173 695688 756824 838920 837374 944563 874598
3262 874598 814874 814924 900148 825093 754948 668257 777797 765223 616661 732725 853272
3251 853272 625984 643743 754799 739414 570273 558643 499540 579272 557079 554738 565123
3240 565123 626234 647796 584297 591205 552668 775211 590892 553015 568866 606536 417903
3229 417903 437053 545218 447044 548242 445689 469841 454768 440167 429308 439566 442907
3218 442907 535862 590169 368859 444155 496816 337156 366565 399128 374111 524976 400836
3207 400836 369489 377808 323532 421539 450869 408215 400406 345490 464242 406163 341277 341606
$$ packed form
3284A190155p2104Q8842m8090o1737j26979L4961J37154M4253m4357j62596J99840
3273A179342j72855J02978k6706p2990j14596j99485O1136Q2096j546J07189o9965
3262H74598n9724N0Q5224p5055p0145q6691J09540j2574j48562J16064J20547
3251H53272k27288J7759J11056j5385j69141j1630n9103P9732k2193k341J0385
3240E65123O1111K1562o3499O908l8537K22543j84319l7877J5851L7670j88633
3229D17903J9150J08165r8174J01198j02553K4152j5073j4601j0859J0258L341
3218D42907R2955N4307k21310P5296N2661j59660K9409L2563k5017J50865j24140
3207D00836l1347Q319n4276R8007K9330m2654p809n4916J18752n8079o4886L29
$$ plain form
3195 341606 320390 260996 422551 380914 408702 378963 422568 397273 311337 402199 255148
3184 255148 357789 286031 272517 140738 149606 234174 298497 290291 331365 161606 249737
3173 249737 283455 262884 220327 215446 218540 213657 277902 315141 183155 343116 203686 274572
3161 274572 212323 331998 278274 304382 300557 475189 548335 516506 410977 557410 815860
3150 815860 841902 954120 949310 749165 784471 639012 575089 478576 419324 453847 273098
3139 273098 328839 336075 264220 310857 193027 270644 271564 197366 176741 195870 214302 47288
3127 47288 72401 180001 140129 195799 90368 11738 115912 131245 285175 337171 114446
3116 114446 137119 130888 134861 169989 160210 47709 53364 121679 104671 121251 194888 221476
$$ packed form
3195C41606k1216n9394J61555m1637K7788k9739M3605k5295q5936R0862j47051
3184B55148J02641p1758j3514j31779Q868Q4568O4323q206M1074j69759Q8131
3173B49737L3718k0571m2557m881L094m883O4245L7239j31986J59961j39430P0886
3161B74572o2249J19675n3724K6108l825J74632P3146l1829j05529J46433K58450
3150H15860K6042J12218m810k00145L5306j45459o3923r6513n9252L4523j80749
3139B73098N5741P236p1855M6637j17830P7617R20p4198k0625J9129J8432j67014
3127D7288K5113J07600l9872N5670j05431p8630J04174J5333J53930N1996k22725
3116A14446K2673o231L973L5128r779j12501N655O8315j7008J6580P3637K6588
$$ plain form
3104 221476 157400 17906 60661 60082 229587 240956 75581 112670 122941 231741 154083
3093 154083 270217 154052 142336 145069 151913 209361 159184 200439 175849 38502 -22081
3082 -22081 -9814 150642 102140 28411 133220 55768 116718 75348 90188 46668 88628
3071 88628 176100 -86422 147660 75857 143364 131446 195090 160266 80043 -55614 37324
3060 37324 193784 63449 20249 63359 156343 182387 -25852 208847 46309 206309 69732
3049 69732 33282 50920 76679 184275 195573 138419 28436 33083 67040 59183 59133 143032
3037 143032 113645 79077 157468 119657 143115 191641 74726 171046 -49456 55864 34496
3026 34496 3950 119150 160926 69130 81814 45220 77975 -48686 52523 9092 -13788
$$ packed form
3104B21476o4076j39494M2755n79J69505J1369j65375L7089J0271J08800p7658
3093A54083J16134j16165j1716K733O844N7448n0177M1255k4590j37347o0583
3082b2081J2267J60456m8502p3729J04809p7452O0950m1370J4840m3520M1960
3071H8628Q7472k62522K34082p1803O7507j1918O3644l4824q0223j35657R2938
3060C7324J56460j30335m3200M3110R2984K6044k08239K34699j62538J60000j36577
3049F9732l6450J7638K5759J07596J1298n7154j09983M647L3957p857n0Q3899
3037A43032k9387l4568P8391l7811K3458M8526j16915R6320k20502J05320k1368
3026C4496l0546J15200M1776r1796J2684l6594L2755j26661J01209m3431k2880
$$ plain form
3015 -13788 -14335 -58245 -20917 -19929 -26266 53118 49890 202159 165833 58474 181626 48063
3003 48063 77181 124000 85332 62014 -41368 51849 71084 55752 43962 60749 151513 123557
2991 123557 116591 140756 137157 37192 38342 58612 84931 57197 -28180 65243 96128 9035
2979 9035 -11378 10862 114 48025 -92880 26028 -46112 15632 13514 172518 33290
2968 33290 108831 -2716 107524 -130394 -50352 60630 -41662 64205 -10069 46727 12510
2957 12510 95752 74836 -22451 36505 43183 -103207 -3212 3296 33936 -79029 41793 -6287
2945 -6287 160283 64097 113155 -5399 6241 -48223 -59873 115037 -46249 -135136 -82012
2934 -82012 82924 -15386 115568 -23067 101967 23334 3035 43608 101157 45512 174851
$$ packed form
3015a3788n47m3910L7328R88o337P9384l228J52269l6326j07359J23152j33563
3003D8063K9118M6819l8668k3318j03382R3217J9235j5332j1790J6787R0764k7956
2991A23557o966K4165l599r9965J150K0270K6319k7734q5377R3423L0885q7093
2979I035k0413K2240j0748M7911j40905J18908p2140O1744k118J59004j39228
2968C3290P5541j11547J10240k37918Q0042J10982j02292J05867p4274N6796l4217
2957A2510Q3242k0916r7287N8956O678j46390R9995O508L0640j12965J20822m8080
2945f287J66570r6186M9058j18554J1640n4464j1650J74910j61286q8887N3124
2934h2012J64936r8310J30954j38635J25034p8633k0299M0573N7549n5645J29339
$$ plain form
2923 174851 153513 145045 41012 -113876 40922 14779 19209 -7428 53307 54324 -99219
2912 -99219 -73472 13871 108327 -39362 -8110 39457 -56350 29909 1025 -4357 203137 51441
2900 51441 -2450 76349 66023 60276 90355 -47166 -9170 44043 6997 229635 32115
2889 32115 -13661 20854 -60554 41128 -136943 -112692 -160545 -69629 135583 181586 -74608
2878 -74608 -6032 39012 -1283 88512 24762 80766 -49348 -25276 33488 -86039 -108169
2867 -108169 -31684 -96081 70771 -27714 38020 31287 21237 18513 24617 4217 60763 -25839
2855 -25839 122651 -46122 55968 -63614 91567 -73190 952 -29278 -124722 34867
2845 34867 -53439 31880 -5738 28546 -71218 89825 -188048 10593 -71966 -35936 77126
$$ packed form
2923A74851k1338q468j04033j54888J54798k6143M430k6637O0735J017j53543
2912i9219K5747Q7343R4456j47689L1252M7567r5807Q6259k8884n382K07494j51696
2900E1441n3891P8799j0326n747L0079j37521L7996N3213l7046K22638j97520
2889C2115m5776L4515q1408J01682j78071K4251m7853R0916K05212M6003k56194
2878g4608O8576M5044m0295Q9795o3750N6004j30114K4072N8764j19527k2130
2867a08169P6485o4397J66852r8485O5734o733j0050k724O104k0400N6546q6602
2855b5839J48490j68773J02090j19582J55181j64757P4142l0230r5444J59589
2845C4867q8306Q5319l7618L4284r9764J61043k77873J98641q2559L6030J13062
$$ plain form
2834 77126 37930 -161465 -19800 -68212 118623 -91037 18353 -66749 -17723 36628 47303
2823 47303 -90292 -68251 -49165 -57017 74733 -122411 -109654 -127761 -23690 -104553 -146859
2812 -146859 30982 -90589 -90738 28529 18833 -49558 -8501 11351 -6471 -66730 4821 -42846
2800 -42846 17052 -10044 43536 -127517 50606 -58448 -7879 -73647 -119792 -18619 -68701
2789 -68701 -60886 19582 -58307 85775 -135362 57679 10484 -87172 -39907 51413 2520
2778 2520 -13449 -133112 -39380 -33654 -84659 -11828 -32155 -68022 -47961 20798 -72941 5033
2766 5033 -132768 -103092 24788 -51780 63282 -100346 -158698 17779 52200 -53209 -115864
2755 -115864 -196354 25978 -209241 -151659 -129101 49537 -162191 -11643 4206 -4177 -56294
$$ packed form
2834G7126l9196j99395J41665m8412J86835k09660J09390q5102M9026N4351J0675
2823D7303j37595K2041J9086p852J31750j97144J2757j8107J04071q0863m2306
2812a46859J77841j21571j49J19267r696o8391M1057J9852j7822o0259P1551m7667
2800d2846N9898k7096N3580j71053J78123j09054N0569o5768m6145J01173n0082
2789f8701P815Q0468p7889J44082k21137J93041m7195r7656M7265R1320m8893
2778B520j5969j19663R3732N726n1005P2831k0327l5867K0061O8759r3739P7974
2766E033j37801K9676J27880p6568J15062j63628n8352J76477L4421j05409o2655
2755a15864q0490K22332k35219N7582K2558J78638k11728J50548J5849q383n2117
$$ plain form
2744 -56294 15248 21098 -101594 -58505 -109386 73160 145546 -61203 -99468 -52236 -27002
2733 -27002 -8950 -62756 31859 20230 -157668 5983 -70973 67810 -60401 2266 54214
2722 54214 39339 -10380 -85984 -82873 -653 -167567 1186 -119476 -102130 -26791 -23169 85420
2710 85420 -118465 -69727 -139494 -98890 -125857 -238029 -57641 -79621 -51187 -211905 -138455
2699 -138455 -176655 -137198 72476 -19596 2288 32150 -54200 -181379 -40078 -82132 -74966
2688 -74966 -163728 -13180 -96312 -20093 -39718 2967 -14204 -47074 27515 -88696 64367
2677 64367 -119183 -73517 -153165 -92475 10791 -119323 -160685 -90608 24647 -69738 -34462
2666 -34462 -97251 -90065 -112469 -23317 35014 9621 -274466 -127006 -77674 -43807 -105828 -5571
$$ packed form
2744e6294P1542N850j22692M3089n0881J82546P2386k06749l8265M7232K5234
2733b7002J8052n3806R4615j1629j77898J63651p6956J38783j28211O2667N1948
2722E4214j4875m9719p5604L111Q2220j66914J68753j20662J7346P5339L622J08589
2710H5420k03885M8738o9767M0604k6967j12172J80388k1980K8434j60718P3450
2699a38455l8200L9457K09674r2072K1884K9862q6350j27179J41301m2054P166
2688g4966q8762J50548q3132P6219j9625M2685j7171l2870P4589j16211J53063
2677F4367j83550M5666p9648O0690J03266j30114m1362P0077J15255r4385L5276
2666c4462o2789P186k2404Q9152N8331k5393k84087J47460M9332L3867o2021J00257
$$ plain form
2654 -5571 -141319 -116341 -122139 -223951 -107616 -164432 -30424 -107831 -123471 -96161 -78015
2643 -78015 -196943 -41483 -50482 -152839 39141 -88328 -147242 -19919 -198201 -28091
2633 -28091 13481 -123853 -46677 -8145 33158 -13962 -125582 -39512 -87484 -124290 -49936
2622 -49936 -91807 -31006 -158876 -58813 -104892 -164311 10654 -150536 -70699 -163599 -131561
2611 -131561 -131146 -97195 -10570 -177165 -282268 -32795 -157014 13876 -7077 30863 -122566
2600 -122566 -227752 -122921 -160686 26745 -76007 117696 -147743 -202437 -94491 79926
2590 79926 -116051 -60553 -86634 -131118 -125194 -60405 9093 -10030 -133391 853 -164279
2579 -164279 34335 -55284 -281636 -149720 83965 -209462 -146908 -157862 -177139 -84431 27157
$$ packed form
2654e571j35748K4978n798j01812J16335n6816J34008p7407j5640K7310J8146
2643g8015j18928J55460q999j02357J91980j27469n8914J27323j78282J70110
2633b8091M1572j37334P7176L8532M1303m7120j11620Q6070m7972l6806P4354
2622d9936m1871O0801j27870J00063m6079n9419J74965j61190P9837r2900L2038
2611a31561M15L3951Q6625j66595j05103K49473j24219J70890k0953L7940j53429
2600a22566j05186J04831l7765J87431j02752J93703k65439n4694J07946J74417
2590G9926j95977N5498k6081m4484N924O4789O9498j9123j23361J34244j65132
2579a64279J98614q9619k26352J31916K33685k93427O2554j0954j9277R2708J11588
$$ plain form
2568 27157 -57220 -44364 32079 -45300 -89931 -16090 -111033 -128634 -102539 58990 -75983
2557 -75983 -108960 -112756 -244080 -113987 -242628 -17655 -136199 -79199 -16381 -49644 -64018
2546 -64018 30795 -166292 40008 -81151 4579 -106451 -73757 -131186 25569 -52729 -112554
2535 -112554 3825 -5741 -6722 -132776 -68145 -40710 -7078 -123238 -168480 -55387 9339
2524 9339 -64589 958 -45034 -138789 -16418 -17407 -190356 10394 18092 -52627 -36606 -64948
2512 -64948 -73103 -111720 -171842 -132224 -60540 -155172 -137265 -121162 -80974 -184020 -42617 -66338
$$ packed form
2568B7157q4377J2856P6443p7379m4631P3841r4943j7601K6095J61529j34973
2557g5983l2977l796j31324J30093j28641K24973j18544N7000O2818l3263j4374
2546f4018R4813j97087K06300j21159Q5730j11030L2694n7429J56755p8298n9825
2535a12554J16379r566r81j26054O4631K7435L3632j16160m5242J13093O4726
2524I339p3928O5547m5992r3755J22371r89j72949K00750P698p0719J6021k8342
2512f4948q155l8617o0122L9618P1684r4632J7907J6103M0188j03046J41403k3721
$$ [...]
##END NTUPLES=NMR SPECTRUM
##END=
