##TITLE=abcd
##JCAMPDX= 6.0         $$ Bruker NMR JCAMP-DX V2.0
##DATA TYPE= NMR SPECTRUM
##DATA CLASS= NTUPLES
##ORIGIN= UXNMR, Bruker Analytische Messtechnik GmbH
##OWNER= root
$$ XWIN-NMR		Version 3.5
$$ Sat Feb 28 11:18:54 2026 Russian Standard Time (UT+4h)  servis@DPX200
##.OBSERVE FREQUENCY= 200.131235884673
##.OBSERVE NUCLEUS= ^1H
##.ACQUISITION MODE= SIMULTANEOUS
##.ACQUISITION SCHEME= undefined
##.AVERAGES= 16
##.DIGITISER RES= 18
##SPECTROMETER/DATA SYSTEM= spect
##.PULSE SEQUENCE= zg
##.SOLVENT NAME= CDCl3
##.SHIFT REFERENCE= (INTERNAL, CDCl3, 0, 16.4885)
##AUDIT TRAIL= $$ (NUMBER, WHEN, WHO, WHERE, WHAT)
$$ ##TITLE= Audit trail, XWIN-NMR		Version 3.5
$$ ##JCAMPDX= 5.01
$$ ##ORIGIN= Bruker BioSpin GmbH
$$ ##OWNER= servis
$$ F:\spectra/data/av/nmr/H1/1/pdata/1/auditp.txt
$$ ##AUDIT TRAIL=  $$ (NUMBER, WHEN, WHO, WHERE, WHAT)
(   1,<2026-02-28 11:17:24.51 +0400>,<servis>,<DPX200>,
      <created by zg, POWCHK disabled, PULCHK disabled
       terminated by command 'halt'
       configuration hash MD5:
       00 E9 B6 7A A2 85 ED C7 34 08 36 98 17 FE 4E 26
       data hash MD5: 32K
       98 80 34 B1 19 B3 4A 55 49 26 C0 74 94 8E BF 4C>)
(   2,<2026-02-28 11:17:26.45 +0400>,<servis>,<DPX200>,
      <Start of raw data processing
       efp BC_mod = 2 LB = 0.05 FT_mod = 6 PKNL = 1 PHC0 = -258.2463 PHC1 = 6.301564 SI = 16K 
       data hash MD5: 16K
       6B 5A B7 F3 B4 54 BF B0 6B 1A 8D BB 4B B8 C1 61>)
$$ ##END=
$$ 
$$ hash MD5
$$ 64 E9 64 5A 39 5F 04 FA 19 54 34 C5 1C 4D 04 FC
##$RELAX= 
##$RELAX= 
##$RELAX= 
##$RELAX= 
##$RELAX= 
##$RELAX= 
##$RELAX= 
##$RELAX= 
$$ Bruker specific parameters
$$ --------------------------
##$DU= <F:\spectra>
##$EXPNO= 1
##$NAME= <H1>
##$PROCNO= 1
##$TYPE= <nmr>
##$USER= <av>
##$AMP= (0..31)
100 100 100 100 100 100 100 100 100 100 100 100 100 100 100 100 100 100 
100 100 100 100 100 100 100 100 100 100 100 100 100 100 
##$AQSEQ= 0
##$AQ_mod= 1
##$AUNM= <au_zg>
##$AUTOPOS= <>
##$BF1= 200.13
##$BF2= 200.13
##$BF3= 200.13
##$BF4= 200.13
##$BF5= 500.13
##$BF6= 500.13
##$BF7= 500.13
##$BF8= 500.13
##$BYTORDA= 1
##$CFDGTYP= 0
##$CFRGTYP= 5
##$CHEMSTR= <none>
##$CNST= (0..31)
1 1 145 1 1 1 1 1 1 1 1 1 1 1 1 1 1 1 1 1 1 1 1 1 1 1 1 1 1 1 1 1 
##$CPDPRG= <>
##$CPDPRG1= <>
##$CPDPRG2= <>
##$CPDPRG3= <>
##$CPDPRG4= <mlev>
##$CPDPRG5= <mlev>
##$CPDPRG6= <mlev>
##$CPDPRG7= <mlev>
##$CPDPRG8= <mlev>
##$CPDPRGB= <>
##$CPDPRGT= <>
##$D= (0..31)
0 2 0 0 0 0 0 0 0 0.06 0 0 0 0 0 0 0.0002 0 0 0 0 0 0 0 0 0 0 0 0 0 0 
0 
##$DATE= 1772263044
##$DBL= (0..7)
120 120 120 120 120 120 120 120 
##$DBP= (0..7)
150 150 150 150 150 150 150 150 
##$DBP07= 0
##$DBPNAM0= <>
##$DBPNAM1= <>
##$DBPNAM2= <>
##$DBPNAM3= <>
##$DBPNAM4= <>
##$DBPNAM5= <>
##$DBPNAM6= <>
##$DBPNAM7= <>
##$DBPOAL= (0..7)
0.5 0.5 0.5 0.5 0.5 0.5 0.5 0.5 
##$DBPOFFS= (0..7)
0 0 0 0 0 0 0 0 
##$DE= 6
##$DECBNUC= <off>
##$DECIM= 32
##$DECNUC= <off>
##$DECSTAT= 4
##$DIGMOD= 1
##$DIGTYP= 9
##$DL= (0..7)
0 120 120 120 120 120 120 120 
##$DP= (0..7)
$$ [...]
##$SUBNAM4= <"">
##$SUBNAM5= <"">
##$SUBNAM6= <"">
##$SUBNAM7= <"">
##$SUBNAM8= <"">
##$SUBNAM9= <"">
##$SW= 20.6817932712277
##$SWIBOX= (0..15)
0 0 3 0 0 0 0 0 0 0 0 0 0 0 0 0 
##$SW_h= 4139.07284768212
##$TD= 32768
##$TD0= 1
##$TE= 0
##$TE2= 300
##$TE3= 300
##$TEG= 300
##$TL= (0..7)
0 120 120 120 120 120 120 120 
##$TP= (0..7)
150 150 150 150 150 150 150 150 
##$TP07= 0
##$TPNAME0= <>
##$TPNAME1= <>
##$TPNAME2= <>
##$TPNAME3= <>
##$TPNAME4= <>
##$TPNAME5= <>
##$TPNAME6= <>
##$TPNAME7= <>
##$TPOAL= (0..7)
0.5 0.5 0.5 0.5 0.5 0.5 0.5 0.5 
##$TPOFFS= (0..7)
0 0 0 0 0 0 0 0 
##$TUNHIN= 0
##$TUNHOUT= 0
##$TUNXOUT= 0
##$USERA1= <user>
##$USERA2= <user>
##$USERA3= <user>
##$USERA4= <user>
##$USERA5= <user>
##$V9= 5
##$VALIST= <valist>
##$VCLIST= <CCCCCCCCCCCCCCC>
##$VD= 0
##$VDLIST= <DDDDDDDDDDDDDDD>
##$VPLIST= <PPPPPPPPPPPPPPP>
##$VTLIST= <TTTTTTTTTTTTTTT>
##$WBST= 1024
##$WBSW= 30
##$XGAIN= (0..3)
0 0 0 0 
##$XL= 0
##$YL= 0
##$YMAX_a= 299499
##$YMIN_a= -206138
##$ZGOPTNS= <>
##$ZL1= 120
##$ZL2= 120
##$ZL3= 120
##$ZL4= 120
##$ABSF1= 0
##$ABSF2= 0
##$ABSG= 0
##$ABSL= 0
##$ALPHA= 0
##$AQORDER= 0
##$ASSFAC= 0
##$ASSFACI= 0
##$ASSFACX= 0
##$ASSWID= 0
##$AUNMP= <proc_1d>
##$AZFE= 0.1
##$AZFW= 0.1
##$BCFW= 0
##$BC_mod= 2
##$BYTORDP= 0
##$COROFFS= 0
##$CY= 18.4799938201904
##$DATMOD= 1
##$DC= 0
##$DFILT= <>
##$DTYPP= 0
##$F1P= 9.9274215381318
##$F2P= -0.165520771350173
##$FCOR= 1
##$FTSIZE= 16384
##$FT_mod= 6
##$GAMMA= 0
##$GB= 0
##$INTBC= 1
##$INTSCL= 4.127829e-11
##$ISEN= 128
##$LB= 0.05
##$LEV0= 0
##$LPBIN= 0
##$MAXI= 10000
##$MC2= 0
##$MEAN= 0
##$ME_mod= 0
##$MI= 50
##$NCOEF= 0
##$NC_proc= -7
##$NLEV= 6
##$NOISF1= 3.799351
##$NOISF2= 2.8
##$NSP= 0
##$NTH_PI= 0
##$NZP= 0
##$OFFSET= 16.48848
##$PC= 4
##$PHC0= -258.2463
##$PHC1= 6.301564
##$PH_mod= 1
##$PKNL= yes
##$PPARMOD= 0
##$PSCAL= 4
##$PSIGN= 0
##$REVERSE= no
##$SF= 200.130005582386
##$SI= 16384
##$SIGF1= 3
##$SIGF2= 2
##$SINO= 400
##$SIOLD= 16384
##$SREGLST= <1H.CDCl3>
##$SSB= 0
##$STSI= 16384
##$STSR= 0
##$SW_p= 4139.07284768211
##$SYMM= 0
##$S_DEV= 0
##$TDeff= 32768
##$TDoff= 0
##$TI= <>
##$TILT= no
##$TM1= 0
##$TM2= 0
##$TOPLEV= 0
##$USERP1= <user>
##$USERP2= <user>
##$USERP3= <user>
##$USERP4= <user>
##$USERP5= <user>
##$WDW= 1
##$XDIM= 16384
##$YMAX_p= 341829097
##$YMIN_p= -1664974
$$ End of Bruker specific parameters
$$ ---------------------------------
##NTUPLES= NMR SPECTRUM
##VAR_NAME=  FREQUENCY,     SPECTRUM/REAL,   SPECTRUM/IMAG
##SYMBOL=    X,             R,               I
##VAR_TYPE=  INDEPENDENT,   DEPENDENT,       DEPENDENT
##VAR_FORM=  AFFN,          ASDF,            ASDF
##VAR_DIM=   16384,         16384,           16384
##UNITS=     HZ,            ARBITRARY UNITS, ARBITRARY UNITS
##FACTOR=    0.252644378177508, 1,           1
##FIRST=     3299.83951724647, 0,            0
##LAST=      -839.233330435636, 0,           0
##MIN=       -839.233330435636, -1664974,    0
##MAX=       3299.83951724647, 341829097,    0
$$ Real data points
##PAGE= N=1
##DATA TABLE= (X++(R..R)), XYDATA
$$ [...]
10407 -151869 -170585 -326381 -378674 -200730 -218994 -126142 -120669 -295591 -145309 -118600 -185176
10396 -185176 -300483 -228211 -173143 -188994 -313836 -421367 -124397 -75354 -94195 2902 -10275
10385 -10275 -144313 -74031 -261929 -178542 4322 -84665 -106358 -138641 14556 -131439 -53979
10374 -53979 -89235 -56745 -107093 -120743 -247466 -260156 -273967 -297834 -289861 -56254 -208644
10363 -208644 128478 -131245 57672 -11022 -152588 -26878 -21905 30748 -273337 -313176
10353 -313176 -6033 -83678 -174847 -38913 -280301 -201315 -183026 -287063 63170 -59879
10343 -59879 -322645 -257070 -237153 -74362 -28994 -11131 -16891 -142486 -105709 -23117 -58201
10332 -58201 -189608 -99839 -94626 -14236 -9257 -137899 -100153 -132102 -269983 -290655 4954
10321 4954 -61687 -159929 -51310 -232917 -43244 -51707 -78289 27977 42617 -189305 -182619
10310 -182619 150752 60429 -94074 142237 -84136 71830 -65116 126449 63959 27221
10300 27221 -48175 -117099 -261463 -256193 74629 18462 -187448 -106919 -205611 -120946 -32465
10289 -32465 -8221 -196299 74383 349293 69703 15461 -70586 -240702 -218990 -32923
10279 -32923 116668 33030 71010 -102237 98395 -5891 40015 233249 91436 -84440
10269 -84440 -217949 -184339 49667 118824 87302 -16092 305348 44127 10862 164644
10259 164644 -190427 80238 -289911 23228 -85875 242073 -232086 -144165 -77959 202179
10249 202179 274946 112496 -32007 307249 -9648 203578 156958 64054 -26255 259340
10239 259340 156017 227078 116623 131547 26311 -117135 191561 186765 182057 346298 355511
10228 355511 241046 97393 205950 41239 84717 188552 117730 4903 171148 101754
10218 101754 51440 195256 184340 -19245 99514 -55728 189487 227056 274391 2366
10208 2366 43919 301022 327933 84681 147990 245854 363873 277858 283664 80808 386377
10197 386377 172714 415346 226144 306612 386808 245106 215065 390487 246376 322601
10187 322601 316631 251634 285473 505654 133524 371794 328186 207496 351284 297860 457448
10176 457448 488210 582652 65845 567211 269341 533103 451600 421541 452409 330695
10166 330695 605266 220996 540388 405081 814324 507629 527344 461494 466300 411773
10156 411773 600277 384171 514703 571414 597381 338115 680622 363778 871757 465804
10146 465804 523956 916818 811703 717162 769727 929248 889906 761191 959858 928505
10136 928505 977101 651139 957143 713458 933076 944797 1007994 1240801 1050684 983598
10126 983598 1125375 1209667 1085366 1108366 1077648 1116103 1133556 1459185 1460093 1286800 1419083
10115 1419083 1506987 1470127 1423193 1641779 1622198 1979667 1631853 1760394 2003054 1868621
10105 1868621 2073615 1546817 1983463 2219225 2021253 2100721 2175847 2286870 2337059 2370246
10095 2370246 2436876 2255360 2367742 2997398 2864141 2810168 2978880 3222198 3063998 3128367
10085 3128367 3370019 3426668 3678703 3710163 3910564 4091891 4120371 4231463 4639290 4759075
10075 4759075 5029703 5088735 5338779 5605361 5691318 6038524 6366998 6936027 7045909 7539107
10065 7539107 7836616 8017834 8297102 8987067 9323198 9830795 10382013 10863399 11136466
10056 11136466 12155942 12753551 13406104 14315236 14985762 16081130 16600149 17471126 18128156
10047 18128156 18639443 19459191 20056537 20536695 21177918 21410257 21461996 21536201 21422184 21144262
10037 21144262 20745155 20395575 19788444 19043809 18275808 17536800 16642295 15952563 15045965
10028 15045965 14415010 13409661 12600918 12159469 11340161 11034708 10375664 9848300 9307187
10019 9307187 8723885 8533861 8141713 7633442 7277435 6783696 6595035 6408385 5835537
10010 5835537 5486838 5354010 5369671 5059049 4871335 4600453 4337681 4025815 4091885 4025887
10000 4025887 3901415 3681505 3363138 3304692 3232070 3389694 2856686 3060941 2794280 2626243
9990 2626243 2658428 2418393 2472229 2411895 2529664 2312782 2241189 2163123 2016066 1921815 1890971
9979 1890971 1924843 1725762 1882818 1880351 1874820 1917593 1593870 1359492 1528811 1257427 1533840
9968 1533840 1157521 1481213 1007437 1059766 1095189 1253458 1116270 1084704 1310781 879950
9958 879950 1188688 973992 919143 1055121 944887 885567 839317 867582 925422 812120 911571
9947 911571 819915 646226 935840 769225 757941 1022967 975360 887310 944625 790217 591815
9936 591815 731687 546649 580360 806160 625634 649497 620811 801600 739604 561888
9926 561888 698631 543901 354417 322155 523402 787575 570345 529106 621537 812426
9916 812426 778043 911030 1199760 1333710 1789841 1422271 1675658 1287346 839056 968095
9906 968095 656673 839573 532631 844304 367658 504822 170922 419176 360755 340643
9896 340643 304999 564957 418634 338158 227872 152692 193216 137146 192129 240829 108847
9885 108847 305237 164581 262580 168194 53823 66106 76825 11321 291835 342222 -115789
9874 -115789 -114624 229924 168352 164467 345121 225325 282048 303812 130695 44376 172836
9863 172836 -84741 401842 423440 384639 -32637 133683 146586 109036 193794 153162 132207
9852 132207 504776 136886 195311 67867 88097 139039 1769 -150978 -62848 206030
9842 206030 174947 27082 97095 110426 -124477 -23218 186156 -166203 26882 -80997
9832 -80997 -118970 158485 128871 16744 43023 -94369 126379 -95623 -129313 -88748 -20570
9821 -20570 -4151 15801 -10873 221414 -311659 -152646 -143649 22096 -105697 -157625 168616
9810 168616 1843 -28279 188019 85767 108932 120107 -57495 -39746 146377 47253 273245
9799 273245 -183482 26941 -92592 -124462 57467 103913 44436 -310333 391396 -28752
9789 -28752 183421 155892 297607 -77677 -88273 195805 47166 109331 145500 210379 82953
9778 82953 251846 71865 108165 157581 400338 -77205 98955 327000 112433 -193732
9768 -193732 -120033 16535 -142834 290331 245909 157305 60401 119464 193754 319666 92678
9757 92678 54496 439424 313371 306645 197806 -31119 3405 -11979 -5385 139361 -41537
9746 -41537 243683 161878 227149 -84649 66117 37148 -123616 -101892 -36427 139557 123817
9735 123817 125229 113376 276047 -37436 284348 357060 -9831 107082 133196 82528 107702
9724 107702 133168 252566 224552 -230680 -20662 22383 400157 -26036 -6608 -43390 53665
9713 53665 -101680 -175395 -66748 -147255 174815 120403 -30015 262338 130450 257815
9703 257815 -167808 -51546 67994 95327 152802 -70027 74856 -85276 160979 -46585
9693 -46585 30042 -62132 76636 146337 202542 -57546 233115 -176313 299340 524312 616343
9682 616343 439117 364906 491084 608159 625072 977564 811578 989506 1264148 1007655
9672 1007655 1068834 1252460 989013 934876 850008 510183 508588 416166 370595 310870 191291
9661 191291 292799 299603 281846 108954 360191 122747 60699 27265 67912 52557 51508
9650 51508 220195 -45885 457725 53398 -31122 191262 82725 38290 27933 -96264
9640 -96264 37200 -21080 118951 172574 -40503 -109290 -93786 18304 219665 157777 -222501
9629 -222501 -137877 -256811 -78965 47405 -27797 82031 -260667 -31341 -21988 -71818 -10209
9618 -10209 28138 239147 89019 25658 -142734 -174861 -28474 88122 -83440 -19893 -79405
9607 -79405 42759 -171427 -172430 -82971 -5528 281460 -85195 -253130 -335917 -137936 -149997
9596 -149997 233414 -31002 -138887 135165 59993 51157 -182161 -84613 32415 -238130
9586 -238130 -164535 -45268 -135249 16787 140764 -436502 -92100 -43093 16837 10457 -53617
9575 -53617 -43682 -208448 81569 -60897 115639 -245360 -149398 75496 89217 -209367 217022
9564 217022 -78167 64572 -108807 -139847 25456 76864 185134 53212 137346 -85106
9554 -85106 222814 280428 -227752 -209875 4098 -31183 51059 -30967 -68204 -76165 -203141
9543 -203141 135189 199216 -36341 -69299 113708 -167519 -13129 -76934 221942 -36897
9533 -36897 -49699 -64176 291238 3766 111695 -108959 -7433 -75227 -94364 70423 219877
9522 219877 -130104 39922 17684 -8549 38555 -142703 -182176 -46230 -48071 36846 -117436
9511 -117436 239867 24082 48768 161269 -79611 69437 -93269 215785 207049 418317
9501 418317 221945 523804 456133 650839 783786 393068 388089 154684 65066 22144 -49782
9490 -49782 -69751 -83649 -352356 59595 83466 159136 220019 -132411 101152 -3760 123698
9479 123698 247817 -72790 -205050 123481 -74867 -103695 130104 89687 110840 30691
9469 30691 20557 71733 363788 207673 30732 149462 157400 88281 -122646 151883 76774
9458 76774 85221 -241480 -164126 11977 166693 198548 128328 324527 55279 -323603 -75454
9447 -75454 275621 -264892 -64757 8754 25885 11224 -8308 51642 -171696 99332 140945
9436 140945 -30305 123022 -32832 426298 11630 180691 -127596 -55588 -120472 104397
9426 104397 195679 134550 -36342 119725 16239 167473 -179651 253757 -141978 -5752
9416 -5752 59806 230164 -40716 89398 177921 306796 -168124 64957 112597 -111828 -61553
9405 -61553 88143 -40955 207765 55957 53245 24080 326327 157001 -186539 210411
9395 210411 80367 538770 -132792 85784 149364 223784 -42920 142726 498094 371216
9385 371216 227382 318580 158773 227082 364330 382146 -11293 31562 210153 244151 357854
9374 357854 307189 130876 374756 178960 366433 203338 202103 -45559 84485 361047
9364 361047 344143 132312 142576 254719 247146 313389 233876 333254 378306 178454 456605
9353 456605 418003 359561 492907 326403 377490 597468 487755 333450 219423 110451
9343 110451 193530 339734 172735 380699 47601 137974 507003 302587 215122 563091
9333 563091 307761 601676 382604 315011 93192 349260 637456 198860 295028 282297
9323 282297 339325 442413 86782 395242 339145 143072 449230 717028 499027 456225
9313 456225 372408 211314 217269 523067 518153 727777 510294 289744 286775 430277 521496
9302 521496 100818 410923 187497 403897 359407 486398 656688 495046 498264 751036
9292 751036 386337 425059 519872 582941 641550 413974 515342 384401 422983 312813 468469
9281 468469 392781 456839 478300 632448 497267 801153 497426 806449 596447 606957
9271 606957 298807 644437 741657 658563 508878 499330 552673 864023 861374 709972 794297
9260 794297 571891 568693 654657 764860 479033 822513 932058 666115 853820 737539
9250 737539 715543 720461 738212 822499 594796 1088366 908991 1026138 1048182 928768 987859
9239 987859 1088199 1158813 1159224 1159481 1101565 1232974 1258134 1084774 1216331 1219219 1299152 1507296
9227 1507296 1302112 1400259 1177327 1251064 1322173 1235179 1072215 1077890 1244014 1127429 1014112
9216 1014112 1135026 1214563 1111726 1288641 918745 1265031 1432407 1031805 1331385 1228259
9206 1228259 1584592 1211776 1471642 1418029 1792476 1560737 1729213 1541154 1575354 1645506
9196 1645506 1552400 1495305 1734091 1727433 1634106 1677651 1910979 1867696 1581810 1671762 1761937
9185 1761937 1880031 1793200 1841066 1718793 1742199 1916780 1905582 1698587 2055132 1926055
9175 1926055 1837686 1958646 2055708 2014542 2069300 2165839 2248730 2609172 2480722 2302948 2453392
9164 2453392 2144251 2281188 2180856 2624347 2760514 2378022 2575379 2553947 2585165 2702781
9154 2702781 2672887 2802786 2794876 2964149 2915483 2769899 3246725 3100713 3012264 3119003
9144 3119003 3416825 3482572 3397376 3644661 3783556 4055660 4232214 4445092 4590497 4716374
9134 4716374 4661927 5093919 4923090 5098515 4819452 4913179 4919070 5363481 5284390 5590350
9124 5590350 5493388 5891289 5882228 6128818 6117019 6456070 6681767 6973364 7193228 7147871
9114 7147871 7046636 7172449 7384151 7137011 7338887 7939295 7869486 7952775 8746330 9252340
9104 9252340 9631435 10129533 10934527 11396447 12287076 13003243 13732149 14170550 15447043
9095 15447043 16481578 18442428 20383632 22623340 26418496 31923982 42029380 62761057
9087 62761057 92472557 114681143 115270736 84177594 58678119 42706526 33285441 27683157
9079 27683157 23717775 21333148 20622909 21000146 22048268 24115624 27351618 31601239
9071 31601239 34590052 36136246 35090133 32048903 28074438 24394411 21609733 19928925
9063 19928925 18574858 18220273 18155205 18081036 19061054 19908448 22229663 26013903 29861567
9054 29861567 34232550 36464852 35859982 32856069 28874680 24533833 21528446 19019435
9046 19019435 18047372 17495440 17159108 17740817 18368028 19783023 21610967 25190802 29585405
9037 29585405 34850961 39570215 41945652 41161345 37553892 31849085 27068363 23436178
9029 23436178 20994590 19266464 18582531 18231604 18791483 19644415 20880822 23739228 27630722
9020 27630722 32494452 36989956 39421075 38685721 35207654 29753897 24598736 20268505
9012 20268505 17316269 14888127 13378038 12260522 11498843 10805214 10402347 10188958 10092957
9003 10092957 9728700 9755821 9772206 9903432 9972969 9831932 9756015 9219658 9106055 9131831
8993 9131831 9131575 8880248 9296907 9312530 9786963 9802360 10354209 10805006 11286673 12457613
8983 12457613 13995006 15848159 18930390 22921359 26786346 28715731 28255512 25931752
8975 25931752 22225063 19088124 17000518 15517658 14529128 14063509 14053829 14201116 14511878
8966 14511878 15987345 17213974 19749987 23418576 27772520 30842151 31796863 30251920
8958 30251920 26680322 23314169 21010914 19499684 18560043 18435273 18129351 18015284 18737219
8949 18737219 19650116 21925162 24976537 29703156 35506208 39895483 41643473 40114000
8941 40114000 36342142 31436354 28553151 27143015 26435927 25787109 25597800 24921419 24795779
8932 24795779 25451380 26705907 29522716 34217100 41210965 47984158 54145253 56791773
8924 56791773 57579464 58064345 59590380 62139742 63735005 64138188 62066887 59446519 57076736
8915 57076736 55286531 54369139 56213109 59036369 62241418 63061534 61427296 57547711
8907 57547711 53051001 47950046 42704575 37634521 33115336 29862221 27629217 26104907
8899 26104907 24973730 23835015 22486600 21364294 20774495 20396245 20512163 20753862 22160889
8890 22160889 23216008 24942158 27178741 30082711 33808427 39241108 45398631 50891632
8882 50891632 53995298 54414398 52952518 51493294 50158006 49052313 49449018 51097557
8874 51097557 53836602 56282361 56264881 53919812 50023032 45480826 40622076 35624807
8866 35624807 29980756 25123167 21264068 18095041 15812046 14355640 13067363 12704111
8858 12704111 11532787 11426972 11102692 10421448 9916941 9357675 9081408 8840037 8890213
8849 8890213 8783113 8473315 8141731 7939589 8040914 7628914 7685497 7656721 7428491 7296477
8839 7296477 7343362 7397667 7440706 7569799 7538723 7960544 7768937 7944841 8072593 8296796
8829 8296796 8403431 8337532 8141873 8805778 8842987 9436888 9799190 10092465 10526327 10706893
8819 10706893 10714673 10737567 10902327 10718788 11656809 12328567 13140361 14097018 15598980 17670920
8809 17670920 20427796 23263836 26404076 27940681 26521705 23931511 21531009 20020798
8801 20020798 19498177 19588000 21022551 23795119 25904759 26864814 25558885 23343379 20683183
8792 20683183 18397998 17003910 15906592 15325904 15127907 15634406 16212597 17209773 17880808
8783 17880808 18193979 18340333 18496715 19295698 20043649 21414563 23423112 26495377 30615262
8774 30615262 36496412 44270954 51790378 56353756 56780144 53689276 48663863 43102832
8766 43102832 39309744 38150727 39812397 44054263 48918578 51530480 50279537 46108495
8758 46108495 39924703 33925179 28429362 24118487 21118745 19479622 18467766 17436042
8750 17436042 17371768 17476329 17604987 17442164 17354709 17379974 17285547 18383558 19842449 21189144
8740 21189144 23783161 27651941 32503088 38076359 43475266 47249732 47420553 43801128
8732 43801128 38252999 33262779 30703393 31026475 33142410 35968179 39423404 40965402
8724 40965402 40030108 35775103 29450492 23629863 19390211 16205986 13965677 12344045
8716 12344045 11299367 10399702 10137858 9745757 9410788 8927944 8858685 8431970 8492997 8780418
8706 8780418 8399714 8798871 9509270 10929837 12402938 15075172 16553665 16050842 14318148
8697 14318148 12462123 10519010 9861630 9503961 10041959 10953619 12903508 13738647 13210929
8688 13210929 11439654 9332383 7858197 6444366 5390577 5189649 4365685 3837145 3775665
8679 3775665 3154119 3409822 3204263 3112023 3051703 2785468 2716092 2703706 2747985 3244107
8669 3244107 2987332 2660548 2496942 2395048 2001894 2133518 1978077 1866243 1836840 1690784
8659 1690784 1772127 1759305 1649815 1629842 1532061 1456992 1770817 1274606 1164816 1133734 1182500
8648 1182500 1061997 898959 1277565 1122977 1270746 1090677 862822 1181921 1062798 949057
8638 949057 1037750 1022763 1010361 1224403 1087719 1040199 1118171 1267411 980936 851895 848914
8627 848914 956041 662607 1069779 757316 953230 775732 740956 666895 646707 614538
8617 614538 401393 409269 538298 505771 501658 517523 463656 631618 554740 606857 602106 600315
8605 600315 861207 490258 489059 760305 668779 735920 679324 786606 694793 634136 542397
8594 542397 424169 459496 455045 677999 739754 586484 340200 527995 178018 393001
8584 393001 159731 245315 322142 159022 520920 359039 150593 176454 257814 186207 169486
8573 169486 431081 149423 281490 226730 221505 311421 190885 109036 199165 165262 402160
8562 402160 270195 328658 385023 304780 218685 46911 563421 148619 197290 331013 387454
8551 387454 89793 298250 487120 -5972 63442 34935 22665 -141833 -209303 -144885 -143996
8540 -143996 -129316 199418 -53164 20500 -8771 152394 53470 182943 -399449 -156148
8530 -156148 -1664974 439098 399498 -60975 -52552 -56731 62798 128574 39256 83969 -252733
8519 -252733 -303408 59056 -29378 -294774 -238275 -41634 -199217 -227918 118504 98916 -17456
8508 -17456 -140894 26744 26343 -10205 82912 -121247 -199347 -157020 -173792 -223898 13006
8497 13006 41129 -183050 -72926 18106 43399 -125919 -163976 -102955 226141 2582 -120184
8486 -120184 -201182 -89586 -117495 201666 -147923 556 72050 -45290 -121408 -279331
8476 -279331 -126954 185776 -34381 13598 20401 90247 -44400 118206 -142728 -125420 49082
8465 49082 -126575 5825 -131914 -10469 6115 -3601 200214 -40343 110743 236896
8455 236896 483 208913 1465 274313 116295 151396 -73941 93446 216155 -167483
8445 -167483 -6397 96898 289182 105698 13308 148736 17199 -20731 -63676 -20668
8435 -20668 -55224 176592 -29086 173512 44866 201816 -99777 117397 -54293 -176452
8425 -176452 -7169 25898 -70734 -108402 96002 41700 238060 -230979 200069 -16657
8415 -16657 178300 234525 304431 100451 199507 155045 33963 230765 -59678 210614 80275
8404 80275 105175 17668 180645 -214538 66114 -148492 -198155 -313111 -178168 -123204 -230178
8393 -230178 -214634 -77879 309611 229513 48051 -288643 -160018 248764 -288813 -25633
8383 -25633 136506 25849 59274 -274268 14832 -224820 -143825 113969 -392264 2273
8373 2273 -90139 -157794 -249124 -261721 9544 -32282 39889 -224735 -242732 -70181 -161681
8362 -161681 -235515 426465 32989 -15427 -58045 -112019 -21775 -110982 94240 -56679 -91092
8351 -91092 108137 -261756 140358 -196718 4947 -10882 81449 -194597 24556 -159395
8341 -159395 -251934 -40459 -29721 -209517 -101169 106757 -23370 -6643 -289734 -178886
8331 -178886 51757 -35005 -183402 -163456 -55481 84424 -45853 124909 -87428 -75416
8321 -75416 -151662 -268364 295936 139654 -410923 -240461 118809 -102414 -129364 -16227
8311 -16227 -283191 -211255 54018 -155202 65277 -401069 -51878 -107335 -95109 -129131 -141493
8300 -141493 -362128 26759 -102404 -25770 -44203 33935 -277545 -167399 -316684 -293116
8290 -293116 56344 175177 -142047 -341432 -28018 83590 -180880 -14677 -27403 -277303
8280 -277303 -30358 170222 97145 -108307 77403 32097 164195 -248782 -218918 -30331
8270 -30331 -173539 302858 83043 -315670 -122977 149719 -308331 17846 -208392 273017
8260 273017 -32921 -158995 -94016 -168604 98004 -5145 140269 -80819 7894 102972
8250 102972 186513 156564 145857 81940 275921 120874 162920 100836 78479 762 368653
8239 368653 -180411 78371 229843 234445 105648 125597 24155 179475 -71009 80219
8229 80219 122089 -131592 203426 7379 -446665 69849 160788 102621 289712 -144412
8219 -144412 220454 68557 -78985 -81514 -34780 55137 -72537 227843 -101593 129967
8209 129967 -261452 -174746 -81202 316243 153541 246792 -61089 401112 -281140 -170599
8199 -170599 109864 514083 16627 -383802 203696 95306 -768610 1415980 -154093
8190 -154093 -349452 401840 57606 388650 157107 366778 -75047 308065 169919 387166
8180 387166 417768 481653 355307 412858 358993 359643 587233 532161 574555 814828 1133026
8169 1133026 1032732 1282693 1273760 1691716 1970068 2261102 2496642 3263178 3908297 4822154
8159 4822154 6097692 6869430 7067168 6880159 6254640 5030508 4120214 3094171 2395695
8150 2395695 2284389 1581753 1254935 1035744 1012312 622321 602139 1020570 468793 571277
8140 571277 785982 288954 474719 424319 519564 429119 41012 285808 376970 401553 192802
8129 192802 233760 252867 153148 374950 319599 400184 167438 463982 326435 322503 267949
8118 267949 326344 157394 74660 385301 164573 184021 62933 42399 245375 -221082
8108 -221082 185810 160512 135481 122950 7944 -23786 183799 82521 294405 103977
8098 103977 85870 341812 160523 8318 164955 353369 71758 163729 -223134 -88968
8088 -88968 -91346 64861 41227 251633 231806 159819 -63141 67691 340999 164960 50022
8077 50022 133235 296306 274859 232682 226132 362208 354389 404859 269676 284984 449463
8066 449463 394167 243956 231243 297188 173055 353527 522951 167506 458516 605876
8056 605876 400669 -66462 72467 137877 251954 28298 410362 422599 76853 223911
8046 223911 94095 231685 167715 221635 137532 156196 21782 -50167 167167 57468 -6483
8035 -6483 171389 233841 209973 249842 127527 -121739 161963 169700 47428 -48090 67765
8024 67765 360397 310679 163874 459271 173595 323435 431873 335797 432397 -58237
8014 -58237 97156 647413 137009 91379 289743 451128 464430 378614 337683 241736 416331
8003 416331 349493 344625 360142 180547 476377 583450 385764 404634 428582 536187 245452
7992 245452 201933 382383 390639 248019 545656 514870 652280 367808 348982 237175 289708
7981 289708 395378 219180 410835 101523 469287 447134 360364 518047 235591 469422
7971 469422 146872 63691 707761 191287 421353 281880 95103 609683 255117 7068
7961 7068 -18571 85652 100954 457331 220403 617608 186693 255383 265369 324047 243730
7950 243730 360840 321221 124225 146756 208704 315497 664615 285256 161152 321739
7940 321739 478706 460183 637703 277585 295303 689706 663802 467918 633705 484448
7930 484448 534647 303566 532935 614777 182805 625857 137100 315314 506925 345556
7920 345556 442076 842252 722351 718736 471914 547983 357025 746237 329697 458558
7910 458558 420013 442847 530332 404808 105225 537911 355845 365214 242010 382543 259589
7899 259589 559778 511049 307972 401918 573932 499302 232647 298361 506329 335694
7889 335694 316686 108307 389227 388695 165190 446152 525200 193672 280935 -27086 309849
7878 309849 349541 60137 294772 468961 626565 384113 104516 38073 -70552 380693
7868 380693 228962 116600 130223 231346 424918 356401 449030 184933 520446 195476
7858 195476 263239 254784 674526 1524235 1870589 264792 438781 335702 242710 239070 347173
7847 347173 283950 337599 276299 614372 413405 130844 415332 245508 332397 355805 154690
7836 154690 253894 633579 439426 2914 227436 509471 9980 395794 98840 229783
7826 229783 205978 276206 456654 212414 311861 285434 267850 419268 311399 235721 194205
7815 194205 486426 415261 565301 337863 597038 284303 451997 376480 490761 484396
7805 484396 387093 366766 358074 330853 418621 428940 395935 309502 606041 728059 720784 919325
7793 919325 573799 551267 799968 673211 600396 635313 760378 903384 986030 897362 528094
7782 528094 606572 708582 605324 819737 428768 588687 583072 651163 622468 836015 614137
7771 614137 497792 585264 634984 379683 455015 551415 663874 354535 609719 334422
7761 334422 486243 486356 307450 594575 446713 801687 580242 407431 658502 495671
7751 495671 809261 789736 1099372 1013333 1068772 1113228 1142370 1091250 924065 987770 1215195
7740 1215195 998036 1019228 1017227 923833 780234 459958 448144 778417 669187 518328
7730 518328 527608 632181 863355 674725 426112 660075 503855 350724 504376 505581
7720 505581 448330 501941 464029 465495 805190 167784 487957 495194 319438 249522 508735
7709 508735 513820 739648 630202 617246 611315 360453 680354 362294 405947 495579 687361
7698 687361 553742 465366 447419 405963 575039 329079 442980 489337 659381 646794 592358
7687 592358 460804 392350 524401 623298 771024 697379 603707 589283 838772 582151 950467
7676 950467 485779 786443 679253 529129 377534 716367 599925 811115 698930 482465
7666 482465 422814 691117 375206 442833 510247 655783 635095 490390 621673 842600
7656 842600 333260 702401 313757 407940 505609 568120 531504 572278 411890 464704 522684
7645 522684 580247 424412 593491 575469 495611 534234 729899 547447 343944 423242 567637
7634 567637 627101 446192 612892 727368 506415 809457 732882 684457 710498 871585
7624 871585 633895 614108 633966 876509 562815 511577 736567 759388 548708 624010 855765
7613 855765 426053 633747 637818 623081 640949 740693 621660 877815 811339 936889 567478
7602 567478 425979 864343 650986 672225 595291 1036355 620271 713695 698639 562302
7592 562302 832256 835250 488150 710576 661617 741435 832415 659486 720311 687346 662389
7581 662389 1041117 900163 838129 822482 899509 724509 945153 689847 839465 980838
7571 980838 1338670 1256417 1484573 1349630 2009367 2237581 2004223 1968732 1690238 1565466
7561 1565466 1534193 1357332 1305094 1042973 1107637 949688 1164539 1337035 1128934 1113972
7551 1113972 917655 971337 1073428 906315 1080839 1180228 1250154 1263428 1360622 1524542
7541 1524542 1278074 1156368 1233625 888756 1087328 1254774 998066 1026720 999415 872067
7531 872067 1203452 1423004 1369801 1450545 1458461 1228674 1609730 1497760 1183899 784095
7521 784095 1274125 1357067 1249346 1439390 1586985 1197419 1307379 1227286 1507886 1427131
7511 1427131 1570569 1828466 1796036 1591448 2109625 2105852 2357110 2653355 2597347 2739798
7501 2739798 3204913 3603101 4248649 4758943 5472194 6633481 7211135 7556910 7756622
7492 7756622 7361987 6386921 5306795 4724032 4025509 3283349 2802712 2582762 2488470 2081662
7482 2081662 1956670 1829192 1648268 1724695 1662539 1424669 1573423 1529319 1160418 1424143
7472 1424143 1110788 1116961 944515 1193916 870777 978078 1260678 1078786 1063703 1218980
7462 1218980 1134340 922634 1146285 904205 941142 915535 944952 982679 986892 856246 1140508
7451 1140508 874163 989274 1017731 776455 778757 715005 1095305 733130 950616 1052995
7441 1052995 1078368 882401 691170 761006 825854 1154459 806821 888759 912516 891503 1036156
7430 1036156 899003 1114893 725214 858859 852517 1195905 792073 1287228 828484 1044383
7420 1044383 1163976 735121 942416 785454 905832 696663 701892 1079316 1050875 928840
7410 928840 888901 1079339 852107 993537 801498 1019918 1230549 906774 912442 941088
7400 941088 873210 1177134 875281 1025819 876259 900426 859486 839403 895921 1035583 908683
7389 908683 879323 895699 963340 928893 1084134 874360 900355 807043 624302 923912 910508
7378 910508 712114 925637 1076679 927522 958355 1088385 1206029 741462 741427 687160 895526
7367 895526 1225900 817074 1164734 777113 1004097 1132648 903856 765945 662004 934966
7357 934966 870945 708872 1103623 1017493 842185 920922 716860 1109783 1074670 679652
7347 679652 1038963 910379 1015050 1254636 1071496 912904 1104264 1170215 1149456 1007976
7337 1007976 788472 798081 744428 625277 955500 1073885 849915 1070744 1322631 1400247
7327 1400247 977936 1118386 826258 701800 884624 1094815 1120137 1141766 856743 945679
7317 945679 1230075 834359 1049253 1134176 821913 930442 885835 958280 818189 810632 1120785
7306 1120785 1084574 1055280 1121217 905371 762641 771008 1163657 1330509 1283926 1069329 959494
7295 959494 1210294 1212587 1183724 935150 1019034 975583 882773 1211069 1002114 750104 1107382
7284 1107382 969200 1209660 936953 1190032 857326 1175350 1323661 1078865 1161303 1113222
7274 1113222 1249663 1105676 923461 965601 1054809 920491 639827 643601 633169 670712 894516
7263 894516 1307625 1103522 1386524 1413214 1153899 1003276 1401241 1342243 1265522 1206653
7253 1206653 1086177 1024924 1201470 1337562 956812 1180586 1253731 812360 1134558 1238777
7243 1238777 846250 1217111 893005 1028248 992593 1008944 1053276 1183429 1186378 894330
7233 894330 891558 1041312 1404259 1198937 985486 1109974 1108204 871456 1096511 1367376
7223 1367376 962270 1170914 1142413 1201434 1117702 1070736 1280614 1211103 1115956 1045722 1270722
7212 1270722 947368 1249726 1217164 1488757 1246438 1286553 979159 1372326 1261444 1308722
7202 1308722 1355894 1088950 1322837 982382 984915 1129800 1126040 1276907 1081457 1237125
7192 1237125 1423699 1199728 1481162 1489079 1206129 1239374 1183884 1198505 1243443 1161226 1385644
7181 1385644 1176389 1329919 968456 1300124 1124853 1193784 1186199 1042869 1297280 1064951
7171 1064951 1225834 1135207 1345060 1239400 1236908 1048577 1197972 1134423 1332038 917797
7161 917797 1016411 1353109 1215040 1231940 1330890 1367712 1217237 1195088 1117357 1237532 1412006
7150 1412006 1368822 1157780 1389514 1408256 1400647 1338731 1432239 1470054 1562910 1295911 1250490
7139 1250490 1002211 1362119 1676419 1140907 1254554 1413811 1227806 1235254 1626673 1428025
7129 1428025 1462726 1738077 1542456 1527255 1211770 1345975 1352134 1402667 1301606 1426149
7119 1426149 1225583 1427483 1451543 1181723 1179887 1496848 1274708 1369423 1447525 1329753
7109 1329753 1335823 1331428 1550828 1213743 1208251 1416374 1604348 1412604 1338517 1453463 1483489
7098 1483489 1725046 1427706 1480116 1581439 1772210 1480448 1679108 1521223 1679423 1574952
7088 1574952 1407347 1320578 1298144 1340569 1223881 1801873 1696136 1301435 1475760 1774882
7078 1774882 1741971 1409459 1511423 1748067 1571808 1403635 1860725 1290077 1415937 1696959
7068 1696959 1371832 1656813 1553680 1613199 1602258 1396649 1729795 1734958 1641432 1576544 1683391
7057 1683391 1854042 1689045 1849192 2034471 1866515 1850867 1725293 2096318 1751945 2379895
7047 2379895 2317200 2144287 2092947 2165125 2362744 2716278 2716256 2943560 3558091 4003106 4749236
7036 4749236 5519927 5837763 5484224 4814203 4336115 3890178 3816720 3471787 3506985 3330302
7026 3330302 3193398 3249706 3229393 3204453 3477842 3543649 3537980 3337830 3348013 2965141 2955040
7015 2955040 2896586 2998789 3075557 3192265 3244607 3457436 3435764 3908374 3903433 4448963 4877489
7004 4877489 5958762 6515451 7843143 9039590 9377144 8946727 8092836 6898115 5925488
6995 5925488 5008626 4296467 3597567 3360441 2929064 3003828 2671221 2757292 2608520 2378012
6985 2378012 2409980 2338294 2592988 1962190 2226067 2127544 2038733 1973548 2200220 2052836
6975 2052836 2011729 2271513 2014237 2038452 2060298 1824840 2009097 1947941 1772629 1747883
6965 1747883 1843871 2107464 1962706 1821555 1944079 1758772 1733194 1828517 1823413 2049272
6955 2049272 1793500 2077978 1881477 1863499 1847406 1993632 1947555 1916639 1993838 1779871
6945 1779871 1988590 1985444 2183029 2085519 2083262 1991575 2115801 2070488 2073080 2160653 2295161
6934 2295161 1948622 2301720 2352803 2169698 2187210 2177192 1821659 1871913 1832402 2135928
6924 2135928 2218009 2021086 2009054 2066024 2354803 1986952 2010517 1975833 2181735 2082766 1832981
6913 1832981 2216957 2327407 2173046 2200205 2213801 2143663 2111952 2082437 2162093 2293436 2244282
6902 2244282 2270672 2445374 2433523 2495640 2881063 2926877 3052744 3690361 3670141 4169340
6892 4169340 4813828 6020666 7171120 8009281 8016100 7169875 5895344 5200824 4603575
6883 4603575 3863647 3705153 3348097 3503993 3403986 3158632 3018584 3014767 2693126 2934041
6873 2934041 2840301 2754690 2988610 3065476 3047659 3203134 3207346 3409563 4007690 4473737 5233776
6862 5233776 5420301 5843533 5551273 5295438 4617825 3677180 3823649 3466286 2916087 2843484
6852 2843484 2820163 2473670 2476537 2705057 2264569 2389245 2250979 2368416 1927511 2114402
6842 2114402 2185621 2010428 2064879 1917498 2085506 2056349 1698916 1692834 1963627 2094931
6832 2094931 1744376 1741808 2022027 1874616 1877990 1927778 1604004 1956980 1783655 1720278 1980202
6821 1980202 1825669 1623555 1536597 1458209 1746215 1877184 1780244 1695793 1788962 1597000
6811 1597000 1725969 1882212 1722760 1662851 1700253 1768625 1910027 1768538 1521762 1698720
6801 1698720 1938495 1751808 1642372 1548253 1709393 1666643 2014834 1763719 1952355 1589519
6791 1589519 1837116 1789959 1924019 1923694 1546998 1796300 1783695 1810253 1964637 1751224 1681039
6780 1681039 1793646 1741536 1870052 1912360 1912759 2008862 1894558 1995487 1604456 1696342 1997218
6769 1997218 1878105 1807319 1690789 1973145 1783378 1950459 1819503 1900439 2095016 1797789
6759 1797789 1728112 2083887 1801391 2202012 1885692 1973841 1950739 1873441 1867284 1849058 2000411
6748 2000411 2038367 2076547 1839402 2187462 2098704 2159072 2112706 2248263 1962697 2176113
6738 2176113 2515715 2251678 2354356 2158346 2339699 2561511 2155665 2125032 2147736 2104588
6728 2104588 2214761 2101765 2151652 1901710 2082876 2222879 1919488 1907373 2274026 2100444
6718 2100444 2048646 2094903 2178845 2536852 2553447 2658725 2533599 2515570 2289927 2519282
6708 2519282 2561643 2468964 2512725 2442762 2253348 2421078 2413693 2303237 2540976 2346619 2246444
6697 2246444 2478280 2385296 2666293 2607368 2820406 2519951 2612559 2769080 2976408 2687660
6687 2687660 2878471 2550996 2723145 2705349 2536976 2430258 2781836 2470934 2370438 2341227
6677 2341227 2397189 2513820 2249750 2311574 2768066 2524340 2547442 2509955 2941916 2874418
6667 2874418 3036334 3812857 4128243 4024845 3944346 3857548 3373050 2911858 2918815 2969011
6657 2969011 2754381 2772547 2732652 2714995 2549145 2553303 2673697 2504006 2597339 2830430 2642922
6646 2642922 2551934 2712590 2442361 2323835 2558949 2474684 2797349 2502708 2437515 2583455
6636 2583455 2625402 2442614 2510188 2507440 2677808 2391973 2585442 2616391 2881266 3048580
6626 3048580 2683971 2717089 2509871 2606211 2853384 2855423 2910951 2930502 2934003 2770060 2865020
6615 2865020 2908319 3108419 3320121 3064224 3235862 3295464 3495438 3470502 3876308 3254434
6605 3254434 3451190 3852583 3679752 3678042 3580907 4213893 4054143 3972181 4278450 4140337
6595 4140337 4111268 4629305 4551791 4730665 4874824 4952225 4974450 5006275 4924242 5209196 5282864
6584 5282864 5249743 5581098 5288233 5223964 5162365 5349208 5093464 5194819 5235157 5100387
6574 5100387 5119373 5120135 5445316 5318159 5086445 5433967 5200179 4833779 4769037 5032986
6564 5032986 4977809 4953448 4862120 5205709 5028056 5200335 5055681 5480789 5364919 5454704
6554 5454704 5454638 5511363 5685041 5490291 5827601 5750990 6329346 6402691 6677797 6802841 7253295
6543 7253295 7547450 8462363 8802891 8975148 9195478 9030792 8907780 8237753 7994144 7770395
6533 7770395 7767727 7761584 7774384 8149419 8315738 8584022 9192764 9292225 9946261 10820223 11757337
6522 11757337 12677905 13719265 13944201 13648726 13149335 12231494 11434386 10664413 10331458
6513 10331458 9864421 9595602 9381331 9512999 9500395 9484670 9475548 9878371 9745164 10195714
6503 10195714 10304118 10646239 11024583 11570127 12016572 12412949 13362797 13986158 14880886
6494 14880886 16010933 16848019 18274008 20025241 21674789 24063381 26567071 29946189
6486 29946189 34019683 38359796 42589137 45488894 46682157 45931265 44661524 43194187
6478 43194187 41850151 41388299 41866405 43211033 45360174 48563016 52508172 55826713
6470 55826713 58657030 60403498 61032585 61799390 62315864 62946998 62744490 61133147 57450905
6461 57450905 52630568 47337676 42710686 38434662 35162170 32599843 31033200 29546665
6453 29546665 29119610 28698195 29249923 30005444 31632772 33841861 36585814 39976959 44120488
6444 44120488 47841554 49980172 49880754 47770608 43453225 38741643 33850281 29898141
6436 29898141 26304262 23624628 21222401 19209727 18022596 16685318 15612487 14644003
6428 14644003 14212242 13356779 12828419 12542547 12217177 11755856 11566478 11440744 11493977 10888020
6418 10888020 11147976 10809695 10570650 10586367 10447662 10384110 10301895 10089805 9903002 9628022
6408 9628022 9416821 9376517 9514825 9383454 9240923 9061565 9039772 9189548 9030110 8988501
6398 8988501 9304895 9307625 9552235 10236851 10242967 10763833 11081228 11829527 12856583 14351368
6388 14351368 15644182 17343602 18463593 18644230 18205415 16965751 15519688 14462404
6380 14462404 13420956 12829485 12272436 12123520 11957558 12145284 12621435 12825580 13673249
6371 13673249 14136297 14582415 14971751 15505255 15527243 15684162 15197542 15189969 14740998 15239150
6361 15239150 15122845 15360636 15700573 16281260 16911341 17560236 18082811 18233658 18614040
6352 18614040 19095008 18867039 18682773 18854906 18927858 19004920 18955306 19193082 19568792 20107448
6342 20107448 20950646 21697181 22444148 23564603 23974011 24558912 24848859 24573533 24122473
6333 24122473 23819501 23159663 22706270 22526034 22807295 22963457 23501564 23553423 23485108 23685642
6323 23685642 23761489 23789594 23715763 23660009 23471728 23222909 22864109 22534415 21818561 21595292
6313 21595292 21179414 21284579 21447905 21496017 21975971 21931033 21529820 21056958 20167954 19755248
6303 19755248 19145840 18732396 18125170 17657507 16890431 17003742 16851514 16898568 16649486 16694707
6293 16694707 16270820 15949312 15842585 15530872 15033242 14033521 13708256 12725623 12431302
6284 12431302 12011505 11583427 11294877 11428294 11144228 11127465 11495088 11076199 11381486 11543862
6274 11543862 10880769 10850990 10873751 10428254 10101539 9965135 9636290 9744498 9402526 9708688
6264 9708688 9492768 10169539 10010323 9751131 9643152 9604570 9298758 9141574 9421531 9473677
6254 9473677 9298251 9411660 9300088 9211399 9172960 9201666 9012058 9363088 9373284 9103238
6244 9103238 9640651 9355329 9640272 9604187 10059898 10487235 10538735 11170221 11729294 11978737
6234 11978737 12104199 12126720 12143224 11990097 12017670 12131669 12283571 12533665 13129581 13124223
6224 13124223 13770510 13903075 14438030 14998284 15596633 16378001 17209671 18137530 19044320
6215 19044320 19893163 20569280 21283680 21564477 22462859 23132474 23770766 24413519 24475281 24974765
6205 24974765 25168822 25306609 25210384 25720548 26238273 26824045 27638415 28434949 29264115 30273766
6195 30273766 32092606 33226756 34587104 35911864 37500396 39588414 41901797 44608069
6187 44608069 48368902 52911720 58696707 66259195 75164366 84304300 93059436 100700130
6179 100700130 108608683 117327228 128267611 138712784 145551470 146166959 141309099 135104472
6171 135104472 129094910 124211151 119987412 116536155 113270748 112177263 112538050 114431194
6163 114431194 117961050 121618272 125555987 128464947 130205480 130629336 130148122 128888051
6155 128888051 125770394 121598273 115263912 107454927 99043438 90500523 82503315 75039062
6147 75039062 67561914 61059405 54819535 49321916 44277833 39704338 36530447 33311627
6139 33311627 30820950 28598565 27055163 25243219 23986051 22715769 21554738 20816313
6131 20816313 19924831 19066741 18435246 17727151 17347074 16722415 16199629 15793942 15404176
6122 15404176 14993998 14533965 13969493 13837203 13641030 13191129 13005653 12576252 12441513
6113 12441513 12105282 11802016 12228215 12122597 12118242 11681345 11810661 12409232 12026911 12515078
6103 12515078 12484598 12522196 12483977 12771786 12201190 12122893 11624119 11235003 11091650 10768625
6093 10768625 10264973 9805654 9851671 9754099 9671288 9778115 10139028 10274915 10287486 9689412
6083 9689412 9456856 8596232 8134299 7277385 6912359 6744023 6543606 6435133 6458607 6189082
6073 6189082 5859926 5816328 5667327 5925089 5760255 5458571 5667526 5606163 5720367 5956141
6063 5956141 5488921 5536160 5538968 5587392 5273507 5208844 4762671 4820039 4808745 4891039 4812122
6052 4812122 4807617 4501194 4622539 4977789 4868588 4790292 4388703 4149674 4308450 4108690
6042 4108690 3875358 4039591 4056544 3942164 3983708 4066248 3966696 3621404 3868694 3539641
6032 3539641 3521458 3458560 3679660 3543976 3505788 3405512 3210139 3370403 3341809 3212461
6022 3212461 3188141 3130490 3433529 3340933 3043025 3368046 3200339 3176518 3013722 3278121
6012 3278121 3097920 3052683 2968056 3073879 2801977 3202144 2830680 2887857 2766723 2717626
6002 2717626 2899842 2669226 2804416 2957202 2870897 2748038 3282808 2758046 2995540 2768785
5992 2768785 2766943 2830547 2663213 2837575 2702050 2606035 2862349 2573521 2672424 2203080
5982 2203080 2534463 2612412 2541208 2539297 2425110 2602963 2572114 2536838 2640086 2361741 2459049
5971 2459049 2343181 2365044 2281833 2218992 2500161 2414707 2223416 2137608 2332515 2086263
5961 2086263 2209681 2362807 1990203 2312367 2017271 1972939 2260652 1919916 2050077 1824072
5951 1824072 2159565 2165536 1932488 2021046 1853628 2094397 1942825 1854150 1830373 1628872
5941 1628872 2117585 1962478 2000146 2233593 2059816 1833982 1960047 1958764 2197668 1887943
5931 1887943 2084107 1999536 1912991 1974423 1619297 1922491 1953861 1939024 2133803 2039046 1936274
5920 1936274 2066101 2090381 2332073 2134199 2327611 2279849 2351595 2196628 2678765 2244000
5910 2244000 2417881 2870716 2900920 2785988 2523237 2590373 2557016 2358936 2504578 2570035
5900 2570035 2456381 2805542 2678856 2811181 2827867 2927780 3126840 3008688 3292506 3003958
5890 3003958 3204953 2893394 3250000 3231237 3298170 3196829 2996285 3013617 3069386 3132154
5880 3132154 3219491 3082783 3048342 2642320 2778134 2659746 2621556 2598746 2732948 2321282
5870 2321282 2151355 2557820 2387472 2278093 2344116 2197010 2537927 2404287 2637055 2678202
5860 2678202 2604209 2516066 2290593 2645124 2742255 3118782 2847078 2893603 2755468 2626293
5850 2626293 2687999 2509744 2627169 2815165 2700205 2513436 2635063 2653482 2757245 2672817
5840 2672817 2619068 2778065 2637645 2810465 2747825 2842505 2807746 3124131 3186607 3112921 3254550
5829 3254550 3169010 2646091 3221105 2970699 3061889 3198089 3282284 3046216 2835417 2708558
5819 2708558 2905912 2734938 2988564 2996883 2777702 3053386 2645506 2843543 3004377 2909768
5809 2909768 2751376 2975483 3074700 3220111 3215006 2992196 2826166 2994885 3160714 3344088
5799 3344088 3076600 3136501 2942767 3006962 3173578 3158903 2952838 2824994 3185640 3093590
5789 3093590 3222768 3161848 3083649 3210670 3014803 3477697 3117077 3203045 3358896 3596138
5779 3596138 3673530 3658695 3646042 3394077 3586687 3531372 3515707 3464291 3272122 3403904 3664229
5768 3664229 3837144 3429717 3613818 3919399 3758323 3758392 3682500 3723831 3839827 4132552 3892738
5757 3892738 3844836 4123404 4196783 4203658 3995906 4411684 4631958 4206032 4436498 4467833
5747 4467833 4360941 4602636 4653887 4518774 4312647 4546455 4660923 4867422 4953662 4934220
5737 4934220 5019831 5048819 5139874 5345331 5644047 5660102 5762799 5707368 5989331 5683645
5727 5683645 5707376 5767330 5568402 5473406 5384980 5367558 5311535 5657415 5727276 5933295 5985773
5716 5985773 6360701 6820499 6958813 7251974 7462131 7433006 7088344 6943986 6680386 6676374
5706 6676374 6587637 6285705 6189735 6177191 5799633 5921249 6146018 6018347 6187289 6207630
5696 6207630 6142504 6225580 6390070 6807736 6893710 7444019 7758989 8101121 8193420 7862409
5686 7862409 8165390 8373257 8168155 7805524 7988526 7937200 7669095 7910590 7846383 8555286
5676 8555286 8482426 8610521 9178543 9812668 11672061 13446151 15536365 17464836 17201362
5667 17201362 16086918 14113840 12458487 11022208 10360425 10439745 10189019 10009425 9618187
5658 9618187 9808868 10160186 10212586 10175322 10488001 10827032 10549203 10717487 11148142 11349402
5648 11349402 11584001 11174539 11289612 11594315 12033916 12144744 12076531 12577901 12569083 13081525
5638 13081525 13396171 13906771 14164147 14683440 15346396 15420379 16108967 16442190 16559474 16655447
5628 16655447 16697402 16588684 17013043 17001522 17141788 17141640 17197801 16952771 17358236 17571680
5618 17571680 17898882 19051695 20299752 21996969 23562903 24474838 24678685 24491262 23269225
5609 23269225 22314013 21896874 21710421 21933258 22217747 22144229 22754730 22412604 22673048 22765294
5599 22765294 23327748 23078150 23706150 24209847 24266962 24552557 25175074 25627556 26025445 26620242
5589 26620242 27011727 27719148 27759263 27629970 27289379 27214475 26845007 26778497 26876266 26548171
5579 26548171 27309404 27658061 28781982 29871623 31411681 32924579 34150997 35556999
5571 35556999 36417486 37547828 38010776 38427027 38268579 37588560 36778662 36270177 35445728
5562 35445728 34674540 34050829 33887826 33898127 33966690 34572173 35205388 36019300 37120130 38128562
5552 38128562 39367993 40624983 41932796 43340739 45026461 45880618 46885852 47204337
5544 47204337 47700089 48001150 48775702 49211451 50384833 50991735 51540572 51990629 52786194
5535 52786194 53753173 54569658 55465766 55922813 56266905 56604672 57266330 57736533 58673197
5526 58673197 59551591 61614298 63821246 66262083 68572797 70931807 73646811 76503749
5518 76503749 80047754 85189938 91526322 100078047 110225186 120637524 127064423 128283228
5510 128283228 124213612 118344479 113787794 112166485 113810732 119066298 128234232 140238915
5502 140238915 154549354 167301060 176728823 182239981 183000934 180998574 177227340 172087771
5494 172087771 165635244 157920517 149008124 140258800 132298224 125091886 118103612 112256588
5486 112256588 107141994 103346727 100838100 98086601 95147385 90783485 85523568 80591166
5478 80591166 76840868 73754671 70937682 68457533 65432438 62772034 60512677 58881894
5470 58881894 57900491 57993014 58824496 60133540 61989277 64034045 66647139 68520123 69704793
5461 69704793 69627797 69428846 68524406 67583576 66784661 66551550 66642913 67765509 68716717 69539093
5451 69539093 70324507 70291478 70854037 71365839 72306527 73753186 74924822 76775404 78406654
5442 78406654 80239029 82074917 83582301 84669285 84389999 82851299 80401771 76662981
5434 76662981 72882744 69459499 66204658 63197168 61311115 59488079 58345477 57319787
5426 57319787 57047746 56445015 56048747 55643665 55138853 54387148 53885539 53352756 53092441
5417 53092441 53191738 53681000 54877443 56554532 58554013 62160643 65581959 69342229 73144395
5408 73144395 76400996 77908559 77590251 75860570 72544947 69126197 66061605 63407750
5400 63407750 61455405 60189085 59711214 60122119 61387546 62999312 64697314 66289222
5392 66289222 67125840 66040920 64742555 62153976 59309959 56537090 53678600 50699625
5384 50699625 48199049 45826311 44017375 41957549 40856111 40035588 39068832 38837852 37927840
5375 37927840 37653790 37869109 37418259 37261061 37357854 37345525 37675601 37975477 38618811 39113092
5365 39113092 39570739 40437946 42386405 43978322 45415479 46541693 46812718 46902376 48021832
5356 48021832 49222975 51839658 55108123 58791070 61264017 62683617 63023995 63578803
5348 63578803 63971536 65211549 67446449 70014393 73965795 79227200 85826778 94446769
5340 94446769 106872178 124541150 151285326 192176977 250087776 310022332 341829097
5333 341829097 327622953 277313408 224532371 181068776 147757360 122614442 103673505
5326 103673505 90286997 80722350 73725616 68456435 64118806 60886857 57931061 55808151
5318 55808151 54696564 54349626 55238434 57104534 60158974 63584875 65643206 65257939 62657927
5309 62657927 59673640 57089618 55617175 54974974 55296659 56128944 57473296 59434257 61973315
5300 61973315 64360225 65516979 65989239 66131107 66075039 65688072 62961271 60417619 58069247
5291 58069247 56167279 55851728 56426446 57317654 58456468 59016310 59297026 59171787 59037519
5282 59037519 59580461 60692230 62808594 65335703 68618033 73306701 78606211 86063402
5274 86063402 94969897 106557831 121832280 142081414 168617302 203082481 242758148
5267 242758148 277605999 294625464 286089910 256704231 219334839 183622157 153609823
5260 153609823 130035604 112310238 98828586 88958750 81329183 75809672 70024426 64989581
5252 64989581 59543598 54677628 50281117 46441180 42842077 40367290 38196119 35995744
5244 35995744 35168140 33749743 32715530 31817668 30878711 29569825 28160018 26905501 25534647
5235 25534647 24512568 23401863 22868460 22052756 21402153 20792242 20261813 19983511 19120637
5226 19120637 18809280 18509119 18123424 17709574 17004245 16659322 16471897 15956698 15687071
5217 15687071 15224755 15191514 14669879 14524329 14376291 13970857 13866236 13558815 13712552 13337104
5207 13337104 13710186 13276934 12951238 12695845 12261717 12697285 11993706 12182702 11682485
5198 11682485 11493558 11863230 11883502 11470404 11550852 11370864 11141150 11022754 11063390 10810651
5188 10810651 10599358 10645154 10659358 10517717 10656099 10689261 10650104 10723378 10932227 10873341
5178 10873341 10771255 10650783 10533904 9998033 10029427 10192716 9841121 9836905 9650552 9792053
5168 9792053 10045058 10121276 10279026 10356017 10455427 10691000 10541037 10510126 10585123 10412438
5158 10412438 10198999 9990217 10243062 10023885 10389818 10695094 10569244 11115103 11464915
5149 11464915 11397897 11379253 11417965 10957001 11011768 10790305 10816068 10727229 10475647 10621625
5139 10621625 9978844 9688873 9630424 9563255 9256352 8969282 9072782 8806289 9203048 8927647
5129 8927647 9090319 9421665 9713189 10150364 10224801 10449114 10385389 10590852 11074114 11008025
5119 11008025 11340793 11842177 12650987 13327332 14517892 15456399 16382543 17928810 19750223
5110 19750223 22620141 26025217 29289465 31273466 33325794 33340483 31106046 26757976
5102 26757976 21878293 18484547 15681961 14496084 13105440 12262203 11867361 11856306 11770760
5093 11770760 11573301 11223520 11082938 10570787 9857661 9767349 9415623 9116676 8800973 8659272
5083 8659272 8667017 8354691 8167854 8151671 8387178 8174281 8236911 8056056 8129276 8219064 8673296
5072 8673296 8147661 8621228 8775924 8934322 9004332 8349983 8169406 8251875 7941513 7787375
5062 7787375 7811391 7711625 7567259 7495861 7595906 7512761 7634814 7512148 7336276 7571592
5052 7571592 7447678 7329055 7481233 7515566 7249312 7612700 7681391 7856733 8077642 8002417
5042 8002417 8187626 7912075 8246140 7838801 7979159 7914259 7817112 7732363 7887056 7967023
5032 7967023 7973145 8211263 8462968 8206552 8680540 8661844 9017621 9501893 9545276 9927930
5022 9927930 9961635 10177023 10297068 10319567 10132302 9927319 10040314 9701812 9755667 10147531
5012 10147531 10195441 10366334 10704010 10635831 11103614 11277152 11620148 11946951 12488435 12785169
5002 12785169 13089788 13735996 13923689 14230580 14713333 14696378 15100190 15565151 15875479 16288414
4992 16288414 16747341 17537118 17874397 18689359 19214315 19780121 20589613 21127788 21944769
4983 21944769 22719151 23567158 24319407 25228529 26306569 26963150 27895179 28983713 29896395
4974 29896395 30776779 31427025 32897767 33749574 34753282 35736742 37344851 37700797 39003479
4965 39003479 40331981 41434184 42550706 43691256 45013077 46351240 47973215 49343960
4957 49343960 50660883 52732955 54217329 56169873 57950549 59526509 61475101 63560039
4949 63560039 65475767 67869925 69673309 71732656 74249945 76827233 79092744 81604852
4941 81604852 84405897 86861693 89515629 91839766 93982788 96212793 97563010 99536849
4933 99536849 101099552 102550190 104061551 105377247 106654116 107870563 108526870 108741521
4925 108741521 108933203 108450345 107256559 106144865 104740229 103184954 101120645 99222350
4917 99222350 97188237 95319576 93117256 90377909 87713799 84861493 81636651 78199517
4909 78199517 74654225 71150511 67551857 64241194 61392703 57890074 55123776 52471350
4901 52471350 49611589 46687433 44292561 41715110 39043224 36607298 34965260 32383447
4893 32383447 30409160 28807130 27115072 25764695 24429066 23196654 21879235 20948113
4885 20948113 20312979 19059840 18239081 17589757 17007065 16199860 15914823 15335327 14797658
4876 14797658 14549633 14089362 13722735 13553140 13588256 13062928 12977172 12436134 12481517 12308237
4866 12308237 11812749 11705395 11636569 11741125 10970438 11279379 10999010 11101991 10761499 10534062
4856 10534062 9999836 10253661 9977138 9924097 9888371 9783643 9582433 9377607 9220349 9191604
4846 9191604 9002932 9056777 8969726 8938628 9014233 8414943 8473680 8552234 8514918 8558399 8441151
4835 8441151 8505328 8343470 8408728 8281594 8371174 8652185 8166338 8041409 8106788 8079737
4825 8079737 7994133 8030596 8020438 7970433 7980708 7912203 7718094 7972408 7721202 7669525 7202387
4814 7202387 7402530 7678792 7444346 7407658 7339947 7133596 7209316 6995037 6963516 7063330
4804 7063330 7070715 7110957 7009596 7093160 7186981 6898580 6939418 7057352 7063680 6998084 7225532
4793 7225532 7090972 7210979 7152459 7081698 7117062 7113028 7377502 7345757 7296208 7689536 7356382
4782 7356382 7394352 7405687 7337884 7596533 7866276 7839795 7627482 7582087 7629002 7814932 7943845
4771 7943845 7779078 7791992 8035301 8370579 7926616 7903590 7950832 8065686 8141589 8113201
4761 8113201 8159966 8113946 8384734 8525281 8527417 8209212 8204373 8625569 8891057 8965291 9407002
4750 9407002 9196080 9303049 9843066 9649279 9859190 10042972 10329518 10352209 10402454 10742734
4740 10742734 10928842 10843672 11114886 11258027 11552233 11841067 11784714 12072071 12391898 12349578
4730 12349578 12697230 12493583 12500066 12950024 13063303 13056047 13306455 13344506 13471530 13621911
4720 13621911 13952863 13877309 14178356 14122192 14126790 14255394 14478246 14554303 14928203 14690080
4710 14690080 15107588 15430807 15781030 16079174 16036814 16547936 16799435 17211685 17791783 18286683
4700 18286683 18525740 18945527 19322959 19928623 20253445 21071792 21272671 22273685 22701207
4691 22701207 23520771 23913383 24438153 25532738 26110906 26592636 27703403 28474580 29416492
4682 29416492 30367994 31352186 32555212 33653773 34929331 36473037 38139047 39765281
4674 39765281 41242995 43164460 44808201 46694677 48921601 50829331 52909536 54338765
4666 54338765 56140377 57864230 59180845 60745381 62278097 63725315 65303081 66390666
4658 66390666 67622943 68741346 69547434 70101506 70711575 70589866 71013304 70396946 70548546
4649 70548546 70574649 70451832 70087825 70193640 70210062 70424039 70636188 70688831 71033943 71527400
4639 71527400 72139397 72987661 73845618 74902101 76568487 78031873 80097899 82675008 85221478
4630 85221478 87960120 91358279 95509712 99708735 104442691 109188934 114578865 119741529
4622 119741529 125319693 130852829 136075086 140955167 145471559 150068118 154033356 157838332
4614 157838332 161654402 165137139 168585223 171152048 173752974 175781665 176629019 176839347
4606 176839347 176001443 174329098 172283977 169297186 166078134 162487915 159540066 155911729
4598 155911729 152287488 149289260 145799693 142637588 139771456 136913344 134519455 132337726
4590 132337726 130877194 129469692 128802518 128546604 128823821 129163037 129748019 130451569 131201706
4581 131201706 132315396 133120246 134004774 134993594 136358948 137805133 139449650 140791854
4573 140791854 141941964 142032977 142223836 141382841 140345106 138290690 135397230 132441482 128960778
4564 128960778 125186499 121011521 116777730 113280485 109284263 105831084 102344336 98479485
4556 98479485 94664043 90808346 86818998 82741786 78809260 75040622 71362784 68295519
4548 68295519 66155067 64188893 62298181 61684289 60675096 60687641 60711148 61183385 61791512
4539 61791512 62587484 63876804 64585310 65445341 66174229 67073316 67281776 67660143 67966041
4530 67966041 68575039 68952604 69776494 69897888 70828863 71038024 71595272 71509551 70927781 70472918
4520 70472918 69741282 69021594 67449214 66191398 65123747 63511630 62682487 61840967 61090815
4511 61090815 60168706 60055673 59735934 59723174 59447962 59912548 60461785 61569956 62611848
4502 62611848 64428848 67356366 70269300 74194549 78932062 84332375 90939561 98236908
4494 98236908 106787514 116460547 127912066 140314727 153823289 167998827 182561380
4487 182561380 196714933 210157873 222558449 232858684 241592667 248548820 252694008
4480 252694008 255382684 256708599 256469983 255341175 253327358 250166155 245820734 240260129
4472 240260129 232293628 223169066 212607819 199885332 186895953 173111171 158991321
4465 158991321 145434025 132154630 120229736 109219864 99367294 90786187 83152186
4458 83152186 76432808 70744288 65352857 60664108 57023029 53476537 50519429 48019117
4450 48019117 45552635 44091244 42380105 41096740 39851541 39040822 38089112 36975256
4442 36975256 36403988 35591420 34660847 34312909 33876257 33387286 32790390 32416469 31720398
4433 31720398 31169077 30768939 30237374 29332948 28740914 28205015 27540404 27120474 26326731
4424 26326731 26041639 25338212 24715815 24389347 23677809 22905401 22329627 21702841 20949714
4415 20949714 20256146 19136060 18677909 18055488 17341673 16720937 16055412 15652733 15159054
4406 15159054 14497828 14262055 13849752 13682256 13116085 12867922 12740998 12635819 11995275
4397 11995275 11741259 11774492 11529863 11211444 11184652 10775947 10679104 10409584 10532694 9920503
4387 9920503 9885277 9877404 9482030 9475654 9537109 9008192 8920400 8987110 8667643 8615773 8308404
4376 8308404 8289880 8135491 8258639 8134677 7882790 7833552 7725928 7608249 7624774 7654110
4366 7654110 7299953 7098261 7267997 7281481 7078013 7103535 7009557 7346162 6895536 6652597
4356 6652597 6915396 6986160 6953917 6814147 6950021 6917618 6809970 6714537 6612060 6616682 6434532
4345 6434532 6571295 6396804 6523177 6387905 6528978 6427535 6349064 6612269 6379090 6773523
4335 6773523 6746073 6989280 7332595 7633841 7762893 7891372 8609268 8865024 9446526 9573820
4325 9573820 10365879 10600996 10666354 10264899 9752987 9274579 8498828 8101772 7752712 7483821
4315 7483821 7193622 7073799 6721350 6300698 6102843 5942200 5545807 5625842 5768137 5097154
4305 5097154 5115705 4622259 4724550 4780535 4632556 4451596 4596108 4911053 5195483 5447934
4295 5447934 6187323 6057638 5587875 4900817 4521619 4287920 3936111 3959325 4109072 3852464
4285 3852464 3670734 3638340 3801426 3476727 3348187 3246063 3159605 3331543 3301845 3369081
4275 3369081 3018958 3046918 3045458 2923055 3293827 3074763 3633397 3650588 4096385 4068340
4265 4068340 3884938 3365398 3197182 3218370 3173551 2823357 2913492 3028702 3078574 2908607
4255 2908607 2628070 2730948 2613434 2715804 2694222 2521897 2484087 2415307 2542556 2437116
4245 2437116 2639938 2486153 2634102 3000196 2878028 2836768 2985361 3064367 2916279 2882063
4235 2882063 3353531 2991009 3009479 3116783 3206349 3291500 3367841 3278669 3218921 3339452 3138944
4224 3138944 3037947 3067834 2928230 2930700 3132950 2672236 2923922 2689389 2756497 2816770
4214 2816770 2733440 2403117 2577761 2336763 2198526 2157879 2256728 1987757 2184977 2196553
4204 2196553 2315522 2223922 2122929 1981594 1888822 2032020 1893436 1776326 1733031 2081043
4194 2081043 1945468 2007446 2041941 1795433 1505216 1610100 1931853 1864559 1839999 1752612
4184 1752612 1870029 1585468 1690680 1902736 1735351 1525644 1697841 1367535 1738049 1538982
4174 1538982 1525337 1891637 1566438 1719453 1569763 1848892 1747192 1836206 1659965 1826184
4164 1826184 1779101 1707699 1672877 1545780 1596169 1422956 1569519 1277361 1703228 1555733
4154 1555733 1646070 1385997 1340894 1394163 1729677 1705028 1819883 1690380 1566464 1768698
4144 1768698 1460606 1480522 1657941 1356972 1590029 1582519 1650340 1366450 1621562 1756917
4134 1756917 1447802 1446047 1647890 1314028 1514905 1533257 1568943 1562376 1736709 1552616 1727072
4123 1727072 1904963 1581425 1540959 1828727 1587068 1520590 1562035 1438584 1901692 1833112
4113 1833112 1705514 1641154 1654955 1668083 1561925 1871334 1599344 1722993 1580908 1856329
4103 1856329 1673437 1587369 1668057 1586102 1475814 1506973 1774179 1533172 1579737 1807658
4093 1807658 1594918 1831675 1707068 1960653 1745224 1835153 1648978 1914273 2095879 2240658
4083 2240658 2224109 1989770 2045562 1783146 2072935 1828323 1650958 1976179 1786032 1964294
4073 1964294 1743923 1600357 1846015 1696131 1590450 1380102 1488562 1500877 1902841 1612322
4063 1612322 1581819 1616055 1799787 1827784 1790896 1903562 1929126 1987010 1980562 1866391 1857322
4052 1857322 1844180 1854162 1843926 2109982 2090610 1673629 1890742 1642428 1748072 1873630
4042 1873630 1748103 1654393 1467826 1739046 1582610 1574895 1807680 1732727 1609655 1818639
4032 1818639 1601461 1810421 1925035 2166093 1798894 1928367 1951951 1831070 1619174 1633128
4022 1633128 1604361 1339607 1505038 1453916 1622664 1641086 1456987 1486913 1396270 1649063
4012 1649063 1453159 1506293 1409901 1370713 1772739 1567992 1687919 1783554 1636724 1533480
4002 1533480 1674178 1513004 1677556 1575327 1504683 1405156 1391367 1396924 1601573 1522908 1599111
3991 1599111 1347974 1404620 1685656 1428602 1575278 1347329 1506252 1238741 1432386 1313743
3981 1313743 1360716 1467846 1238457 1259134 1039702 1109556 1141889 1197033 1158381 1003571 748377
3970 748377 1042901 996820 1024128 1109181 951222 657255 950744 1041104 1013051 1030893 904568
3959 904568 1019141 830908 649721 715553 1073071 919407 939310 1054542 976026 1061038
3949 1061038 922476 996688 948074 1025779 1122933 811579 691716 668533 668467 863429 616898
3938 616898 615123 784545 517946 767481 796736 662523 725853 634594 519069 1044436 443487
3927 443487 872891 670584 937301 828800 741182 963379 1014539 936620 760183 832566
3917 832566 792428 730398 678809 553734 830893 467795 623339 864601 855627 628608 696249
3906 696249 382891 616050 780212 908821 759782 838900 821924 940818 711750 539086
3896 539086 829126 799888 860906 523153 720601 711038 1021659 626484 471044 577064
3886 577064 941092 579451 548794 577650 235403 435556 499368 629212 616614 376061
3876 376061 618575 299572 512686 615884 649655 540295 202165 336981 705555 215540
3866 215540 552925 621890 469814 396734 561119 562121 463262 593595 499505 644538 533680
3855 533680 497308 572945 523092 430847 568154 501340 549138 468225 420456 378665 529619
3844 529619 330033 530069 588900 323473 490068 732263 796285 406618 514036 485010
3834 485010 692901 548450 328648 565887 715868 618362 443562 556046 529025 595880
3824 595880 646605 478686 544706 820029 407672 282772 681910 549913 831278 576119
3814 576119 506573 794747 530514 743939 530389 572358 642677 783267 514913 722279
3804 722279 685731 607131 517278 624376 800279 804326 495474 565607 410633 575957 767813
3793 767813 739422 609986 700924 848276 645579 731821 749426 456772 759725 1053708
3783 1053708 621552 640700 532625 653155 740496 648345 505925 546427 461068 775484
3773 775484 460441 688905 1001077 530320 592683 555896 553661 704906 358837 748038
3763 748038 692220 753148 645231 503903 730902 592965 651119 999953 754285 776571
3753 776571 823217 736467 863004 679840 911031 839633 850154 774623 568187 642141 511958
3742 511958 794768 424598 396707 872984 483854 610779 821989 471959 712652 996298
3732 996298 742779 638440 698093 777599 696695 829431 873932 703788 602529 779436
3722 779436 290010 598904 539081 567963 576384 351273 560409 625470 386098 578036 192895
3711 192895 452407 325834 434856 567353 552177 373519 519802 292783 396143 408271
3701 408271 421334 361689 560696 740922 476822 653409 466974 485145 821363 524275
3691 524275 514721 585171 456827 666159 348223 643419 342195 352674 379736 215057 617633
3680 617633 494130 379978 375349 468967 514752 410949 638871 672927 379325 3738 466141
3669 466141 233524 247233 332648 346347 425031 231155 569205 474805 266939 478988 556909
3658 556909 418541 521782 452977 403272 593635 334198 232234 606532 309855 269486
3648 269486 424607 300019 210630 253773 367742 101462 502593 437778 206232 192871
3638 192871 211569 279214 455702 400134 221394 389449 425004 298178 233588 59185 464578
3627 464578 213379 143264 340836 12896 552050 485244 436694 407440 483604 429442 540436
3616 540436 282781 224767 334608 301358 477489 210719 158679 178024 258023 174019 313119
3605 313119 396050 317156 157840 206900 378702 278907 535695 507553 197632 356788 311336
3594 311336 108779 275603 -35293 227238 715079 354839 526033 497266 370361 381265
3584 381265 446467 297992 614116 421832 291776 329159 698578 526970 655133 480682
3574 480682 549044 613747 841827 549539 445336 898586 1116332 1438089 1520584 1719785
3564 1719785 1132834 1173238 911808 911735 943910 487972 664055 605015 626738 648459 416907
3553 416907 349281 143705 452448 540623 423601 165495 356930 443845 557892 511153
3543 511153 500973 296823 573337 118809 424683 399815 248130 471569 430378 207269
3533 207269 304561 713816 245288 251773 146844 452061 461675 343803 426674 389703 438148
3522 438148 449828 426237 301730 395333 461496 472948 327988 489591 495770 360808 532021
3511 532021 439757 -6455 430777 642392 393835 536975 435364 298584 442467 620368
3501 620368 590654 359436 320035 413436 383571 517559 636382 736909 472656 364559
3491 364559 344824 586041 340228 478388 368447 664302 633227 484092 750822 873339
3481 873339 701548 481514 575142 461540 703825 423081 585272 623840 709830 646603
3471 646603 922797 675837 726198 878996 704768 975369 927303 740055 526184 567139
3461 567139 704665 560874 380021 800218 605507 559804 777789 762726 1002474 852955
3451 852955 946683 1059523 783861 884834 1073283 1147991 870989 973396 995271 976307
3441 976307 961525 1035788 993143 868159 895524 901223 1203713 1169563 965976 1115441 1340131
3430 1340131 1204952 1243400 1050033 1231298 1126911 1133856 940571 1329533 1226149 1163697
3420 1163697 1367731 1147943 1181723 1224648 1557316 1754378 1883927 1881835 1760098 2087301
3410 2087301 1644509 1738577 2022549 1949951 1771779 1951328 2194990 1809077 1779983 1651511
3400 1651511 1726300 1965928 1991284 2339525 2361456 2627052 2542519 2450499 2642597 2858662
3390 2858662 2655242 2664438 2735063 3079249 3012005 3001981 2937787 3141155 3171638 3022133 3190172
3379 3190172 3133706 3482354 3538645 3521128 3537578 4084311 4116473 4000574 4092454 4437917 4641255
3368 4641255 4690628 4936625 5096374 5652203 5554463 5816113 6335466 6573746 6625278 7011487
3358 7011487 7413190 8095462 8881061 9019096 9669488 10190170 11142940 12331956 13229376
3349 13229376 14638585 16571582 19617868 22947795 24543968 24865847 25308399 27128509
3341 27128509 30596556 34716129 40309854 48787680 61248874 81676037 124370382 195103187
3333 195103187 258462529 273320640 208004476 139256590 95695489 69678206 53314707
3326 53314707 40290492 32203039 27201453 23899209 22397993 21831888 21468962 20884794
3318 20884794 18348609 15440176 13711159 12057355 11421160 10593053 9861878 9492853 9159080
3309 9159080 8500255 8232546 7570038 7371078 7098972 6758918 6795730 6466332 6191751 6084555
3299 6084555 5502932 5846766 5335228 5283093 5205081 4859127 4483750 4358714 4342347 4470126
3289 4470126 4162353 3905657 3829018 4011215 3310722 3447583 3192288 3295283 2878442 3149296
3279 3149296 2841254 2987784 2727191 2704910 2536495 2819934 2658493 2619891 2624294 2523687
3269 2523687 2326593 2568804 2209173 2116304 1844676 1811063 1483326 1930587 1918517 1958465
3259 1958465 1901020 1681385 1759806 1619012 1864047 1457207 1644567 1461703 1570289 1557177
3249 1557177 1764283 1610470 1253847 1264095 1288087 1279472 1120673 1383079 1319817 1123228
3239 1123228 987339 1221988 894626 952589 1070136 889762 1202539 1092830 800399 980079
3229 980079 953335 918807 625904 990931 692555 724325 819614 829757 545956 767106 1064920
3218 1064920 927390 770734 623100 451697 222291 556562 477888 562632 583525 265397
3208 265397 505486 450031 384234 328315 278207 428663 366805 495071 484583 380626 348304
3197 348304 521937 406688 335483 438589 315986 519365 579525 231912 249082 125082
3187 125082 405592 133180 225248 44590 158911 317643 309882 432108 255495 366768
3177 366768 209474 272889 241221 243359 305414 290876 273613 154165 520717 329044 150689
3166 150689 2231 259830 93350 377146 369044 133131 42560 254445 228053 202631 230380
3155 230380 80082 30517 128858 -165736 140566 126962 312439 124413 109374 422453
3145 422453 42516 109050 69606 374731 44693 337816 188681 124823 -98770 -193879
3135 -193879 53633 54741 20147 -86150 95817 299690 -272448 195632 -29992 34405
3125 34405 96764 -171222 -136576 -89145 -58966 -337891 -109221 151548 -60498 -157743 -189094
3114 -189094 -77200 82289 102885 255652 -165804 221289 30022 -22826 112981 34521
3104 34521 100347 390022 220656 423674 550052 533276 1214415 1279107 907999 1004830 820091
3093 820091 340525 535278 195737 -93613 185339 244612 85446 140979 -2816 -158906
3083 -158906 3613 48248 117456 -273860 177632 -55788 63209 -15517 -89591 -100223 -276439
3072 -276439 -346806 -65295 -50252 44011 -48831 -100651 -168180 -254147 -131569 -87467 -101546
3061 -101546 -187411 -115379 -115955 -95857 -24637 -250313 -120936 -29249 -208827 150845 -170974
3050 -170974 128655 -15868 -442587 24105 -191619 -128791 -348634 -95096 -184345 -332482
3040 -332482 82440 -373289 -59079 -141332 -282070 -204550 164650 -179067 -426671 -110612
3030 -110612 -239773 -95146 -62629 -215563 -235630 -113199 -306467 -57727 -364951 -150680
3020 -150680 -261106 -26815 -80292 -29711 -217132 -132844 -131805 -97149 -7828 -100123 -63218
3009 -63218 -14232 -329107 -360319 -44440 -206851 -225252 9961 -243477 15451 -48214 -342185
2998 -342185 -67878 -106651 -100888 -184828 -173666 -122389 -20191 -30123 -27736 -116571 -206079 -141083
2986 -141083 -50602 -132862 20925 -52674 -128281 -38199 -307246 -123136 -23309 -96352 -310036
2975 -310036 -158151 -81714 -186905 -46156 -152473 -63746 -86672 -259000 -259707 -79840 -135686
2964 -135686 39187 139877 -176287 33934 -317768 -200050 96837 99029 -62635 -302684
2954 -302684 -208281 -220437 -148554 -286515 -365159 -27903 -391553 -380728 -37119 -257524 4068
2943 4068 -219248 -155706 -230566 -350576 -133790 125116 -132202 -261461 -72423 -70101 -285196
2932 -285196 -361537 -379490 -85669 -152520 -196862 -116346 -2069 -253770 -211352 -85441 -282012
2921 -282012 -47334 -172237 -392088 -326588 51043 -267851 -25715 -64095 -52755 -331238
2911 -331238 -62989 -159887 -280348 -49898 -270791 -178271 -79466 -14982 -144648 -163621 -207505
2900 -207505 333804 6474 -419492 -307776 -226839 -207578 -64663 -250770 23360 -65543
2890 -65543 -104922 -32195 -304859 -250041 -112495 -159277 -245411 -306482 -89064 -303260 -106887
2879 -106887 -88906 -170378 -1276 -150291 19807 -212256 -405884 150907 -334654 -102076
2869 -102076 37883 -171532 -62275 63111 -178793 -237263 -200068 -206267 -449382 -219482
2859 -219482 -160051 -317586 -252216 -232115 -295671 -312243 -250412 -503642 -517924 -299717 -157525
2848 -157525 -195032 -169487 -95395 -27250 -94987 -101395 -345877 -32291 -313444 57849 -196006
2837 -196006 195498 57184 -69358 -305467 -189991 10612 -156443 -217479 -387846 -272769
2827 -272769 -275667 -186151 -255069 -3890 -260131 -316631 -39065 -123768 197021 -89896 -130851
2816 -130851 -225322 -270438 -223008 -212112 -155500 -371570 -261385 -29415 -65446 -359619 -279044
2805 -279044 -510792 -400643 24908 -205467 -371447 -231818 -76088 -209270 -180065 -446661
2795 -446661 -190805 -2058 -142432 55384 -155119 -38882 -360481 5531 -134181 -66612
2785 -66612 -90693 -16417 -347432 -387616 -414294 -51765 -14259 -291550 -550234 -208471 37552
2774 37552 -312226 -175387 -125065 -386637 -200812 -190995 -2425 -202082 -520668 -279913
2764 -279913 -259618 -326754 -220450 -542647 -317767 -224961 -72546 -206286 -141232 -178112 -337976
2753 -337976 -134267 -149896 -234812 -365212 -245025 -456919 -237293 -206326 -418776 -247573
2743 -247573 -143296 -440635 -130522 -323171 -426286 -174207 -90419 -274604 -333074 -330399
2733 -330399 -149114 -347972 -307404 -62793 -308805 -308812 -474458 -4353 -209346 -32237 -282867
2722 -282867 -150640 -81932 -435972 -375696 -291354 -339369 -229683 -160475 -51304 -251966 89838
2711 89838 -225654 -165552 83832 -289898 -142452 -69311 -91360 -266951 -220572 -173330 -260414
2700 -260414 -116066 -202415 -99686 -215498 -192729 -178183 -226198 -357668 -226668 -442763
2690 -442763 -291902 -219577 -321970 -232530 -152969 -98078 -49773 -330613 -287554 -441752 -93817
2679 -93817 -165316 33752 -73493 -219887 -309122 -148670 -43497 -114447 -403123 -204761
2669 -204761 -211189 -428021 -122196 -325211 26892 -325887 -456689 -272256 -373266 11888
2659 11888 -238522 -349604 -302228 -279969 -404500 -54326 -155956 -386659 -185256 -51441
2649 -51441 -229985 -372313 -265733 -233792 -144851 96379 -405318 -360584 -289153 -291639 -255158
2638 -255158 -136198 -100347 -337994 29021 53467 -325461 -136802 67236 -243990 -365965
2628 -365965 -146361 -7848 49776 -9632 -352793 -243868 -75563 -139030 -180659 -346094
2618 -346094 -391437 -223410 -238362 -376645 -66360 -153956 -223988 -511286 -197965 -273170 -370824
2607 -370824 -390017 -355044 -122668 -47838 -186460 -74773 -236651 -253199 -316827 -376801 -303508
2596 -303508 -489045 -88334 -354993 -80894 -255319 -181419 -185441 83934 -192560 27159
2586 27159 -492916 -233807 -65880 -169173 -249241 -121829 -190066 120256 -200757 -91816
2576 -91816 143782 -169777 -237682 -328271 -331740 -413417 -333105 -301060 -430182 -322134 -317687
2565 -317687 3161 -318106 -399636 -297864 -140170 -179372 -335582 -286200 -164934 -60628
2555 -60628 -49897 -425135 -59000 -251372 -438646 -251757 -218638 -354909 -48090 -227796
2545 -227796 -204756 -407265 -244308 -406850 -240718 -125810 -352841 -22031 -132259 -26110
2535 -26110 -25525 -273176 -198420 -207781 -191598 54525 -132997 -9824 -508384 -41474 -101442
2524 -101442 -338388 -262171 -402645 -261324 70953 -329046 -412204 -410885 -388018 -284546 -462766
2513 -462766 -170541 -334662 -323931 -321764 -264873 -70155 -221000 -486035 -158178 -334978
2503 -334978 -435212 -370889 -390291 -568132 -520621 -149716 -224963 -234135 -132989 -264325 -380995
2492 -380995 -287510 -273454 -375878 -269971 -278042 -434814 -353317 -231664 -116537 -291291 -165479
2481 -165479 -416387 -384312 -90827 -185018 -151329 -253916 -209586 -307224 -216546 -565206 -102191
2470 -102191 -324576 -256125 -126835 -207399 -297654 -318932 -277453 -402029 -271545 -70834 -282073
2459 -282073 -250324 -279546 -145957 -255323 -68431 -159239 -421057 -413404 -558429 -455826 -421494
2448 -421494 -62308 -491794 -23364 -457176 -329826 -448811 -459322 -211643 -119548 -157377
2438 -157377 -123027 -308456 -272275 -326094 -343857 -384136 -153277 -239097 -42564 -272601 -98617
2427 -98617 -239018 -60950 -391746 -123755 -79257 -206983 -269296 -190807 -185599 -258544 -185876
2416 -185876 34595 -355265 -275717 -409995 141625 41354 -75479 -217413 -246767 -121534
2406 -121534 -418892 -307430 -184299 -318323 -334374 -318225 -266551 -376892 -137736 -100068
2396 -100068 -317366 -319127 -281152 -134358 -279118 -511803 -364615 -8931 -264394 -274540
2386 -274540 -303256 -160293 48820 -507778 -235189 -147335 -152108 198321 -498268 -289899
2376 -289899 -448897 -112137 -111495 -250173 -215162 -239494 -95411 -87887 -193478 -64253 -27542
2365 -27542 -474454 -348547 -106084 -209453 -406842 -164125 -208465 -176203 -202131 -321078
2355 -321078 -404573 -424613 -488202 -156696 -219353 -356715 -381473 -506891 -260771 -305073 -274050
2344 -274050 -246541 -489478 -243341 -400278 -210635 -405430 -352679 -376146 -407230 -230760
2334 -230760 -178506 -53032 -323460 -138283 -104287 -254810 -305826 -81141 -297056 -134261
2324 -134261 -260870 -209903 -119597 -264929 -454418 -266887 -402476 -270763 -239462 -163404
2314 -163404 -319897 -138176 -177388 -166894 -357360 -356189 65988 -25168 -227824 -396721 21595
2303 21595 -15795 -402795 -100628 -273061 -260559 -148636 -118934 -344513 -91425 -155870 -100074
2292 -100074 -253121 -190467 -399992 -130036 -248438 -161002 -189478 -493798 -330380 -309079
2282 -309079 -531149 -148858 -249358 -332623 -322352 -370508 -151068 -344801 -147857 -323298
2272 -323298 -320913 -284931 -272086 -340857 -464520 -290280 -256500 -115698 -371323 -421388 -139181
2261 -139181 -320136 -382967 -22907 -167141 3331 -22862 -198274 -26296 -418522 17160
2251 17160 -294935 -115357 -126582 -328799 -350003 -304465 -56987 -462098 -513863 -298434 -182472
2240 -182472 -274500 -436716 -114000 -373496 -399938 -309261 -562647 -109158 -386506 -138386
2230 -138386 -445355 -53658 -348314 -326633 -334370 -371157 -291520 -28824 -301079 -192067 24423
2219 24423 -191649 -144155 -152872 -321328 -261807 -188866 -381149 -148476 -246147 -291014 -205576
2208 -205576 -468614 -424099 -256973 -358930 -533330 -363933 -413581 -149076 -446512 -274813
2198 -274813 -164718 -187648 -333909 -327714 -90334 -335635 -150726 -112555 7861 -285124
2188 -285124 -19565 -233238 -166371 -271144 -80323 -501297 -282615 -222629 -379455 -181942
2178 -181942 -205820 -316991 -189528 -425559 -299259 -469603 -332771 -104055 -351550 -85336
2168 -85336 66951 -343110 -94624 -353654 -165345 -137456 -236346 -200311 -449483 -354812 -242397
2157 -242397 -208569 -429910 -279597 -180763 -266581 -125310 -434582 -240515 -225088 -124691
2147 -124691 -241415 -377224 -406337 -110283 -290084 -101859 -493862 -239027 -192110 -347587
2137 -347587 -134590 -90710 -113009 -280501 -382855 -116528 -51813 -524176 -349473 -215694
2127 -215694 -156439 -134231 -304883 -105227 -421595 -418004 -490800 -247205 -109113 -80941 -197382
2116 -197382 -170473 -479685 -153545 -194454 -239949 -347466 -266675 -296492 -260738 -416464 -272205
2105 -272205 -157778 -456877 -277124 -273341 -313398 -361705 -536182 -319611 -319055 -474555 -116997
2094 -116997 -94741 -508137 -118808 -174468 -132811 -298107 -477394 -386713 -81646 -164378 -350814
2083 -350814 -493455 -385482 -361500 -43433 -227746 -192467 -167354 -139389 -191563 -326236 -109388
2072 -109388 -399413 -228059 -23691 -385136 -145582 -459210 -299719 -356223 -254480 -194514
2062 -194514 -183435 61475 -315894 -16943 -216798 -226468 -165584 -66561 -141159 -263363 -118113
2051 -118113 -129907 -311249 -161861 -319718 -452712 -350560 -249944 -340689 -318748 -322245 -72069
2040 -72069 -326978 -203169 -418604 -126438 -133072 -296800 -266295 -261989 -229226 -285526 -367355
2029 -367355 -201320 -341326 -266516 -279084 -125985 -74032 -338438 -699148 -425677 -78830
2019 -78830 -470136 -351497 -426116 -234748 -103557 -82658 -301151 -51999 -503374 135929
2009 135929 -316052 -247047 -272400 -262728 -281280 -369514 -381837 -243953 -357792 -279164 -208469
1998 -208469 -503726 -98543 -185161 -470493 -337936 -116905 -447958 -475620 -326103 -289772
1988 -289772 -504691 -323309 -206979 -317117 -263531 -475830 -404996 -149671 -65954 -168495
1978 -168495 -111151 -184565 -449730 -381412 -440747 -532803 -336644 -347387 -359314 -280333 -465083
1967 -465083 -284047 -331836 -325364 -369136 -180908 -168960 -325159 -396369 -424867 -435442 -228639
1956 -228639 -319533 -424987 -126193 -306564 -415055 -255243 -269099 -354941 -403387 -410208 -343782
1945 -343782 -385640 -345165 -354389 -383294 -396164 -115844 -380262 -375167 -244441 -443771 -23694
1934 -23694 -116465 -290622 -280298 -160005 -481919 -391682 -365568 -158704 -184558 -333783 -103758
1923 -103758 48391 -357068 -223310 -241250 -152992 -76430 -163085 -419025 -41185 -279046
1913 -279046 -549181 -344726 -181032 -231815 141703 -374391 -361867 -172311 -446775 -499538
1903 -499538 -25052 -329746 -337570 -93398 -168550 -262636 -269202 -334596 -391446 -98368 -359619
1892 -359619 121054 -191078 -224254 -278364 -347853 -360430 -328351 -240586 -360917 -41769 -341834
1881 -341834 -438342 -567343 -396078 -349301 -398455 -505643 -314260 -475310 -555455 -309587
1871 -309587 -307559 -299981 -254317 -173624 -229615 -283715 -278910 -289656 -560641 -141878 -422873 -179670
1859 -179670 -268162 -375648 -451966 -359030 43593 -70254 -187427 -33255 -259915 -510391
1849 -510391 -325471 -338289 -676783 -357595 -5069 -294246 -140439 -246037 -377631 -482669
1839 -482669 -593755 -408049 -202849 -204254 -301242 -208094 -240882 -421683 -311807 -119276 -477266
1828 -477266 -404885 -374298 -275831 -263752 -388688 -27823 -319836 -239706 -446831 -27407 -315772
1817 -315772 -449510 -158357 -305359 -275276 -257562 -334291 -111181 -229582 -187500 -141596 -288361
1806 -288361 -294530 -332406 -256760 -529967 -137753 5572 -313260 -256403 -562386 -475032 -460034
1795 -460034 -333031 -40201 -168142 -346636 -137471 -175042 -310512 -283985 -235690 -68845
1785 -68845 -483312 -405681 -479511 -399184 41279 14527 -603015 -449845 -337939 -388531 -288539
1774 -288539 -367532 -398126 -431881 -381405 -342048 -315659 -339094 -360154 -495213 -432555 -208685
1763 -208685 -111220 -377500 -218204 -100987 -158218 -412067 -310002 -531763 -67426 -380284
1753 -380284 -388313 -295181 -465219 -163892 -52289 -94764 -146291 -408836 -515906 -392508 -255242
1742 -255242 -523213 -217795 -435807 -234801 -463091 -425838 -333010 -282769 -422154 -115024
1732 -115024 -486197 -259557 -539679 -18389 -541467 -440518 -271738 -325878 -647488 -324303
1722 -324303 -205258 197739 6454 -353332 -314982 -22338 -45228 -110510 -107658 -142627 -408990
1711 -408990 -155896 -547369 -397133 -354294 -408483 -320210 -385473 -232629 -305379 -93682 -358268
1700 -358268 -332341 -223324 -157977 -337725 -425636 -104108 -90106 -315324 -241212 -326200 -419210
1689 -419210 -524907 -356657 -275705 -211092 -137876 -642871 -466621 -452263 -282113 -366743 -381325
1678 -381325 -713702 -132303 -422783 -398777 10159 -395524 -281113 -324522 -193900 -267946
1668 -267946 -145435 -343917 -84597 -382000 -336154 -329492 -431693 -336739 -457686 -355774
1658 -355774 -266114 -203998 -282107 -549872 -699487 -210648 -308724 -337770 -184791 -105297 -408774
1647 -408774 -395699 -101348 -182993 -215931 -263219 -369452 -163038 -80549 -230012 -65683 -349531
1636 -349531 -154661 -356495 -304983 -615439 -154225 -317165 -203024 -203226 -188422 -478546 -240176
1625 -240176 -169167 -134898 -558863 -506826 -189631 -285462 -337449 -145762 -215731 -279977 -246424
1614 -246424 -237144 -332801 -361103 -368747 -286456 -186942 -56630 -255800 -292516 -264935 -389669
1603 -389669 -404967 -88558 -18826 -349050 -304763 -233139 -271805 -337258 -103752 -263842 -130919
1592 -130919 -221900 -463266 -577711 -263429 -98330 -225696 -404361 -563290 -482020 -447740
1582 -447740 -417487 -212141 -223006 -490425 -228593 -401316 -274149 -240320 -196467 -375601
1572 -375601 -413106 -377964 -400200 -201246 -272917 -229555 -138177 -153024 -228230 -622320 -505994
1561 -505994 -36343 -434591 -488261 -175981 -122315 -420578 -229373 -254672 -214237 -241276 -127665
1550 -127665 -104295 -42239 -257449 -479363 -180958 -437365 -533505 -338660 -242316 -58784
1540 -58784 -506447 -252008 -210877 -485244 -232711 -252160 -448908 -346428 -317933 -420500
1530 -420500 -433842 -263896 -400559 21866 -115426 -112592 -179229 -4790 -247232 -332495 -292091
1519 -292091 -302510 -112251 -481181 -288690 -288783 -272212 -466902 -361694 -294905 -223154 -244807
1508 -244807 -348879 -385569 -119709 -350909 -459397 -388326 -116846 -518659 -237836 -217180
1498 -217180 -101184 -247473 -238041 -154554 -462018 -328848 -197876 -70501 -140401 -417097
1488 -417097 -235931 -105539 -529762 -318313 -450834 -282449 -404704 -322807 -285045 -382201
1478 -382201 -452328 -449610 -470534 -665428 -384716 -456053 -233517 -174549 -54299 -142905 -275825
1467 -275825 -445001 -288644 -449988 -244173 -378981 -303566 -135287 -448709 -357259 -195966
1457 -195966 -556017 -454776 -62127 -394529 -470659 -323934 -252368 -379927 -149289 -198645
1447 -198645 -198417 -310939 -365247 -172074 -522331 -114582 -243707 -241448 -166135 -368092 -445195
1436 -445195 -81561 -42992 -492437 -414323 -335210 -512175 -569466 -406853 -170346 -398700
1426 -398700 -347451 -28852 -313447 -47860 -347520 -528061 -227331 -346064 -223123 -186948
1416 -186948 -395004 -224004 -300776 -72537 -497244 -619119 -443076 -327832 -422634 -523958
1406 -523958 26702 -278636 -165471 -349637 -242075 -208379 -339422 -355610 -380215 133294
1396 133294 -472161 -574806 -411169 -358930 -119256 -593392 -272899 -232256 -256544 -521971
1386 -521971 -200019 -251738 -284401 -251578 -275028 -168870 -178734 -128774 -296362 -169268 -80262
1375 -80262 -110291 90371 -270545 -61995 -33237 -127402 -269888 -402941 -170060 -112069 -168780
1364 -168780 -398547 -452652 -446920 -425747 -603529 -283954 -491921 -260640 -399356 -611395
1354 -611395 -457954 -229390 -356109 -306721 -394037 -481537 -307867 -80031 -375427 -212364
1344 -212364 -187387 10769 -164338 -255229 -481819 -418435 -261775 -147255 -470777 -291797
1334 -291797 -469441 -431821 -375485 -151701 -350211 -460002 -246898 -68183 -100768 -343643
1324 -343643 -245653 -197787 -416502 -85223 -430324 -374474 -545278 -449063 56910 -259269
1314 -259269 -348644 -49299 -217592 -366089 -58194 -230591 -603247 -177750 -424446 -355334
1304 -355334 -191686 -294292 -265664 -517149 -259454 -569208 -119025 -301120 29208 -169776
1294 -169776 -401313 -181171 -347803 -229237 -439618 -294803 -117334 -162896 -406388 -79643
1284 -79643 -547433 -374123 -524941 -337862 -349839 -309641 -178532 -449646 -150143 -128787
1274 -128787 -109092 -423387 -577467 -266744 -261722 -303745 -325617 -387348 -443762 -233507 -87885
1263 -87885 -371212 -309669 -186309 -195935 -146556 -42047 -421034 -621842 -399184 -157986 -371515
1252 -371515 -197380 -551290 -299742 -456304 -223063 -256475 -376091 -191273 -48730 -213019
1242 -213019 -369002 -193667 -66854 -131599 -81709 -516390 -287842 -54482 -263349 -350086
1232 -350086 -335009 -86402 -596920 -467115 -322050 -471098 -384900 -108295 -385457 -16210
1222 -16210 -401083 -213476 -55051 -141746 -205208 -315465 -264778 -176633 -368183 -142402 -95330
1211 -95330 -182808 -296208 -115829 -164789 -94671 -266176 -344207 -250308 -235813 -469163 -366967
1200 -366967 -272761 -259810 -60016 -169823 -153597 -267221 -272826 -449576 -453572 -327720 -97659
1189 -97659 -304780 -492825 -296653 -148817 -287475 -283408 -13003 -436021 -309172 -519686
1179 -519686 -273972 -527955 -285476 -431995 -188134 -394033 -307422 -411300 -267728 -191940
1169 -191940 -241516 -167689 -205122 -534835 -132604 -46112 -84389 -529473 -204590 -181496 -261478
1158 -261478 -109811 -502575 -204844 -93246 -127772 -473471 -393458 -382438 -337260 -440521
1148 -440521 -18761 -145789 -299968 -209853 -181151 -262854 -193647 -344868 -384792 -436467 -393883
1137 -393883 -258331 -321648 -361396 -254546 -368456 -278058 -15415 -376014 -69957 -427280
1127 -427280 -514690 -209702 -39047 -263782 -233058 -212265 -286557 -187966 -553086 -134416 -299015
1116 -299015 -487811 -98918 -335355 -341321 -490316 -455869 -278043 -580158 -244160 -413575
1106 -413575 -228538 -406317 -280558 -375939 -328641 -257973 -319866 -107824 -430509 -141850
1096 -141850 -284550 -128784 -480334 -63134 -81228 -163762 -205199 -509371 -478570 -313726
1086 -313726 -192726 -214514 -276736 -212057 -330863 -349782 -342533 -292834 -355879 -226261 -185774
1075 -185774 -420402 -376641 -258390 -328891 -392063 -377944 -382347 -319592 -125642 -267429 -438404
1064 -438404 -399680 -151310 -196086 -337866 -476600 -191445 -400088 -306348 -299207 -368169 -411296
1053 -411296 -316564 26875 -387438 -401853 -203579 -351337 -321575 -359196 -113533 -76965 -393121
1042 -393121 -163415 -117144 -245746 -498760 -230263 -171962 -231166 -319060 -380702 -279011 -311903
1031 -311903 -199480 -395229 -309548 -167888 -261156 -262787 -489562 -280881 -335993 -299892 -364525
1020 -364525 -231661 -231655 -159948 -477411 -127371 -326559 -422171 -311471 -277105 -331196 -15340
1009 -15340 -415620 -235762 -121587 -109087 -358852 21453 -311414 -299141 -394165 -285651
999 -285651 -323880 -213590 -389937 -297219 -252450 -270513 -118055 -383245 -347984 -294077 -287993
988 -287993 -163503 -176375 -203750 -200323 -436255 -142992 -368062 -443900 -492596 -214374 -372876
977 -372876 -180125 -286711 -468729 -207123 -350714 -241901 -345116 -222034 -197909 -195582
967 -195582 -230618 -43803 -449541 -294818 -271258 -475020 -650450 -261780 -18314 -133898
957 -133898 -502316 -440847 -146133 -233683 -213846 -360807 -198732 -366293 -250229 -424153
947 -424153 -331859 -291543 -252902 -66968 -308051 -269531 -444988 -432508 -383858 -276519 -321029
936 -321029 -441811 -400127 -336487 -394451 -211768 -471905 -226816 -378157 -454645 -267380 -82889
925 -82889 -278512 -193295 -393673 -438751 -398015 -390085 -353516 -313620 -348270 -102580 -508452
914 -508452 -377015 -398404 -234769 -215531 -532579 -502175 -279248 -382569 -350147 -188197 -479658
903 -479658 -403635 -359810 -313718 -176495 -266773 -393214 -194195 -722047 -415790 -446340 -373877
892 -373877 -472314 -318062 -52610 -145433 -302757 -291090 -431522 -298562 -315953 -263414 -220350
881 -220350 -205419 -47960 -156270 -202423 -305244 -219200 -239135 -455541 -308372 69193 -180262
870 -180262 -291697 -153241 -43006 -261182 -87720 -333847 -91719 -106212 -413196 -140745
860 -140745 -19694 -545817 -298331 -216430 -243032 -370837 -267971 -373628 -364531 -68324 -458391
849 -458391 -437616 -580928 -161130 -156914 -161000 -238270 -301088 -82152 -394461 -313856 -573602
838 -573602 -199091 -307469 -17312 -404920 -375222 -191951 -385997 -316541 -254124 -75954
828 -75954 -286405 -246279 -290944 -112849 -504429 -291118 -169333 -304368 -79138 -378021
818 -378021 -394458 -312036 -212555 -276334 -384730 -335974 -422400 -300922 -311506 55972 -154760
807 -154760 -326789 -63505 -319036 -525276 -245354 -214229 -191016 -321793 -349396 -35937
797 -35937 -196399 42901 -281215 -264693 -370709 -195832 -596091 -285877 -337971 -452714
787 -452714 -473552 -495174 -677546 -266874 -70612 -283105 -206478 -484675 -306888 -124479
777 -124479 -154040 -439652 -354982 -391238 -118335 -7280 -249527 -181052 -271056 -400754 -185138
766 -185138 -351689 -103977 -344114 -307446 -117731 -408228 -351074 -288566 -494151 -541511 -217075
755 -217075 -401476 -370447 -367843 -279382 -167480 -81408 -620046 -405002 -543142 -323511 -255159
744 -255159 -384415 -21757 -378442 -364125 -291401 -118897 -253041 -239134 -350770 -272662 -417732
733 -417732 -307469 -107306 -416091 -318990 -354674 -106503 -275626 -299840 -352468 -421048 -264413
722 -264413 -342226 -14701 -200981 -282763 -212834 -558230 -92637 -300822 -291011 -405057 -204173
711 -204173 -251551 -608439 -280803 -527239 -130017 -389545 -250973 -249615 -174516 -317464 -190230
700 -190230 -316658 -270868 -362126 -366197 -205185 -320858 -122243 -410331 -455852 -301156 -282334
689 -282334 -387916 -62916 -172128 -458956 -386294 -317039 -193035 -418055 -120006 -182548
679 -182548 -490611 -412791 -183072 -569934 -262542 -453377 -269654 -364242 -150500 -131884
669 -131884 -334204 -206218 -461621 -206260 -369818 -184660 -231388 -231919 -441477 -449963 -373126
658 -373126 -421185 -335458 -403145 -523094 -396776 -184315 -249919 -528409 -263625 -319212 -265408
647 -265408 -673804 -259775 -426915 -493428 133873 -328585 -158217 -193470 -292556 -405
637 -405 -110937 -422394 -200515 -340492 -415498 -415579 -228456 -120882 -364990 -328960 -591960
626 -591960 72056 -292998 -212522 -185792 -343046 -353111 -372625 -129868 -195415 -411274 -298662
615 -298662 -113151 -232952 -431284 -218413 -459717 -396010 -165184 -107781 -276823 -570483
605 -570483 -346443 -324941 -416299 -412637 -418746 -547067 -395553 -237169 -205711 -371226 -233128
594 -233128 -104599 -244188 -605701 -684435 -523141 -494140 -527392 -229783 -135307 -380558 36175
583 36175 -351160 -243084 -186663 -269964 -568246 -188858 -375927 -254795 -573046 -190480
573 -190480 -78218 -491240 -329371 -356035 -241383 -518184 -240801 -419556 -274693 -450822
563 -450822 -223729 -256178 -370876 -236127 -381372 -105428 -269688 -197374 -151618 -197403 -410810
552 -410810 -321858 -457510 -302225 -131111 -351748 -296192 -267160 -247190 -478498 -445099 -260872
541 -260872 -178603 -326530 -184633 -373691 -335787 -370511 -428530 -621073 -602183 -349500 -226245
530 -226245 -577258 -490890 -516112 -206998 -695776 -320365 -296250 -359437 -244389 -184364 -343999
519 -343999 -369554 -427828 -329554 -336766 41357 -361524 -502013 -132050 -250066 -481904 -80090
508 -80090 -192093 -228810 -249090 -229347 -254233 -322458 -241034 -204512 -110077 -396401 -329175 -298677
496 -298677 -418684 -255954 -501563 -400238 -371317 -453213 -471813 -407583 -238873 -484301 -190118
485 -190118 -369047 -142391 -204614 -216322 -369858 -169643 -177878 -357868 -485486 -446562 -336801
474 -336801 -551103 -450687 -262318 -426435 -220603 -204969 -210773 -90345 -175104 -351861 -113612
463 -113612 -352021 -103642 -155201 -344928 -362147 -388232 -546098 -445883 -151590 -485420
453 -485420 -338374 -63431 -233732 -357931 -311808 -265924 -316808 -302362 -388599 -160379 -184448
442 -184448 -248504 -289454 -60196 -635472 -144017 -329163 -184990 -208524 -257719 -427441 -335701
431 -335701 -535270 -471481 -378531 -349784 -603258 -182900 -64805 -630642 -644685 -145611 -231036
420 -231036 -450564 -115482 -438296 -170410 -364827 -243172 -353201 -330543 -340264 -601187
410 -601187 -206433 -247936 -389658 -322372 -260249 -231815 -250373 -126231 -452528 -436584 -477066
399 -477066 -430719 -328390 -271809 -485306 -513165 -223032 -388511 -312227 -333516 -420119 -346323
388 -346323 -317376 -111606 -145929 -150619 -439787 -181420 -247573 -286354 -330306 -442740 -307810
377 -307810 -248129 -441600 -151739 -177112 -309019 -318858 -313950 -475249 -606004 -1499 -299712
366 -299712 -641581 -642484 -161977 -84573 -265285 -416466 -350724 -409968 -367613 5664 -262354
355 -262354 -446287 -472550 -326226 -139358 -475420 -317093 -256865 -255942 -494002 -284435 -302274
344 -302274 -379834 -446870 -328531 -354257 -252695 -162633 -509510 -481388 -389889 -54572 -98786
333 -98786 -57556 -151517 -237792 -606534 -70327 -178616 -400964 -376896 -497585 -288395 -356027
322 -356027 -175427 -379680 -241546 -93186 -39470 -293174 -200557 -349066 -487968 -99091
312 -99091 -429370 -191114 -220219 -214754 -474776 -238581 -447175 -83254 -339906 -438698 -412522
301 -412522 -183011 -353087 -173589 -373894 -91728 -304475 -317636 -440185 -522972 -249411
291 -249411 -206109 -199446 -383197 -251653 -462206 -418956 -211755 -318456 -460753 -93852 -107299
280 -107299 -522407 -380373 -230528 -547856 -488532 -399943 -268451 -232619 328685 -475859
270 -475859 -367873 -462560 -600687 -333771 -572924 -134420 -205856 -310914 -237987 -222097 -424634
259 -424634 -331870 -308310 -276067 -425545 -351417 -461070 -346531 -576722 -254100 -130713 -125699
248 -125699 -257039 -494133 -282412 -205238 -393445 -560926 -330671 -292794 -389744 -294137 -766787
237 -766787 -124759 -570094 -255205 -240201 -394290 -468574 -285179 -374513 -243248 -313725 -434250
226 -434250 -117220 -656364 -436686 -280307 -310109 -286974 -170087 -309181 -469752 -284701
216 -284701 -348960 -467120 -395691 -317704 -444088 -330951 -187078 -388018 -390831 -496020 -386501
205 -386501 -475900 -253621 -494499 -350584 -97928 -196527 -376831 -393909 -220767 -508865
195 -508865 -308213 -291329 -533742 -316571 -318792 -414587 -211496 -605078 -352593 -357432 -405602
184 -405602 -453345 -463809 -568256 -263131 -192667 -269568 -62525 -582413 -252414 21304 -579920
173 -579920 -389837 -381406 -263629 -445808 -379726 -394822 -293775 -358032 -280103 -378659 -544605
162 -544605 -315621 -440382 -252858 -277920 -198588 -371084 -378235 -281374 -468232 -252488 -364816
151 -364816 -199479 -600826 -547174 -236461 -554655 -145461 -375008 -686478 -288815 -462835
$$ [...]
##END NTUPLES=NMR SPECTRUM
##END=
