##TITLE=1H BAU-KUSOV-1
DMSO CD3OH
24.09.10
##JCAMPDX= 6.0         $$ Bruker NMR JCAMP-DX V2.0
##DATA TYPE= NMR SPECTRUM
##DATA CLASS= NTUPLES
##ORIGIN= UXNMR, Bruker Analytische Messtechnik GmbH
##OWNER= root
$$ TOPSPIN		Version 1.3
$$ 2026-06-07 09:08:44.640 +0400  servis@DPX200
$$ Compression mode = diff/dup
##.OBSERVE FREQUENCY= 200.1305999994
##.OBSERVE NUCLEUS= ^1H
##.ACQUISITION MODE= SIMULTANEOUS
##.ACQUISITION SCHEME= undefined
##.AVERAGES= 32
##.DIGITISER RES= 18
##SPECTROMETER/DATA SYSTEM= spect
##.PULSE SEQUENCE= zg30
##.SOLVENT NAME= DMSO
##.SHIFT REFERENCE= INTERNAL, DMSO, 1, 11.60086
##AUDIT TRAIL= $$ (NUMBER, WHEN, WHO, WHERE, WHAT)
$$ ##TITLE= Audit trail, TOPSPIN		Version 1.3
$$ ##JCAMPDX= 5.01
$$ ##ORIGIN= Bruker BioSpin GmbH
$$ ##OWNER= servis
$$ $$ C:/Bruker/TOPSPIN/data/ira/nmr/1H/1/pdata/1/auditp.txt
$$ ##AUDIT TRAIL=  $$ (NUMBER, WHEN, WHO, WHERE, VERSION, WHAT)
(   1,<2026-06-07 09:04:55.406 +0400>,<servis>,<DPX200>,<TOPSPIN 1.3>,
      <created by zg
	started at 2026-06-07 09:01:57.140 +0400,
	POWCHK disabled, PULCHK disabled
       configuration hash MD5:
       BE 6D 3F 07 2A EA 11 49 91 17 2B D3 AF B3 58 0D
       data hash MD5: 16K
       B7 8A 3C 31 3A F5 36 B7 FC EA BE E4 ED 66 F7 64>)
(   2,<2026-06-07 09:05:04.406 +0400>,<servis>,<DPX200>,<TOPSPIN 1.3>,
      <Start of raw data processing
       efp BC_mod = 2 LB = 0.2 FT_mod = 6 PKNL = 1 PHC0 = -979.134 PHC1 = -311.0004 SI = 16K 
       data hash MD5: 16K
       96 20 16 4E 4D 91 68 34 35 78 9B 9F 67 95 91 99>)
$$ ##END=
$$ 
$$ $$ hash MD5
$$ $$ ED 77 3B 8B C5 6F 59 E0 4B 12 E1 3E 00 8A 9A C9
##$RELAX= 
##$RELAX= 
##$RELAX= 
##$RELAX= 
##$RELAX= 
##$RELAX= 
##$RELAX= 
$$ Bruker specific parameters
$$ --------------------------
##$DU= <C:/Bruker/TOPSPIN>
##$EXPNO= 1
##$NAME= <1H>
##$PROCNO= 1
##$TYPE= <nmr>
##$USER= <ira>
##$AMP= (0..31)
100 100 100 100 100 100 100 100 100 100 100 100 100 100 100 100 100 100 
100 100 100 100 100 100 100 100 100 100 100 100 100 100 
##$ANAVPT= -1
##$AQSEQ= 0
##$AQ_mod= 1
##$AUNM= <au_zg>
##$AUTOPOS= <>
##$BF1= 200.13
##$BF2= 200.13
##$BF3= 200.13
##$BF4= 200.13
##$BF5= 200.13
##$BF6= 200.13
##$BF7= 200.13
##$BF8= 200.13
##$BYTORDA= 1
##$CFDGTYP= 0
##$CFRGTYP= 5
##$CHEMSTR= <none>
##$CNST= (0..63)
1 1 145 1 1 1 1 1 1 1 1 1 1 1 1 1 1 1 1 1 1 1 1 1 1 1 1 1 1 1 1 1 1 1 
1 1 1 1 1 1 1 1 1 1 1 1 1 1 1 1 1 1 1 1 1 1 1 1 1 1 1 1 1 1 
##$CPDPRG= <>
##$CPDPRG1= <>
##$CPDPRG2= <>
##$CPDPRG3= <>
##$CPDPRG4= <mlev>
##$CPDPRG5= <mlev>
##$CPDPRG6= <mlev>
##$CPDPRG7= <mlev>
##$CPDPRG8= <mlev>
##$CPDPRGB= <>
##$CPDPRGT= <>
##$D= (0..63)
0 3 0 0 0 0 0 0 0 0 0 0 0 0 0 0 0 0 0 0 0 0 0 0 0 0 0 0 0 0 0 0 0 0 0 
0 0 0 0 0 0 0 0 0 0 0 0 0 0 0 0 0 0 0 0 0 0 0 0 0 0 0 0 0 
##$DATE= 1780808693
##$DBL= (0..7)
120 120 120 120 120 120 120 120 
##$DBP= (0..7)
150 150 150 150 150 150 150 150 
##$DBP07= 0
##$DBPNAM0= <>
##$DBPNAM1= <>
##$DBPNAM2= <>
##$DBPNAM3= <>
##$DBPNAM4= <>
##$DBPNAM5= <>
##$DBPNAM6= <>
##$DBPNAM7= <>
##$DBPOAL= (0..7)
$$ [...]
##$SUBNAM9= <"">
##$SW= 16.9726125362387
##$SWIBOX= (0..15)
0 0 3 0 0 0 0 0 0 0 0 0 0 0 0 0 
##$SW_h= 3396.73913043478
##$TD= 16384
##$TD0= 1
##$TE= 300
##$TE2= 300
##$TE3= 300
##$TEG= 300
##$TL= (0..7)
120 120 120 120 120 120 120 120 
##$TP= (0..7)
150 150 150 150 150 150 150 150 
##$TP07= 0
##$TPNAME0= <>
##$TPNAME1= <>
##$TPNAME2= <>
##$TPNAME3= <>
##$TPNAME4= <>
##$TPNAME5= <>
##$TPNAME6= <>
##$TPNAME7= <>
##$TPOAL= (0..7)
0.5 0.5 0.5 0.5 0.5 0.5 0.5 0.5 
##$TPOFFS= (0..7)
0 0 0 0 0 0 0 0 
##$TUNHIN= 0
##$TUNHOUT= 0
##$TUNXOUT= 0
##$USERA1= <user>
##$USERA2= <user>
##$USERA3= <user>
##$USERA4= <user>
##$USERA5= <user>
##$V9= 5
##$VALIST= <valist>
##$VCLIST= <CCCCCCCCCCCCCCC>
##$VD= 0
##$VDLIST= <DDDDDDDDDDDDDDD>
##$VPLIST= <PPPPPPPPPPPPPPP>
##$VTLIST= <TTTTTTTTTTTTTTT>
##$WBST= 1024
##$WBSW= 4
##$XGAIN= (0..3)
0 0 0 0 
##$XL= 0
##$YL= 0
##$YMAX_a= 189849
##$YMIN_a= -360928
##$ZGOPTNS= <>
##$ZL1= 120
##$ZL2= 120
##$ZL3= 120
##$ZL4= 120
##$ABSF1= 0
##$ABSF2= 0
##$ABSG= 0
##$ABSL= 0
##$ALPHA= 0
##$AQORDER= 0
##$ASSFAC= 0
##$ASSFACI= 0
##$ASSFACX= 0
##$ASSWID= 0
##$AUNMP= <proc_1d>
##$AXLEFT= 0
##$AXRIGHT= 0
##$AXTYPE= 0
##$AXUNIT= <>
##$AZFE= 0.1
##$AZFW= 0.1
##$BCFW= 0
##$BC_mod= 2
##$BYTORDP= 0
##$COROFFS= 0
##$CY= -3
##$DATMOD= 1
##$DC= 0
##$DFILT= <>
##$DTYPP= 0
##$F1P= 0
##$F2P= 0
##$FCOR= 1
##$FTSIZE= 16384
##$FT_mod= 6
##$GAMMA= 0
##$GB= 0
##$INTBC= 1
##$INTSCL= 3.024016e-009
##$ISEN= 128
##$LB= 0.2
##$LEV0= 0
##$LPBIN= 0
##$MAXI= 14.27885
##$MC2= 0
##$MEAN= 0
##$ME_mod= 0
##$MI= 1.005453
##$NCOEF= 0
##$NC_proc= -8
##$NLEV= 6
##$NOISF1= 3.799351
##$NOISF2= 2.8
##$NSP= 0
##$NTH_PI= 0
##$NZP= 0
##$OFFSET= 11.60086
##$PC= 4
##$PHC0= -979.134
##$PHC1= -311.0004
##$PH_mod= 1
##$PKNL= yes
##$PPARMOD= 0
##$PPDIAG= 0
##$PPIPTYP= 0
##$PPMPNUM= 100
##$PPRESOL= 1
##$PSCAL= 0
##$PSIGN= 0
##$REVERSE= no
##$SF= 200.129976689336
##$SI= 16384
##$SIGF1= 3
##$SIGF2= 2
##$SINO= 400
##$SIOLD= 16384
##$SREGLST= <1H.CDCl3>
##$SSB= 0
##$STSI= 16384
##$STSR= 0
##$SW_p= 3396.73913043479
##$SYMM= 0
##$S_DEV= 0
##$TDeff= 16384
##$TDoff= 0
##$TI= <>
##$TILT= no
##$TM1= 0
##$TM2= 0
##$TOPLEV= 0
##$USERP1= <user>
##$USERP2= <user>
##$USERP3= <user>
##$USERP4= <user>
##$USERP5= <user>
##$WDW= 1
##$XDIM= 16384
##$YMAX_p= 535704735
##$YMIN_p= -28936201
$$ End of Bruker specific parameters
$$ ---------------------------------
##NTUPLES= NMR SPECTRUM
##VAR_NAME=  FREQUENCY,     SPECTRUM/REAL,   SPECTRUM/IMAG
##SYMBOL=    X,             R,               I
##VAR_TYPE=  INDEPENDENT,   DEPENDENT,       DEPENDENT
##VAR_FORM=  AFFN,          ASDF,            ASDF
##VAR_DIM=   16384,         16384,           16384
##UNITS=     HZ,            ARBITRARY UNITS, ARBITRARY UNITS
##FACTOR=    0.207333158178282, 1,           1
##FIRST=     3396.73913043479, -530324,      765131
##LAST=      0,             -1044728,        186325
##MIN=       0,             -28936201,       0
##MAX=       3396.73913043479, 535704735,    0
$$ Real data points
##PAGE= N=1
##DATA TABLE= (X++(R..R)), XYDATA
$$ [...]
9554b1603964J92776p14813L19363L21811P97993L60555m46914Q3036M74216J32466
9544b0083475N3212K82227r98025m44768L1204l25345L59703n212k75229Q9575
9534b1316133k23389O21884j41043l61195j77012n35645L77120K30110r4810M8144
9524b1571969q541L79785M17248k51807R2362r4872r3359K7249K72075K06805
9514b0625024l56012L29283k593L24746M8941n82554K60324L02504k85123N32616
9504b0052892N3835l40285L85840m679j36750J80017J70133m58203N88800J11755
9494a9502429K50653M65362k59638Q4966J41556P9776j27972m7145k49230M9350
9484a9114751P72561N7694P4851K40727j04061Q2064M56264l65874r3905M48710
$$ y = [-21603964, -21411188, -22126001, -21806638, -21484827, -20686834, -20326279, -20773193, -20690157, -20215941, -20083475, -20030263, -19748036, -20746061, -21190829, -21159625, -21484970, -21125267, -21130479, -21405708, -21316133, -21539522, -20917638, -21058681, -21419876, -21596888, -22132533, -21755413, -21525303, -21620113, -21571969, -21580510, -21200725, -20783477, -21035284, -20942922, -21037794, -21131153, -21103904, -20831829, -20625024, -20981036, -20651753, -20654346, -20329600, -20280659, -20863213, -20602889, -20300385, -20585508, -20052892, -19999057, -20339342, -19953502, -19958181, -20094931, -19914914, -19744781, -20202984, -19614184, -19502429, -19251776, -18786414, -19046052, -18961086, -18819530, -18739754, -18867726, -18914871, -19164101, -19114751, -18342190, -18284496, -18209645, -17968918, -18072979, -17990915, -17534651, -17900525, -17994430, -17545720]
9474a7545720K20959L41267J45045J77298Q1821o1382N32269L83397j31000M8840
9464a5807206l26455K35679Q64065R8782O9492L9812K06157N06698K12531K1305
9454a3879140L63355J7894k23056P66642j30366K81132N14904J34059P62156R4981
9444a1297439J16510o1189N52067N44168P46661O71172n9628M43923J053334P44450
9434f545971J010955O29232O46665J165985R36436J311723J201081J640125J219518
9425C215749J873864J960376J297386K006923J510860J600548K095204J656279
9417A7217189J734105J402113J790142J276942J684309J451439M46011R85826
9409B7988076R7223r8141o54781p77575r85482j896541j430749j835784k136899
$$ y = [-17545720, -17324761, -16983494, -16838449, -16661151, -16579330, -16640712, -16108443, -15725046, -15856046, -15807206, -16133661, -15897982, -15033917, -14935135, -14865643, -14825831, -14619674, -14112976, -13900445, -13879140, -13515785, -13497891, -13720947, -12954305, -13084671, -12803539, -12288635, -12154576, -11392420, -11297439, -11180929, -11242118, -10690051, -10145883, -9399222, -8728050, -8787678, -8343755, -7290421, -6545971, -5535016, -4905784, -4259119, -3093134, -2156698, -844975, 356106, 1996231, 3215749, 5089613, 7049989, 8347375, 10354298, 11865158, 13465706, 15560910, 17217189, 18951294, 20353407, 22143549, 23420491, 25104800, 26556239, 27002250, 27988076, 28085299, 27987158, 27332377, 26554802, 25569320, 23672779, 22242030, 20406246, 18269347]
9400A8269347j672573k255225j961609j433955j433471r01043j198674n29800
9392F882997n71476m89722l82138m42821j77982n37466O81677J6629M11179N33328
9382E924205M3029Q20673Q46297J033641L24034P68520J163676J108311J627934
9373A3660320J869291K115573J470139J760288K326747J919053K548995K096701
9365B9767107K757483K728113L184635L481298K843924L127565L471414K428759
9357E3790298K940635K770497K037515K539559J792645J748868J307586R30854
9349F9858457P93116L96919L08575l90367n00170k68332q09124q58422j111066
9340F7419586r75396j254401j036568j107619r78362j153306j293562j231815
$$ y = [18269347, 16596774, 14341549, 12379940, 10945985, 9512514, 8611471, 7412797, 6882997, 6311521, 5821799, 5439661, 4996840, 4818858, 4281392, 4963069, 4979698, 5390877, 5924205, 5967234, 6787907, 7634204, 8667845, 8991879, 9760399, 10924075, 12032386, 13660320, 15529611, 17645184, 19115323, 20875611, 23202358, 25121411, 27670406, 29767107, 32524590, 35252703, 38437338, 41918636, 44762560, 47890125, 51361539, 53790298, 56730933, 59501430, 61538945, 64078504, 65871149, 67620017, 68927603, 69858457, 70651573, 71048492, 71357067, 70966700, 70466530, 70198198, 69389074, 68530652, 67419586, 66444190, 65189789, 64153221, 63045602, 62067240, 60913934, 59620372, 58388557]
9332E8388557j127201j200959l53750j007817j170877j00836r6911p9065M94831
9323E3745972j57248P5867O10410J052222R22614J207683J169774J275446J952333
9314F1855073J374578K034845P45145J130183J521194J154048J528185J201477
9306G2544728Q79529O31435N48046Q62644J73816l03456l25261m39509j42128
9297G4429844k39408p40316o45499l69152r3948n15508m85511M4642j147426l89427
9287F9848291J58565k17188M98716j18886M62743M44669O46528P75961N50527
9278G3049926L16162O32643J356594J002059J053517J096708P32028J438341J438487
9269H2116465R74026Q09175P19423P63368J200801Q48763O38718R15616J46477
$$ y = [58388557, 57261356, 56060397, 55706647, 54698830, 53527953, 53427117, 53330206, 53251141, 53745972, 53588724, 53664591, 54275001, 55327223, 56249837, 57457520, 58627294, 59902740, 61855073, 63229651, 65264496, 66009641, 67139824, 68661018, 69815066, 71343251, 72544728, 73424257, 74055692, 74603738, 75466382, 75640198, 75336742, 75011481, 74571972, 74429844, 74190436, 73450120, 72804621, 72435469, 72341521, 71826013, 71340502, 71385144, 70237718, 69848291, 70006856, 69789668, 70288384, 70169498, 70632241, 71076910, 71723438, 72499399, 73049926, 73366088, 73998731, 75355325, 76357384, 77410901, 78507609, 79239637, 80677978, 82116465, 83090491, 83899666, 84619089, 85382457, 86583258, 87432021, 88070739, 88986355, 89132832]
9260H9132832K62434K22843l99883m8341k43644j628099p09126j591180k152681
9251H2845155k124188k981341l009483l652267l018223m064681l865808l391454
9243E6737710l905181l137456l941136l372583l113391k872778k335168k537395
9235C1522622j686777j641135j917299j279530j639021j095687r24207p98046
9227B0540920k96406r96955l40431k76049n48556l12297q48147r36997q78603
9218A5106479k46054n14108m85418l57933q52376p05525k9230k93028j09409n3043
9208A1460355l6490K10528O72925O67101Q27034J302802R31398J578994J484624
9199A9099271R66053Q87356P66127M07136j57964l4907o21056p87919q11480j530856
$$ y = [89132832, 89395266, 89618109, 89218226, 89169885, 88926241, 87298142, 86589016, 84997836, 82845155, 80720967, 77739626, 74730143, 71077876, 68059653, 63994972, 60129164, 56737710, 52832529, 49695073, 45753937, 42381354, 39267963, 36395185, 34060017, 31522622, 29835845, 28194710, 26277411, 24997881, 23358860, 22263173, 21338966, 20540920, 20244514, 19247559, 18907128, 18631079, 18082523, 17770226, 16922079, 15985082, 15106479, 14860425, 14346317, 13860899, 13502966, 12650590, 11945065, 11915835, 11622807, 11513398, 11460355, 11423865, 11634393, 12307318, 12974419, 13801453, 15104255, 16035653, 17614647, 19099271, 20065324, 20952680, 21718807, 22125943, 21967979, 21933072, 21312016, 20524097, 19712617, 18181761]
9189A8181761r96053k136410k515501j545830j939799j356090j465001r88390
9181E238687r44747j138191m82589q32011p14013q67918o8984l27146l69999M2019
9171d64892l43595j61721K51240R5910j27558l66645k91894l05138L07524o7910
9161a474679o47085O8233n45445p79400l79807p48026m66354j222583n89849j31600
9151f916595p29877K15152m85649p55872m26603q43542m10980m80778o56913k16427
9141a1708084l95055J30065p9601k77824o05770o66926k18277q9281o27459J00977
9131a4437235j002701j40699O59811l93243Q887n54510m06754M9516k13669j42887
9121a6573484J12902m84665l70905k6312j5864K35859N4802l39125m41690J84547
$$ y = [18181761, 17185708, 15049298, 12533797, 10987967, 9048168, 7692078, 6227077, 5238687, 4293940, 3155749, 2673160, 1841149, 1127136, 259218, 190234, -136912, -506911, -464892, -808487, -970208, -718968, -623058, -750616, -1117261, -1409155, -1714293, -1406769, -1474679, -2121764, -2053531, -2598976, -3378376, -3758183, -4506209, -4972563, -6195146, -6784995, -6916595, -7646472, -7431320, -7916969, -8672841, -9099444, -9942986, -10353966, -10834744, -11491657, -11708084, -12103139, -11973074, -12052675, -12330499, -12936269, -13603195, -13821472, -13910753, -14538212, -14437235, -15439936, -15580635, -14920824, -15314067, -15305180, -15859690, -16266444, -16216928, -16430597, -16573484, -16460582, -16945247, -17316152, -17342464, -17358328, -17122469, -17067667, -17406792, -17848482, -17663935]
9111a7663935K90714j82561j4712n04619j3717J70324k64636j46132l47215j07116
9101a8783605J21378J82778K52370m23086r4096M7620K19288L08301j69889n25573
9091a8864514l10560l33066R96365J05080l44911J3199l12388K97476M32350k84270
9081a8605239j94590o00135J61092L84189J93276J28548n59481J47774K62224
9072a8682342j42609M7872n49783l7441M7447R651O55311j01521k31604J41917
9062a8843102K4048N9329J43266m34746K54420J39476J82589m3405J76560J6189
9052a8325376N7900l36018q7201J62194J08337M22355k69326K00717J60501j65900
9042a8071817K51757j32850J30687k04445K10558L88873j45951K14805m21151
$$ y = [-17663935, -17373221, -17555782, -17570494, -18075113, -18088830, -17918506, -18183142, -18329274, -18676489, -18783605, -18662227, -18479449, -18227079, -18650165, -18744261, -18696641, -18477353, -18169052, -18338941, -18864514, -19175074, -19508140, -18511775, -18406695, -18751606, -18738407, -19050795, -18753319, -18320969, -18605239, -18799829, -19399964, -19238872, -18854683, -18661407, -18532859, -19092340, -18944566, -18682342, -18824951, -18777079, -19326862, -19364303, -19316856, -19307205, -18651894, -18753415, -18985019, -18843102, -18819054, -18759725, -18616459, -19051205, -18796785, -18657309, -18474720, -18518125, -18341565, -18325376, -18267476, -18603494, -18690695, -18528501, -18420164, -17997809, -18267135, -18066418, -17905917, -18071817, -17820060, -17952910, -17822223, -18026668, -17816110, -17427237, -17573188, -17358383, -17779534]
9033a7779534J75422m01549l77101K04464J26312K65954N3680K80220J62334q0427
9023a7370225k63190O1119m236j84405J2994K28551O2278M59480M56354j02501
9013a6643781j68885j88695J88594r9923l64397N40854J11613j27494j29161L26964
9003a6554311l6418L93215k06415N9327L3721l29962N94888l39828q2126K62158
8993a6205751J92052J35257j59959l52275O7887N18743L39635R1966q752o11354
8983a5992551K52535k50865K21557k32604j9316l1183k2781J105941q7455L80947
8973a4675775l22714l4162J27133O7393L7541L11159l48283O5262K34597N19453
8963a4018396P50632k00360J5983k40700k25576N83056J69605q1456K02839K63730
$$ y = [-17779534, -17604112, -18005661, -18382762, -18178298, -18051986, -17786032, -17732352, -17452132, -17289798, -17370225, -17633415, -17572296, -17576532, -17760937, -17747943, -17519392, -17457114, -16997634, -16541280, -16643781, -16812666, -17001361, -16812767, -16912690, -17277087, -16736233, -16624620, -16752114, -16881275, -16554311, -16590729, -16197514, -16403929, -16344602, -16310881, -16640843, -16045955, -16385783, -16467909, -16205751, -16013699, -15878442, -16038401, -16390676, -16322789, -15804046, -15464411, -15372445, -15381197, -15992551, -15740016, -15990881, -15769324, -16001928, -16021244, -16052427, -16075208, -14969267, -15056722, -14675775, -14998489, -15032651, -14905518, -14838125, -14800584, -14489425, -14837708, -14772446, -14537849, -14018396, -13267764, -13468124, -13452141, -13692841, -13918417, -13335361, -13165756, -13247212, -13044373, -12780643]
8953a2780643M66594M79310j03436O40513J80694L81472Q36109K8673N47904p9121
8943i401931O89469Q87252J30455J080851j14844N2687M10921k4772O33852l83815
8933f039875l51258K09103l48622J70402K67085n90195J04704l08621O08245J09367
8923f169665l66756j1947m4731P57646K63801O07240M1754Q92008J849100K54291
8913a927259Q14943L39445N36068J048910N56240N33830P80308L21059J157202
8904D160746N10133M20110L63971k81010J23055J69983k90461m12516j108093
8895C655918k51121n46387p56590j37945p21847j379829k98978r359k40645M8527
8885f38256n36411m17093k41912M29969k6594M35157Q06591K48776J057131Q13345
$$ y = [-12780643, -12314049, -11834739, -11938175, -11297662, -11116968, -10735496, -9899387, -9870714, -9322810, -9401931, -8712462, -7825210, -7694755, -6613904, -6728748, -6676061, -6265140, -6289912, -5656060, -6039875, -6391133, -6182030, -6530652, -6360250, -6093165, -6683360, -6578656, -6887277, -6279032, -6169665, -6536421, -6548368, -6593099, -5835453, -5571652, -4964412, -4922658, -4030650, -2181550, -1927259, -1112316, -772871, -236803, 812107, 1368347, 1902177, 2682485, 3003544, 4160746, 4670879, 5090989, 5454960, 5173950, 5297005, 5466988, 5176527, 4764011, 3655918, 3404797, 2858410, 2101820, 1963875, 1242028, -137801, -436779, -446138, -686783, -638256, -1174667, -1591760, -1833672, -1403703, -1430297, -995140, -188549, 60227, 1117358, 1930703]
8875A930703L29232N65618r021K90621R13572k08848O9424K72744k06079K97650
8865D245616K77821q62213o11998j27919q56387l55770l64592j097610m82922
8856b35974n7103l2159J62521l77697k12178k27454N55744L396k67618l39197
8846a027719m96042M47657R51229p3539L00760j98272l25530K66108K75079M91765
8836F11496M72508J65563j81374N3770O32178m59420J28463O58332j97179K67134
8826B151471Q02713P8601L3032J93866l11959J86356L13892r8083K99796N66041
8816D215726K24519M34810L73268J76841L65659p4336m2225K96080j07282N56305
8806F419365O97010M44100K29117K78231O46238K75990m3052J25770J7070P27632
$$ y = [1930703, 2259935, 2825553, 2816532, 3107153, 4020725, 3811877, 3881301, 4154045, 3947966, 4245616, 4523437, 3661224, 3049226, 2921307, 2064920, 1709150, 1344558, 246948, -235974, -293077, -325236, -162715, -540412, -752590, -980044, -424300, -420904, -688522, -1027719, -1523761, -1076104, -124875, -198414, 102346, -95926, -421456, -155348, 119731, 611496, 1084004, 1249567, 1068193, 1121963, 1754141, 1294721, 1423184, 2081516, 1884337, 2151471, 2954184, 3032785, 3065817, 3259683, 2947724, 3134080, 3447972, 3349889, 3649685, 4215726, 4440245, 4875055, 5248323, 5425164, 5790823, 5716487, 5674262, 5970342, 5863060, 6419365, 7116375, 7560475, 7789592, 8067823, 8714061, 8990051, 8946999, 9072769, 9089839, 9817471]
8796I817471Q61421M31275N14196L32548R9191p8439N19798N01549M59144J13032
8786A3571186L58701M55162O34592L04314Q13050K82259k0020L87804O62830P57792
8776A8207670N37314L16002K9834R56080J62907P91146Q56906R9447N41750N37899
8766B3036955O06600R18402M67768Q94781J88079P09004M12056Q57369N51039
8757B8642053j71779J073719M66932J013378J128744M37767L58431L02366R68717
8748C4220328R25968L64370O73806P57574J383089N92336Q48259P28534j01884
8739D0392380J214614J053185P52267J644479N07275O55874J095355J075472K057669
8730E0448570Q49551M91927O64470J122415J326185J139541R24728J259089J330170
$$ y = [9817471, 10678892, 11110167, 11624363, 11956911, 12056102, 11977663, 12497461, 12999010, 13458154, 13571186, 13929887, 14385049, 15019641, 15323955, 16137005, 16419264, 16399244, 16787048, 17449878, 18207670, 18744984, 19060986, 19090820, 20046900, 20209807, 21000953, 21857859, 21957306, 22499056, 23036955, 23643555, 24561957, 25029725, 25924506, 26112585, 26821589, 27233645, 28091014, 28642053, 28470274, 29543993, 30010925, 31024303, 32153047, 32590814, 32949245, 33251611, 34220328, 35146296, 35510666, 36184472, 36942046, 38325135, 38917471, 39765730, 40494264, 40392380, 41606994, 42660179, 43412446, 45056925, 45564200, 46220074, 47315429, 48390901, 50448570, 51298121, 51790048, 52454518, 53576933, 54903118, 56042659, 56967387, 58226476, 59556646]
8721E9556646R42905J636739R79772J630758J354183N34188J779310J384617J164712
8712G0963830J474151R95483J804097J554935J739992K060461J334450J933586
8704H3860985J663053J700427J812718J296258K071760J919576J999999K437039
8696I8761815K230185K118967J854892K324841K122459K139558J833301K025659
8688A15411677K657254K070097K205428K882897K389295L031861K952491K293960
8680A35894960K713241K288149K523470L227002L004983L010451L112880L781035
8672A59556171L645878L201946L629610L022103L767115L942426L443932M101474
8664A88310655M131075L998440L895978M352185M421281L957100M388206M226175
$$ y = [59556646, 60499551, 62136290, 63116062, 64746820, 66101003, 66635191, 68414501, 69799118, 70963830, 72437981, 73433464, 75237561, 76792496, 78532488, 80592949, 81927399, 83860985, 85524038, 87224465, 89037183, 90333441, 92405201, 94324777, 96324776, 98761815, 100992000, 103110967, 104965859, 107290700, 109413159, 111552717, 113386018, 115411677, 118068931, 120139028, 122344456, 125227353, 127616648, 130648509, 133601000, 135894960, 138608201, 140896350, 143419820, 146646822, 149651805, 152662256, 155775136, 159556171, 163202049, 166403995, 170033605, 173055708, 176822823, 180765249, 184209181, 188310655, 192441730, 196440170, 200336148, 204688333, 209109614, 213066714, 217454920, 221681095]
8656B21681095M053669N140932M828341N236655N531189N418390O006455O589861
8648B64486587O276808P324949P143733O892601P571577O534577O099795N036083
8640C17366710L099703L014807J757022J031712O08047M47083r0754k7997J162418
8631C28368751M36649Q25695L65656P82072J205246N85954J746238P76924M89110
8622C35582295J332199J139754J433468N60942P14479P46038j97541O01201O16247
8613C42529082r90402r37170j676592j206723k205419j909671l115740l135828
8605C27351537l287005k787718l746791k661425k654527n925366n070518m864902
8597B96353285n515129n870590n420767n651881n656175m842034m596467n629433
$$ y = [221681095, 225734764, 230875696, 235704037, 240940692, 246471881, 251890271, 257896726, 264486587, 270763395, 278088344, 285232077, 292124678, 299696255, 306230832, 312330627, 317366710, 320466413, 323481220, 325238242, 326269954, 326878001, 327325084, 327234330, 327206333, 328368751, 328805400, 329631095, 329996751, 330778823, 331984069, 332570023, 334316261, 335093185, 335582295, 336914494, 338054248, 339487716, 340048658, 340763137, 341509175, 341311634, 341912835, 342529082, 341538680, 340601510, 338924918, 337718195, 335512776, 333603105, 330487365, 327351537, 324064532, 321276814, 317530023, 314868598, 312214071, 306288705, 301218187, 296353285, 290838156, 284967566, 279546799, 273894918, 268238743, 263396709, 258800242, 253170809]
8589B53170809n040623m780421m822614m158435m138476n272257m870571m269732
8581B15817680m299656m159874m356813m615707m317055l801787l530731l676619
8573A83059438l709059m282908l722656l490050l936169l687329l375849l404999
8565A53450419k645855l236725l571091k713348k823273l258965k756201l019300
8557A29425661l100374k731353k605456k109705k621762k565654k181418k592877
8549A08917062k002921k462455k749133k449797k598996j799363k385986j830024
8541I0638387k055442k157648j313179k181654k313129j859996j978267j968538
8533G4810534j862248q23495j679321k035311j288852j749001r79105j550282
$$ y = [253170809, 248130186, 243349765, 238527151, 234368716, 230230240, 224957983, 220087412, 215817680, 211518024, 207358150, 203001337, 198385630, 194068575, 190266788, 186736057, 183059438, 179350379, 175067471, 171344815, 167854765, 163918596, 160231267, 156855418, 153450419, 150804564, 147567839, 143996748, 141283400, 138460127, 135201162, 132444961, 129425661, 126325287, 123593934, 120988478, 118878773, 116257011, 113691357, 111509939, 108917062, 106914141, 104451686, 101702553, 99252756, 96653760, 94854397, 92468411, 90638387, 88582945, 86425297, 85112118, 82930464, 80617335, 78757339, 76779072, 74810534, 72948286, 72124791, 70445470, 68410159, 67121307, 65372306, 64393201, 62842919]
8525F2842919j527733j443476j619540j247184j465694j376144j525903j568363
8517E1068882p71230j318430p07242j081173j908561n29898q28752j337173j186771
8508D1399652j223411j410981n61693o47159j045065j192052r09808j071179l42648
8499C2995656n37320q28114j255011p80635q34207o70293l91494o41910o74729
8490B6381943o37348p56056m68000q64530q08308o39788r05985n35945j49832
8481B0616151q30586q14812n42651p02843m43998n19357l51268j154128n94899
8472A4661609q5840k93768o16093n95286o42195n15838o65309l77159o27795m19049
8462I823277l88709o8901m45498m33671j78902o54057l54815l5677l32586m72598
$$ y = [62842919, 61315186, 59871710, 58252170, 57004986, 55539292, 54163148, 52637245, 51068882, 50297652, 48979222, 48271980, 47190807, 45282246, 44752348, 43923596, 42586423, 41399652, 40176241, 38765260, 38203567, 37556408, 36511343, 35319291, 34409483, 33338304, 32995656, 32458336, 31630222, 30375211, 29594576, 28760369, 28090076, 27698582, 27056672, 26381943, 25744595, 24988539, 24520539, 23656009, 22847701, 22207913, 21301928, 20765983, 20616151, 19785565, 18970753, 18428102, 17725259, 17281261, 16761904, 16410636, 15256508, 14661609, 14575769, 14282001, 13665908, 13070622, 12428427, 11912589, 11247280, 10870121, 10242326, 9823277, 9434568, 9365667, 8920169, 8486498, 8307596, 7653539, 7298724, 7263047, 6930461, 6457863]
8452F457863k99406q9047o63609k21073j89213q00643L2405o2325l98895k76733
8442C489324m47875j48240m75378j70038k99888n33477j22697m37813J4683k18855
8432F49746k42232j08876o24115j3906j18726m78282l84079k25713o1188l34725
8422a942096j48114j02490l37866L05621k03534n82820r0019k66599m14849J71579
8412c611187k92469n234k08453l49444k060m4872o9138j07429L0298O6902j21811
8401d714897K72526k69999o62138J22464j31906J40533L80102l80872l47630J35903
8391e455914m2821Q2145N92383m93441p98806N82357L67458M6387K98846l9776
8381d861182l36006K08693j92142O75725j55790o62642K80717l6835K36048P74322
$$ y = [6457863, 6158457, 6069410, 5405801, 5184728, 4995515, 4194872, 4227277, 4164952, 3766057, 3489324, 3041449, 2893209, 2417831, 2247793, 1947905, 1414428, 1291731, 853918, 868601, 649746, 407514, 298638, -325477, -339383, -458109, -936391, -1320470, -1546183, -1607371, -1942096, -2090210, -2192700, -2530566, -2224945, -2428479, -3011299, -3101318, -3367917, -3782766, -3611187, -3903656, -3908890, -4117343, -4466787, -4468847, -4513719, -4582857, -4690286, -4659988, -4593086, -4714897, -4442371, -4712370, -5374508, -5252044, -5383950, -5243417, -4863315, -5244187, -5591817, -5455914, -5498735, -5416590, -4824207, -5317648, -6116454, -5534097, -5166639, -5120252, -4821406, -4861182, -5197188, -4988495, -5180637, -4504912, -4660702, -5323344, -5042627, -5079462, -4843414, -4069092]
8371d069092j25040k3200k29721M94994M12250n9327k1555m3713P32801N89767
8361b341836L59255L37536N99696N51930k79205J115122R25773J43626M85598
8352A897495M54054J414793R35805R04595J407803P76037J015341J607305J481898
8343A1895126J224894J619976J576493J143372J514691J755011J454602J787086
8335B3971251J845082N67917J078922J456427N39930L31980P20275l11896J53379
8326C0353267K82747o67418q74820j009378r30584j274227p33260j424730j505130
8317B2216467j300867j327621o30819j166456j365944j259948o95830m60887k97292
8308A3710803n97700p67097p0872J42253j04427r0792k2419k48600K94390O23794
$$ y = [-4069092, -4194132, -4217332, -4447053, -3952059, -3539809, -3599136, -3620691, -3664404, -2931603, -2341836, -1982581, -1645045, -1045349, -493419, -772624, 342498, 1268271, 1411897, 1897495, 2351549, 3766342, 4702147, 5606742, 7014545, 7790582, 8805923, 10413228, 11895126, 13120020, 14739996, 16316489, 17459861, 18974552, 20729563, 22184165, 23971251, 25816333, 26384250, 27463172, 28919599, 29459529, 29791509, 30511784, 30199888, 30353267, 30636014, 29968596, 29093776, 28084398, 27153814, 25879587, 25146327, 23721597, 22216467, 20915600, 19587979, 18957160, 17790704, 16424760, 15164812, 14468982, 14008095, 13710803, 13113103, 12346006, 12275134, 12417387, 12312960, 12222168, 12199749, 11951149, 12245539, 12869333]
8298A2869333O87852P14169P75669N20978R96140J472308R21604J265082J261395
8289B1484530J522076K091326J955347J930588K557120K154576J838537L231548
8281C8765648K133602K146597K612081K085593K207992K240862J700739J362672
8273E5255786J230611P49963j2157J58519k81675p86415r53411j472869k150898
8264E1737454j931525k264590k266424j841882k877723l097246k855228k999236
8256C1603600k356525k290668k548200k618688k022329j440976k303100j641165
8248A4381949k028311k177077q62841r62321j349119j239559j755162p43245q30782
8239B433532q38598o33389j045072q09671l19186j006814l01698l19632m67705
$$ y = [12869333, 13557185, 14271354, 15047023, 15568001, 16564141, 18036449, 18958053, 20223135, 21484530, 23006606, 25097932, 27053279, 28983867, 31540987, 33695563, 35534100, 38765648, 40899250, 43045847, 45657928, 47743521, 49951513, 52192375, 53893114, 55255786, 56486397, 57236360, 57224203, 57382722, 57101047, 56314632, 55361221, 53888352, 51737454, 49805929, 47541339, 45274915, 43433033, 40555310, 37458064, 34602836, 31603600, 29247075, 26956407, 24408207, 21789519, 19767190, 18326214, 16023114, 14381949, 12353638, 10176561, 9313720, 8351399, 7002280, 5762721, 4007559, 3264314, 2433532, 1594934, 961545, -83527, -893198, -1212384, -2219198, -2520896, -2840528, -3308233]
8230c308233n28758m45172l51884r17846j29242R0344n0359m44634m65420K67125
8220f284079l45835P9238o09162K5273K94046o60489J05413J97732j42047k21177
8210g561087n19304J007790R24m07081K68546k33419O77013Q20131R3964k96265
8200f148788m39811O89406O6024R42828m76509O60614J33466K177624M608434
8191B213288l627710p35763R9902Q44575K06505O26468J002304j24426O27693
8182A132836Q72899J135583J561001M45580N44193J302963J070693J540584R02519
8173A0508851J067023R95777J805770J915804R73540J710910J008920J050030
8165B1036625K011089Q88998Q65026Q65651M61120Q181Q66644N31195P0J8675
$$ y = [-3308233, -3836991, -4282163, -4634047, -5551893, -5681135, -5590791, -5641150, -6085784, -6551204, -6284079, -6629914, -6550676, -7159838, -7134565, -6840519, -7501008, -7395595, -7197863, -7339910, -7561087, -8080391, -7072601, -7071677, -7478758, -7210212, -7443631, -6766618, -5946487, -5852523, -6148788, -6588599, -5899193, -5833169, -4890341, -5366850, -4706236, -4572770, -2395146, 2213288, -1414422, -2150185, -2050283, -1205708, -999203, -372735, 629569, 505143, 1132836, 2005735, 3141318, 4702319, 5147899, 5692092, 6995055, 8065748, 9606332, 10508851, 11575874, 12571651, 14377421, 16293225, 17266765, 18977675, 19986595, 21036625, 23047714, 23936712, 24801738, 25667389, 26128509, 26136690, 27003334, 27534529, 27534599, 27553274]
8155B7553274k03037Q6774Q9459n12556o13289j123467m96985k93610K08151K25575
8145B4920289n83713r7792J79908q4056N66207J15775k66354K26619M07901J105656
8135B6490440N28209N70295J020232Q01867J099997N15168R77968Q64551r8382
8126C2770345J029462J147816M82628J012179L61391j63600N59322L2045k98773
8117C6932815J74773l5467j77051J0170K32574q70851R4754k37482o35982L63526
8107C5851779k04943Q8198K06131l89685n44247L49358l51076q39875n44070q01252
8097C2820318l43391K4128p8110j51813n62480j00184n87514o1775j48374n72012
8087C0238793j09719m01820m14191O38439n80285m1570o3358n38005k91480l36353
$$ y = [27553274, 27350237, 27437011, 27526470, 27013914, 26400625, 25277158, 24780173, 24486563, 24694714, 24920289, 24336576, 24238784, 24418692, 24334636, 24900843, 25016618, 24750264, 24976883, 25384784, 26490440, 27018649, 27588944, 28609176, 29411043, 30511040, 31026208, 32004176, 32868727, 32770345, 33799807, 34947623, 35430251, 36442430, 36803821, 36640221, 37199543, 37231588, 36932815, 37107588, 37072121, 36895070, 36905240, 37137814, 36266963, 36361717, 36124235, 35488253, 35851779, 35646836, 35735034, 35941165, 35551480, 35007233, 35356591, 35005515, 34165640, 33621570, 32820318, 32476927, 32501055, 32422945, 32271132, 31708652, 31608468, 31020954, 30959179, 30810805, 30238793, 30129074, 29727254, 29313063, 29951502, 29371217, 29329647, 29266289, 28728284, 28436804, 28100451]
8077B8100451l74765m52661L3546j15413o36022M99325k069m6069k51583n53009
8067B6201731K52321l284K46473m61175k89670k06183l62064L06085j186023n87851
8057B3910360J43324q62445j05365o11222q24131n22884J36006l18882k74283
8048B0670478q4825l67234L822O59027j7952M75211M63298L48169M22587J090546
8038B3663127O29303L66209O62489K7128J029019J324256K99737J111984N37223
8029B9650475N50714J419106N31338l63172M03574N98640O39324J174208J133587
8020C5737794O44656O54954J040728J321614J666701J508251R77135K052560J783153
8011D7387546J844967J938618J139664J885356J411607J009851J288817N68659
$$ y = [28100451, 27725686, 27273025, 27306571, 27191158, 26555136, 27054461, 27052392, 27006323, 26754740, 26201731, 26454052, 26450768, 26697241, 26236066, 25946396, 25740213, 25378149, 25684234, 24498211, 23910360, 24053684, 23191239, 23085874, 22474652, 21650521, 21127637, 21263643, 20944761, 20670478, 20585653, 20218419, 20222241, 20881268, 20863316, 21338527, 21801825, 22149994, 22572581, 23663127, 24292430, 24658639, 25321128, 25348256, 26377275, 27701531, 28001268, 29113252, 29650475, 30201189, 31620295, 32151633, 31788461, 32192035, 32790675, 33429999, 34604207, 35737794, 36382450, 37037404, 38078132, 39399746, 41066447, 42574698, 43551833, 45604393, 47387546, 49232513, 51171131, 52310795, 54196151, 55607758, 56617609, 57906426, 58475085]
8003E8475085L04337K74465j00166L7477o97221m76056q81708j012132q48751
7994E5075330j158762p97360k96464m21988q52208o16830j55859o1700j00775
7985E0613384K58493L98698N61568N74607Q05286P70088K68792L87214m3646L36909
7975E4931393J19742K93245M31559K19005Q5440K25090J227m07514m56577k73306
7965E5169304K1891L8101J43397N93999M32717O06905Q57627J39341J34639L31366
7955E8469287P48549L00450j08191M4720J02206M68946m17385q77915j004679
7946E7725988j925986j280235j212668j779725j445627k053434j661904j333375
7938D5033034j471056j329793k011598j889672j292223p94277k62174r40302j072115
$$ y = [58475085, 58779422, 59053887, 58953721, 58991198, 58293977, 57817921, 56936213, 55924081, 55075330, 53916568, 53119208, 52822744, 52400756, 51548548, 50931718, 50775859, 50714159, 50613384, 50871877, 51270575, 51832143, 52406750, 53212036, 53982124, 54250916, 54638130, 54594484, 54931393, 55051135, 55344380, 55775939, 55994944, 56080384, 56305474, 56306701, 55899187, 55442610, 55169304, 55191195, 55229296, 55372693, 55966692, 56399409, 57006314, 57863941, 58003282, 58137921, 58469287, 59217836, 59518286, 59410095, 59454815, 59557021, 60025967, 59608582, 58730667, 57725988, 55800002, 54519767, 53307099, 51527374, 50081747, 48028313, 46366409, 45033034, 43561978, 42232185, 40220587, 38330915, 37038692, 36244415, 35982241, 35041939, 33969824]
7929C3969824r38096r54404n26830k73243o43357j206683r60262m03906r09227
7920B7153816l53169p80392p92287j383028j049724j007455j370960p39434j515607
7911A8161760o96198o19324p99573l050p31250q93846m03188p22540l89427j71333
7901A2732031n06725j70468L06164l46529L10655L73305p632l69503k37616N0005
7891A2133687l48964j4420L93206L90025M72045L17806J203939L74553J83721
7882A5105598Q55284J94185O72021J114411P71701J332689R28528J718589J943320
7873B4636326J375531J755520J151206Q58405J532374J246469J492964J693638
7865C5742433J377413J259072K270900J912568J770050J967949J674012K462476
$$ y = [33969824, 33031728, 32077324, 31550494, 31277251, 30633894, 29427211, 28466949, 28063043, 27153816, 26800647, 26020255, 25227968, 23844940, 22795216, 21787761, 20416801, 19677367, 18161760, 17465562, 16846238, 16046665, 16043615, 15312365, 14418519, 14015331, 13292791, 12903364, 12732031, 12225306, 12054838, 12361002, 12014473, 12325128, 12698433, 12690801, 12321298, 12083682, 12133687, 11784723, 11770303, 12163509, 12553534, 13025579, 13343385, 14547324, 14921877, 15105598, 15960882, 16155067, 16827088, 17941499, 18713200, 20045889, 20974417, 22693006, 24636326, 26011857, 27767377, 28918583, 29776988, 31309362, 32555831, 34048795, 35742433, 37119846, 38378918, 40649818, 42562386, 44332436, 46300385, 47974397, 50436873]
7857E0436873K494902K437268K950080K114885K330796L274097K801784L215874
7849G2056559K411823K234244J937819K832273K450650J364055J865596J382424
7841H8535443J228311K473452J607566J542478J709675J699619K716058K767852
7833A04280454K628185K582923L028315K883694L683974M322885L493039M261651
7825A31165120L626976L826665M249444K979883K708942J764720J312027N87431
7817A52221208K89283l61697k040740j303634k549907k620017k380815l865506
7809A37388175l376894l475615l865732l514797l321177l245683l078970k044512
7801A11464795k097370j982843j869526k661355j831309j668209k720779k661547
$$ y = [50436873, 52931775, 55369043, 58319123, 60434008, 62764804, 66038901, 68840685, 72056559, 74468382, 76702626, 78640445, 81472718, 83923368, 85287423, 87153019, 88535443, 89763754, 92237206, 93844772, 95387250, 97096925, 98796544, 101512602, 104280454, 106908639, 109491562, 112519877, 115403571, 119087545, 123410430, 126903469, 131165120, 134792096, 138618761, 142868205, 145848088, 148557030, 150321750, 151633777, 152221208, 152510491, 152148794, 150108054, 148804420, 146254513, 143634496, 141253681, 137388175, 134011281, 130535666, 126669934, 123155137, 119833960, 116588277, 113509307, 111464795, 109367425, 107384582, 105515056, 102853701, 101022392, 99354183, 96633404, 93971857]
7793I3971857k167822k172176k904472k248835l431669l029143k413217l105144
7785G2499379l288725k414367l026010m808027k876675l424775k744432k569495
7777D7346873k121589j737837j782804j743072k051064j203887j121287j175113
7769C4410220r11575r74123n5673L43872L64101J019698J767072J330730K718745
7760D0013067L404721M005297N826233O621990P853767R154223R420812R834534
7752I6134644J0569555J0109219J0272774J0469280R721442J1776239J2853852
7745A71907005J2975775J2710399J2065887J0831186R515477Q506107O833914
7738B45345750O974237P543808Q091028O538444N021997J572933j576793n297409
$$ y = [93971857, 91804035, 89631859, 86727387, 84478552, 81046883, 78017740, 75604523, 72499379, 69210654, 66796287, 63770277, 58962250, 56085575, 52660800, 49916368, 47346873, 45225284, 43487447, 41704643, 39961571, 37910507, 36706620, 35585333, 34410220, 33498645, 32524522, 32468849, 32812721, 33176822, 34196520, 35963592, 37294322, 40013067, 43417788, 47423085, 53249318, 59871308, 67725075, 76879298, 86300110, 96134644, 106704199, 116813418, 127086192, 137555472, 147276914, 159053153, 171907005, 184882780, 197593179, 209659066, 220490252, 230005729, 238511836, 245345750, 252319987, 259863795, 267954823, 274493267, 279515264, 281088197, 279511404, 274213995]
7730B74213995q418911q316506q540618q130372p594970p799340r474516j0415856
7722B05522906j2392828j4399669j4121868j3121861j2361893j1502211j0452299
7715A17170277j0955977j0435820j0653928j1149026j0453681j0349447r056396
7708D4116002p732198o392875n817854m596048l636256k740487k344105k068559
7700H787620j737762k038404j772705j660563j188708j188889q36927q93692q27019
7691c357049n98894m12675m78820r25779k00627p19897n91745m15728j000535
7682h701749K75891m21383l75226p15133j4403m93927j43186m25289p08164l91346
7672a2113915p71427J71945l14904j10485l46864n11439K25627o75182p0405J63135
$$ y = [274213995, 265795084, 257478578, 248937960, 240807588, 233212618, 225413278, 215938762, 205522906, 193130078, 178730409, 164608541, 151486680, 139124787, 127622576, 117170277, 106214300, 95778480, 85124552, 73975526, 63521845, 53172398, 44116002, 36383804, 29990929, 24173075, 19577027, 15940771, 13200284, 10856179, 8787620, 7049858, 5011454, 3238749, 1578186, 389478, -799411, -1636338, -2530030, -3357049, -3955943, -4368618, -4847438, -5773217, -5973844, -6693741, -7285486, -7701214, -8701749, -8425858, -8847241, -9222467, -9937600, -9952003, -10445930, -10589116, -11014405, -11722569, -12113915, -12885342, -12713397, -13028301, -13138786, -13485650, -13997089, -13771462, -14446644, -14517049, -14353914]
7662a4353914r95106j84062j82462l70251J63832j03202k17359o21756l74513
7653a7238793n0016l47743k99191n4933K64688k30603k83434O3573l84318L18743
7643a8242027o99392n10926K59339j48951N08767m49187k78067J62005L08320
7634a9090119l94355n43928l30645n12591J10394K03624L07594o40563j73446
7625b1064035J10114Q145M59900n16414m56790m40945k76638M79164O13077l10110
7615b1394532j49113j73210J55885J83965l62525P7550k25575n96737N00245M06226
7605b1577821m25250J99981O0643K9806m1708m49517J68831q25317l16084N92044
7595b2584392J97945j40048l35623r4023J87626J00926j71567l86020N6485L20612
$$ y = [-14353914, -15349020, -15533082, -15715544, -16085795, -15921963, -16025165, -16242524, -16864280, -17238793, -17288809, -17636552, -17935743, -17990676, -17725988, -17956591, -18240025, -18176452, -18560770, -18242027, -18941419, -19452345, -19193006, -19341957, -18833190, -19282377, -19560444, -19398439, -19090119, -19484474, -20028402, -20359047, -20871638, -20761244, -20557620, -20250026, -20890589, -21064035, -20953921, -20945776, -20485876, -21002290, -21459080, -21900025, -22176663, -21697499, -21084422, -21394532, -21543645, -21716855, -21560970, -21377005, -21739530, -21661980, -21887555, -22484292, -21984047, -21577821, -22003071, -21803090, -21742447, -21712641, -21754349, -22203866, -22035035, -22860352, -23176436, -22584392, -22386447, -22526495, -22862118, -22956141, -22768515, -22667589, -22839156, -23225176, -23168691, -22848079]
7585b2848079N3456M11707k31133l29102r718j32332L66266l07045k36302K44223
7575b3018059J94881J81671K74512j50320n48282J32773J10844j95832L21829
7566b2695983n17779O19352k2589n916L06842m75315L29821J3081l61624j32024
7556b2942134j22847K27103K33648L86200L8455m50027k56738L85420L47241k16201
7546b2369880k72249P0106J84311L80928K43523P0120k78412J0725L41508j50854
7536b1770174M21501n17812p27514J40804K7346O49302M72228j17280K22007n6924
7526b1256516K26292J22242j19887o22356L8084K59123K89858l95690K19768j082
7516b1240164K75965J98073K32642j82294k37666m0182L85472J36469M782k14189
$$ y = [-22848079, -22794623, -22382916, -22614049, -22943151, -22952869, -23085201, -22718935, -23025980, -23262282, -23018059, -22823178, -22641507, -22366995, -22517315, -23065597, -22932824, -22821980, -23017812, -22695983, -23213762, -22594410, -22616999, -22622915, -22316073, -22791388, -22461567, -22448486, -22810110, -22942134, -23064981, -22837878, -22604230, -22218030, -22179575, -22629602, -22886340, -22500920, -22153679, -22369880, -22642129, -22572023, -22387712, -22006784, -21763261, -21693141, -21971553, -21960828, -21619320, -21770174, -21348673, -21866485, -22593999, -22453195, -22425849, -21776547, -21304319, -21421599, -21199592, -21256516, -21030224, -20907982, -21027869, -21650225, -21612141, -21353018, -21063160, -21458850, -21239082, -21240164, -20964199, -20766126, -20533484, -20715778, -20953444, -20993626, -20608154, -20471685, -20466903, -20681092]
7506b0681092K68875J12254K02891j45915k95573k0886L13749J02060m5692r5811
7496b0285140r1573M57448J71081L01787j85086j34875J38751K81259K06847k11731
7486a9351232K15170J56172Q2215M98049k1832m65482J40782M38041K6276M78186
7476a7803655J7448j41972q0843P5324O3606J43854J46636l73489K18672K27008
7466a7507411J9898N67866M12359j14656K58863J56299m47975O59527q2192K19265
7456a5858157K85003L72731N94389k4086M5212J78425j19416M25023K25707j15143
7446a3990312L78417L86090O45250O37990K5313M60320N0782l26294K01271K83604
7436a1247569L91615P20297j98448P85214M28467q6773P61604q9250M04001O94600
$$ y = [-20681092, -20412217, -20299963, -20097072, -20242987, -20538560, -20559446, -20245697, -20143637, -20189329, -20285140, -20376713, -19919265, -19748184, -19446397, -19631483, -19766358, -19627607, -19346348, -19139501, -19351232, -19136062, -18979890, -18897675, -18399626, -18421458, -18886940, -18746158, -18308117, -18281841, -17803655, -17786207, -17928179, -18009022, -17933698, -17870092, -17726238, -17579602, -17953091, -17734419, -17507411, -17487513, -16919647, -16507288, -16621944, -16363081, -16206782, -16654757, -15995230, -16077422, -15858157, -15573154, -15200423, -14606034, -14630120, -14584908, -14406483, -14525899, -14100876, -13875169, -13990312, -13611895, -13225805, -12580555, -11942565, -11917252, -11456932, -11406150, -11732444, -11531173, -11247569, -10855954, -10135657, -10334105, -9548891, -9120424, -9207197, -8445593, -8534843, -8130842, -7436242]
7426g436242O0878R58342J49304L4885N81316J249305Q38775J43968L71480O0809
7416b987180P90474J015523Q48510M66109O26571Q95310O38623J390479R57462
7407D641881L57556J112637J181695J415461J434153P34975J359362J560446J708281
7398A5506447K088158J722061J853542J826071K329650K423364K348336K519524
7390C2617153K687539L368904L547275L345415L510744M017287M235237M231061
7382F1560615M953879M626363M756181N310083N824476O095378N823766O190989
7374A05141730P110499O251244P168461P083595P094604P363740P352755P916261
7366A62482889P167433P166763P574994P024820P390074O749395O264269O708244
$$ y = [-7436242, -7375364, -6417022, -6267718, -6232833, -5651517, -4402212, -3563437, -3419469, -3047989, -2987180, -2196706, -1181183, -332673, 133436, 760007, 1655317, 2293940, 3684419, 4641881, 4999437, 6112074, 7293769, 8709230, 10143383, 10878358, 12237720, 13798166, 15506447, 17594605, 19316666, 21170208, 22996279, 25325929, 27749293, 30097629, 32617153, 35304692, 38673596, 42220871, 45566286, 49077030, 53094317, 57329554, 61560615, 66514494, 71140857, 75897038, 81207121, 87031597, 93126975, 98950741, 105141730, 112252229, 118503473, 125671934, 132755529, 139850133, 147213873, 154566628, 162482889, 169650322, 176817085, 184392079, 191416899, 198806973, 205556368, 211820637, 218528881]
7358B18528881O139130O145584N680987M423630M287295M606531L748037L299126
7350B56859201K555652J482164J507312J035776O19415k84655j660542k349380
7342B59764943k570879l019622k629512l692961m506603m220908n227450m526238
7334B29370770n840641o314051o146582p073451o422582o913424p009508p322465
7326A76328066p209317p008305o665988o891607p640352o886871p117042o458766
7318A20449818n803014n946430o403670o281185n456618n359404n159822m801808
7310G5237867n599051m608168m124150m573970l235422l783012l949880k419315
7302D2944899l210195k881818k990771k478423k187024j993913j795109j970296
$$ y = [218528881, 224668011, 230813595, 236494582, 240918212, 245205507, 249812038, 253560075, 256859201, 259414853, 260897017, 262404329, 263440105, 264059520, 263774865, 262114323, 259764943, 257194064, 254174442, 251544930, 247851969, 243345366, 239124458, 233897008, 229370770, 223530129, 217216078, 211069496, 203996045, 197573463, 190660039, 183650531, 176328066, 169118749, 162110444, 155444456, 148552849, 140912497, 134025626, 126908584, 120449818, 114646804, 108700374, 102296704, 96015519, 90558901, 85199497, 80039675, 75237867, 69638816, 65030648, 60906498, 56332528, 53097106, 49314094, 45364214, 42944899, 39734704, 36852886, 33862115, 31383692, 29196668, 27202755, 25407646, 23437350]
7294B3437350j417391j933300j273008j080457j801206j535135o99271j064383
7286A2633199r22677m54390j138747p09358l17853n27318q62820o94361p16734
7277F288941n39829j38592n28722n56640q61649j31836l54183l539k20878n03317
7267B449756k35916j7506M15126K22544n23845j89753p5180m0472L92658J10748
7257B508160o15139J11987K9360J85325O63092O3696k07608k30426M87991N31801
7247C528239J04759P8684j17724M9962O11272Q20269J8594n3718K96885N473L43906
7236E686601K94475K08650J85876N30121P41026L79984N57262N03603M26821N31190
7226A0045609M33598P08723P73823M89381R20322L06974J177500Q97486J079669
$$ y = [23437350, 22019959, 20086659, 18813651, 17733194, 15931988, 14396853, 13697582, 12633199, 11710522, 11256132, 10117385, 9408027, 9090174, 8562856, 7700036, 7005675, 6288941, 5749112, 5610520, 5081798, 4525158, 3663509, 3531673, 3177490, 3173951, 2953073, 2449756, 2213840, 2196334, 2611460, 2834004, 2310159, 2120406, 2045226, 2004754, 2397412, 2508160, 1893021, 2005008, 2034368, 2219693, 2882785, 2946481, 2738873, 2508447, 2996438, 3528239, 3632998, 3711682, 3593958, 3643920, 4255192, 5075461, 5094055, 5040337, 5337222, 5342695, 5686601, 5981076, 6189726, 6375602, 6905723, 7646749, 8026733, 8583995, 9087598, 9514419, 10045609, 10479207, 11187930, 11961753, 12451134, 13371456, 13678430, 14855930, 15753416, 16833085]
7217A6833085J187014J319371J817602O81635J625719J507476J095437J557681
7209B7625020K270857J973450J833939K320712K358949J691148K735197K371299
7201D5180571K121319K325107K542856K307166K204541K665922K490182K116489
7193F3954153K932685J749890K129329K243014J385508J501356J286527J987977
7185G9170439J719298J385954J437123J214305J731250N63793J305200J226533
7177H9753895L15382J161931J412828J302998J725339J054805P77534J470251
7169I8974963J877170K004429J957340J957330K677703L480497L137070L817649
7161A19884151M105763M666091M769074N307031N667090O060443P091181O852534
$$ y = [16833085, 18020099, 19339470, 21157072, 21838707, 23464426, 24971902, 26067339, 27625020, 29895877, 31869327, 33703266, 36023978, 38382927, 40074075, 42809272, 45180571, 47301890, 49626997, 52169853, 54477019, 56681560, 59347482, 61837664, 63954153, 66886838, 68636728, 70766057, 73009071, 74394579, 75895935, 77182462, 79170439, 80889737, 82275691, 83712814, 84927119, 86658369, 87222162, 88527362, 89753895, 90069277, 91231208, 92644036, 93947034, 95672373, 96727178, 97504712, 98974963, 100852133, 102856562, 104813902, 106771232, 109448935, 112929432, 116066502, 119884151, 123989914, 128656005, 133425079, 138732110, 144399200, 150459643, 157550824, 164403358]
7153A64403358Q147668Q808826R027640J0074502R947310J0876612J1198820J1714883
7145B44199619J2359137J2431704J3148347J3084776J3085235J3815355J3397061
7138C35521234J3475529J3437506J2883462J3097038J3186867J2299431J2272322
7131D26173389J1636811J1212133J0800459J0269248R712413R364960Q773296
7124D97942709P547069P259215O787831N175643M374371L445329J799966J070774
7116E35402907L01828j808927j947558l185975m095225m562647n024132n810662
7108E09269609n980332p044601p084776o696804q077633p376697p829226q216667
7100D50962873p881268p964285q124590q695319q225264q192626q644599q352108
$$ y = [164403358, 172551026, 181359852, 190387492, 200461994, 210409304, 221285916, 232484736, 244199619, 256558756, 268990460, 282138807, 295223583, 308308818, 322124173, 335521234, 348996763, 362434269, 375317731, 388414769, 401601636, 413901067, 426173389, 437810200, 449022333, 459822792, 470092040, 479804453, 489169413, 497942709, 505489778, 512748993, 519536824, 524712467, 529086838, 532532167, 534332133, 535402907, 535704735, 533895808, 531948250, 528762275, 524667050, 520104403, 515080271, 509269609, 503289277, 496244676, 489159900, 482463096, 474385463, 467008766, 459179540, 450962873, 443081605, 435117320, 426992730, 418297411, 410072147, 401879521, 393234922, 384882814]
7092C84882814q220384q118147p561088p471295o999232o670072p224357o517336
7084C26100903o152195o532487n513032n730138n017558l964744m467276l865426
7076B84858047l416479l493164k641492k645332k308520j744345j806006p61730
7068B66040979j205391q55966r38714o00239L551m36628j32344j086134r42544
7059B59846570r2341q38096p90388j145220r39860j246669q38700r21148j606943
7050B51427205j691040k294558j320889k043656k469750k332241l282084k807096
7042B33185891k769809l942144l470721m593400m544375m470357n305550m964920
7034A99124615n934519n377632n139701n035885m890814m652450m876333m057739
$$ y = [384882814, 376662430, 368544283, 360983195, 353511900, 346512668, 339842596, 332618239, 326100903, 319948708, 313416221, 307903189, 302173051, 297155493, 293190749, 288723473, 284858047, 281441568, 277948404, 275306912, 272661580, 270353060, 268608715, 266802709, 266040979, 264835588, 263979622, 263040908, 262440669, 262444220, 262007592, 261875248, 260789114, 259846570, 259754229, 258916133, 258125745, 256980525, 256040665, 254793996, 253955296, 253034148, 251427205, 249736165, 247441607, 246120718, 244077062, 241607312, 239275071, 235992987, 233185891, 230416082, 226473938, 223003217, 218409817, 213865442, 209395085, 204089535, 199124615, 193190096, 187812464, 182672763, 177636878, 172746064, 168093614, 163217281, 159159542]
7026A59159542l715140l978235k952366l328816l701318k909489k705578k219134
7018A33649466j956751k383335k208564j880411j647539k024551j800108j554744
7010A18193463j949277j042566k110710k475616j464609k449946k424184k061761
7002A02214794k964773k417772k183675k779004j992138j907755k467031j657906
6994H3844740k127444j672270j215787j666628j461580r62319j256601j102563
6986G2379548q89822o30619j033232p33130m44239r03590L1679j62729q22186
6977F6791680N07805k12417n23499L59413j9595K36727N09543R06891R50741J249973
6967G0757262J193563J500750P02615J103406J440238O67029J350790J078652
$$ y = [159159542, 155444402, 151466167, 148513801, 145184985, 141483667, 138574178, 135868600, 133649466, 131692715, 129309380, 127100816, 125220405, 123572866, 121548315, 119748207, 118193463, 116244186, 115201620, 113090910, 110615294, 109150685, 106700739, 104276555, 102214794, 99250021, 96832249, 94648574, 91869570, 89877432, 87969677, 85502646, 83844740, 81717296, 80045026, 78829239, 77162611, 75701031, 74738712, 73482111, 72379548, 71489726, 70859107, 69825875, 69092745, 68648506, 67744916, 67776595, 67613866, 66791680, 67299485, 67087068, 66563569, 66922982, 66903387, 67140114, 67649657, 68556548, 69507289, 70757262, 71950825, 73451575, 74154190, 75257596, 76697834, 77364863, 78715653, 79794305]
6959G9794305J160861J767836J128558J512052R18151K87604R22638L82282K29536
6950H8103823L82000R7371k97710O5646k96542j68678o11507r76655o02433j280633
6940H4414682r63250j015548j466089q15482j058318m34150p44811j302965J14182
6931G6728251j162620l88953K49494p30356M19060K06217N10506J746122J668632
6922G9246353J554562K228298K706526L155674L245302L582470M845263M583761
6914A05148209N280911O227629O038848O878068P248501P536102Q072155P624380
6906A60054803Q792688Q567314Q918581R187670P996796Q574685Q657381P764891
6898B28514809Q452036P754085P254269P327561O639093O823260N694134M673880
$$ y = [79794305, 80955166, 82723002, 83851560, 85363612, 86281763, 86569367, 87492005, 87874287, 88103823, 88485823, 88583194, 88285484, 88351130, 88054588, 87885910, 87274403, 86297748, 85695315, 84414682, 83451432, 82435884, 80969795, 80154313, 79095995, 78661845, 77917034, 76614069, 76728251, 75565631, 75176678, 75426172, 74695816, 75114876, 75321093, 75831599, 77577721, 79246353, 80800915, 83029213, 85735739, 88891413, 92136715, 95719185, 100564448, 105148209, 110429120, 116656749, 122695597, 129573665, 136822166, 144358268, 152430423, 160054803, 168847491, 177414805, 186333386, 195521056, 203517852, 212092537, 220749918, 228514809, 236966845, 244720930, 251975199, 259302760, 265941853, 272765113, 278459247, 283133127]
6890B83133127M388566M095932L600578K989874J862513J918920J448387Q14142
6882C04252039J526781k17757l74004J34942o52707k93923j28432q58950o13436
6873C02774553R3001N3373j53628l26199p54984l02146p0597m1073o47615o0696
6863C00563989k70551o8195Q03671m30286l23842p31203j476934k59487j238997
6854B96568165k255301k919934l326870l981258l817004m475857n525432n525658
6846B64740851o749118o470340o538434p306851p543724p909271p610001p915510
6838B06697602q232865p769798r095227q209960q181089q360443p334084q389584
6830A41124552p757731p130637p004191o391764o546015n649684n115085m363019
$$ y = [283133127, 287521693, 291617625, 295218203, 298208077, 300070590, 301989510, 303437897, 304252039, 305778820, 305561063, 305187059, 305322001, 304669294, 304375371, 304246939, 303387989, 302774553, 302867554, 302920927, 302767299, 302441100, 301686116, 301383970, 301313373, 301272300, 300624685, 300563989, 300293438, 300225243, 301028914, 300598628, 300274786, 299543583, 298066649, 297807162, 296568165, 294312864, 291392930, 288066060, 284084802, 280267798, 275791941, 270266509, 264740851, 257991733, 251521393, 244982959, 237676108, 230132384, 222223113, 214613112, 206697602, 198464737, 190694939, 181599712, 173389752, 165208663, 156848220, 149514136, 141124552, 133366821, 126236184, 119231993, 112840229, 106294214, 100644530, 95529445, 91166426]
6822I1166426l562779l992331l035627k925027k173345j895018k005845j114787
6814G0461667j507714k16018l15107K57916J266l17707N28150Q294j60616K37404
6804F8977535n97476J88983O90410L53188K83810K037J82982j22646P7480n02560
6794F9533743j042158q29584j674150j428177n33160j431171j757716j744129
6786E9093498k165155k016410k171126k838867j877973k115278k220291j732429
6778D1955969l131078k032291k624194k700349k409424k836938k738201k310415
6770B1173079j751082j791457k172185j906128j682135j915289k014327j659700
6762F280776j479946j464225j222062j100954p76896p49474r09978q40810j036274
$$ y = [91166426, 87603647, 83611316, 80575689, 77650662, 75477317, 73582299, 71576454, 70461667, 68953953, 68737935, 68422828, 68680744, 68682010, 68364303, 68892453, 68900747, 68740131, 68977535, 68380059, 68569042, 69259452, 69612640, 69896450, 69898487, 70081469, 69958823, 70036303, 69533743, 68491585, 67662001, 65987851, 64559674, 64026514, 62595343, 60837627, 59093498, 56928343, 54911933, 52740807, 49901940, 48023967, 45908689, 43688398, 41955969, 38824891, 36792600, 34168406, 31468057, 29058633, 26221695, 23483494, 21173079, 19421997, 17630540, 15458355, 13552227, 11870092, 9954803, 7940476, 6280776, 4800830, 3336605, 2114543, 1013589, 236693, -512781, -1422759, -2263569, -3299843]
6753c299843j110301p33758n21217m49304o53515q39585m61273k12185M7659o77679
6743h911001p02474p85815q34009l7688k44889l51902k85058k61861l93587n34034
6733a3342318o9130j92546j95869q35205p21313n3492J343J8948m35840l33858
6723a6159280j98375k76293l47320o06210k93958k18757J76314J40766m74588
6714a8257701k52827K4821j55048m535j64607n34748k37333j82690M61301P223
6704a9296144l75548m90693Q2180l56661K4075j86908j09306n13045m95433K15988
6694b1501495j61374l70382j377m3187M73241n48587m87776j05366j08858J77177
6684b2677984n19325K2286J2956l10115N39916j62674j42530K97715n39378o7046
$$ y = [-3299843, -4410144, -5143902, -5665119, -6114423, -6767938, -7607523, -8068796, -8280981, -8233322, -8911001, -9613475, -10399290, -11233299, -11270987, -11515876, -11867778, -12152836, -12414697, -12808284, -13342318, -13411448, -13603994, -13799863, -14635068, -15356381, -15409873, -15408530, -15389582, -15825422, -16159280, -16357655, -16633948, -16981268, -17587478, -17881436, -18100193, -17923879, -17783113, -18257701, -18510528, -18485707, -18640755, -18645290, -18809897, -19344645, -19581978, -19764668, -19303367, -19296144, -19671692, -20162385, -20080205, -20436866, -20412791, -20599699, -20709005, -21222050, -21717483, -21501495, -21662869, -22033251, -22034628, -22077815, -21604574, -22153161, -22640937, -22746303, -22855161, -22677984, -23197309, -23175023, -23162067, -23472182, -22932266, -23094940, -23237470, -22939755, -23479133, -23546179]
6674b3546179K49172o11500M43070q8910l56703M70266l14198n2297j9920k69286
6664b4096485r8499k1805j7816k67197k54252J95885P243l15791l8330n95823
6654b5502870Q8717K29688L4970N3959k98735J33568N3401j64327L7431k00611
6644b5534809j70215J65402k2467o659J27069M0255n7445J34477K85474m5620
6634b5084538o93826J24290K45969k53851N35675p8595o22048J81360q22785K58763
6624b6209586M87079n34377L45013L74130n27324J35908k98999k24622n463r5699
6614b6553940j51861L34338J5514j29052M21457j96313k95315K60077L3229m08357
6604b6670223J65239q3795N0062O62058L58749l36318Q5364j88774J70261J57524
$$ y = [-23546179, -23297007, -23908507, -23465437, -23554347, -23911050, -23440784, -23754982, -23807279, -23827199, -24096485, -24194984, -24216789, -24234605, -24501802, -24756054, -24560169, -24552926, -24868717, -24907047, -25502870, -25414153, -25184465, -25149495, -25095536, -25394271, -25260703, -25207302, -25371629, -25334198, -25534809, -25705024, -25539622, -25562089, -25568748, -25441679, -25401424, -25458869, -25324392, -25038918, -25084538, -25778364, -25654074, -25408105, -25661956, -25126281, -25204876, -25826924, -25645564, -26468349, -26209586, -25722507, -26256884, -25911871, -25537741, -26065065, -25929157, -26228156, -26452778, -26458241, -26553940, -26705801, -26371463, -26355949, -26485001, -26063544, -26259857, -26555172, -26295095, -26261866, -26670223, -26504984, -26588779, -26538717, -25876659, -25517910, -25854228, -25768864, -25957638, -25787377, -25629853]
6594b5629853k87481l52761j39825K00225J73336J15171j44460L20000l26720
6585b6072368m24798J80256J29146j8119j00266O9448K14756j5776K56914n16024
6575b6296831j72078K38287l30107L21222k27988K72869J45523j87343L31283
6566b5905163m25663M55257J12285p37922j62928k90093N53513N25992k82459
6557b6157181J00241J75619j2230k17417L7678m27100j29518L02755l85196K3099
6547b6689250J75670J07366J52959j66968L58360n08024J86947k00474n85090
6538b7168504L81538j11482J87209J3668l32408N40993J71509j0693l05091j67236
6528b6800497r8008K03677p5800l20408k48580L10614K20155O47913o6886p57970
$$ y = [-25629853, -25917334, -26270095, -26409920, -26209695, -26036359, -25921188, -26065648, -25745648, -26072368, -26497166, -26316910, -26187764, -26205883, -26306149, -26236701, -26021945, -26037721, -25780807, -26296831, -26468909, -26230622, -26560729, -26239507, -26467495, -26194626, -26049103, -26236446, -25905163, -26330826, -25875569, -25763284, -26501206, -26664134, -26954227, -26400714, -25874722, -26157181, -26056940, -25881321, -25893551, -26110968, -26073290, -26500390, -26629908, -26327153, -26712349, -26689250, -26513580, -26406214, -26253255, -26420223, -26061863, -26569887, -26382940, -26583414, -27168504, -26786966, -26898448, -26711239, -26697571, -27029979, -26488986, -26317477, -26328170, -26633261, -26800497, -26898505, -26694828, -26770628, -27091036, -27339616, -27029002, -26808847, -26160934, -26227820, -26985790]
6518b6985790l09992K97241J80344M8037j26275m13697J29412N10265K18843R069
6508b6442543M24919n35822K20616p0593J70129j00635J02922J39460n7161M15979
6498b5732729l35695j13795M13467p36318L93253k9903q81516L55119l75069Q8693
6488b6954493K73666l72269j50627o30371N65574k50721K77566j91866p42577
6479b8176118K29060L89970L74648N4739n01111l21273M51443J1660k95296J62037
6469b7620241k63952N23311L29948m75129R3849j73720k31381j45518M56354Q519
6459b7497960l48504N47013K7920j60647J02969j59179n7460n25892n0494K70091
6449b7852143m19362J8536O7142M66812p2518j4808N2168n10982N21860l03895
$$ y = [-26985790, -27295782, -26998541, -26818197, -26770160, -26896435, -27310132, -27180720, -26670455, -26451612, -26442543, -26017624, -26553446, -26332830, -26403423, -26233294, -26333929, -26231007, -26091547, -26148708, -25732729, -26068424, -26182219, -25768752, -26505070, -26111817, -26141720, -27023236, -26668117, -27043186, -26954493, -26680827, -27053096, -27203723, -27834094, -27268520, -27519241, -27241675, -27433541, -28176118, -27947058, -27557088, -27182440, -27127701, -27628812, -27950085, -27498642, -27486982, -27782278, -27620241, -27884193, -27360882, -27030934, -27506063, -27412214, -27585934, -27817315, -27962833, -27506479, -27497960, -27846464, -27299451, -27271531, -27432178, -27329209, -27488388, -27545848, -28071740, -28122234, -27852143, -28271505, -28252969, -28185827, -27719015, -27791533, -27806341, -27754173, -28265155, -27743295, -28047190]
6439b8047190k16994n46N6919O64550K31909K87345k55626J62459k40865K24894
6429b7133145M47214m13623R0855L39274M86528P74647K67540k2166l83862K00598
6419b5346140o4714l02542j71973q37605N41623L68986l64919l03398o2704k57385
6409b6800771j90337k24196l62160m33949R8353K11457r698j3077m687k49196
6399b7978261O67160l95481J03947j9246q22215L05003J29936N0274r8970j35497
6389b8193350j18576J21524L66047r7681l65212j18038l8416M28725j08047k48086
6379b8371110K23629k23684P23055N10144j56704j44743k266L64322l3562J85293
6369b6925626k92381l61211M90657p0708J88553N340o56360l41338L49178l00492
$$ y = [-28047190, -28264184, -28264730, -28207811, -27543261, -27311352, -27024007, -27279633, -27117174, -27358039, -27133145, -26685931, -27099554, -27008699, -26669425, -26182897, -25408250, -25140710, -25162876, -25546738, -25346140, -25410854, -25713396, -25885369, -26722974, -26181351, -25812365, -26177284, -26480682, -26543386, -26800771, -26991108, -27215304, -27577464, -28011413, -27913060, -27701603, -27711301, -27724378, -27729065, -27978261, -27311101, -27706582, -27602635, -27621881, -28444096, -28139093, -28009157, -27958883, -28057853, -28193350, -28311926, -28190402, -27824355, -27922036, -28287248, -28405286, -28443702, -28014977, -28123024, -28371110, -28147481, -28371165, -27648110, -27137966, -27294670, -27439413, -27441679, -27077357, -27110919, -26925626, -27218007, -27579218, -27088561, -27159269, -26970716, -26965376, -27621736, -27963074, -27613896, -27914388]
6359b7914388m51026Q5128o45805K82970M33083N8695P0813j90027l8536k5664
6349b8334757L95584l34210j0719N185k43605N99317K12618m68880O11819r9969
6339b7667617K92731R99866J74460M29670J14508K49505m42373k0811l46044o28487
6329b6844592O5913n19716k80283L28470L95672l08866l45475j79245l43263J67096
6319b7864289l2586m80475M5839j0881j48789N92685n0130k80615J70974p07304
6309b8765571J14991K5851K07342K26939p6284O76407J24468P40212o1569m73722
6299b7260936K70119n36689k18745M26588o70547M85232j57545k63454P30248
6290b7195729n86584N4192L4485M8493J96210n50150O7414k58819n6980O16371
$$ y = [-27914388, -28365414, -28280286, -28926091, -28643121, -28210038, -28151343, -28080530, -28270557, -28309093, -28334757, -27939173, -28273383, -28284102, -28278917, -28522522, -27923205, -27710587, -28179467, -27567648, -27667617, -27374886, -26375020, -26200560, -25770890, -25656382, -25406877, -25849250, -25870061, -26216105, -26844592, -26778679, -27298395, -27578678, -27250208, -26854536, -27163402, -27508877, -27688122, -28031385, -27864289, -27896875, -28377350, -28331511, -28342392, -28491181, -27898496, -27948626, -28229241, -28058267, -28765571, -28650580, -28624729, -28417387, -28190448, -28266732, -27590325, -27465857, -26725645, -26787214, -27260936, -26990817, -27527506, -27746251, -27319663, -27990210, -27504978, -27662523, -27925977, -27195729, -27782313, -27728121, -27693636, -27645143, -27448933, -27999083, -27931669, -28190488, -28247468, -27631097]
6280b7631097m38528k46186R1384j56049k4454p6462O7200p3684n832P0452L54883
6269b8068373j1391l76703o7136K50535O9544j64867N7394j50260m74944M04283
6259b8531918j31453R5717O23449k16031l7268K05676k98443j742k26982l71180
6249b8890175J8294J75197K09541J13118O517L598K41892j15629l97607m2470
6239b8677724M23674p147K70479N4217m19836Q1016O38147j77489p02l94813l31540
6228b8541718Q59971l3842M6059M29071o08401l49100O9781K45607J16128n60925
6218b8327369j23756K41825L56199O2846n19337k54537R8028k42533N02945l74394
6208b8580083k91776J36041K46342M61030K17860j44625l64922K22413m76127
$$ y = [-27631097, -28069625, -28315811, -28224427, -28380476, -28404930, -28481392, -28414192, -28487876, -28493708, -28423256, -28068373, -28079764, -28456467, -28523603, -28273068, -28203524, -28368391, -28310997, -28461257, -28936201, -28531918, -28663371, -28567654, -27944205, -28160236, -28197504, -27991828, -28290271, -28292013, -28518995, -28890175, -28871881, -28696684, -28487143, -28374025, -28367508, -28363910, -28122018, -28237647, -28635254, -28677724, -28254050, -28261197, -27990718, -27936501, -28356337, -28275321, -27637174, -27814663, -27815365, -28210178, -28541718, -27681747, -27715589, -27669530, -27240459, -27848860, -28197960, -28128179, -27882572, -27766444, -28327369, -28451125, -28209300, -27853101, -27790255, -28309592, -28564129, -28466101, -28708634, -28205689, -28580083, -28871859, -28735818, -28489476, -28028446, -27810586, -27955211, -28320133, -28097720, -28573847]
6199b8573847L36388J0090j8890J72977K48398R2144r8682R3359j90767k78664
6189b8207494j70518P2287j84444K07988l64477K47621O05147m37446M13457r0809
6179b7908688k88638J13511n98904R1002J93674M34770R7128l49678L3042J54589
6169b8028192K94422k27462o21886o8129M26919n3755P61902K7548l56901J54235
6159b7691299j7779K85643n4283k33616l71770K13840k08418Q9217M3189M3759
6149b7901517l8155K53981J32364L2481j21432o57164M53697J21727k67843L0953
6139b7960908N09887k04571K63477K44690o27672N0209m92657J76705N08291P760
6129b7524789m4994o50643O59844L36926K06764j14164n43294M747k32375L93150
$$ y = [-28573847, -28237459, -28227369, -28246259, -28073282, -27824884, -27732740, -27831422, -27738063, -27928830, -28207494, -28378012, -28305725, -28490169, -28282181, -28646658, -28399037, -27793890, -28231336, -27817879, -27908688, -28197326, -28083815, -28682719, -28591717, -28398043, -27963273, -27866145, -28215823, -28182781, -28028192, -27733770, -27961232, -28583118, -28651247, -28224328, -28278083, -27516181, -27488633, -27845534, -27691299, -27709078, -27423435, -27477718, -27711334, -28083104, -27869264, -28077682, -27988465, -27945276, -27901517, -27939672, -27685691, -27553327, -27520846, -27642278, -28299442, -27845745, -27724018, -27991861, -27960908, -27451021, -27655592, -27392115, -27147425, -27775097, -27724888, -28217545, -28040840, -27532549, -27524789, -27569783, -28220426, -27560582, -27223656, -27016892, -27131056, -27674350, -27669603, -27901978, -27508828]
6119b7508828m26705k22691J79934K34070O56959k815j5459k40692l34548J46687
6109b7534088j18079j91112j396l11844M64271J80894N01849j36827l75562j34190
6099b7656084j98824L82589n47461k2328k51425J81348O55619J87452J37595n01669
6089b7633188l92828J99341j96005J85058j97895k69346K91816o420M85114J49253
6079b7385100n09175j58504q7766l51476m7708Q617L767K83500M45843J37412
6069b7660590L45950l30607l56726Q6226P8398j07973p7118J39121l20444J02485
6059b8101278M03033K91124K27349o14196o445l49866K83135O73901k57781j2864
6049b7463888O4210q0641K76556L29566n33391k39372k09830J52502K40220J19281
$$ y = [-27508828, -27935533, -28158224, -27978290, -27744220, -27087261, -27090076, -27105535, -27346227, -27680775, -27534088, -27652167, -27843279, -27844675, -28156519, -27692248, -27511354, -27009505, -27146332, -27521894, -27656084, -27854908, -27472319, -28019780, -28042108, -28293533, -28112185, -27456566, -27269114, -27131519, -27633188, -28026016, -27826675, -28022680, -27837622, -28035517, -28304863, -28013047, -28019467, -27534353, -27385100, -27894275, -28052779, -28140545, -28492021, -28539729, -28531112, -28527345, -28243845, -27798002, -27660590, -27314640, -27645247, -28001973, -27915747, -27837349, -27945322, -28022440, -27883319, -28203763, -28101278, -27698245, -27407121, -27179772, -27793968, -27800413, -28150279, -27867144, -27193243, -27451024, -27463888, -27399678, -27480319, -27203763, -26874197, -27407588, -27646960, -27856790, -27704288, -27464068, -27344787]
6039b7344787k8781k59164M6229K52127j08329l41430n8367m5828o2187L47939
6029b7602578L97236K8529l59175n95941J69468L03936k97056m04229L0663O35854
6019b7693293J94519J13227n2574R7683m9237k81739Q6745k15958l62431o9194
6009b8232252L96242J001J56646L9461k92940J52340j3070j6364j98196k47530
5999b8254662K74708k05349M81176N84883n09522L33471m51057O9342l8176j08737
5989b7823923J39324j08907M05103k51959K03838M1406j64249K21231k98808K35298
5979b7401646j06230k01568K8411m21999L4595M54046J52508j24191k78553J30748
5969b7733879J0065j16659M30999m93160l53140m13792l9879N65002J52931L29268
$$ y = [-27344787, -27373568, -27632732, -27586503, -27334376, -27442705, -27784135, -27842502, -27888330, -27950517, -27602578, -27205342, -27176813, -27535988, -28131929, -27962461, -27658525, -27955581, -28359810, -28329147, -27693293, -27498774, -27385547, -27438121, -27340438, -27389675, -27671414, -27584669, -27800627, -28163058, -28232252, -27836010, -27835009, -27678363, -27638902, -27931842, -27779502, -27792572, -27808936, -28007132, -28254662, -27979954, -28185303, -27704127, -27119244, -27628766, -27295295, -27746352, -27677010, -27715186, -27823923, -27684599, -27793506, -27388403, -27640362, -27436524, -27395118, -27559367, -27338136, -27636944, -27401646, -27507876, -27709444, -27681033, -28103032, -28068437, -27614391, -27461883, -27586074, -27864627, -27733879, -27723814, -27840473, -27409474, -27902634, -28255774, -28669566, -28709445, -28144443, -27991512, -27662244]
5959b7662244r7584J28874K08691K6919l04072l03326k06226N64421l677K76344
5949b7371880L07087k60488J23479r3946O9160M25528l49543m60880j4322l28370
5939b7954175L77467J0955J57393L14294l09957n3134l23480m4883J86959m7037
5929b7685598N7423l04700M02149L47477l54402p5639l84800q0907J90419J54036
5919b7734542L5725k26171K28194o03691M61587K10353l60261K32719n82808N94813
5909b7744082M86261o27371J87263k06988l42013N92337J95463k38482J49060
5900b7548552k17857L79956N91840n5732n97928k60452m1172Q9378K7548K19657
5890b7413314K15791J16328L35181k93907K20755j16847m55231l2702l7493J52866
$$ y = [-27662244, -27759828, -27630954, -27422263, -27395344, -27699416, -28002742, -28208968, -27644547, -27648224, -27371880, -27064793, -27325281, -27201802, -27295748, -27226588, -26801060, -27150603, -27611483, -27625805, -27954175, -27576708, -27565753, -27408360, -27094066, -27404023, -27457157, -27780637, -27825520, -27638561, -27685598, -27628175, -27932875, -27530726, -27183249, -27537651, -27613290, -27998090, -28078997, -27888578, -27734542, -27698817, -27924988, -27696794, -28300485, -27838898, -27628545, -27988806, -27756087, -28338895, -27744082, -27257821, -27885192, -27697929, -27904917, -28246930, -27654593, -27459130, -27697612, -27548552, -27766409, -27386453, -26794613, -26850345, -27448273, -27708725, -27749897, -27660519, -27632971, -27413314, -27197523, -27081195, -26746014, -27039921, -26819166, -26936013, -27391244, -27423946, -27461439, -27308573]
5880b7308573q5791L2956J703L10081L14671n4581n80999L80385o35080j08169
5870b7733397L13992l59641M47982M3149n8469J21760M29330l76928k41474M06713
5860b7006983m06485R3592j28265K79958L35370m88016L24121l08607L33095j68764
5850b7140984M07760L37761o54459k46109J08706j75330L04432k07468m12016
5841b7677707O00503j13061L42021J14479m44379m95258r0386M00228j26319j48610
5831b7638489q7119j3962L7896N31517K96487q4118K02281o90795L0903L9218
5821b7376181k27867L60551k26968j64142O59443O25563j18592q1715l33713l08686
5811b7192307N81982k32144o16256p6031L07052M5418K00009J28987n16947j50243
$$ y = [-27308573, -27394364, -27361408, -27359705, -27049624, -26734953, -26789534, -27370533, -26990148, -27625228, -27733397, -27419405, -27779046, -27331064, -27287915, -27346384, -27224624, -26795294, -27172222, -27413696, -27006983, -27413468, -27319876, -27448141, -27168183, -26832813, -27320829, -26996708, -27305315, -26972220, -27140984, -26733224, -26395463, -27049922, -27296031, -27187325, -27362655, -27058223, -27265691, -27677707, -27077204, -27190265, -26848244, -26733765, -27178144, -27673402, -27763788, -27363560, -27489879, -27638489, -27725608, -27739570, -27701674, -27170157, -26873670, -26957788, -26755507, -27446302, -27415399, -27376181, -27604048, -27243497, -27470465, -27634607, -26975164, -26349601, -26468193, -26549908, -26883621, -27192307, -26610325, -26842469, -27458725, -27534756, -27227704, -27182286, -26982277, -26853290, -27370237, -27520480]
5801b7520480M36141N4287J33913l67909l87491K3309k53715P52052L44298k79002
5791b7064597L2098j0051M9258Q9269n0490p61536j44374L154K0641Q97653R0533
5780b6848442J26005k87068L47988J48822m48315L4418k99148m66854O19153k21927
5770b7295368Q35927k39523j72659N75854o66160L7631l19840l11303J76789k50627
5760b7629279L24498J21177J24785J74500k77902M03205q5888m28848k0854k70468
5750b7565074k02576M55747J28706l67686k450M55761J14070K63091l31122M89
5740b7051044q0581m65444O33787k03561J23142K81365n43097L98421l75986P49417
5730b6533581k27563o24595R47724p06436J50790J64021n09534J45839J74044
$$ y = [-27520480, -27084339, -27030052, -26896139, -27264048, -27651539, -27628230, -27881945, -27129893, -26785595, -27064597, -27032499, -27042550, -26993292, -26904023, -26954513, -27716049, -27860423, -27857269, -27836628, -26938975, -26848442, -26722437, -27009505, -26661517, -26512695, -26961010, -26926592, -27225740, -27692594, -27073441, -27295368, -26459441, -26698964, -26871623, -26295769, -26961929, -26924298, -27244138, -27555441, -27378652, -27629279, -27304781, -27183604, -27058819, -26884319, -27162221, -26759016, -26844904, -27273752, -27294606, -27565074, -27767650, -27311903, -27183197, -27550883, -27553333, -27097572, -26983502, -26720411, -27051533, -27051044, -27131625, -27597069, -26963282, -27166843, -27043701, -26762336, -27305433, -26907012, -27282998, -26533581, -26761144, -27385739, -26438015, -27144451, -26993661, -26829640, -27339174, -27193335, -27019291]
5721b7019291M56407O2465j81779n1728k46451K06439l9091m8334j32290m64493
5711b7458146J07895K48548m6395Q1890J23969K78510m25103L60468k41183l05965
5701b7275512L70473m18669N13053m6485n4345K00690n5665k79494j97854J74847
5691b7068961M75063l32287J90912j60497j9354L55356P8337M3219k33869n48612
5681b7220693K79794p786K87412Q0302k44167l49499K58119q6649m75055K76744
5671b7201478l53661M06803q7602K04897J00871l07488L49454m17514K31224N3240
5661b7021254o25008M82274K75283q6233L71755m33166N9494N06452k79215J15790
5651b6633828J44655p6646j63335L51784L42209n51J9983m25658K19934k88464
$$ y = [-27019291, -26562884, -26500419, -26682198, -26733926, -26980377, -26773938, -26813029, -26861363, -26993653, -27458146, -27350251, -27101703, -27148098, -27066208, -26942239, -26663729, -27088832, -26728364, -26969547, -27275512, -26905039, -27323708, -26810655, -26857140, -26911485, -26710795, -26766460, -27045954, -27243808, -27068961, -26593898, -26926185, -26735273, -26895770, -26915124, -26559768, -26481431, -26438212, -26672081, -27220693, -26940899, -26948685, -26661273, -26580971, -26825138, -27174637, -26916518, -27003167, -27478222, -27201478, -27555139, -27148336, -27235938, -27031041, -26930170, -27237658, -26888204, -27305718, -27074494, -27021254, -27646262, -27163988, -26888705, -26974938, -26603183, -27036349, -26976855, -26470403, -26749618, -26633828, -26489173, -26565819, -26729154, -26377370, -26035161, -26035712, -26015729, -26441387, -26221453, -26509917]
5641b6509917J36749K81530l8420L4161n63918K35542j70018k8395L47178o61890
5631b6937398M26332L3478l00101K51649l14082J31536r4664q2640j59424k18954
5621b7264268N15268k9470j01072M27494p03076L36254N42264m58574K17759k62079
5611b6779500Q4176J45048P0431J54030m12144N78964l50100M97078J62938m25031
5601b6274110j90834m8068m84844K64527M14319n81409j40019L41679N1823K93679
5591b6353257R8950l71443k369k64935m7818N11969J24351j68806K35164m57495
5581b6695689r5665Q94983J3502l8396j45257l47531K36000o61755l67397K92473
5571b6914732J1911P32524j8109K63666K54757N7367J6211l62174l60058l24338
$$ y = [-26509917, -26373168, -26091638, -26130058, -26095897, -26659815, -26424273, -26594291, -26622686, -26275508, -26937398, -26511066, -26477588, -26777689, -26526040, -26840122, -26708586, -26803250, -26885890, -27045314, -27264268, -26749000, -26778470, -26879542, -26452048, -27155124, -26818870, -26276606, -26735180, -26517421, -26779500, -26695324, -26550276, -26479845, -26325815, -26737959, -26158995, -26509095, -26012017, -25849079, -26274110, -26464944, -26513012, -26997856, -26733329, -26319010, -26900419, -27040438, -26698759, -26646936, -26353257, -26254307, -26625750, -26628119, -26893054, -26940872, -26428903, -26304552, -26473358, -26238194, -26695689, -26791354, -25896371, -25882869, -25921265, -26066522, -26414053, -26178053, -26839808, -27207205, -26914732, -26902821, -26170297, -26188406, -25924740, -25669983, -25612616, -25596405, -25958579, -26318637, -26642975]
5561b6642975m62932J0175J03050K66151L98178J00682j17992j92978M56475n33048
5551b6615214m5471j90788m76459N15631L11383l05671J34857J77974j16385L3534
5541b6576609N9361r7709L5182k178N3056J95699J37864k51219L93754J58893
5531b5893906L08245J9655j83593j67938m45469K75488j06215M3414K28102j84216
5521b6106433J4543J6207O7304J35315n45219l12624j16556L16903M10766l24290
5511b6444084Q5485k46440q9980J54911k6386J11718k49018q0873O77884l41757
5501b6448540j52163l38383L02254j63929k00158M68446o9168M21441K67796j08642
5491b6021046m52720M8705M04111j78032J2543K33005J22233p5554J05474R091
$$ y = [-26642975, -27105907, -27095732, -26992682, -26726531, -26328353, -26227671, -26345663, -26538641, -26082166, -26615214, -26660685, -26851473, -27327932, -26812301, -26500918, -26806589, -26671732, -26493758, -26610143, -26576609, -26517248, -26614957, -26579775, -26581953, -26528897, -26333198, -26195334, -26446553, -26052799, -25893906, -25585661, -25566006, -25749599, -25917537, -26363006, -26087518, -26193733, -26150319, -25922217, -26106433, -26091890, -26075683, -26008379, -25873064, -26418283, -26730907, -26847463, -26530560, -26119794, -26444084, -26358599, -26605039, -26695019, -26540108, -26566494, -26454776, -26703794, -26784667, -26106783, -26448540, -26600703, -26939086, -26636832, -26800761, -27000919, -26532473, -26601641, -26180200, -25912404, -26021046, -26473766, -26425061, -26020950, -26198982, -26186439, -25953434, -25831201, -25906755, -25801281, -25792190]
5481b5792190l65202K80924m23929o1373K03780j08868J92327J42148k7144K27732
5471b5731795j25228K61903L1231o15159j08277l56128J46244l3755K42582j3952
5461b6302334M25873L53050k32605L06153n61356j16666n41062L7578O4239j10333
5451b6677463P95260j43521J29103J26334k04257o2083k20371k58095k94258O98419
5441b6110932K9603l24377P8296l20792M25349J43246o15045M71514k28199P1665
5431b6379672O19981j98799J61421n24108M44404M16302o48050K07473n05709
5422b6406757K77813K79760K4545L25846k20833m36461k19137K69637M33932j18889
5412b5790544o96502K1727K32000N04419J57622q4737n49415l28431K21576J45592
$$ y = [-25792190, -26157392, -25876468, -26300397, -26361770, -26157990, -26266858, -26074531, -25932383, -25959527, -25731795, -25857023, -25595120, -25563889, -26179048, -26287325, -26643453, -26497209, -26530964, -26288382, -26302334, -25876461, -25523411, -25756016, -25449863, -26011219, -26127885, -26668947, -26631369, -26567130, -26677463, -25882203, -26025724, -25896621, -25770287, -25974544, -26036627, -26256998, -26515093, -26809351, -26110932, -26081329, -26405706, -26327410, -26648202, -26222853, -26079607, -26694652, -26223138, -26451337, -26379672, -25759691, -25958490, -25797069, -26321177, -25876773, -25460471, -26108521, -25901048, -26406757, -26128944, -25849184, -25824639, -25498793, -25719626, -26156087, -26375224, -26105587, -25671655, -25790544, -26487046, -26465319, -26233319, -25728900, -25571278, -25656015, -26205430, -26533861, -26312285, -26166693]
5402b6166693K1053Q0954o3088J54057J80703K21261p207n91207m54160K43555
5392b6380772J01299K67029M2767m31541L62560N18630K61598j12793o34665j07334
5382b6113222j01252J40087L74936o72689L69800K43288J2057N92306k97693l36472
5372b5788854l13239m49808L16491L57935Q8127k86249O53319k38671R3722N69757
5362b4997470m31512j27184k45851J49136M03493k98390J51037J0191l82938O41582
5352b5127906m5836m53903K02572j55823k95612P9450O13013m83303L29186m20094
5342b5758256Q4883L72755m86506J51999j08998J32720R074m79131p0127k34257
5332b6385844m5424K79478J084K69533o5365K83500K74563l94311j95206K74801
$$ y = [-26166693, -26145640, -26064686, -26127774, -25973717, -25793014, -25571753, -25578960, -26170167, -26624327, -26380772, -26279473, -26012444, -25969677, -26401218, -26038658, -25520028, -25258430, -25371223, -26005888, -26113222, -26214474, -26074387, -25699451, -26372140, -26002340, -25759052, -25746995, -25154689, -25452382, -25788854, -26102093, -26551901, -26235410, -25877475, -25789348, -26075597, -25422278, -25660949, -25567227, -24997470, -25428982, -25556166, -25802017, -25652881, -25249388, -25547778, -25396741, -25386550, -25769488, -25127906, -25173742, -25627645, -25425073, -25580896, -25876508, -25797058, -25184045, -25667348, -25338162, -25758256, -25673373, -25300618, -25787124, -25635125, -25744123, -25611403, -25602329, -26081460, -26151587, -26385844, -26431268, -26151790, -26150706, -25881173, -25946538, -25663038, -25388475, -25782786, -25977992, -25703191]
5322b5703191p66569K29859J99004M11010j25923K77446K41977l09564j18398
5313b5664349j47465j0301N58023j90144n33365K11538M60743M92254j40022k60094
5303b5223182j3220l48975N7399j04956j32653p3178N7288L88203l24099J96469
5293b5520904P5430m17420n7613j24273J78569m73232J45669o4282P6938L66629
5283b5814489J88532M07038k38040l90615J58529j86088P23507Q299q94045N66962
5273b5470410j18609L10937L55860j78906j7120l13430k51842k27240K80033k2103
5263b5652830O3040J8078j42643J13421l65510L34858q9365k29604L31965p3795
5253b5692385Q8362o0442r4352L28020l47958M52336j2428k89716M8611K1351
$$ y = [-25703191, -26469760, -26239901, -26040897, -25629887, -25755810, -25478364, -25236387, -25545951, -25664349, -25811814, -25822115, -25264092, -25454236, -25987601, -25776063, -25315320, -24823066, -24963088, -25223182, -25236402, -25585377, -25527978, -25632934, -25765587, -25838765, -25781477, -25393274, -25717373, -25520904, -25445474, -25862894, -25920507, -26044780, -25866211, -26339443, -26193774, -26258056, -26181118, -25814489, -25625957, -25218919, -25456959, -25847574, -25689045, -25875133, -25151626, -25143327, -26037372, -25470410, -25589019, -25278082, -24922222, -25101128, -25118248, -25431678, -25683520, -25910760, -25630727, -25652830, -25589790, -25571712, -25714355, -25600934, -25966444, -25631586, -25720951, -25950555, -25618590, -25692385, -25604023, -25664465, -25758817, -25430797, -25778755, -25326419, -25338847, -25628563, -25579952, -25558601]
5243b5558601M5746j28256M0088M60282k95860M5361k55339K32962k00060N7332
5233b5556345J69004j80826O06206n26624j8375l10682J23098M92609l89089N61383
5223b5029641k79977q9887K15186k81031K45986j84546K8584L72325k88026J05263
5213b5185764l69920j36054N75892j7418J1754m5772N0431J249k41205Q0111p2317
5202b5349013m6326q8442p8068L76742M37415m28482q3105K30202N8139p0362
5192b5041300m30808m00917p5717L23611M63029M27955O7405p07755L85452J48151
5182b4840894l46315L42331n14622k77550L3778J68127R4122j55033M84900J70394
5172b4840762l28301N6630j68821o3747m00846j46269M85006k28016L85831K67683
$$ y = [-25558601, -25512855, -25641111, -25601023, -25140741, -25436601, -25391240, -25646579, -25413617, -25613677, -25556345, -25387341, -25568167, -24961961, -25488585, -25506960, -25817642, -25694544, -25201935, -25591024, -25029641, -25309618, -25399505, -25184319, -25465350, -25219364, -25403910, -25375326, -25003001, -25291027, -25185764, -25555684, -25691738, -25115846, -25133264, -25121510, -25167282, -25116851, -25115602, -25356807, -25276696, -25349013, -25395339, -25483781, -25561849, -25185107, -24747692, -25176174, -25259279, -25029077, -24970938, -25041300, -25472108, -25873025, -25948742, -25625131, -25162102, -24734147, -24666742, -25374497, -24989045, -24840894, -25187209, -24844878, -25359500, -25637050, -25603272, -25435145, -25341023, -25496056, -25011156, -24840762, -25169063, -25112433, -25281254, -25345001, -25745847, -25892116, -25407110, -25635126, -25249295, -24981612]
5162b4981612r0972J8829n32218n1438N8289L16238j74870j44321K38388K28601
5152b5115086o505J95280k2502J06151k05397m9768L72016m3864k67965L77644
5142b4659996k83761K4928M31109k68742l19561j02264J68820R6106k45838K15611
5132b4943588o81706L95891M24967m03830P4811m98198J27725K17927k5467O9476
5122b5241992k03112k65436N03447J86810k13067J08686q6555j57123J12510J60812
5112b5095020M76660k36325l12381o5691R5300M22797J96052j06790k87815J23745
5102b4789468K16625Q852l52036K60629n17203j06955N7864k07933K85848j84923
5092b5328700J31521J60510J76493J44351n59539p4781j23739j19531N83107k9951
$$ y = [-24981612, -25072584, -25053755, -25585973, -25637411, -25579122, -25262884, -25437754, -25582075, -25343687, -25115086, -25121591, -24926311, -24948813, -24842662, -25048059, -25097827, -24725811, -24769675, -25037640, -24659996, -24943757, -24918829, -24487720, -24756462, -25076023, -25178287, -25009467, -24913361, -25159199, -24943588, -25625294, -25229403, -24804436, -25208266, -25133455, -25631653, -25503928, -25286001, -25311468, -25241992, -25445104, -25710540, -25207093, -25020283, -25233350, -25124664, -25211219, -25368342, -25255832, -25095020, -24618360, -24854685, -25167066, -25232757, -25137457, -24714660, -24518608, -24625398, -24913213, -24789468, -24572843, -24563991, -24916027, -24655398, -25172601, -25279556, -25221692, -25429625, -25143777, -25328700, -25197179, -25036669, -24860176, -24715825, -25275364, -25350145, -25473884, -25593415, -25010308, -25040259]
5082b5040259q1885L49558m92048N27976P1073m16270J59850j75036l9342K55613
5072b4880770j04985j58038K38158L32926j74809j43829R3634j08622J37883j42323
5062b4910775j50215J71790j01742k60848M15330m31588M89249J93479P7217m98766
5052b5006869K62698N1207l55235R1755p8939Q87N14048k85925M74930J21178
5042b4210265l04242M26460m02903r8648l14521j12507K50004k80172Q4501l10831
5032b5273124m2203L81656K6768M25431P3936j08574m15018j67240K1375N9414
5022b5017579J41187J61259K7270k02484J30724J74800K2519m46808k56139L21766
5012b4943485j11847K32374M49644n50308J24468K55281K694L48397l69263N4383
$$ y = [-25040259, -25122144, -24772586, -25264634, -24736658, -24665585, -25081855, -24922005, -25097041, -25136383, -24880770, -24985755, -25143793, -24905635, -24572709, -24747518, -24891347, -24797713, -24906335, -24768452, -24910775, -25060990, -24889200, -24990942, -25251790, -24836460, -25268048, -24778799, -24585320, -24508103, -25006869, -24744171, -24692964, -25048199, -24956444, -25035383, -25034496, -24520448, -24806373, -24331443, -24210265, -24514507, -24088047, -24490950, -24589598, -24904119, -25016626, -24766622, -25046794, -24962293, -25273124, -25315327, -24933671, -24906903, -24481472, -24407536, -24516110, -24931128, -25098368, -25076993, -25017579, -24876392, -24715133, -24687863, -24890347, -24759623, -24584823, -24562304, -25009112, -25265251, -24943485, -25055332, -24822958, -24373314, -24923622, -24799154, -24543873, -24541179, -24192782, -24562045, -24507662]
5002b4507662l24298L0100q9761J10417k64258l62840J030827J74231j2742k62150
4992b4478136r3225m2830k63725M57670m28637l56193K77434k50347Q52293J51742
4982b4173954q3710l75808m59884M17929J04696m5222j38660p7687K21239J81366
4972b4429695K16569P7845n96413q0774L59979J54623M4573j88035l85248K61292
4962b4565284K51953J03084k6806J06945l77867k56711P08432K6841m7129L75367
4952b3701175o18302J9959L5566P2109N1316n04994K05137K22857L68883k95968
4942b4144612m74057q6766j20696K16482m4699k67480J17659J06349J69038N13375
4932b4015407l74020j86020j1042m54296K44155j38009M08454P559J71957L57358
$$ y = [-24507662, -24831960, -24801860, -24891621, -24781204, -25045462, -25408302, -24377475, -24203244, -24215986, -24478136, -24571361, -24614191, -24877916, -24420246, -24848883, -25205076, -24927642, -25177989, -24325696, -24173954, -24257664, -24633472, -25093356, -24675427, -24570731, -24615953, -24754613, -24832300, -24611061, -24429695, -24213126, -24135281, -24731694, -24812468, -24452489, -24297866, -24253293, -24441328, -24826576, -24565284, -24313331, -24210247, -24237053, -24130108, -24507975, -24764686, -24056254, -24029413, -24076542, -23701175, -24319477, -24299518, -24263952, -24191843, -24140527, -24645521, -24440384, -24217527, -23848644, -24144612, -24618669, -24705435, -24826131, -24609649, -24654348, -24921828, -24804169, -24697820, -24528782, -24015407, -24389427, -24575447, -24586489, -25040785, -24796630, -24934639, -24526185, -24518626, -24346669, -23989311]
4922b3989311l15784K16661j93347m79084P0358K82452j11181L96628k91249N35790
4912b3878067M10953k56605j89638k55902l22757m75386M98921L35473m20571
4903b4553579N81198q7542j86391K20136R3704l9606k00423m90742k18508p6020
4893b4957773P95343M72957k27259l09471m98153L06881K69402k68903m2180k61248
4883b4720404J23400K92306M50642m14511j78959l02459L02757P53991k83481
4874b3976718q3613k02070L37240J6569K11990L82239o15887l29796O19173k54516
4864b3895389R4954j61732l26697L12064j03506J14652J58137o42325J08584M11737
4854b3929521K0142m15995k14055q8061N05672M03005l87347j74744J22881K81364
$$ y = [-23989311, -24305095, -24088434, -24281781, -24760865, -24690507, -24408055, -24519236, -24122608, -24413857, -23878067, -23467114, -23723719, -23913357, -24169259, -24492016, -24967402, -24468481, -24133008, -24553579, -23972381, -24059923, -24246314, -24026178, -23932474, -23972080, -24172503, -24663245, -24881753, -24957773, -24162430, -23689473, -23916732, -24226203, -24724356, -24417475, -24148073, -24416976, -24459156, -24720404, -24597004, -24304698, -23854056, -24268567, -24447526, -24749985, -24447228, -23693237, -23976718, -24060331, -24262401, -23925161, -23908592, -23696602, -23314363, -23930250, -24260046, -23640873, -23895389, -23800435, -23962167, -24288864, -23976800, -24080306, -23965654, -23807517, -24449842, -24341258, -23929521, -23909379, -24325374, -24539429, -24627490, -24121818, -23718813, -24106160, -24280904, -24158023, -23876659]
4844b3876659k4330K89171n07875m80595J93383j6183N52309j47795O8899j34210
4834b4083885j0499N36159o656m29642j1273k5659M65325j66947j90286j17393
4824b4040756K03017J55806J05215k28921k99596j26348M09395r7317P2474N4414
4814b3792617l48912J99667l6326l21877J26413K22423k56966K53208J85737m51240
4804b4220490L51903J9777k1057j90956R6972n38624M03896J06930n7697L59749
4794b3689597n15195M97946n8249k54822J09585k75257j02341L39521j72503K65315
4784b3855597J61884m35663J8919K59970j76993J19193m50462K53166n7733J38621
4774b4024695J17237J98433R8797r9688N5862k2828L9657j69226J45451j44126
$$ y = [-23876659, -23900989, -23611818, -24119693, -24600288, -24406905, -24423088, -23870779, -24018574, -23949675, -24083885, -24094384, -23558225, -23564881, -23994523, -24005796, -24031455, -23566130, -23733077, -23923363, -24040756, -23837739, -23681933, -23576718, -23805639, -24105235, -24231583, -23822188, -23919505, -23847031, -23792617, -24141529, -23941862, -23978188, -24300065, -24173652, -23951229, -24208195, -23954987, -23769250, -24220490, -23868587, -23848810, -23869867, -24060823, -23963851, -24502475, -24098579, -23991649, -24049346, -23689597, -24204792, -23706846, -23765095, -24019917, -23910332, -24185589, -24287930, -23948409, -24120912, -23855597, -23693713, -24129376, -24110457, -23850487, -24027480, -23908287, -24358749, -24105583, -24163316, -24024695, -23907458, -23709025, -23610228, -23709916, -23654054, -23676882, -23637225, -23806451, -23661000, -23805126]
4764b3805126J27928J70295j97338J6238m53431M17779K01028L2818j54359l50533
4754b3994701K3162K1367l73130Q07K42632J48050P3814L93060R6217k69569l12279
4743b3950570J2081Q448j50689k72952M12385J0202L92203k3108K90871N85767
4733b2685362m86259J92219m69172k90456L49141k94334K67205K17172m72259
4724b3672105J71967L299L642m3136j16616m71325j4300Q88869k20674j0248J88273
4713b3292354n53168J87396K76273l89521k51681R5601P6261J04955K45533n5508
4703b3556213p3019o0463K3400N49123j30247j24785j04557n0554M30768M0028
4693b3056519k81835J73870m39659K77257n6637l82324P4771j41502N96803L21500
$$ y = [-23805126, -23677198, -23506903, -23704241, -23688003, -24141434, -23723655, -23522627, -23489809, -23644168, -23994701, -23971539, -23950172, -24323302, -24322495, -24079863, -23931813, -23857999, -23464939, -23368722, -23638291, -23950570, -23938489, -23930041, -24080730, -24353682, -23941297, -23931095, -23538892, -23562000, -23271129, -22685362, -23171621, -22979402, -23448574, -23739030, -23389889, -23684223, -23417018, -23199846, -23672105, -23500138, -23496839, -23493197, -23536333, -23652949, -24124274, -24138574, -23249705, -23470379, -23480627, -23292354, -23845522, -23658126, -23381853, -23771374, -24023055, -23927454, -23851193, -23746238, -23500705, -23556213, -23629232, -23689695, -23666295, -23117172, -23247419, -23372204, -23476761, -23527315, -23096547, -23056519, -23338354, -23164484, -23604143, -23326886, -23383523, -23765847, -23691076, -23832578, -23235775, -22914275]
4683b2914275m96931j74602k67923q4649K77831R2172l40328p5081O50941o4887
4673b3397732J03624K94985n76954K4335P5374o8945m5955l02511J48851K6328
4663b3718600N0139K81489o4736L28119j8683k64867J6466J07871J64935n9553
4653b3177420k56471j06114N1466k06553M28328M64906j70905n01507j26232K8930
4643b3571572r7092l39661M6058K70046J34788J30424L63685J89026k15102J13815
4633b2975585J81700m81396J02744l35634k19727M21369j34706L42465L2092R2629
4623b2974049R1692M22746k09661p45520j14130j08630J96759N08190k70099L35539
4613b2867163k39749j96647M20228n08559m2652j17613k646J12669J88652O05329
$$ y = [-22914275, -23411206, -23585808, -23853731, -23938380, -23660549, -23568377, -23908705, -23983786, -23332845, -23397732, -23294108, -22999123, -23576077, -23551742, -23476368, -23545313, -23591268, -23893779, -23744928, -23718600, -23668461, -23386972, -23451708, -23123589, -23142272, -23407139, -23390673, -23282802, -23117867, -23177420, -23433891, -23540005, -23488539, -23695092, -23266764, -22801858, -22972763, -23474270, -23600502, -23571572, -23668664, -24008325, -23962267, -23692221, -23557433, -23427009, -23063324, -22874298, -23089400, -22975585, -22793885, -23275281, -23172537, -23508171, -23727898, -23306529, -23441235, -23098770, -23066678, -22974049, -22882357, -22459611, -22669272, -23414792, -23528922, -23637552, -23440793, -22932603, -23202702, -22867163, -23106912, -23303559, -22883331, -23391890, -23434542, -23552155, -23554801, -23442132, -23253480, -22648151]
4603b2648151j63698n5434N0285n48863K66873k35234j20773J75422M31595J00527
4593b2747451m6774k2927j39237K67299K37574k92996m98855k33822K34485L10104
4583b2932600L5446l8559l17657j20842o4224l42327j09830M92691k57866L60794
4573b3294974J59555R0938m6606l72481j49725l9822J3400J40798R6042J75870
4563b3227005J30316J94485P053K10982q8011k49853K7000K877O196M09478N5888
4552b2520594k69540J62097k07975L2357k6610j54247j58355K88912l85839J3148
4542b3226646K4922k03622K23601k83453M79005k29766J80957K7441n96798Q5416
4532b3518943M0060K58605j14721J54456R3956L3735L93030o109k5185m19716
$$ y = [-22648151, -22811849, -22867283, -22816998, -23365861, -23098988, -23334222, -23454995, -23279573, -22847978, -22747451, -22794225, -22817152, -22956389, -22689090, -22451516, -22744512, -23243367, -23477189, -23242704, -22932600, -22897154, -22935713, -23253370, -23374212, -23438436, -23780763, -23890593, -23397902, -23655768, -23294974, -23135419, -23044481, -23091087, -23463568, -23613293, -23653115, -23639715, -23498917, -23402875, -23227005, -23096689, -22902204, -22895151, -22684169, -22772180, -23022033, -22995033, -22992156, -22985960, -22576482, -22520594, -22790134, -22628037, -22836012, -22803655, -22830265, -22984512, -23142867, -22853955, -23239794, -23226646, -23201724, -23405346, -23181745, -23465198, -22986193, -23215959, -23035002, -23007561, -23604359, -23518943, -23478883, -23220278, -23334999, -23180543, -23086587, -23052852, -22659822, -22665931, -22691116, -23110832]
4522b3110832k88191J93763O3620J63062J45037K42674J69052n5055q500j74947
4512b2660317n78226R6659K14195K22392k25592l49619O34278Q6639L3019L19269
4502b2207303m16478r30650N46409Q7348n9073o3759j63404J33833j7806O85638
$$ y = [-23110832, -23399023, -23205260, -23141640, -22978578, -22833541, -22590867, -22421815, -22476870, -22485370, -22660317, -23238543, -23141884, -22927689, -22705297, -22930889, -23280508, -22646230, -22559591, -22526572, -22207303, -22623781, -23554431, -23008022, -22920674, -22979747, -23043506, -23206910, -23073077, -23090883, -22405245]
$$ [...]
##END NTUPLES=NMR SPECTRUM
##END=
