##TITLE=abcd
##JCAMPDX= 6.0         $$ Bruker NMR JCAMP-DX V2.0
##DATA TYPE= NMR SPECTRUM
##DATA CLASS= NTUPLES
##ORIGIN= UXNMR, Bruker Analytische Messtechnik GmbH
##OWNER= root
$$ XWIN-NMR		Version 3.5
$$ Fri Jul 10 16:32:18 2026 Russian Standard Time (UT+4h)  servis@DPX200
##.OBSERVE FREQUENCY= 200.131235884673
##.OBSERVE NUCLEUS= ^1H
##.ACQUISITION MODE= SIMULTANEOUS
##.ACQUISITION SCHEME= undefined
##.AVERAGES= 8
##.DIGITISER RES= 18
##SPECTROMETER/DATA SYSTEM= spect
##.PULSE SEQUENCE= zg
##.SOLVENT NAME= CDCl3
##.SHIFT REFERENCE= (INTERNAL, CDCl3, 0, 16.4885)
##AUDIT TRAIL= $$ (NUMBER, WHEN, WHO, WHERE, WHAT)
$$ ##TITLE= Audit trail, XWIN-NMR		Version 3.5
$$ ##JCAMPDX= 5.01
$$ ##ORIGIN= Bruker BioSpin GmbH
$$ ##OWNER= servis
$$ F:\spectra/data/av/nmr/H1/1/pdata/1/auditp.txt
$$ ##AUDIT TRAIL=  $$ (NUMBER, WHEN, WHO, WHERE, WHAT)
(   1,<2026-07-10 16:31:44.79 +0400>,<servis>,<DPX200>,
      <created by zg, POWCHK disabled, PULCHK disabled
       terminated by command 'halt'
       configuration hash MD5:
       00 E9 B6 7A A2 85 ED C7 34 08 36 98 17 FE 4E 26
       data hash MD5: 32K
       1D 07 0E 01 10 AA EC 62 C3 2B A0 FA 33 7A D6 00>)
(   2,<2026-07-10 16:31:49.00 +0400>,<servis>,<DPX200>,
      <Start of raw data processing
       efp BC_mod = 2 LB = 0.05 FT_mod = 6 PKNL = 1 PHC0 = -415.39 PHC1 = 3.101563 SI = 16K 
       data hash MD5: 16K
       BA BE D7 25 D0 9C CD CE 0D 73 12 73 3C A6 BF 2D>)
$$ ##END=
$$ 
$$ hash MD5
$$ 12 F6 99 0D 80 7C B9 88 E0 59 8B AF BF 53 53 49
##$RELAX= 
##$RELAX= 
##$RELAX= 
##$RELAX= 
##$RELAX= 
##$RELAX= 
##$RELAX= 
##$RELAX= 
$$ Bruker specific parameters
$$ --------------------------
##$DU= <F:\spectra>
##$EXPNO= 1
##$NAME= <H1>
##$PROCNO= 1
##$TYPE= <nmr>
##$USER= <av>
##$AMP= (0..31)
100 100 100 100 100 100 100 100 100 100 100 100 100 100 100 100 100 100 
100 100 100 100 100 100 100 100 100 100 100 100 100 100 
##$AQSEQ= 0
##$AQ_mod= 1
##$AUNM= <au_zg>
##$AUTOPOS= <>
##$BF1= 200.13
##$BF2= 200.13
##$BF3= 200.13
##$BF4= 200.13
##$BF5= 500.13
##$BF6= 500.13
##$BF7= 500.13
##$BF8= 500.13
##$BYTORDA= 1
##$CFDGTYP= 0
##$CFRGTYP= 5
##$CHEMSTR= <none>
##$CNST= (0..31)
1 1 145 1 1 1 1 1 1 1 1 1 1 1 1 1 1 1 1 1 1 1 1 1 1 1 1 1 1 1 1 1 
##$CPDPRG= <>
##$CPDPRG1= <>
##$CPDPRG2= <>
##$CPDPRG3= <>
##$CPDPRG4= <mlev>
##$CPDPRG5= <mlev>
##$CPDPRG6= <mlev>
##$CPDPRG7= <mlev>
##$CPDPRG8= <mlev>
##$CPDPRGB= <>
##$CPDPRGT= <>
##$D= (0..31)
0 2 0 0 0 0 0 0 0 0.06 0 0 0 0 0 0 0.0002 0 0 0 0 0 0 0 0 0 0 0 0 0 0 
0 
##$DATE= 1783686704
##$DBL= (0..7)
120 120 120 120 120 120 120 120 
##$DBP= (0..7)
150 150 150 150 150 150 150 150 
##$DBP07= 0
##$DBPNAM0= <>
##$DBPNAM1= <>
##$DBPNAM2= <>
##$DBPNAM3= <>
##$DBPNAM4= <>
##$DBPNAM5= <>
##$DBPNAM6= <>
##$DBPNAM7= <>
##$DBPOAL= (0..7)
0.5 0.5 0.5 0.5 0.5 0.5 0.5 0.5 
##$DBPOFFS= (0..7)
0 0 0 0 0 0 0 0 
##$DE= 6
##$DECBNUC= <off>
##$DECIM= 32
##$DECNUC= <off>
##$DECSTAT= 4
##$DIGMOD= 1
##$DIGTYP= 9
##$DL= (0..7)
0 120 120 120 120 120 120 120 
##$DP= (0..7)
$$ [...]
##$SUBNAM4= <"">
##$SUBNAM5= <"">
##$SUBNAM6= <"">
##$SUBNAM7= <"">
##$SUBNAM8= <"">
##$SUBNAM9= <"">
##$SW= 20.6817932712277
##$SWIBOX= (0..15)
0 0 3 0 0 0 0 0 0 0 0 0 0 0 0 0 
##$SW_h= 4139.07284768212
##$TD= 32768
##$TD0= 1
##$TE= 0
##$TE2= 300
##$TE3= 300
##$TEG= 300
##$TL= (0..7)
0 120 120 120 120 120 120 120 
##$TP= (0..7)
150 150 150 150 150 150 150 150 
##$TP07= 0
##$TPNAME0= <>
##$TPNAME1= <>
##$TPNAME2= <>
##$TPNAME3= <>
##$TPNAME4= <>
##$TPNAME5= <>
##$TPNAME6= <>
##$TPNAME7= <>
##$TPOAL= (0..7)
0.5 0.5 0.5 0.5 0.5 0.5 0.5 0.5 
##$TPOFFS= (0..7)
0 0 0 0 0 0 0 0 
##$TUNHIN= 0
##$TUNHOUT= 0
##$TUNXOUT= 0
##$USERA1= <user>
##$USERA2= <user>
##$USERA3= <user>
##$USERA4= <user>
##$USERA5= <user>
##$V9= 5
##$VALIST= <valist>
##$VCLIST= <CCCCCCCCCCCCCCC>
##$VD= 0
##$VDLIST= <DDDDDDDDDDDDDDD>
##$VPLIST= <PPPPPPPPPPPPPPP>
##$VTLIST= <TTTTTTTTTTTTTTT>
##$WBST= 1024
##$WBSW= 30
##$XGAIN= (0..3)
0 0 0 0 
##$XL= 0
##$YL= 0
##$YMAX_a= 157253
##$YMIN_a= -293850
##$ZGOPTNS= <>
##$ZL1= 120
##$ZL2= 120
##$ZL3= 120
##$ZL4= 120
##$ABSF1= 0
##$ABSF2= 0
##$ABSG= 0
##$ABSL= 0
##$ALPHA= 0
##$AQORDER= 0
##$ASSFAC= 0
##$ASSFACI= 0
##$ASSFACX= 0
##$ASSWID= 0
##$AUNMP= <proc_1d>
##$AZFE= 0.1
##$AZFW= 0.1
##$BCFW= 0
##$BC_mod= 2
##$BYTORDP= 0
##$COROFFS= 0
##$CY= 18.4799938201904
##$DATMOD= 1
##$DC= 0
##$DFILT= <>
##$DTYPP= 0
##$F1P= 9.9274215381318
##$F2P= -0.165520771350173
##$FCOR= 1
##$FTSIZE= 16384
##$FT_mod= 6
##$GAMMA= 0
##$GB= 0
##$INTBC= 1
##$INTSCL= 4.127829e-11
##$ISEN= 128
##$LB= 0.05
##$LEV0= 0
##$LPBIN= 0
##$MAXI= 10000
##$MC2= 0
##$MEAN= 0
##$ME_mod= 0
##$MI= 50
##$NCOEF= 0
##$NC_proc= -6
##$NLEV= 6
##$NOISF1= 3.799351
##$NOISF2= 2.8
##$NSP= 0
##$NTH_PI= 0
##$NZP= 0
##$OFFSET= 16.48848
##$PC= 4
##$PHC0= -415.39
##$PHC1= 3.101563
##$PH_mod= 1
##$PKNL= yes
##$PPARMOD= 0
##$PSCAL= 4
##$PSIGN= 0
##$REVERSE= no
##$SF= 200.130005582386
##$SI= 16384
##$SIGF1= 3
##$SIGF2= 2
##$SINO= 400
##$SIOLD= 16384
##$SREGLST= <1H.CDCl3>
##$SSB= 0
##$STSI= 16384
##$STSR= 0
##$SW_p= 4139.07284768211
##$SYMM= 0
##$S_DEV= 0
##$TDeff= 32768
##$TDoff= 0
##$TI= <>
##$TILT= no
##$TM1= 0
##$TM2= 0
##$TOPLEV= 0
##$USERP1= <user>
##$USERP2= <user>
##$USERP3= <user>
##$USERP4= <user>
##$USERP5= <user>
##$WDW= 1
##$XDIM= 16384
##$YMAX_p= 405390285
##$YMIN_p= -524182
$$ End of Bruker specific parameters
$$ ---------------------------------
##NTUPLES= NMR SPECTRUM
##VAR_NAME=  FREQUENCY,     SPECTRUM/REAL,   SPECTRUM/IMAG
##SYMBOL=    X,             R,               I
##VAR_TYPE=  INDEPENDENT,   DEPENDENT,       DEPENDENT
##VAR_FORM=  AFFN,          ASDF,            ASDF
##VAR_DIM=   16384,         16384,           16384
##UNITS=     HZ,            ARBITRARY UNITS, ARBITRARY UNITS
##FACTOR=    0.252644378177508, 1,           1
##FIRST=     3299.83951724647, 0,            0
##LAST=      -839.233330435636, 0,           0
##MIN=       -839.233330435636, -524182,     0
##MAX=       3299.83951724647, 405390285,    0
$$ Real data points
##PAGE= N=1
##DATA TABLE= (X++(R..R)), XYDATA
$$ [...]
$$ plain form
12241 -244566 -162270 -152259 -94316 -172860 -193202 -73350 -267514 -209270 -181411 -182518 -245342
12230 -245342 -188788 -189117 -243031 -133152 -214596 -168063 -273266 -205871 -160268 -244994 -181621
12219 -181621 -182345 -218280 -282862 -252273 -265838 -281334 -192257 -181971 -195285 -146372 -232649 -235198
12207 -235198 -186814 -189799 -227781 -136112 -140805 -151941 -197202 -210658 -139289 -102893 -156279 -74678
12195 -74678 -194644 -295311 -282318 -89801 -244786 -289837 -191934 -251228 -9317 -235706
12185 -235706 -126690 -191964 -173618 -185702 -146205 -104775 -225215 -62794 -215073 -210552 -211384
12174 -211384 -229239 -158001 -236571 -262440 -245845 -123587 -171586 -130894 -197926 -171271 -94033
12163 -94033 -128073 -239174 -228699 -288949 -215434 -270002 -277666 -174522 -213303 -162936 -203746
$$ packed form
12241b44566Q2296J0011N7943p8544k0342J19852j94164N8244K7859j107o2824
12230b45342N6554l29n3914J09879q1444M6533j05203O7395M5603q4726O3373
12219a81621p24l5935o4582L0589j3565j5496Q9077J0286j3314M8913q6277k549
12207b35198M8384k985l7982R1669m693j1136m5261j3456P1369L6396n3386Q1601
12195g4678j19966j00667J2993J92517j54985m5051R7903n9294K41911k26389
12185b35706J09016o5274J8346j2084L9497M1430j20440J62421j52279M521q32
12174b11384j7855P1238p8570k5869J6595J22258m7999M0692o7032K6655P7238
12163i4033l4040j11101J0475o0250P3515n4568p664J03144l8781N0367m0810
$$ plain form
12152 -203746 -91553 -291687 -78222 -136046 -135000 -250844 -249182 -197677 -191374 -231540 -199551
12141 -199551 -180491 -187174 -220016 -146903 -187328 -202370 -198416 -129088 -264838 -63825 -221976
12130 -221976 -293435 -179790 -101375 -166921 -165172 -220982 -331096 -122340 -191994 -39638 -235823
12119 -235823 -206461 -157585 -88113 -100063 -196160 -134241 -185010 -239630 -165838 -216883 -107640
12108 -107640 -172225 -315620 -322561 -171660 -205178 -276329 -192078 -184866 -175585 -200925 -187885 -253869
12096 -253869 -149629 -152774 -191089 -115339 -169912 -212025 -160445 -184318 -154380 -125125 -126460 -258079
12084 -258079 -188350 -351739 -343311 -49642 -160488 -204115 -113773 -115450 -102953 -151994 -167840
12073 -167840 -245483 -146397 -194439 -199435 -254964 -104067 -168081 -229970 -191201 -242212 -251466 -59435
$$ packed form
12152b03746J12193k00134K13465n7824J046j15844J662N1505O303m0166L1989
12141a99551J9060o683l2842P3113m0425j5042L954O9328j35750K01013j58151
12130b21976p1459J13645P8415o5546J749n5810j10114K08756o9654J52356j96185
12119b35823K9362M8876O9472j1950r6097O1919n0769n4620P3792n1045J09243
12108a07640o4585j43395o941J50901l3518p1151Q4251P212R281k5340J3040o5984
12096b53869J04240l145l8315P5750n4573m2113N1580k3873K9938K9255j335j31619
12084b58079O9729j63389Q428K93669j10846m3627R0342j677J2497m9041j5846
12073a67840p7643R9086m8042m996n5529J50897o4014o1889L8769n1011r254J92031
$$ plain form
12061 -59435 -92110 -137284 -146247 -105795 -200667 -290602 -246227 -260308 -244329 -172349 -284582 -92037
12049 -92037 -259232 -10255 -137313 -64248 -134723 -177109 -217860 -238927 -180196 -266180 -71982
12038 -71982 -241339 -137078 -232024 -216098 -221363 -125179 -78624 -189374 -210506 -197174 -179147
12027 -179147 -173581 -261808 -244510 -175868 -190245 -146248 -220802 -167952 -208447 -99817 -177376
12016 -177376 -255348 -89090 -184588 -275037 -149868 -222675 -198522 -171329 -140856 -113324 -111548
12005 -111548 -139259 -11879 -74083 -188950 -181418 -159946 -221171 -118548 -48633 -214313 -135796
11994 -135796 -195050 -186192 -207929 -121936 -218298 -178190 -97670 -107065 -162266 -255972 -152619 -348878
11982 -348878 -197065 -269680 -261276 -239330 -297120 -237994 -160625 -123391 -167749 -123735 -210394
$$ packed form
12061e9435l2675m5174q963M0452r4872q9935M4375j4081J5979P1980j12233J92545
12049i2037j67195K48977j27058P3065p0475m2386m0751k1067N8731q5984J94198
12038g1982j69357J04261r4946J5926n265R6184M6555j10750k1132J3332J8027
12027a79147N566q8227J7298O8642j4377M3997p4554N2850m0495J08630p7559
12016a77376p7972J66258r5498r0449J25169p2807K4153K7193L0473K7532J776
12005a11548k7711J27380o2204j14867P532K1472o1225J02623O9915j65680P8517
11994a35796n9254Q858k1737Q5993r6362M0108Q0520r395n5201r3706J03353j96259
11982c48878J51813p2615Q404K1946n7790N9126P7369L7234m4358M4014q6659
$$ plain form
11971 -210394 -100241 -166658 -155426 -152502 -345269 -296635 -369990 -180777 -164226 -147169 -164717
11960 -164717 -189715 -92647 -84739 -21577 -84929 -269535 -122424 -109272 -178084 -187455 -179630 -213311
11948 -213311 -235868 -117246 -164747 -253545 -237083 -136519 -298439 -254118 -156239 -191832 -187281
11937 -187281 -244159 -218416 -73650 -142083 -58389 -143355 -200213 -210804 -78855 -68064 -197314
11926 -197314 -132674 -277292 -211131 -193250 -180016 -286683 -88008 -206990 -226114 -103588
11916 -103588 -119973 -152078 -111197 -143061 -299627 -201328 -302656 -289065 -98398 -118457 -195414
11905 -195414 -145616 -208599 -192225 -93491 -174246 -102132 -175837 -159653 -184832 -257031 -170350
11894 -170350 -187247 -74448 -329962 -259332 -287284 -357591 -265517 -26004 -22883 -146824 -38972
$$ packed form
11971b10394J10153o6417J1232K924j92767M8634p3355J89213J6551J7057j7548
11960a64717k4998R7068P908O3162o3352j84606J47111J3152o8812r371P825l3681
11948b13311k2557J18622m7501q8798J6462J00564j61920M4321R7879l5593M551
11937a87281n6878K5743J44766o8433Q3694q4966n6858j0591J31949J0791j29250
11926a97314O4640j44618O6161J7881J3234j06667J98675j18982j9124J22526
11916a03588j6385l2105M0881l1864j56566R8299j01328J3591J90667k0059p6957
11905a95414M9798o2983J6374R8734q0755P2114p3705J6184k5179p2199Q6681
11894a70350j6897J12799k55514P0630k7952p0307R2074K39513L121j23941J07852
$$ plain form
11883 -38972 -108361 -274324 -165541 -136347 -188137 -270937 -185152 -53876 -220738 -176440 -181545
11872 -181545 -184198 -184175 -204542 -147328 -237968 -109006 -141568 -98028 -139771 -215634 -241586 -275927
11860 -275927 -155735 -250502 -153990 -156485 -108812 -190816 -198586 -163427 -158169 -181414 -153799 -178400
11848 -178400 -188144 -167577 -141154 10822 -94119 -80749 -265335 -185919 -106730 -172993 -237381
11837 -237381 -313495 -119510 -136129 -203102 -192845 -219042 -197399 -195139 -207131 -276253 -169047
11826 -169047 -74723 -161145 -118782 -169618 -186368 -293563 -268917 -327406 -183284 -226445 -261737
11815 -261737 -192120 -140228 -230956 -296179 -233035 -153215 -93096 -254656 -262584 -127571 -113720
11804 -113720 -150491 -103241 -270877 -187441 -231516 -338267 -184251 -250394 -198337 -162141 -119605
$$ packed form
11883c8972o9389j65963J08783K9194n1790q2800Q5785J31276j66862M4298n105
11872a81545k653K3k0367N7214r0640J28962l2562M3540m1743p5863k5952l4341
11860b75927J20192r4767R6512k495M7673q2004p770L5159N258k3245K7615k4601
11848a78400r744K0567K6423J51976j04941J3370j84586P9416P9189o6263o4388
11837b37381p6114J93985j6619o6973J0257k6197K1643K260j1992o9122J07206
11826a69047R4324q6422M2363n0836j6750j07195K4646n8489J44122m3161l5292
11815b61737O9617N1892r0728o5223O3144P9820O0119j61560p928J35013J3851
11804a13720l6771M7250j67636Q3436m4075j06751J54016o6143N2057L6196M2536
$$ plain form
11793 -119605 -148460 -214865 -168671 -238109 -225344 -345594 -257498 -321694 -167903 -132402 -164299
11782 -164299 -59371 -179648 -130943 -308042 -207600 -193985 -130656 -244879 -161129 -239074
11772 -239074 -141911 -200304 -148370 -136994 -145770 -322449 -163937 -150984 -164590 11550 -126922
11761 -126922 -188937 -190933 -207816 -131889 -44099 -172939 -200968 -152533 -198171 -163858 -316130
11750 -316130 -104823 -110889 -203742 -127781 -274172 -198748 -231612 -175233 -104560 -111628 -241588
11739 -241588 -186208 -143352 -132463 -268611 -261408 -209033 -118267 -199115 -137014 -224819 -116219
11728 -116219 -221555 -155406 -228034 -244139 -254447 -206281 -96411 -114945 -108113 -148118 -305337
11717 -305337 -200758 -224657 -238396 -216742 -156971 -214989 -243744 -192783 -373944 -178906 -129958
$$ packed form
11793a19605k8855o6405M6194o9438J2765j20250Q8096o4196J53791L5501l1897
11782a64299J04928j20277M8705j77099J00442J3615O3329j14223Q3750p7945
11772b39074R7163n8393N1934J1376q776j76679J58512J2953j3606J76140j38472
11761a26922o2015j996j6883P5927Q7790j28840k8029M8435m5638L4313j52272
11750c16130K11307o066r2853P5961j46391P5424l2864N6379P0673p068j29960
11739b41588N5380M2856J0889j36148P203N2375R0766q0848O2101q7805J08600
11728a16219j05336O6149p2628j6105j0308M8166J09870j8534O832m0005j57219
11717c05337J04579k3899j3739K1654N9771n8018k8755N0961j81161J95038M8948
$$ plain form
11706 -129958 -111736 -113423 -142022 -232217 -125069 -190084 -143079 -179790 -348679 -261840 -218649
11695 -218649 -213259 -178556 -200702 -187121 -186228 -178539 -162345 -194245 -78721 -103880 -188920 -295802
11683 -295802 -127713 -251541 -114466 -109102 -75908 -111574 -192036 -148010 -201010 -146783 -196228
11672 -196228 -111207 -179235 -34164 -117409 -166361 -250636 -44664 -191669 -165300 -147428 -239447
11661 -239447 -219549 -149122 -183173 -104203 -74163 -173481 -192203 -241010 -144876 -229774 -195314
11650 -195314 -141820 -187246 -141780 -213977 -166263 -83158 -330178 -221251 -264066 -317078 -240054
11639 -240054 -117209 -161712 -140348 -48571 -96031 -176301 -103603 -84449 -197807 -126531 -117009
11628 -117009 -142237 -117329 -241780 -147438 -137381 -190501 -199860 -285914 -215953 -232409 -108796
$$ packed form
11706a29958J8222j687k8599r0195J07148o5015M7005l6711j68889Q6839M3191
11695b18649N390L4703k2146J3581Q93P689J6194l1900J15524k5159q5040j06882
11683b95802J68089j23828J37075N364L3194l5666q0462M4026n3000N4227m9445
11672a96228Q5021o8028J45071q3245m8952q4275K05972j47005K6369J7872r2019
11661b39447J9898P0427l4051P8970L0040r9318j8722m8807R6134q4898L4460
11650a95314N3494m5426M5466p2197M7714Q3105k47020J08927m2815n3012P7024
11639b40054J22845m4503K1364R1777m7460q0270P2698J9154j13358P1276R522
11628a17009k5228K4908j24451R4342J0057n3120r359q6054O9961j6456J23613
$$ plain form
11617 -108796 -105939 -142316 -82125 -197154 -155374 -89122 -227887 -238528 -197839 -241369 -322829
11606 -322829 -155862 -110558 -179454 -176037 -204911 -212517 -207857 -286341 19623 -140901 -145566 -56395
11594 -56395 -42604 -171131 -147994 -162271 -186153 -163738 -166243 -231782 -132783 -162680 -174717 -172686
11582 -172686 -127984 -204501 -182191 -193659 -108313 -148830 -172408 -19127 -238948 -221489 -214664
11571 -214664 -117427 -199088 -192727 -37196 -232481 -130724 -203936 -46505 -141469 -147886 -48134
11560 -48134 -254962 -54414 -135678 -192981 -229691 -177583 -74562 -235000 -118292 -73807 -153434
11549 -153434 -141788 -122285 -174928 -127154 -131654 -179391 -256631 -108579 -120617 -92141 -241505
11538 -241505 -162531 -239577 -185188 -146603 -150056 -89052 -147023 -58472 -248097 -164220 -243307
$$ packed form
11617a08796K857l6377O0191j15029M1780O6252j38765j0641M0689m3530q1460
11606c22829J66967M5304o8896L417k8874p606M660p8484L05964j60524m665Q9171
11594e6395J3791j28527K3137j4277k3882K2415k505o5539R8999k9897j2037K031
11582a72686M4702p6517K2310j1468Q5346m0517k3578J53281k19821J7459O825
11571b14664R7237q1661O361J55531j95285J01757p3212J57431r4964o417R9752
11560d8134k06828K00548q1264n7303l6710N2108J03021j60438J16708M4485p9627
11549a53434J1646J9503n2643M7774m500m7737p7240J48052j2038K8476j49364
11538b41505P8974p7046N4389L8585l453O1004n7971Q8551j89625Q3877p9087
$$ plain form
11527 -243307 -192711 -144553 -202920 -220343 -194075 -89094 -219086 -143518 -263859 -158444 -133682
11516 -133682 -147622 -324637 -149953 -100119 -93057 -161557 -193037 -189215 -151701 -119109 -221310
11505 -221310 -166183 -150131 -241203 -176462 -93436 -93029 -245888 -226757 -236482 -153527 -188994 -192816
11493 -192816 -183375 -261099 -266060 -127572 -162465 -246871 -204413 -118402 -181127 -161741 -240106 -217235
11481 -217235 -181847 -122000 -120665 -126670 -104997 -122780 -228828 -145109 -160252 -140647 -98539 -44971
11469 -44971 -166469 -266454 -201031 -113500 -239989 -182543 -114464 -123849 -173766 -80368 -155696
11458 -155696 -163518 -34342 -248105 -291510 -234610 -222994 -197414 -248237 -214608 -202117 -133978
11447 -133978 -146208 -75010 -159662 -196815 -145713 -145809 -70394 -175533 -108202 -138794 -207493 -56407
$$ packed form
11527b43307N0596M8158n8367j7423K6268J04981j29992P5568j20341J05415K4762
11516a33682j3940j77015J74684M9834P062o8500l1480L822L7514L2592j02201
11505b21310N5127J6052r1072O4741Q3026M07j52859J9131r725Q2955l5467l822
11493a92816R441p7724m961J38488l4893q4406M2458Q6011o2725J9386p8365K2871
11481b17235L5388N9847J335o005K1673j7783j06048Q3719j5143J9605M2108N3568
11469d4971j21498r9985O5423Q7531j26489N7446O8079r385m9917R3398p5328
11458a55696p822J29176k13763m3405N6900J1616K5580n0823L3629J2491O8139
11447a33978j2230P1198q4652l7153N1102r6P5415j05139O7331l0592o8699J51086
$$ plain form
11435 -56407 -153579 -140922 -187623 -189871 -174322 -193581 -144644 -298405 -201575 -125168 -158994 -208826
11423 -208826 -210868 -113204 -159167 -212663 -217536 -76995 -239582 -90741 -128620 -146528 -231825
11412 -231825 -214338 -179088 -293569 -123445 -129790 -202748 -162156 -146600 -117950 -23005 -186434
11401 -186434 -142155 -197124 -219636 -106201 -139223 -230316 -168992 -45127 -295406 -222851 -192681
11390 -192681 -223453 -108244 -52415 -159306 -151673 -55507 -218025 -117291 -175273 -134455 -171315
11379 -171315 -196276 -170410 -193343 -141207 -67366 -201832 -47986 -255526 -111329 -118846 -231105
11368 -231105 -166840 -165376 -120302 -286549 -275420 -279027 -114544 -64509 -217676 -172321 -92832
11357 -92832 -233557 -154433 -106415 -162088 -120846 -263718 -203876 -126343 -266711 -223842 -189034
$$ packed form
11435e6407r7172J2657m6701k248J5549j9259M8937j53761R6830P6407l3826m9832
11423b08826k042R7664m5963n3496m873J40541j62587J48841l7879j7908q5297
11412b31825J7487L5250j14481J70124o345p2958M0592J5556K8650R4945j63429
11401a86434M4279n4969k2512J13435l3022r1093O1324J23865k50279P2555L0170
11390a92681l0772J15209N5829j06891P633R6166j62518J00734n7982M0818l6860
11379a71315k4961K5866k2933N2136P3841j34466J53846k07540J44197p517j12259
11368b31105O4265J464M5074j66247J1129l607J64483N0035j53167M5355P9489
11357i2832j40725P9124M8018n5673M1242j42872N9842P7533j40368M2869L4808
$$ plain form
11346 -189034 -139256 -169351 -173476 -142825 -93773 -104444 -63322 -262478 -145748 -128861 -250647
11335 -250647 -152942 -97003 -152548 -288287 -133714 -243318 -235140 -234053 -51786 -194928 -239943
11324 -239943 -104510 -241856 -192722 -199981 -172918 -175886 -224596 -82314 -206382 -183924 -64676
11313 -64676 -105265 -196778 -246696 -95891 -247144 -237218 -194954 -163711 -135396 -133084 -197790 -204458
11301 -204458 -162752 -87310 -9457 -123143 -72236 -158304 -176421 -122144 -151944 -175755 -200839
11290 -200839 -181663 -165570 -222553 -200751 -163576 -306563 -120170 -106049 -180672 -148779 -191456
11279 -191456 -167205 -165282 -97939 -211879 -198079 -152147 -175078 -36653 -128858 -59106 -175097
11268 -175097 -176281 -322835 -166107 -200740 -133156 -200225 -90211 -192403 -203708 -159423 -199773
$$ packed form
11346a89034M9778l0095m125L0651M9052j0671M1122j99156J16730J6887j21786
11335b50647R7705N5939n5545j35739J54573j09604Q178J087J82267j43142m5015
11324b39943J35433j37346M9134p259K7063k968m8710J42282j24068K2458J19248
11313f4676m0589r1513m9918J50805j51253R926M2264L1243K8315K312o4706o668
11301b04458M1706P5442P7853j13686N0907q6068j8117N4277k9800k3811k5084
11290b00839J9176J6093n6983K1802L7175j42987J86393J4121p4623L1893m2677
11279a91456K4251J923O7343j13940J3800M5932k2931J38425r2205O9752j15991
11268a75097j184j46554J56728l4633O7584o7069J10014j02192j1305M4285m0350
$$ plain form
11257 -199773 -21351 -219944 -137157 -202507 -147158 -239449 -143244 -160188 -254502 -146059 -170404
11246 -170404 -185322 -246053 -160378 -189468 -184917 -270203 -250642 -165047 -147566 -253830 -6578
11235 -6578 -110747 -213811 -174799 -134750 -172378 -118232 -105203 -186169 -104823 -163610 -159059 -52497
11223 -52497 -32031 -169495 -231984 -163626 -188839 -131508 -227176 -201735 -7191 -70849 -136920
11212 -136920 -184802 -182875 -155823 -130606 -121839 -184866 -173517 -186742 -144056 -72660 -209551 -185855
11200 -185855 -301622 -220891 -133111 -239047 -222298 -259810 -56686 -133787 -122232 -155138 -253738
11189 -253738 -47504 -201020 -126667 -212551 -104063 -142891 -62129 -217000 -195040 -77917
11179 -77917 -139157 -129277 -200113 -322869 -146356 -162990 -103241 -93692 -89433 -172070 -150327 -117548
$$ packed form
11257a99773J78422j98593Q2787o5350N5349r2291R6205j6944r4314J08443k4345
11246a70404j4918o0731Q5675k9090M551q5286J9561Q5595J7481j06264K47252
11235f578j04169j03064L9012M0049l7628N4146J3029q0966Q1346n8787M551J06562
11223e2497K0466j37464o2489O8358k5213N7331r5668K5441J94544o3658o6071
11212a36920m7882J927K7052K5217Q767o3027J1349j3225M2686P1396j36891K3696
11200a85855j15767Q0731Q7780j05936J6749l7512K03124p7101J1555l2906r8600
11189b53738K06234j53516P4353q5884J08488l8828Q0762j54871K1960J17123
11179g7917o1240R880p0836j22756J76513j6634N9749R549M259q2637K1743L2779
$$ plain form
11167 -117548 -237427 -59242 -154034 -11781 -285014 -135970 -112549 -204053 -199559 -195975 -258589
11156 -258589 -300360 -143573 -132607 -105195 -95503 -148764 -191901 -92193 -270650 -92091 -175863
11145 -175863 -132336 -198379 -105136 -55689 -145889 -113945 -106045 -156889 -219491 -191757 -267188 -110173
11133 -110173 -243142 -151127 -59747 -39442 -156007 -118483 -205129 -235135 -128895 -187411 -76686
11122 -76686 -248273 -104867 -191039 -270635 -250580 -189361 -187023 -184552 -200054 -76504 -99981
11111 -99981 -51707 -119194 -156491 -101623 -12782 -142232 -100842 -63450 -124624 -130590 -70160 -125024
11099 -125024 -154058 -178903 -109019 -183335 -120412 -137080 -180214 -147511 -162493 -69762 -156033
11088 -156033 -42742 -160254 -205959 -130329 -187272 -132798 -133829 -186286 -174003 -162255 -193579
$$ packed form
11167a17548j19879J78185r4792J42253k73233J49044K3421r1504M494L584o2614
11156b58589m1771J56787J0966K7412R692n3261m3137R9708j78457J78559q3772
11145a75863M3527o6043R3243M9447r0200L1944P900n0844o2602K7734p5431J57015
11133a10173j32969R2015R1380K0305j16565L7524q6646l0006J06240n8516J10725
11122g6686j71587J43406q6172p9596K0055O1219K338K471j5502J23550k3477
11111i9981M8274o7487l7297N4868Q8841j29450M1390L7392o1174n966O0430n4864
11099a25024k9034k4845O9884p4316O2923j6668m3134L2703j4982R2731q6271
11088a56033J13291j17512m5705P5630n6943N4474j031n2457J2283J1748l1324
$$ plain form
11077 -193579 -80030 -225500 -171326 -263037 -235979 -230206 -50562 -73800 -148987 -207287 -78217
11066 -78217 -183219 -165774 -239901 -172945 -112739 -134989 -183265 -121262 -64181 -114801 -135056
11055 -135056 -155648 -141643 -160953 -153612 -136867 -66710 -115971 -181034 -162508 -199445 -145669 -231345
11043 -231345 -117224 -187449 -220515 -121289 -121944 -105900 -118906 -128227 -38690 -168221 -120633 -235798
11031 -235798 -158144 -181825 -124887 -187519 -100943 -28101 -116640 -110114 -140140 9724 -211023
11020 -211023 -164581 -98601 -129881 -116753 -131702 -63207 -95875 -179561 -201602 -197203 -181504 -162227
11008 -162227 -47540 -172904 -74316 -104875 -151382 -148251 -91641 -170814 -241618 -38121 -145338
10997 -145338 -162235 -68982 -178605 -100045 -167656 -180374 -245568 -283856 -147300 -228461 -90982
$$ packed form
11077a93579J13549j45470N4174r1711K7058N773J79644k3238p5187n8300J29070
11066g8217j05002J7445p4127O6956O0206k2250m8276O2003N7081n0620k0255
11055a35056k0592J4005j9310P341J6745P0157m9261o5063J8526l6937N3776q5676
11043b31345J14121p0225l3066R9226o55J6044j3006r321Q9537j29531M7588j15165
11031b35798P7654k3681N6938o2632Q6576P2842q8539O526l0026J49864k20747
11020b11023M6442O5980l1280J3128j4949O8495l2668q3686k2041M399J5699J9277
11008a62227J14687j25364R8588l0559m6507L131N6610p9173p0804K03497j07217
10997a45338j6897R3253j09623P8560o7611j2718o5194l8288J36556q1161J37479
$$ plain form
10986 -90982 -56038 -69588 -206282 -161006 -81822 -121239 -182367 -117556 -160582 -128529 -120350 -84441
10974 -84441 -197664 -233024 -105235 -69975 -226750 -169195 -99724 -146644 -115143 -90508 -163104
10963 -163104 -138419 -198847 -125018 -122722 -169306 -96957 -148266 -129559 -195635 -139617 -176943 -93757
10951 -93757 -88938 -156137 -168594 -77260 -249185 -188320 -223018 -143858 -76699 -103566 -208190
10940 -208190 -105562 -167667 -166326 -136711 -88337 -158962 -137236 -77118 -128747 -136232 -248057
10929 -248057 -256857 -174510 -205975 5486 -170938 -69388 -172199 -86782 -286851 -238355 -157825
10918 -157825 -145277 -162343 -135575 -175706 -86765 -23559 -186520 -117233 -118678 -217339 -153503
10907 -153503 -135188 -177403 -286823 -130373 -196532 -125391 -142835 -143282 -109571 -58742 -34114
$$ packed form
10986i0982L4944j3550j36694M5276P9184l9417o1128O4811m3026L2053Q179L5909
10974h4441j13223l5360J27789L5260j56775N7555O9471m6920L1501K4635p2596
10963a63104K4685o0428P3829K296m6584P2349n1309J8707o6076N6018l7326Q3186
10951i3757M819o7199j2457R1334j71925O0865l4698P9160O7159k6867j04624
10940b08190J02628o2105J341K9615M8374p0625K1726O0118n1629p485j11825
10929b48057q800Q2347l1465K11461j76424J01550j02811Q5417k00069M8496Q0530
10918a57825J2548j7066K6768m0131Q8941O3206j62961O9287j445r8661O3836
10907a53503J8315m2215j09420J56450o6159P1141j7444m47L3711N0829K4628
$$ plain form
10896 -34114 -65826 -119903 -145421 -135950 -73111 -73646 -103867 -123591 -188669 -183270 -145889 -248064
10884 -248064 -177152 -99626 -73915 -146158 -161926 -47198 -67587 -114692 -162540 -73195 -166604
10873 -166604 -106364 -128885 -82687 -69317 -220939 -165413 -153338 -195006 -252758 -40414 -166559
10862 -166559 15554 -152866 -231649 -128257 -39738 -199579 -55713 -63973 1357 -165312
10852 -165312 -104958 -95345 -58059 2335 -87136 -90854 -86675 -130875 -266066 -186823 -118537 -231638
10840 -231638 -234891 -154658 -93417 -225066 -130267 -180766 -122193 -226323 -230832 -122268 -143012
10829 -143012 -22894 -106739 -161045 -154518 -172718 -190219 -111345 -152310 -107784 -86113 -120322
10818 -120322 -203390 -144383 -130243 -136631 -66288 -182611 -85470 -88616 -204295 -121092 53591
$$ packed form
10896c4114l1712n4077k5518R471O2839n35l0221j9724o5078N399L7381j02175
10884b48064P0912P7526K5711p2243j5768J14728k0389m7105m7848Q9345r3409
10873a66604O0240k2521M6198J3370j51622N5526J2075m1668n7752K12344j26145
10862a66559J82113j68420p8783J03392Q8519j59841J43866q260O5330j66669
10852a65312O0354R613L7286O0394q9471l718M179m4200j35191P9243O8286j13101
10840b31638l253Q0233O1241j31649R4799n0499N8573j04130m509J08564k0744
10829a43012J20118q3845n4306O527j8200j7501P8874m0965M4526K1671l4209
10818a20322q3068N9007J4140o388P0343j16323R7141l146j15679Q3203J74683
$$ plain form
10807 53591 -54877 -120861 -26832 -82545 -128369 -96359 -191713 -135170 -182414 -96132 -193734
10796 -193734 -174714 -189289 -123314 -224864 -237987 941 -177374 -104779 -53042 14924 -95356
10785 -95356 -164568 -142613 -111946 -104841 -220659 -96601 -186010 -111753 -147942 -266226 -100026
10774 -100026 -107888 -119734 -125558 -3308 -153372 -180136 -139693 -134796 -71766 -115610 -198302 -113195
10762 -113195 -135072 -178383 -68042 -208833 -177658 -184400 -118781 -68352 -94108 -79019 -210226
10751 -210226 -135107 -111426 -94381 -251679 -6332 -173403 -137235 -76744 -17689 -212081 -196409
10740 -196409 -178856 -66661 -161811 -188568 -50061 -142938 -182637 -14472 -72965 -144437 -151045
10729 -151045 -178864 -258923 -41035 -82406 -217797 -178574 -45040 -175183 -143988 -150447 21066
$$ packed form
10807E3591j08468o5984R4029n5713m5824L2010r5354N6543m7244Q6282r7602
10796a93734J9020j4575O5975j01550j3123K38928j78315P2595N1737O7966j10280
10785i5356o9212K1955L0667P105j15818J24058q9409P4257l6189j18284J66200
10774a00026p862j1846n824J22250j50064k6764M0443M897O3030m3844q2692Q5107
10762a13195k1877m3311J10341j40791L1175o742O5619N0429k5756J5089j31207
10751b10226P5119K3681J7045j57298K45347j67071L6168O0491N9055j94392J5672
10740a96409J7553J12195r5150k6757J38507r2877l9699J68165n8493p1472o608
10729a51045k7819q0059K17888m1371j35391L9223J33534j30143L1195o459J71513
$$ plain form
10718 21066 -196513 -154579 -111941 -4765 -182335 -206766 -133408 -173573 -184597 -77248 -251466
10707 -251466 -162096 -41153 -109412 -173316 66615 -139031 -114211 -174019 -101998 -90576 -204601
10696 -204601 -70170 -139092 -138939 -112373 -86229 -142698 -127364 -105841 -243473 -175855 -119349
10685 -119349 -20572 -42794 -114390 -172524 -210650 -197123 -113376 -60009 -227803 -137844 -23832
10674 -23832 -178792 -200945 -95351 -81915 -216194 -166601 3328 -249534 -42858 -46682 -123686
10663 -123686 -137015 -58657 -43371 -213818 -120185 -76794 -308465 -217671 -69834 -76713 -180019
10652 -180019 -89035 -114664 -163523 -129322 -25562 -188143 -116271 -101399 -144646 -62426 -190385
10641 -190385 -34586 -216519 -228554 -70230 -180136 -45340 -56674 360 -98937 -213722
$$ packed form
10718B1066k17579M1934M2638J07176j77570k4431P3358m0165j1024J07349j74218
10707b51466Q9370J20943o8259o3904K39931k05646K4820n9808P2021J1422j14025
10696b04601J34431o8922J53K6566K6144n6469J5334K1523j37632O7618N6506
10685a19349R8777k2222p1596n8134l8126J3527Q3747N3367j67794Q9959J14012
10674b3832j54960k2153J05594J3436j34279M9593J69929k52862K06676l824p7004
10663a23686j3329P8358J5286j70447R3633M3391k31671R0794J47837o879j03306
10652a80019R0984k5629m8859L4201J03760j62581P1872J4872m3247Q2220j27959
10641a90385J55799j81933j2035J58324j09906J34796j1334N7034r9297j14785
$$ plain form
10631 -213722 -104964 -88560 -147785 -195084 -62041 -178039 -237862 -127505 -95327 -155395 -175723
10620 -175723 -149873 -158651 -123987 -159129 -56584 -220181 -80374 -76223 -226411 -130487 -13626
10609 -13626 -108031 -68269 -111540 -145496 -190487 -245695 -119135 -192509 -47313 -137050 -167873
10598 -167873 -196117 -104410 -151926 -180982 -141769 -230061 -100398 -60502 -48744 -196288 -198062
10587 -198062 -138971 -200283 -104956 -136376 -144729 -202760 -161409 -54046 -101695 -137606 -25878
10576 -25878 -133321 -152228 -42514 -121502 -137611 -124906 -73886 -274417 -46595 -175634 -35238
10565 -35238 -171778 -224400 -90385 -213870 -108312 -43483 -61429 -179021 -150866 -180950 -82941
10554 -82941 -164972 -155886 -99235 -127850 -140852 -173599 -235633 -183400 -12827 -231932 -69426
$$ packed form
10631b13722J08758J6404n9225m7299J33043j15998n9823J10357L2178o0068k0328
10620a75723K5850q778L4664l5142J02545j63597J39807M151j50188R5924J16861
10609a3626r4405L9762m3271l3956m4991n5208J26560p3374J45196q9737l0823
10598a67873k8244R1707m7516k9056L9213q8292J29663L9896J1758j47544j774
10587a98062N9091o1312R5327l1420q353n8031M1351J07363m7649l5911J11728
10576b5878j07443j8907J09714p8988j6109J2705N1020k00531K27822j29039J40396
10565c5238j36540n2622J34015j23485J05558O4829j7946j17592K8155l0084R8009
10554h2941q2031R086N6651k8615j3002l2747o2034N2233J70573k19105J62506
$$ plain form
10543 -69426 -5462 -151036 -143601 -95582 -55204 -121067 -107561 -166187 -101414 -141586 -140917 -111776
10531 -111776 -98770 -115748 -184242 -124468 -188429 -154669 -96656 -163078 -52382 -22820 -147000
10520 -147000 -116198 -70544 -127403 -110965 -172208 -220757 -229752 -148076 -158992 -242516 -158318 -109523
10508 -109523 -154463 -74522 -144835 -140052 -36194 -57983 1461 -77896 -167474 -66876 -220673
10497 -220673 -153830 -139041 -195826 -138752 -201121 -74528 -50684 -55504 -115809 -164990 -107559
10486 -107559 -158476 -220302 -13228 -98009 -79626 -36086 -225990 -115892 -147054 -126247 -189861
10475 -189861 -161400 -126764 -59073 -152703 -121014 -135494 -204198 -108997 -159060 -134619 -244360
10464 -244360 -25070 -70124 -100424 -131508 -167396 -91579 -171695 -108512 -162792 7448 -90989
$$ packed form
10543f9426O3964j45574P435M8019M0378o5863J3506n8626O4773m0172O69K9141
10531a11776J3006j6978o8494N9774o3961L3760N8013o6422J10696K9562j24180
10520a47000L0802M5654n6859J6438o1243m8549q995Q1676j0916q3524Q4198M8795
10508a09523m4940P9941p0313M783J03858k1789N9444p9357q9578J00598j53797
10497b20673O6843J4789n6785N7074o2369J26593K3844m820o0305m9181N7431
10486a07559n0917o1826K07074q4781J8383M3540j89904J10098l1162K0807o3614
10475a89861K8461L4636O7691r3630L1689j4480o8704R5201n0063K4441j09741
10464b44360K19290m5054l0300l1084l5888P5817q0116O3183n4280J70240r8437
$$ plain form
10453 -90989 -41980 -2672 -104434 -71398 -95440 -102539 -140116 -225421 -171974 -4784 -123566
10442 -123566 -102767 -152027 -52538 -103024 -165832 -93332 -74663 -153629 -117945 -159926 -163959 5913
10430 5913 -245331 -153826 -95961 -198571 -183220 -263458 -91314 -74997 -63127 -37481 -118564
10419 -118564 7413 -180643 -194652 -115315 -34645 -68195 -211534 -170533 -117730 -108294 -149128
10408 -149128 17944 -55689 -143613 -205372 -220409 -166933 -249912 -135278 -57715 -107326 -85119
10397 -85119 -79642 -122077 -162208 -103934 -264579 -210790 -45049 -161146 -117703 -76051 -88884
10386 -88884 -147134 -150712 -125194 -238349 -126469 -137744 -108924 -108236 -90611 -133860 -138582 -100959
10374 -100959 -132600 -116918 -161341 -103391 -167018 -152793 -169097 -134560 -222655 -149485 -131603
$$ packed form
10453i0989M9009L9308j01762L3036k4042p099l7577q5305N3447J67190j18782
10442a23566K0799m9260R9489n0486o2808P2500J8669p8966L5684m1981m033J69872
10430E913k51244R1505N7865j02610J5351q0238J72144J6317J1870K5646q1083
10419a18564J25977j88056j4009P9337Q0670l3550j43339M1001N2803R436m0834
10408a49128J67072p3633q7924o1759j5037N3476q2979J14634P7563m9611K2207
10397h5119N477m2435m0131N8274j60645N3789J65741j16097M3443M1652j2833
10386h8884n8250l578K5518j13155J11880j1275K8820O88J7625m3249m722L7623
10374a00959l1641J5682m4423N7950o3627J4225j6304L4537q8095P3170J7882
$$ plain form
10363 -131603 -212986 -73165 -139014 -145659 -142246 -2576 -147345 -136151 -106918 -153859 -140055
10352 -140055 -177052 -78380 -200678 -120890 -124962 -32475 -111003 -164846 -77961 -228166 -96770
10341 -96770 -260585 -109603 -88402 -23037 -93998 -158047 -28130 -93972 -56466 -180403 -73113
10330 -73113 -124618 -206341 -119285 -71351 -161073 -156208 -3729 -26498 -63466 -155316 -71357 -162479
10318 -162479 -76619 -155549 -105817 -95342 -182045 -201839 -97420 -162718 -189961 -157087 -117096
10307 -117096 -166270 -150264 -224575 -92446 -95943 -165860 -124917 -187291 -40292 -89239 -154800
10296 -154800 -154242 -152088 -37121 -195287 -112662 -281170 -132866 -84561 -117180 -3711 -162582
10285 -162582 -162710 -107867 -174015 -122481 -95191 -125519 -148286 -9468 -137563 -66266 -52785
$$ packed form
10363a31603q1383J39821o5849o645L413J39670j44769J1194K9233m6941J3804
10352a40055l6997R8672j22298P9788m072R2487p8528n3843Q6885j50205J31396
10341i6770j63815J50982K1201O5365p0961o4049J29917o5842L7506j23937J07290
10330g3113n1505q1723Q7056M7934q9722M865J52479k2769l6968r1850Q3959r1122
10318a62479Q5860p8930M9732J0475q6703j9794J04419o5298k7243L2874L9991
10307a17096m9174J6006p4311J32129l497o9917M0943o2374J46999m8947o5561
10296a54800N58K154J14967j58166Q2625j68508J48304M8305l2619J13469j58871
10285a62582j28N4843o6148N1534K7290l0328k2767J38818j28095P1297J3481
$$ plain form
10274 -52785 -45477 -85514 -107278 -14405 -148450 -207036 -151164 -161945 -70948 -165316 7861
10263 7861 -127158 -109379 -9369 -90638 -77538 -232671 -183185 -108789 -127404 -60584 -127875
10252 -127875 -85860 -48322 -19450 -34244 -100564 -71159 -171539 -128863 -237689 -160034 -64793
10241 -64793 -188388 15485 -76980 19 -172128 -116535 -193757 -95603 -110488 -168731 -110208
10230 -110208 -152212 -23205 -186654 10867 -86565 -96710 -139502 -103651 -155607 -139235 -58339
10219 -58339 -8780 -73838 -186343 -97559 -80196 -96990 -213166 -16637 -37448 -74683 -82398
10208 -82398 -198903 -127267 -158373 -83978 -179036 -99952 -201536 -105845 -96662 -57519 -44924
10197 -44924 -122206 -191300 -140096 -129206 -155370 -127796 -90600 -149567 -221124 -163486 -120667 -192531
$$ packed form
10274e2785P308m0037k1764R2873j34045n8586N5872j0781R0997r4368J73177
10263G861j35019J7779J00010q1269J3100j55133M9486P4396j8615O6820o7291
10252a27875M2015L7538K8872j4794o6320K9405j00380M2676j08826P7655R5241
10241f4793j23595K03873r2465P6999j72147N5593p7222R8154j4885n8243N8523
10230a10208m2004J29007j63449J97521r7432j0145m2792L5851n1956J6372Q0896
10219e8339M9559o5058j12505Q8784J7363j6794j16176J96529k0811l7235p715
10208h2398j16505P1636l1106P4395r5058P9084j01584R5691R183L9143J2595
10197d4924p7282o9094N1204J0890k6164K7574L7196n8967p1557N7638M2819p1864
$$ plain form
10185 -192531 -115925 -112593 -183069 -165230 -127046 -126208 -68315 -140753 -145120 -139312 -84727 -46944
10173 -46944 -102885 -103089 25338 -118914 -168586 -30120 -147226 -206342 -89951 -147507 -130259
10162 -130259 -220869 -147066 -149224 -112636 -101108 3822 18329 -58741 -132312 -83577 -128192
10151 -128192 -28111 -122143 -50276 -108622 -103755 -181421 -91185 -28305 -135511 -211986 -70004
10140 -70004 -39963 -70599 2985 -29353 -49667 -98599 -172086 -248503 -151001 -55130 -153670 -31033
10128 -31033 -116102 -126033 -177796 -100958 50786 -122690 -205248 -51929 -112526 -227801 -176263
10117 -176263 -48326 -61681 -116852 -30150 -248679 -141607 -100195 -107094 -177058 -140220 -133911
10106 -133911 -162711 -120137 5251 -118583 -281018 -71060 -100265 -211664 -197796 -25141
$$ packed form
10185a92531P6606L332p0476J7839L8184Q38N7893p2438m367N808N4585L7783
10173d6944n5941k04J28427j44252m9672J38466j17106n9116J16391n7556J7248
10162a30259r0610P3803k158L6588J1528J04930J4507p7070p3571M8735m4615
10151a28192J00081r4032P1867n8346M867p7666R0236O2880j07206p6475J41982
10140g0004L0041l0636P3584l2338k0314m8932p3487p6417R7502R5871r8540J22637
10128c1033q5069r931n1763P6838J51744j73476q2558J53319o0597j15275N1538
10117a76263J27937j3355n5171Q6702k18529J07072M1412o899o9964L6838O309
10106a33911k8800M2574J25388j23834j62435K09958k9205j11399J3868J72655
$$ plain form
10096 -25141 -13450 -3706 -56748 -52669 -121604 -203641 -84590 -150401 -45500 -38109 -101570 -114523
10084 -114523 -42909 16898 -246393 33483 -34632 -53699 -180434 -114989 -122418 -52271 -31225
10073 -31225 -115659 -42402 -164498 11549 -146081 -10797 -91433 -41339 -145309 -232928 28292
10062 28292 -183347 -128750 -247851 -109610 -197992 -89460 -125637 -123502 -66768 -158268 -44489
10051 -44489 -211670 -122493 10702 -105407 54765 -39819 -153914 -114726 -127578 -167030 -162109
10040 -162109 28991 -106665 -61721 -65602 28097 -116870 -93926 -16175 -92381 -123447 -117660
10029 -117660 -119780 -190045 -59662 15513 -121136 -114640 -22054 -17340 -38537 -101745 -43445 -116377
10017 -116377 -51575 -100277 -170561 -64652 -29702 164222 -51146 64420 104161 87457 38805
$$ packed form
10096b5141J1691R744n3042M079o8935q2037J19051o5811J04901P391o3461j2953
10084a14523P1614N9807k63291K79876o8115j9067j26735O5445p429P0147K1046
10073c1225q4434P3257j22096J76047j57630J35284q0636N0094j03970q7619K61220
10062B8292k11639N4597j19101J38241q8382J08532l6177K135N6734r1500J13779
10051d4489j67181Q9177J33195j16109J60172r4584j14095L9188j2852l9452M921
10040a62109J91100j35656M4944l881R3699j44967K2944P7751p6206l1066N787
10029a17660k120p0265J30383P5175j36649O496R2586M714k1197o3208N8300p2932
10017a16377O4802m8702p0284J05909L4950J93924k15368J15566L9741j6704m8652
$$ plain form
10006 38805 152190 150626 16693 140974 88889 -67209 86082 84225 129486 -55540 4004
9995 4004 96684 -85951 -23218 -144058 -17728 -110126 -213802 -33088 -4590 -45249 -49120
9984 -49120 113404 -91759 9206 -104677 -156290 -108568 -41754 -158832 -66063 -27541 -108527
9973 -108527 -158433 -81848 -59034 -61477 -174344 -60894 -33361 -132254 -59046 72546 -150029
9962 -150029 9 -70192 -70309 -149845 43449 -94146 -193012 -74569 -42741 -122714 -69359
9951 -69359 1432 -178994 -158228 -170686 -68464 -98548 -103729 -57048 55638 -67128 -64561
9940 -64561 -137590 -146102 -118145 44827 14634 -6894 60270 -60538 -65180 -91919 5767 -73178
9928 -73178 -104536 -117959 -111345 -131409 -80762 -46204 -14139 -90120 67707 -105134 -62776 -11937
$$ packed form
10006C8805J13385j564j33933J24281n2085j56098J53291j857M5261j85026N9544
9995D004R2680j82635O2733j20840J26330r2398j03676J80714K8498m0659l871
9984d9120J62524k05163J00965j13883n1613M7722O6814j17078R2769L8522q0986
9973a08527m9906P6585K2814k443j12867J13450K7533r8893P3208J31592k22575
9962a50029J50038p0201j17p9536J93294j37595r8866J18443L1828p9973N3355
9951f9359P0791j80426K0766j2458J02222l0084n181M6681J12686j22766K567
9940f4561p3029q512K7957J62972l0193k1528O7164j20808m642k6739R7686p8945
9928g3178l1358j3423O614k0064N0647L4558L2065p5981J57827j72841M2358N0839
$$ plain form
9916 -11937 -27327 -57532 -63585 -6433 -95285 -95321 -75654 -49355 -47050 -77513 -131047 -120949 91658
9903 91658 137623 2891 6581 121843 40404 16540 61293 126839 240861 133473 291103
9892 291103 61047 82193 27690 138821 40332 221444 176434 -2721 217516 268096 247506
9881 247506 163059 493310 404079 431619 434084 449220 572456 346066 534058 459312 328805
9870 328805 403128 386255 290292 320073 415485 154743 254838 233552 293818 262486 406773
9859 406773 437488 202831 223413 321225 254500 213927 331005 439493 340451 319260 488483
9848 488483 428778 541674 580037 832554 581849 672504 713978 677044 811082 743603 570735
9837 570735 498328 464866 536245 311254 444996 390953 251468 225542 207837 205523 148464
$$ packed form
9916a1937j5390l0205o053N7152q8852l6J9667K6299K305l0463n3534J0098K12607
9903I1658M5965j34732L690J15262q1439k3864M4753O5546J14022j07388J57630
9892B91103k30056K1146n4503J11131r8489J81112m5010j79155K20237N0580k0590
9881B47506q4447L30251q9231K7540K465J5136J23236k26390J87992p4746j30507
9870C28805P4323j6873r5963K9781R5412k60742J00095k1286O0266l1332J44287
9859D06773L0715k34657K0582R7812o6725m0573J17078J08488r9042k1191J69223
9848D88483n9705J12896L8363K52517k50705R0655M1474l6934J34038o7479j72868
9837E70735p2407l3462P1379k24991J33742n4043j39485k5926j7705k314n7059
$$ plain form
9826 148464 252883 142513 87508 56576 49865 91003 108848 210944 174539 155309 174090
9815 174090 197600 264533 218440 234348 50021 201868 96708 116720 70626 85798 190807
9804 190807 36715 113615 62552 7990 65926 -897 143631 -65689 10173 -101658 -125235
9793 -125235 71670 -72046 305168 -54248 -11340 -38675 -8409 16439 33433 -10299 -44819
9782 -44819 50201 117639 -18765 -93680 26156 31211 103059 2739 60526 -58888 -8613
9771 -8613 -56668 38765 83410 16231 119534 74739 -1413 55703 12047 -1323 -134763 -66483
9759 -66483 -121857 9207 117577 159521 91551 71731 108259 59858 -9425 110405 120292
9748 120292 88853 58616 102146 31450 27894 -56566 192604 44791 57151 73714 -38361
$$ packed form
9826A48464J04419j10370n5005l0932o711M1138J7845J02096l6405j9230J8781
9815A74090K3510O6933m6093J5908j84327J51847j05160K0012m6094J5172J05009
9804A90807j54092P6900n1063n4562N7936o6823J44528k09320P5862j11831k3577
9793a25235J96905j43716L77214l59416M2908k7335L0266K4848J6994m3732l4520
9782d4819R5020O7438j36404p4915J19836N055P1848j00320N7787j19414N0275
9771h613m8055R5433M4645o7179J03303m4795p6152N7116m3656j3370j33440O8280
9759f6483n5374J31064J08370M1944o7970j9820L6528m8401o9283J19830R887
9748A20292l1439l0237M3530p0696l556q4460K49170j47813J2360J6563j12075
$$ plain form
9737 -38361 -27394 -7095 30521 34611 -77938 116251 -60046 36129 109167 -89811 -80472
9726 -80472 13706 146384 -39369 626 46743 3333 -9369 44049 40797 -38246 17168 102409
9714 102409 -59385 3246 -85641 -120373 -22813 47231 115110 -19906 106431 41510 10206
9703 10206 -119442 -76238 5520 7155 -38954 -2092 -80488 808 60168 54688 -46363 100361
9691 100361 -40960 -117272 94713 -22777 -25438 45318 15264 41013 32898 157998 169040
9680 169040 68589 41724 126834 5942 6455 66863 196734 89396 65660 95347 66064
9669 66064 114342 249642 194572 399400 452451 499169 487026 488528 525222 482151 686606
9658 686606 652179 468138 560585 486195 540946 331696 440741 378730 193887 230395 98961
$$ packed form
9737c8361J0967K0299L7616M090j12549J94189j76297R6175P3038j98978R339
9726h0472R4178J32678j85753L9995M6117m3410j2702N3418l252p9043N5414Q5241
9714A02409j61794O2631q8887l4732R7560P0044O7879j35016J26337o4921l1304
9703A0206j29648M3204Q1758J635m6109L6862p8396Q1296N9360n480j01051J46724
9691A00361j41321p6312K11985j17490k661P0756l0054K5749q115J25100J1042
9680A69040j00451k6865Q5110j20892N13O0408J29871j07338k3736K9687k9283
9669F6064M8278J35300n5070K04828N3051M6718j2143J502L6694m3071K04455
9658F86606l4427j84041R2447p4390N4751k09250J09045o2011j84843L6508j31434
$$ plain form
9647 98961 264950 265815 305855 122038 275865 314896 211295 352292 193688 251438 261494
9636 261494 195017 262193 409753 548877 613848 688280 777754 434640 562118 485629 657044
9625 657044 690774 658445 580850 512885 368030 155158 330180 58836 148136 97314 -30924
9614 -30924 73313 54952 104388 226221 137477 -37729 53199 101539 85237 68578 141769
9603 141769 12812 164394 45040 238 43570 141636 112791 105666 45682 36232 201898
9592 201898 78890 120691 225458 57494 184797 -12116 73144 -45050 147078 8105
9582 8105 81880 151643 -80688 145987 140704 60636 15626 61390 72700 71726 187245 103407
9570 103407 58994 108093 74973 96579 41840 88557 107352 169772 287064 169002 157418
$$ packed form
9647I8961J65989Q65M0040j83817J53827L9031j03601J40997j58604N7750J0056
9636B61494o6477O7176J47560J39124O4971P4432Q9474l43114J27478p6489J71415
9625F57044L3730l2329p7595o7965j44855k12872J75022k71344Q9300n0822j28238
9614c0924J04237j8361M9436J21833q8744j75206R0928M8340j6302j6659P3191
9603A41769j28957J51582j19354m4802M3332R8066k8845p125n9984r450J65666
9592B01898j23008M1801J04767j67964J27303j96913Q5260j18194J92128j38973
9582H105P3775O9763k32331K26675n283q0068m5010M5764J1310r74J15519q3838
9570A03407m4413M9099l3120K1606n4739M6717J8795O2420J17292j18062j1584
$$ plain form
9559 157418 141610 157088 80768 131201 103239 111984 160683 22819 106279 33789 137980
9548 137980 274495 14308 37338 67940 83641 -37102 84252 151790 177017 137701 222373
9537 222373 273110 106329 167664 137121 69135 83436 101914 72500 269519 161846 220019
9526 220019 47647 61561 89301 79595 92771 139558 194841 139787 303503 238271 119767
9515 119767 209634 210854 207978 227721 267830 192239 202118 422258 174758 268774 248773 245792
9503 245792 149836 218897 303153 302180 425759 478000 516923 316667 448449 397955 410970
9492 410970 410051 378337 363322 495428 578806 708523 553960 646859 515266 438250 474726
9481 474726 511310 528249 445809 559060 637398 507561 457056 518017 582805 529835 566796
$$ packed form
9559A57418j5808J5478p6320N0433k7962Q745M8699j37864Q3460p2490J04191
9548A37980J36515k60187K3030L0602J5701j20743J21354O7538K5227l9316Q4672
9537B22373N0737j66781O1335l0543o7986J4301J8478k9414J97019j07673N8173
9526B20019j72372J3914K7740r706J3176M6787N5283n5054J63716o5232j18504
9515A19767Q9867J220k876J9743M0109p5591R879K20140k47500R4016k0001k981
9503B45792r5956O9061Q4256r73J23579N2241L8923k00256J31782n0494J3015
9492D10970r19l1714j5015J32106Q3378J29717j54563R2899j31593p7016L6476
9481D74726L6584J6939q2440J13251P8338j29837n0505O0961O4788n2970L6961
$$ plain form
9470 566796 404135 576254 614287 756350 622377 815732 643620 779229 687843 847234
9460 847234 788256 875632 1075531 978357 975533 982320 1108932 1099174 1163424 1124820 1175421 1098792
9448 1098792 1190777 1115186 1074906 1221389 1259133 1222690 1189304 1267750 1337269 1237286 1494476
9437 1494476 1508248 1397893 1502777 1488872 1426135 1381589 1377473 1431340 1273248 1291658 1301800
9426 1301800 1367364 1328550 1341965 1384845 1207316 1178941 1327651 1366515 1396999 1418711 1418331
9415 1418331 1327821 1471573 1506792 1557537 1582758 1626677 1684942 1585077 1662528 1662817 1623630 1654347
9403 1654347 1437076 1530889 1449030 1349915 1235111 1276649 1114872 1159440 1110326 1080284 1100733
9392 1100733 947275 968814 1131035 1075542 1109035 987418 1085338 1181858 1159769 1143424 1180779
$$ packed form
9470E66796j62661J72119L8033J42063j33973J93355j72112J35609r1386J59391
9460H47234n8978Q7376J99899r7174k824O787J26612r758O4250l8604N0601p6629
9448A098792R1985p5591m0280J46483L7744l6443l3386P8446O9519r9983K57190
9437A494476J3772j10355J04884j3905o2737m4546m116N3867j58092J8410J0142
9426A301800O5564l8814J3415M2880j77529k8375J48710L8864L0484K1712l80
9415A418331r0510J43752L5219N0745K5221M3919N8265r9865P7451K89l9187L0717
9403A654347k17271R3813q1859r9115j14804M1538j61777M4568m9114l0042K0449
9392A100733j53458K1539J62221n5493L3493j21617R7920R6520k2089j6345L7355
$$ plain form
9381 1180779 1063888 1012573 789371 1059079 1015617 1049388 1002113 1121339 1078736 1050213 1063371
9370 1063371 1074012 1206093 1051000 1201000 1068255 1035523 1242387 1164535 1292929 1185322
9360 1185322 1183307 1225298 1240402 1092165 1079118 1238080 1257396 1304434 1342450 1261736 1317616
9349 1317616 1217139 1420557 1306802 1373454 1377937 1552261 1715987 1725685 1879383 1770098
9339 1770098 1619114 1705765 1754558 1742276 1852945 1929669 1792505 1718740 1649415 1574871 1690019
9328 1690019 1512142 1560839 1618050 1657760 1576920 1640611 1609777 1509715 1676436 1557384 1773389
9317 1773389 1698515 1746146 1869497 2084095 2207350 2224881 2377661 2476308 2386216 2612361
9307 2612361 2579644 2549763 2335344 2289135 2218171 2200994 2317562 2310832 2260723 2253561 2339310
$$ packed form
9381A180779j16891n1315k23202K69708m3462L3771m7275J19226m2603k8523J3158
9370A063371J0641J32081j55093J50000j32745l2732K06864p7852J28394j07607
9360A185322k015M1991J5104j48237j3047J58962J9316M7038L8016q0714N5880
9349A317616j00477K03418j13755O6652M483J74324J63726R698J53698j09285
9339A770098j50984Q6651M8793j2282J10669P6724j37164p3765o9325p4544J15148
9328A690019j77877M8697N7211L9710q0840O3691l0834j00062J66721j19052K16005
9317A773389p4874M7631J23351K14598J23255J7531J52780R8647r0092K26145
9307B612361l2717k9881k14419m6209p0964j7177J16568o730n0109p162Q5749
$$ plain form
9296 2339310 2199508 2199497 2303111 2256309 2279956 2458877 2287548 2410186 2261575 2328588 2272429
9285 2272429 2287789 2429467 2511493 2475753 2590461 2728523 2764655 2886407 3034816 2937230
9275 2937230 2886882 2875570 2824048 2771548 2934344 2926783 2802105 2876513 2863862 2899592 2870884
9264 2870884 2915729 2932564 2933071 3003246 3059757 3100727 3242399 3330419 3383307 3409701 3695650
9253 3695650 3567889 3565744 3594375 3704469 3658687 3820437 4073114 4068510 4124634 4160691 4050932
9242 4050932 4083143 4087535 4209790 4327123 4277964 4476367 4507081 4481374 4464863 4649092 4607485
9231 4607485 4682780 4888973 4745572 4913773 5072222 5136527 5373378 5461042 5622423 5855015
9221 5855015 6017552 6110148 6256221 6550776 6560077 6707747 6675369 7058321 7262085 7251420
$$ packed form
9296B339310j39802j1J03614m6802K3647J78921j71329J22638j48611O7013n6159
9285B272429J5360J41678Q2026l5740J14708J38062L6132J21752J48409r7586
9275B937230n0348j1312n1522n2500J62796p561j24678P4408j2651L5730k8708
9264B870884M4845J6835N07P0175N6511M0970J41672Q8020N2888K6394K85949
9253C695650j27761k145K8631J10094m5782J61750K52677m604N6124L6057j09759
9242D050932L2211M392J22255J17333m9159J98403L0714k5707j6511J84229m1607
9231D607485P5295K06193j43401J68201J58449O4305K36851Q7664J61381K32592
9221E855015J62537R2596J46073K94555R301J47670l2378L82952K03764j0665
$$ plain form
9211 7251420 7347043 7521176 7637559 7516237 7810695 7989286 8073926 8358468 8566773 8806960
9201 8806960 8967164 9352630 9617972 10028482 10339653 10688334 11085593 11389272 11954883 12314726
9191 12314726 13051334 14005568 15133229 16487760 17864650 19125780 20015728 21646575 24066941
9182 24066941 26629449 29433710 31259051 32330009 32789688 33168565 33365382 33364316 32641710
9173 32641710 31237360 29667573 28541841 28105180 27906369 28126229 28639347 29285472 29781081
9164 29781081 30647882 31526964 32770971 34685725 37500409 41011667 44859652 48361774
9156 48361774 51845461 55651236 58856694 62788973 66662843 70296932 74408937 78695425
9148 78695425 84315888 89811309 94663353 97264339 96262293 94558799 92853301 90896095
$$ packed form
9211G251420R5623J74133J16383j21322K94458J78591Q4640K84542K08305K40187
9201H806960J60204L85466K65342M10510L11171L48681L97259L03679N65611L59843
9191A2314726P36608R54234J127661J354531J376890J261130Q89948J630847K420366
9182B4066941K562508K804261J825341J070958M59679L78877J96817j066p22606
9173C2641710j404350j569787j125732m36661j98811K19860N13118O46125M95609
9164B9781081Q66801Q79082J244007J914754K814684L511258L847985L502122
9156D8361774L483687L805775L205458L932279L873870L634089M112005M286488
9148G8695425N620463N495421M852044K600986j002046j703494j705498j957206
$$ plain form
9140 90896095 88466077 87425868 89018374 92859624 98359219 104694239 112994460 124740894
9132 124740894 143055639 167538068 197733715 231256195 259993224 282362174 301966623
9125 301966623 321224641 347767407 379433806 400799912 405390285 389460062 357972108
9118 357972108 321232751 280867804 238810126 198970076 165255236 139442848 120419642
9111 120419642 107720840 101620393 100398130 102293400 104726140 104621403 102098169 101367322
9103 101367322 102900930 105670423 108733701 109629277 108423486 106136866 101473018 95476397
9095 95476397 90253356 86245001 82843160 79646178 76524324 72737515 70291053 71344814
9087 71344814 74487411 76931616 79369892 75843170 69251988 63926673 60306433 57891052
$$ packed form
9140I0896095k430018j040209J592506L841250N499595O335020Q300221J1746434
9132A24740894J8314745K4482429L0195647L3522480K8737029K2368950J9604449
9125C01966623J9258018K6542766L1666399K1366106M590373j5930223l1487954
9118C57972108l6739357m0364947m2057678l9840050l3714840k5812388j9023206
9111A20419642j2698802o100447j222263J895270K432740j04737k523234p30847
9103A01367322J533608K769493L063278Q95576j205791k286620m663848n996621
9095I5476397n223041m008355l401841l196982l121854l786809k446462J053761
9087G1344814L142597K444205K438276l526722o591182n325315l620240k415381
$$ plain form
9079 57891052 56289129 54488431 52777929 51976653 52171801 52747015 52516490 51279449 48826863
9070 48826863 45662101 43113163 41144722 40177386 39836328 40140773 39941281 38801736 36954057
9061 36954057 34550021 31963059 29767243 28153225 26614161 25110512 23994150 23525342
9053 23525342 23762077 24207191 24638778 24472875 23365336 21741885 20388642 19376094 18860234
9044 18860234 19130203 19412398 19768054 19496242 18212139 16580902 14979068 13921946 12967796
9035 12967796 12151934 11804032 11811349 11485821 11114490 10536516 9792609 9217778 8783448 8268550
9025 8268550 8018672 7562175 7407097 7010667 6906929 6735339 6608397 6443376 6173979 6132311
9015 6132311 5819365 5487441 5510535 5334975 5229014 5069534 4964004 4873718 4685409 4581715
$$ packed form
9079E7891052j601923j800698j710502q01276J95148N75214k30525j237041k452586
9070D8826863l164762k548938j968441r67336l41058L04445j99492j139545j847679
9061C6954057k404036k586962k195816j614018j539064j503649j116362m68808
9053B3525342K36735M45114M31587j65903j107539j623451j353243j012548n15860
9044A8860234K69969K82195L55656k71812j284103j631237j601834j057122r54150
9035A2967796q15862l47902P317l25528l71331n77974p43907n74831m34330n14898
9025H268550k49878m56497j55078l96430j03738j71590j26942j65021k69397m1668
9015F132311l12946l31924K3094j75560j05961j59480j05530r0286j88309j03694
$$ plain form
9005 4581715 4379785 4405795 4384358 4187048 4126717 3976601 4001556 3593434 3565071 3556019 3407604
8994 3407604 3272255 3186021 3086303 2981412 2960880 2966971 2765478 2752330 2717116 2625228 2593803
8983 2593803 2543577 2483920 2367742 2326672 2294175 2312339 2132733 2206013 2143940 2122528 2084939
8972 2084939 1952422 1819825 1816945 1957817 1807044 1949522 1844826 1622637 1520205 1689211
8962 1689211 1554127 1481234 1593008 1511795 1490209 1322830 1354568 1302262 1247490 1253170 1218852
8951 1218852 1088869 1005742 1040980 907373 963697 974316 953202 963140 1074791 854959 861135
8940 861135 871180 843419 769151 557261 738243 682748 607715 647005 541632 623687 456223
8929 456223 499744 379097 475428 557359 398610 381928 301511 319184 277062 338954 450507
$$ packed form
9005D581715k01930K6010k1437j97310o0331j50116K4955m08122k8363r052j48415
8994C407604j35349q6234r9718j04891k0532O091k01493j3148l5214r1888l1425
8983B593803n0226n9657j16178m1070l2497J8164j79606P3280o2073k1412l7589
8972B084939j32517j32597k880J40872j50773J42478j04696k22189j02432J69006
8962A689211j35084p2893J11774q1213k1586j67379L1738n2306n4772N680l4318
8951A218852j29983q3127L5238j33607N6324J0619k1114R938J11651k19832O176
8940H61135J0045k7761p4268k11890J80982n5495p5033L9290j05373Q2055j67464
8929D56223M3521j20647R6331Q1931j58749j6682q0417J7673m2122O1892J11553
$$ plain form
8918 450507 236778 369802 332767 233878 183674 298324 282330 120451 190507 -24015 154510
8907 154510 178462 100637 244746 88743 242670 29061 119977 98196 195649 69316 -75487
8896 -75487 70617 6687 114780 -9294 -11425 -10523 -24036 -40915 -152370 -117569 -87211 65706
8884 65706 72979 -41971 30256 -35205 -34688 25663 -133167 -76638 -42077 -83384 -43997 -143866
8872 -143866 -76173 19050 -58731 -157945 -46538 -49282 -100716 98182 -20962 50354 34014
8861 34014 -37205 70973 136138 111409 88899 263111 222471 233015 51889 206255 322464
8850 322464 229971 159586 173855 102133 52236 -12128 123753 50016 67474 64733 -293 -22165
8838 -22165 63316 67342 158840 201770 170471 234241 278816 393878 516389 516901 548029 750835
$$ packed form
8918D50507k13729J33024l7035r8889n0204J14650j5994j61879P0056k14522J78525
8907A54510K3952p7825J44109j56003J53927k13609R0916k1781R7453j26333j44803
8896g5487J46104o3930J08093j24074k131R02j3513j6879j11455L4801L0358J52917
8884F5706P273j14950P2227o5461N17O0351j58830N6529L4561m1307L9387r9869
8872a43866O7693R5223p7781r9214J11407k744n1434J98898j19144P1316j6340
8861C4014p1219J08178O5165k4729k2510J74212m0640J0544j81126J54366J16209
8850C22464r2493p0385J4269p1722m9897o4364J35881p3737J7458k741o5026k1872
8838b2165Q5481M026R1498M2930l1299O3770M4575J15062J22511N12L1128K02806
$$ plain form
8826 750835 717978 810156 865548 909398 953227 993739 889785 914463 816783 805913 858308
8815 858308 829180 722528 647593 490090 486719 431782 302687 165199 93190 263356 108441
8804 108441 140204 213759 278973 352003 357177 445711 327014 619708 559425 637387 684946
8793 684946 663659 753064 679275 729601 616069 644544 621103 466791 669259 354990 303250
8782 303250 327820 251885 275102 185978 266093 149438 183624 220984 75797 166353 50199
8771 50199 57331 -51912 -69105 -48170 32759 24966 -52712 30745 74675 84061 113654 8591
8759 8591 102785 -54092 -38593 -76048 89898 71761 -38498 -15197 -76819 -32249 -54601
8748 -54601 -47136 -3083 -37881 -105037 -116610 -80554 -101110 -172292 16528 -128235 -119429 -63289
$$ packed form
8826G50835l2857R2178N5392M3850M3829M0512j03954K4678r7680j0870N2395
8815H58308k9128j06652p4935j57503l371n4937j29095j37488p2009J70166j54915
8804A08441L1763P3555O5214P3030N174Q8534j18697K92694o0283P7962M7559
8793F84946k1287Q9405p3789N0326j13532K8475k3441j54312K02468l14269n1740
8782C03250K4570p5935K3217q9124Q0115j16655L4186L7360j45187R0556j16154
8771E0199P132j09243j7193K0935Q0929p793p7678Q3457M3930R386K9593j05063
8759H591R4194j56877J5499l7455J65946j8137j10259K3301o1622M4570k2352
8748e4601P465M4053l4798o7156j1573L6056k0556p1182J88820j44763Q806N6140
$$ plain form
8736 -63289 -53485 -141381 -149178 -136513 -85459 -50223 -296352 -245101 -239082 -303662 -62488 -145292
8724 -145292 -101218 -69005 -144573 -141491 -152149 -189990 -259048 -158456 -280148 -270029 -247668
8713 -247668 -240078 -153086 -205279 -270484 -272237 -287117 -355822 -237176 -144651 -164742 -184238 -262387
8701 -262387 -161980 -228850 -343324 -305190 -213587 -322111 -297370 -318048 -241116 -238707 -130898
8690 -130898 -160792 -284387 -232734 -238390 -233098 -329416 -280838 -249987 -377219 -259628 -344034
8679 -344034 -313215 -280894 -252327 -284228 -314304 -271461 -333326 -317682 -154856 -167515 -213373
8668 -213373 -85084 -186234 -153536 -234240 -150297 -171726 -179127 -283706 -345128 -276577 -296171
8657 -296171 -274057 -235470 -333992 -222082 -302336 -243497 -191793 -279625 -327317 -240263 -244747 -297414
$$ packed form
8736f3289R804q7896p797J2665N1054L5236k46129N1251O019o4580K41174q2804
8724a45292M4074L2213p5568L082j0658l7841o9058J00592j21692J0119K2361
8713b47668P590Q6992n2193o5205j753j4880o8705J18646R2525k0091j9496p8149
8701b62387J00407o6870j14474L8134R1603j08524K4741k0678P6932K409J07809
8690a30898k9894j23595N1653n656N292r6318M8578L0851j27232J17591q4406
8679c44034L0819L2321K8567l1901l0076M2843o1865J5644J62826j2659m5858
8668b13373J28289j01150L2698q0704Q3943k1429p401j04579o1422O8551j9594
8657b96171K2114L8587r8522J11910q0254N8839N1704q7832m7692Q7054m484n2667
$$ plain form
8645 -297414 -275849 -336908 -266907 -301736 -284475 -342939 -204607 -351964 -411141 -205469 -285287
8634 -285287 -323577 -292732 -164744 -314644 -342441 -251077 -267014 -219047 -308346 -428467 -324081
8623 -324081 -197698 -280929 -270833 -213297 -165471 -329073 -344509 -141735 -138998 -219835 -184708
8612 -184708 -221655 -391217 -342353 -258194 -321904 -275145 -219600 -378425 -283079 -275059 -216383
8601 -216383 -327039 -200460 -247989 -269234 -231493 -215399 -245207 -219178 -253907 -255685 -380362
8590 -380362 -257942 -351738 -164370 -250029 -250829 -214189 -291316 -254175 -238782 -334806 -93867
8579 -93867 -188300 -260943 -268566 -240386 -284159 -314768 -270847 -221131 -152763 -312034 -234903 -176418
8567 -176418 -246814 -232625 -270937 -162864 -241518 -300503 -335697 -229018 -202309 -254845 -322399
$$ packed form
8645b97414K1565o1059P0001l4829J7261n8464J38332j47357n9177K05672p9818
8634b85287l8290L0845J27988j49900k7797R1364j5937M7967q9299j20121J04386
8623c24081J26383q3231J0096N7536M7826j63602j5436K02774K737q0837L5127
8612a84708l6947j69562M8864Q4159o3710M6759N5545j58825R5346Q020N8676
8601b16383j10656J26579m7529k1245L7741J6094k9808K6029l4729j778j24677
8590c80362J22420r3796J87368q5659q00L6640p7127L7141J5393r6024K40939
8579i3867r4433p2643p623K8180m3773l0609M3921M9716O8368j59271P7131N8485
8567a76418p0396J4189l8312J08073p8654n8985l5194J06679K6709n2536o7554
$$ plain form
8556 -322399 -197584 -248725 -285455 -310060 -106523 -191648 -279098 -308168 -110831 -224204 -189723
8545 -189723 -123850 -154429 -137417 -303450 -306076 -211079 -240058 -225469 -261738 -285750 -439645
8534 -439645 -485075 -273494 -311535 -200506 -368947 -257211 -286107 -383377 -330847 -183758 -296078
8523 -296078 -319687 -247542 -398817 -240710 -208931 -338386 -298115 -297538 -308034 -304251 -246075 -292166
8511 -292166 -110835 -196843 -205134 -192328 -198431 -210861 -293331 -253307 -320667 -223755 -329452 -327016
8499 -327016 -331639 -299155 -210161 -203859 -274502 -348663 -270111 -292822 -276218 -270589 -197478 -235866
8487 -235866 -241844 -201713 -222022 -156042 -311756 -268636 -283369 -161172 -260630 -139382 -188839
8476 -188839 -273087 -154082 -328741 -196834 -340746 -182967 -331782 -232760 -225258 -270807 -376050
$$ packed form
8556c22399J24815n1141l6730k4605K03537q5125q7450k9070J97337j13373L4481
8545a89723O5873l0579J7012j66033k626R4997k8979J4589l6269k4012j53895
8534d39645m5430K11581l8041J11029j68441J11736k8896r7270N2530J47089j12320
8523b96078k3609P2145j51275J58107L1779j29455M0271N77j0496L783N8176m6091
8511b92166J81331q6008q291J2806o103j2430q2470M0024o7360R6912j05697K436
8499c27016m623L2484Q8994O302p0643p4161P8552k2711J6604N629P3111l8388
8487b35866n978M0131k0309O5980j55714M3120j4733J22197r9458J21248m9457
8476a88839q4248J19005j74659J31907j43912J57779j48815R9022P502m5549j05243
$$ plain form
8465 -376050 -334144 -187159 -274602 -214426 -165830 -229238 -173051 -189517 -199901 -289949 -152914
8454 -152914 -250463 -331850 -282486 -244825 -227845 -211734 -200652 -149889 -251241 -278029 -231645
8443 -231645 -330048 -272101 -219266 -172947 -231119 -220573 -205825 -205425 22406 -226523 -234956 -300567
8431 -300567 -291214 -325054 -354519 -203877 -255085 -286490 -254348 -122004 -193283 -110945 -61059
8420 -61059 -160736 -208119 -271424 -205453 -245353 -237367 -216566 -158868 -170137 -163430 -229844 -213202
8408 -213202 -231881 -140275 -258206 -257937 -206732 -230804 -182203 -238221 -138192 -311326 -97843
8397 -97843 -246233 -247447 -205404 -234487 -247516 -189051 -196360 -254740 -312196 -260669 -157334 -156102
8385 -156102 -168785 -213045 -224606 -217473 -252049 -175248 -310025 -169742 -282099 -248865 -187591
$$ packed form
8465c76050M1906J46985q7443O0176M8596o3408N6187j6466j0384r0048J37035
8454a52914r7549q1387M9364L7661J6980J6111J1082N0763j01352k6788M6384
8443b31645r8403N7947N2835M6319n8172J0546J4748M00K27831k48929q433o5611
8431c00567R353l3840k9465J50642n1208l1405L2142J32344p1279Q2338M9886
8420f1059r9677m7383o3305O5971l9900P986K0801N7698j1269O707o6414J6642
8408b13202j8679R1606j17931K69N1205k4072M8601n6018J00029j73134K13483
8397i7843j48390j214M2043k9083j3029N8465p309n8380n7456N1527J03335J232
8385a56102j2683m4260j1561P133l4576P6801j34777J40283j12357L3234O1274
$$ plain form
8374 -187591 -192128 -191396 -211511 -167891 -281609 -187184 -157016 -242779 -304628 -275439 -193591 -237623
8362 -237623 -185073 -289040 -143735 -410207 -314851 -406554 -238081 -233640 -244259 -215796 -136987
8351 -136987 -80822 -162126 -242941 -316069 -287435 -298514 -199017 -184768 -199005 -289468 -277114 -150741
8339 -150741 -186887 -204724 -107981 -272521 -207895 -181620 -182960 -203348 -150169 -178827 -185736 -163965
8327 -163965 -234549 -205704 -284964 -195780 -158581 -253048 -286424 -173037 -209420 -297317 -211477
8316 -211477 -128188 -178827 -95901 -171736 -184780 -222036 -128142 -322915 -133149 -221618 -301450
8305 -301450 -172055 -193076 -217566 -196704 -163858 -214304 -188364 -221444 -337776 -150400 -199551
8294 -199551 -241037 -208030 -77686 -185230 -191443 -298276 -237002 -170979 -349751 -244921 -143369
$$ packed form
8374a87591m537P32k0115M3620j13718R4425L0168q5763o1849K9189Q1848m4032
8362b37623N2550j03967J45305k66472R5356r1703J68473M441j0619K8463P8809
8351a36987N6165q1304q0815p3128K8634j1079R9497J4249j4237r0463J2354J26373
8339a50741l6146j7837R6743j64540O4626K6275j340k0388N3179k8658o909K1771
8327a63965p0584K8845p9260Q9184L7199r4467l3376J13387l6383q7897Q5840
8316b11477Q3289n0639Q2926p5835j3044l7256R3894j94773J89766q8469p9832
8305c01450J29395k1021k4490K0862L2846n0446K5940l3080j16332J87376m9151
8294a99551m1486L3007J30344j07544o213j06833O1274O6023j78772J04830J01552
$$ plain form
8283 -143369 -148134 -188576 -217826 -223895 -141358 -232276 -196465 -214297 -267912 -280759 -239653 -201454
8271 -201454 -246827 -186398 -227878 -65608 -111897 -189589 -160475 -176013 -157143 -285554 -201662
8260 -201662 -242188 -215788 -242056 -181960 -95262 -133731 -193615 -253476 -268480 -172874 -292308
8249 -292308 -231165 -216231 -235466 -233394 -164468 -83203 -141066 -111592 -117252 -187818 -229404 -285093
8237 -285093 -321899 -260294 -165838 -331774 -224839 -226034 -139309 -99528 -251108 -145529 -210121
8226 -210121 -208121 -335259 -231567 -161336 -307592 -216308 -243536 -142042 -245183 -158435 -218514
8215 -218514 -321378 -216263 -192602 -237162 -244354 -231112 -270515 -155973 -140331 404 -111514
8204 -111514 -84471 -186639 -235021 -241836 -161836 -122227 -163835 -84619 -193626 -327536 -269075
$$ packed form
8283a43369m765m0442k9250o069Q2537r0918L5811j7832n3615j2847M1106L8199
8271b01454m5373O0429m1480J62270m6289p7692K9114j5538J8870j28411Q3892
8260b01662m0526K6400k6268O0096Q6698l8469n9884n9861j5004R5606j19434
8249b92308O1143J4934j9235K072O8926Q1265n7863K9474n660p0566m1586n5689
8237b85093l6806O1605R4456j65936J06935j195Q6725L9781j51580J05579o4592
8226b10121K000j27138J03692P0231j46256R1284k7228J01494j03141Q6748o0079
8215b18514j02864J05115K3661m4560p192J3242l9403J14542J5642J40735j11918
8204a11514K7043j02168m8382o815Q0000L9609m1608P9216j09007j33910N8461
$$ plain form
8193 -269075 -245025 1060392 -299459 -174112 -203372 -228940 -442592 -120973 -234405 -303850
8183 -303850 -158788 -111629 -237398 -238105 -191782 -387108 -197914 -153895 -233720 -172762 -100732
8172 -100732 -109914 -175804 -117552 -151519 -4020 -275699 -203468 -160356 -221353 -212531 -166508 -193334
8160 -193334 -110200 -119365 -192549 -189355 -240516 -174328 -170618 -170546 -162827 -159943 -242298 -270494 -244707
8147 -244707 -279212 -305320 -133454 -178592 -179954 -248901 -137181 -168648 -84932 -133955 -89350
8136 -89350 -78241 -163248 -99346 -42921 -98095 -213959 -274576 -82101 -151355 -201511 -235999
8125 -235999 -199600 -101255 -229075 -31377 -91510 -79682 -180634 -205711 -45712 -165626 30159
8114 30159 -114235 -41720 -172694 -163944 -185514 -198569 -70143 -149988 -161616 -60426 -99948
$$ packed form
8193b69075K4050J305417j359851J25347k9260k5568k13652L21619j13432o9445
8183c03850J45062M7159j25769p07M6323j95326J89194M4019p9825O0958P2030
8172a00732r182o5890N8252l3967J47499k71679P2231M3112o0997Q822M6023k6826
8160a93334Q3134r165p3184L194n1161O6188L710P2P719K884q2355k8196K5787
8147b44707l4505k6108J71866m5138j362o8947J11720l1467Q3716m9023M4605
8136h9350J1109q5007O3902N6425n5174j15864o0617J92475o9254n0156l4488
8125b35999L6399R8345j27820J97698o0133J1828j00952k5077J59999j19914J95785
8114C0159j44394P2515j30974Q750k1570j3055J28426p9845j1628J01190l9522
$$ plain form
8103 -99948 -121993 -122211 -86266 -83587 -117495 -88433 -140395 34437 -95661 -88786 -88515 -249646
8091 -249646 -149342 -97955 -104377 -23723 -63599 -170717 -290011 -68929 -89829 -94121 -102988
8080 -102988 -126047 -7626 -177064 -59033 -62902 -35455 166720 13293 82784 67742 149833
8069 149833 15752 10766 12741 -25997 -9925 -28276 2872 -60628 48039 -28115 -68189 -32146
8057 -32146 -93323 -114651 -54249 57382 -551 -31242 83389 86483 207939 297202 329063
8046 329063 486916 494420 405664 153084 288709 103171 192582 141657 14522 60472 -42192
8035 -42192 -73011 -69835 58696 -90377 -64886 5334 28205 -10007 15682 -10217 89407 41933
8023 41933 27107 131549 101626 290025 392609 530167 302721 448677 265506 113988
$$ packed form
8103i9948k2045k18L5945K679l3908K9062n1962J74832j30098O875K71j61131
8091b49646J00304N1387o422Q0654l9876j07118j19294K21082k0900m292q867
8080a02988k3059J18421j69438J18031l869K7447K02175j53427O9491j5042Q2091
8069A49833j34081m986J975l8738J6072j8351L1148o3500J08667p6154m0074L6043
8057c2146o1177k1328O0402J11631n7933l0691J14631L094J21456Q9263L1861
8046C29063J57853P504q8756k52580J35625j85538Q9411n0925j27135M5950j02664
8035d2192l0819L176J28531j49073K5491P0220K2871l8212K5689k5899R9624m7474
8023D1933j4826J04442k9923J88399J02584J37558k27446J45956j83171j51518
$$ plain form
8013 113988 169747 179957 127203 -28653 59746 -141711 -154932 -59476 -55296 -90835 -82489 -170759
8001 -170759 -99985 76580 6009 -48542 4845 -138351 -17617 46087 142688 169587 64401
7990 64401 13548 -79297 1169 -21685 -57668 -160642 -182454 -128753 -62804 -133041 -153518 -205538
7978 -205538 -58162 62567 -57655 -80495 -233255 -210603 -180486 -173801 -225849 -133815 -88989
7967 -88989 -165057 -64833 -133496 -51635 -124265 -137975 -69114 -157718 -81329 -196029 -167086
7956 -167086 -136451 -103328 -275440 -126786 -206602 -51077 -74374 -248872 -134314 -206416 -191105
7945 -191105 -80710 -195213 -185245 -123570 -219483 -79831 -167144 -162015 -254246 -153186 -278540
7934 -278540 -317334 -182075 -258047 -145215 -219010 -82788 -183955 12286 -36554 -128195 -135719
$$ packed form
8013A13988N5759J0210n2754j55856Q8399k01457j3221R5456M180l5539Q346q8270
8001a70759P0774J76565p0571n4551N3387j43196J20734O3704R6601K6899j05186
7990F4401n0853r2845Q0466k2854l5983j02974k1812N3701O5949p0237k0477n2020
7978b05538J47376J20729j20222k2840j52760K2652L0117O685n2048R2034M4826
7967h8989p6068J00224o8663Q1861p2630j3710O8861q8604P6389j14700K8943
7956a67086L0635L3123j72112J48654p9816J55525k3297j74498J14558p2102J5311
7945a91105J10395j14503R968O1675r5913J39652q7313N129r2231J01060j25354
7934b78540l8794J35259p5972J12832p3795J36222j01167J96241m8840r1641p524
$$ plain form
7923 -135719 -110490 -181317 -224538 -106963 -247386 -231656 -248528 -90913 -284265 -122652 -191322
7912 -191322 -254443 -139472 -169043 -159133 -215753 -102219 -212934 -77212 -140308 -15437 -155291
7901 -155291 -112210 -224840 -273918 -164931 -212910 -122974 -209731 -203065 -61984 -36791 -158138
7890 -158138 -99040 -61800 -58892 -129301 -175244 -187189 -213484 -163073 -226692 -31733 -260627
7879 -260627 -138623 -267452 -199016 -258374 -183550 -189540 -87743 -97490 -159373 -95965 -161441
7868 -161441 -164605 -175698 -156074 -212540 -231487 -152144 -198546 -218158 -89716 -127282 -179776 -160080
7856 -160080 -185855 -98784 -168991 -132159 -76334 -255936 -336612 -167393 -383658 -244862 -56712
7845 -56712 -90731 -253672 -87817 -105981 -124051 -169791 -137204 -176271 -163959 -175521 -223941
$$ packed form
7923a35719K5229p0827m3221J17575j40423J5730j6872J57615j93352J61613o8670
7912a91322o3121J14971k9571R910n6620J13534j10715J35722o3096J24871j39854
7901a55291M3081j12630m9078J08987m7979Q9936q6757O666J41081K5193j21347
7890a58138N9098L7240K908p0409m5943j1945k6295N0411o3619J94959k28894
7879b60627J22004j28829O8436n9358P4824n990J01797r747o1883O3408o5476
7868a61441l164j1093J9624n6466j8947P9343m6402j9612J28442l7566n2494J9696
7856a60080k5775Q7071p0207L6832N5825j79602q0676J69219k16265J38796J88150
7845e6712l4019j62941J65855j8164j8070m5740L2587l9067J2312j1562m8420
$$ plain form
7834 -223941 -94967 -132817 -142473 -279653 -185798 -156704 -192191 -193261 -240958 -10351 -209897
7823 -209897 -153368 -61171 -152442 -112715 -150909 -92442 -188984 -74714 -271205 -267698 -171149
7812 -171149 -246962 -206136 -148625 -106080 -127721 -165195 -221007 -149331 -225020 -83350 -97364
7801 -97364 -50740 -147766 34739 -116529 5578 -180242 -178013 -289364 -183683 -195417 -336480
7790 -336480 -174850 -214357 -232142 -264307 -140126 -146653 -152692 -93867 -78189 -185490 -99788
7779 -99788 -130503 -159097 -201792 -245740 -118375 -247966 -37700 -90148 -85341 -116352 -145994
7768 -145994 -128720 -145404 -132123 -195763 -26964 -215208 -84552 -138648 -84064 -24602 -111844
7757 -111844 -189910 -154206 -196815 -224122 -149194 -148297 -278775 -181880 -160848 -102946 -137779 -224494
$$ packed form
7834b23941J28974l7850r656j37180R3855K9094l5487j070m7697K30607j99546
7823b09897N6529R2197r1271L9727l8194N8467r6542J14270j96491L507R6549
7812a71149p5813M0826N7511M2545k1641l7474n5812P1676p5689J41670j4014
7801i7364M6624r7026J82505j51268J22107j85820K229j11351J05681j1734j41063
7790c36480J61630l9507j7785l2165J24181o527o039N8825J5678j07301Q5702
7779i9788l0715k8594m2695m3948J27365j29591K10266n2448M807l1011k9642
7768a45994J7274j6684J3281o3640J68799j88244J30656n4096N4584N9462q7242
7757a11844p8066L5704m2609k7307P4928Q97j30478R6895K1032N7902l4833q6715
$$ plain form
7745 -224494 -63413 -214827 -208074 -90869 -86868 -198931 -157042 -51326 -196996 -83850 -118047
7734 -118047 -161083 -130120 -235374 -285458 -233989 -194081 -90666 -204705 -150588 -47454 -163116
7723 -163116 -110798 -190328 -127500 -214509 -39285 -176959 -212954 -138324 -93214 -62832 -130271
7712 -130271 -128664 -210246 -165757 -99299 -106393 -143006 -248045 -150548 -197403 -136445 -182998 -217412
7700 -217412 -139441 -140982 -126813 -144235 -145839 -134746 -198145 -112691 -133103 -172804 -148838 -203515
7688 -203515 -88965 -174224 -178719 -188889 -137107 -133845 -137810 -104450 -104800 -220757 -60685 -54979
7676 -54979 -43192 -61088 -131507 -154138 -41673 -200806 -206001 -190709 -81134 -196656 -169560
7665 -169560 -83579 -102188 -298877 -72166 -191710 25718 -157479 -111245 -155901 -157083 -20684
$$ packed form
7745b24494J61081j51414O753J17205M001j12063M1889J05716j45670J13146l4197
7734a18047m3036L0963j05254n0084N1469L9908J03415j14039N4117J03134j15662
7723a63116N2318p9530O2828q7009J75224j37674l5995P4630M5110L0382o7439
7712a30271J607q1582M4489O6458p094l6613j05039R7497m6855O0958m6553l4414
7700b17412P7971j541J4169j7422j604J1093o3399Q5454k0412l9701K3966n4677
7688b03515J14550q5259m495j0170N1782L262l965L3360l50j15957J60072N706
7676e4979J1787j7896p0419k2631J12465j59133n195J5292J09575j15522K7096
7665a69560Q5981j8609j96689K26711j19544K17428j83197M6234m4656j182J36399
$$ plain form
7654 -20684 -60381 -41939 -72887 -68290 -98440 -93116 -119595 -171737 -179896 -138256 -148327 -237899
7642 -237899 -247005 -99284 -141577 -135816 -80802 -86504 -61484 -74178 -178255 -149128 -162604 -143940
7630 -143940 -158427 -186940 -230689 -117557 -127016 -5165 -35534 -139489 -110766 -111617 -126428 -81819
7618 -81819 -111273 -169620 -147615 -71781 -70365 -43884 -109004 -73144 -104287 -112908 -23492 -43938
7606 -43938 2471 30984 -79095 -48349 -38425 -45499 -36189 -74040 29652 -166944 -70275 -165704
7594 -165704 -75351 -49477 54624 84486 36541 12311 -86427 -58212 -73434 -103242 -95582 -123888
7582 -123888 -102580 -145786 -158425 -203000 -146722 -29967 -91280 -161870 -170076 -179335 -43394 -57239
7570 -57239 -190329 -26264 45670 -219363 -141706 -106332 -48544 -176917 -115535 -176083 -127044
$$ packed form
7654b0684l9697J8442l0948M597l0150N324k6479n2142q159M1640j0071q9572
7642b37899r106J47721m2293N761N5014n702K5020j2694j04077K9127j3476J8664
7630a43940j4487k8513m3749J13132r459J21851l0369j03955K8723q51j4811M4609
7618h1819k9454n8347K2005P5834J416K6481o5120L5860l1143q621Q9416k0446
7606d3938M6409K8513j10079L0746R924p074R310l7851J03692j96596R6669r5429
7594a65704R0353K5874J04101K9862m7945k4230r8738K8215j5222k9808P660k8306
7582a23888K1308m3206j2639m4575N6278J16755o1313p0590q206r259J35941j3845
7570e7239j33090J64065P1934k65033P7657L5374N7788j28373O1382o0548M9039
$$ plain form
7559 -127044 -55865 -99160 -99715 -50201 -138818 -134941 -84019 -99952 -192553 -147883 -77646 -161558
7547 -161558 -117403 -111703 -23901 -22956 -77171 -81946 -135205 -195724 -187832 -164176 -166475 -141529 -137123
7534 -137123 -79181 -30656 15584 -83496 -44584 -79799 -147055 -92540 -70870 -91242 -121304 -101071
7522 -101071 -258360 56791 -127623 -114233 74239 -51775 -65944 -61078 -110802 -110191 -11292
7511 -11292 -224191 -78933 -112517 -139837 -132723 -103928 -164370 -97918 -129866 -187889 32922
7500 32922 -128471 -160774 -167564 -39458 -143742 -175879 -40535 -116195 -182026 -108915 28184
7489 28184 -172172 -39049 14767 -5568 -3190 34026 -26417 -34038 -1779 -79854 -87794 -106587
7477 -106587 -173133 -180162 -119121 -78296 -89885 -129060 -58554 -107177 -160017 -189523 -128422 -154825
$$ packed form
7559a27044P1179m3295n55M9514q8617L877N0922j5933r2601M4670P0237q3912
7547a61558M4155N700Q7802R45n4215m775n3259o0519P892K3656k299K4946M406
7534a37123N7942M8525M6240r9080L8912l5215o7256N4515K1670k0372l0062K0233
7522a01071j57289L15151j84414J3390J88472j26014j4169M866m9724O11R8899
7511a1292k12899J45258l3584k7320P114K8795o0442O6452l1948n8023K20811
7500C2922j61393l2303o790J28106j04284l2137J35344p5660o5831P3111J37099
7489B8184k00356J33123N3816k0335K378L7216o0443p621L2259p8075p940j8793
7477a06587o6546p029O1041M0825j1589l9175P0506m8623n2840k9506O1101k6403
$$ plain form
7465 -154825 -133718 -101547 -122406 -105520 -139015 30497 -136060 -95332 -32191 -140185 -180068
7454 -180068 -147342 -75726 -185942 16382 -177779 -154628 -94347 -83037 15442 43933 -11007
7443 -11007 16544 -70674 -108068 27940 -206715 -180076 -164810 -39431 -204976 -188815 -68774
7432 -68774 -47952 -25396 7413 -33449 -37590 -169126 -62491 -71790 -35279 -104111 -73302 -73686
7420 -73686 -146238 -23596 -185784 -78291 -65957 -69454 -84870 54321 54058 -12458 -25176 -106840
7408 -106840 -33888 -167181 -121320 -177208 -161973 -153345 -71706 -15379 -122954 -75731 -51242
7397 -51242 -49076 -66216 -135045 -49945 -107692 -143997 -95753 -56908 -38002 -75914 -102886 -47670
7385 -47670 -66331 -46388 -134988 -84207 -159253 -247148 -178473 -43614 -43861 -169978 -152812 -43894
$$ packed form
7465a54825K1107L2171k0859J6886l3495J69512j66557M0728O3141j07994l9883
7454a80068L2726P1616j10216K02324j94161K3151O0281J1310R8479K8491n4940
7443a1007K7551q7218l7394J36008k34655K6639J5266J25379j65545J6161J20041
7432f8774K0822K2556L2809m0862m141j31536J06635r299L6511o8832L0809l84
7420g3686p2552J22642j62188J07493J2334l497j5416J39191k63o6516j2718q1664
7408a06840P2952j33293M5861n5888J5235Q628Q1639N6327j07575M7223K4489
7397e1242K166j7140o8829Q5100n7747l6305M8244L8845J8906l7912k6972N5216
7385d7670j8661J9943q8600N0781p5046q7895O8675J34859k47j26117J7166J08918
$$ plain form
7373 -43894 -65253 -88728 -16867 -40145 -99984 -112190 -164376 -122712 -89840 -63160 -76205 13202
7361 13202 -18337 -92778 -189493 -55599 47279 -88513 -49459 -45006 -112592 -117079 11672
7350 11672 -42047 -65514 -35331 55831 -104185 -114515 -99091 -97441 -134611 -76365 -97626 24161
7338 24161 -96677 830 -42732 -106980 -62507 -94945 -176483 -116785 -90842 -60541 -222721
7327 -222721 40294 -17972 47093 -955 -138961 -76350 -56285 105802 -62776 -29184 -100918
7316 -100918 -107351 -97872 -36560 -36304 -107413 -91022 -91189 5794 9736 -151199 -19702 -189308
7304 -189308 -110807 -28166 -39532 -6279 -76773 53999 -97328 98513 -159284 -136714 -51008
7293 -51008 -40185 -138572 -64874 -95006 -33126 -56827 -18840 -117491 -107121 -59714 -115447 -115093
$$ packed form
7373d3894k1359k3475P1861k3278n9839j2206n2186M1664L2872K6680j3045Q9407
7361A3202l1539p4441r6715J33894J02878j35792L9054M453o7586m487J28751
7350A1672n3719k3467L0183R1162j60016j0330J5424J650l7170N8246k1261J21787
7338B4161j20838R7507m3562o4248M4473l2438q1538N9698K5943L0301j62180
7327b22721K63015n8266O5065m8048j38006O2611K0065J62087j68578L3592p1734
7316a00918o433R479O1312K56p1109J6391j67R6983L942j60935J31497j69606
7304a89308P8501Q2641j1366L3253p0494J30772j51327J95841k57797K2570Q5706
7293e1008J0823r8387P3698l0132O1880k3701L7987r8651J0370M7407n5733L54
$$ plain form
7281 -115093 -115182 -70375 -45878 53961 -1249 44284 -63914 -51041 63873 -214537 -51426
7270 -51426 -44015 19136 -29852 2177 -7940 -15521 -48131 91241 -62363 2802 -77373 2334
7258 2334 -26011 72022 11154 -50543 80512 57473 97732 -22704 93249 20398 59395
7247 59395 89250 164079 184443 107785 168302 75746 30339 103266 39014 185334 93140 72237
7235 72237 36090 146204 111271 -105238 -22550 36950 149637 43432 164387 154676 137162
7224 137162 200377 195547 303504 422067 617520 582442 525679 566498 620962 280377 384961
7213 384961 391576 171235 163360 260466 249881 211692 377660 260764 287731 188096 177082
7202 177082 331622 230488 352724 243104 317850 370647 698053 776790 937591 864288
$$ packed form
7281a15093q9M4807K4497R9839n5210M5533j08198J2873J14914k78410J63111
7270e1426P411O3151m8988L2029j0117p581l2610J39372j53604O5165q0175P9707
7258B334k8345R8033o0868o1697J31055k3039M0259j20436J15953p2851L8997
7247E9395K9855P4829K0364p6658O0517r2556m5407P2927o4252J46320r2194k0903
7235G2237l6147J10114l4933k16509Q2688N9500J12687j06205J20955r711j7514
7224A37162O3215m830J07957J18563J95453l5078n6763M0819N4464l40585J04584
7213C84961O615k20341p875R7106j0585l8189J65968j16896K6967r9635j1014
7202A77082J54540j01134J22236j09620P4746N2797L27406P8737J60801p3303
$$ plain form
7192 864288 877618 739657 753293 555210 507544 460831 420100 421773 362737 407457 407022 404930
7180 404930 309258 349564 319699 326432 344961 386829 397883 474571 385153 486505 432929 483062
7168 483062 570115 371354 586097 444228 314686 412404 400369 290864 116816 182230
7158 182230 270223 254890 191583 332627 308909 286233 319510 277456 314132 177087 245374
7147 245374 206167 210724 200479 110330 177759 160326 210261 44193 113107 21733 24473 133764
7135 133764 64570 150655 117263 313689 90401 314682 353679 271393 101143 138697 132621
7124 132621 140327 151707 29852 100187 161374 140897 134500 86186 54526 113687 89609 119066
7112 119066 220383 162063 193908 279091 167857 170137 170899 187537 111576 146955 220265 180771
$$ packed form
7192H64288J3330j37961J3636j98083m7666m6713m0731J673n9036M4720m35k092
7180D04930r5672M0306k9865O733J8529M1868J1054P6688q9418J01352n3576N0133
7168D83062Q7053j98761K14743j41869j29542R7718j2035j09505j74048O5414
7158A82230Q7993j5333o3307J41044k3718k2676L3277m2054L6676j37045O8287
7147B45374l9207M557j0245r0149O7429j7433M9935j66068O8914r1374K740J09291
7135A33764o9194Q6085l3392J96426k23288K24281L8997q2286j70250L7554o076
7124A32621P706J1380j21855P0335O1187k0477o397m8314l1660N9161k4078K9457
7112A19066J01317n8320L1845Q5183j11234K280P62J6638p5961L5379P3310l9494
$$ plain form
7100 180771 228996 123093 131145 208908 139062 94499 139232 130922 57368 200350 207686 150946
7088 150946 208257 221468 201893 112872 134176 200329 148677 155833 239885 231502 184972 202607
7076 202607 175132 233946 170917 309347 265882 161151 297035 251303 263383 175904 231200
7065 231200 154448 274919 225468 210907 190021 273882 235059 287636 294368 203857 179162 162029
7053 162029 235156 306316 260898 350989 289047 277337 352985 287700 351510 385167 364437 358661
7041 358661 257816 308235 320203 265336 419100 426153 393628 424410 270553 329866 361158
7030 361158 477821 375974 509352 488103 489720 553841 454834 535847 513770 467287 476004
7019 476004 627770 521282 534264 642530 597994 503623 744672 625584 606449 712240
$$ packed form
7100A80771M8225j05903Q052P7763o9846m4563M4733q310p3554J42982P336n6740
7088A50946N7311J3211j9575q9021K1304O6153n1652P156Q4052q383m6530J7635
7076B02607k7475N8814o3029J38430m3465j04731J35884m5732J2080q7479N5296
7065B31200p6752J20471m9451j4561k0886Q3861l8823N2577O732r0511k4695j7133
7053A62029P3127P1160m5418R0091o1942j1710P5648o5285O3810L3657k0730n776
7041C58661j00845N0419J1968n4867J53764P053l2525L0782j53857N9313L1292
7030C61158J16663j01847J33378k1249J617O4121r9007Q1013k2077m6483Q717
7019D76004J51766j06488J2982J08266m4536r4371K41049j19088j9135J05791
$$ plain form
7009 712240 747511 740999 614855 824563 747343 870684 780217 742751 817620 795010 851401
6998 851401 864874 896536 757159 944038 904502 965740 1000253 933663 878393 1136844 1014107
6987 1014107 1122337 1045336 1054218 1172300 1178907 1261478 1318613 1356014 1232980 1347318 1424007
6976 1424007 1421854 1453797 1467428 1481752 1490605 1718396 1527283 1639942 1798165 1820383 1940576
6965 1940576 1977296 2110491 2157889 2332107 2520454 2631886 2950233 3493673 3928062 4396973
6955 4396973 4952195 5017172 4685257 4506928 4179152 3984319 3821256 3811887 3677894 3674381
6945 3674381 3650995 3771307 3907871 4247484 4646632 5230051 5977391 6832063 7420805 7693010
6935 7693010 7746716 7927717 7967383 7955689 7868438 7561447 7107948 6743117 6658766 6644992 6666675
$$ packed form
7009G12240L5271o512j26144K09708p7220J23341r0467l7466P4869k2610N6391
6998H51401J3473L1662j39377J86879l9536O1238L4513o6590n5270K58451j22737
6987A014107J08230p7001Q882J18082O607Q2571N7135L7401j23034J14338P6689
6976A424007k153L1943J3631J4324Q853K27791j91113J12659J58223K2218J20193
6965A940576L6720J33195M7398J74218J88347J11432L18347N43440M34389M68911
6955D396973N55222O4977l31915j78329l27776j94833j63063r369j33993l513
6945C674381k3386J20312J36564L39613L99148N83419P47340Q54672N88742K72205
6935G693010N3706J81001L9666j1694q7251l06991m53499l64831q4351j3774K1683
$$ plain form
6924 6666675 6834265 7074528 7436944 8042949 8789652 9670395 10892984 12956522 15886138
6915 15886138 20013257 24759086 28820963 31260246 30530104 28470833 26044405 23972999
6907 23972999 22352984 21377725 21175717 22113972 24610489 28391813 32239872 35669930 37087784
6898 37087784 37825697 38907038 40638409 41944799 42360266 41385477 40696230 41905450 44150585
6889 44150585 46274002 46817746 44732286 42497603 42178328 43563455 45589985 46865412
6881 46865412 45527423 42933748 40903807 40977282 41806511 42888665 43174313 42785663 42642845
6872 42642845 43068904 43341517 41973178 38417926 34070105 30104985 26548700 24035879
6864 24035879 21973546 20985506 21092401 22817496 25951121 29590998 32264187 32719276 30299928
$$ packed form
6924F666675J67590K40263L62416O06005P46703Q80743J222589K063538K929616
6915A5886138M127119M745829M061877K439283p30142k059271k426428k071406
6907B3972999j620015r75259k02008R38255K496517L781324L848059L430058J417854
6898C7087784P37913J081341J731371J306390M15467r74789o89247J209220K245135
6889D4150585K123417N43744k085460k234683l19275J385127K026530J275427
6881D6865412j337989k593675k029941P3475Q29229J082154K85648l88650j42818
6872D2642845M26059K72613j368339l555252m347821l965120l556285k512821
6864B4035879k062333r88040J06895J725095L133625L639877K673189M55089k419348
$$ plain form
6855 30299928 26642257 23130557 20061776 17259176 14645624 12651266 10932757 9745405
6847 9745405 8654535 8080669 7596017 7091383 6925361 6826388 7091959 7285299 7611505 7792646
6837 7792646 7797949 7990840 8433081 8503435 8540004 8093347 7436005 6664036 6263296 5616743
6827 5616743 5138066 4764508 4435204 4206182 3860454 3880583 3836206 3796274 3974593 4441327
6817 4441327 4803080 5283138 5673932 5307633 4936100 4533385 4018193 3729438 3263955 3019848
6807 3019848 2693949 2330740 2274218 2136667 2108183 1999823 1881854 1862348 1836940 1667393
6797 1667393 1565842 1534393 1544880 1628832 1483438 1486938 1423711 1384009 1302478 1214927 1207156
6786 1207156 1176897 1166493 1267142 1113266 1187316 1091707 1147570 925662 937455 981593 1052681
$$ packed form
6855C0299928l657671l511700l068781k802600k613552j994358j718509j187352
6847I745405j090870n73866m84652n04634j66022r8973K65571J93340L26206J81141
6837G792646N303J92891M42241P0354L6569m46657o57342p71969m00740o46553
6827E616743m78677l73558l29304k29022l45728K0129m4377l9932J78319M66734
6817D441327L61753M80058L90794l66299l71533m02715n15192k88755m65483k44107
6807C019848l25899l63209n6522j37551k8484j08360j17969j9506k5408j69547
6797A667393j01551l1449J0487Q3952j45394L500o3227l9702q1531q7551p771
6786A207156l0259j0404J00649j53876P4050r5609N5863k21908J1793M4138P1088
$$ plain form
6775 1052681 956448 1038897 993720 958468 926950 894127 871619 833002 797296 872655 778585
6764 778585 798322 823615 850859 826292 946237 982662 961312 928022 896656 811216 840860
6753 840860 910060 852651 943842 878785 867480 742152 675829 674674 689770 593596 537847 646290
6741 646290 520546 634302 549311 443538 529089 409855 438577 389291 443871 367826 465706
6730 465706 423185 445929 413262 433710 442960 339175 405277 384813 412877 343506 239493
6719 239493 485207 347562 358917 385413 370234 306759 209496 310177 227845 362855 292256
6708 292256 307546 318962 265969 270872 211955 190336 325695 222411 272381 409498 369922
6697 369922 400385 354537 338167 263362 318210 426693 437452 457271 384733 468206 342069
$$ packed form
6775A052681r6233Q2449m5177l5252l1518l2823k2508l8617l5706P5359r4070
6764G78585J9737K5293K7244k4567J19945L6425k1350l3290l1366q5440K9644
6753H40860O9200n7409R1191o5057j1305j25328o6323j155J5096r6174n5749J08443
6741F46290j25744J13756q4991j05773Q5551j19234K8722m9286N4580p6045R7880
6730D65706m2521K2744l2667K0448R250j03785O6102k0464K8064o9371j04013
6719B39493K45714j37645J1355K6496j5179o3475r7263J00681q2332J35010p0599
6708B92256J5290J1416n2993M903n8917k1619J35359j03284M9970J37117l9576
6697C69922L0463m5848j6370p4805N4848J08483J0759J9819p2538Q3473j26137
$$ plain form
6686 342069 233627 280376 370824 271168 259770 255174 250954 249504 145176 171472 209713 239724
6674 239724 71923 223496 198468 255634 215535 252865 351104 360964 411365 439306 348131
6663 348131 165548 364709 157080 209852 151519 228012 311103 165478 237161 188694 122807
6652 122807 142752 102304 210294 190481 163562 171839 127409 165729 175178 101678 185184 335754
6640 335754 271226 468311 512460 351012 351242 292934 273100 302498 357599 316361 283988 337241
6628 337241 236097 233331 323876 314494 316367 330322 324509 254324 236495 211222 174070 186186
6616 186186 221123 294092 265610 400494 425995 466312 447002 447957 572467 528602 658037
6605 658037 593772 617032 706744 578555 695030 622415 529475 673333 598562 487835 599364
$$ packed form
6686C42069j08442M6749R0448r9656j1398m596m220j450j04328K6296L8241L0011
6674B39724j67801J51573k5028N7166m0099L7330R8239R860N0401K7941r1175
6663C48131j82583J99161k07629N2772n8333P6493Q3091j45625P1683m8467o5887
6652A22807J9945m0448J07990j9813k6919Q277m4430L8320R449p3500Q3506J50570
6640C35754o4528J97085M4149j61448K30n8308j9834K9398N5101m1238l2373N3253
6628C37241j01144k766R0545r382J873J3955n813p0185j7829k5273l7152J2116
6616A86186L4937P2969k8482J34884K5501M0317j9310R55J24510m3865J29435
6605F58037o4265K3260Q9712j28189J16475p2615r2940J43858p4771j10727J11529
$$ plain form
6594 599364 544248 478119 497658 401714 589314 471212 629182 582634 509786 510448 762263
6583 762263 594680 815940 840424 868787 625279 840567 749457 696446 763237 721515 680007
6572 680007 700477 680918 631143 574143 441544 525637 525576 520977 423976 503622 387926 495931
6560 495931 511040 457972 601008 626191 523169 509402 648941 571083 632360 563328 546078
6549 546078 688991 581407 585240 525430 594990 432820 513884 424350 373964 472376 376553
6538 376553 373516 507745 513528 317944 438729 372685 509160 462669 479588 466322 442531
6527 442531 491843 442361 497775 433910 512754 544280 476691 592059 647161 440860 455705
6516 455705 533828 540319 643288 503379 588010 569307 588061 585334 541536 520086 474528 636114
$$ packed form
6594E99364n5116o6129J9539r5944J87600j18102J57970m6548p2848O62K51815
6583G62263j67583K21260K4484K8363k43508K15288r1110n3011O6791m1722m1508
6572F80007K0470j9559m9775n7000j32599Q4093o1m599r7001P9646j15696J08005
6560D95931J5109n3068J43036K5183j03022j3767J39539p7858O1277o9032j7250
6549E46078J42913j07584L833n9810O9560j62170Q1064q9534n0386R8412r5823
6538C76553l037J34229N783j95584J20785o6044J36475m6491J6919j3266k3791
6527D42531M9312m9482N5414o3865P8844L1526o7589J15368N5102k06301J4845
6516D55705P8123O491J02969j39909Q4631j8703J8754k727m3798k1450m5558J61586
$$ plain form
6504 636114 624886 600646 596697 645776 637081 558019 641735 682095 662014 743481 650204 688620
6492 688620 661387 593335 610327 656119 663365 733252 766398 790525 748979 729199 837098 852906
6480 852906 828565 796691 979004 931222 932045 963915 959432 1074582 1090201 1051350 1147823 1065180
6468 1065180 1077524 1090588 992762 1005864 1082020 985920 1052896 1186582 1091105 1231433 1221999
6457 1221999 1358153 1191333 1392207 1236016 1397408 1401634 1235340 1353771 1419011 1362118
6447 1362118 1424072 1351623 1409606 1365635 1358916 1376680 1316475 1192135 1274860 1368894 1351417
6436 1351417 1359914 1392418 1433227 1373678 1547804 1520987 1622852 1627920 1673028 1735560 1678190
6425 1678190 1594130 1626246 1712238 1728889 1771716 1827901 1771162 1921925 1921939 1729322 1939460
$$ packed form
6504F36114j1228k4240l949M9079q695p9062Q3716M0360k0081Q1467r3277L8416
6492F88620k7233o8052J6992M5792P246O9887L3146K4127m1546j9780J07899J5808
6480H52906k4341l1874J82313m7782Q23L1870m483J15150J5619l8851R6473q2643
6468A065180J2344J3064r7826J3102P6156r6100O6976J33686r5477J40328r434
6457A221999J36154j66820K00874j56191J61392M226j66294J18431O5240n6893
6447A362118O1954p2449N7983m3971o719J7764o0205j24340Q2725R4034j7477
6436A351417Q497L2504M0809n9549J74126k6817J01865N068M5108O2532n7370
6425A678190q4060L2116Q5992J6651M2827N6185n6739J50763J4j92617K10138
$$ plain form
6414 1939460 1985043 1975789 2077635 2004604 2022373 2076283 2158569 2073634 2042417 2108421 2179740
6403 2179740 2272240 2272543 2287647 2358915 2447437 2482395 2659286 2676739 2740266 2871641 2869619 3015349
6391 3015349 3014775 3097173 3088728 3142836 3304479 3515056 3622198 3873406 3928599 4087549 4420099
6380 4420099 4641485 4910374 5299067 5799117 6179805 6926413 7746331 8733683 10580313
6371 10580313 12820977 15251503 17302691 18841005 19788978 20612108 21511016 22048538 22161472
6362 22161472 21043914 19434201 17485191 15941281 14496024 13522318 12640208 12334781 12234865
6353 12234865 12413426 12715166 13504962 14578182 15870647 17864120 21024062 25979603 32491549
6344 32491549 39963715 46589152 50841509 52900041 54573419 57138627 59477989 60010346
$$ packed form
6414A939460M5583r254J01846p3031J7769N3910Q2286q4935l1217O6004P1319
6403B179740R2500L03J5104P1268Q8522L4958J76891J7453O3527J31375k022J45730
6391C015349n74Q2398q445N4108J61643K10577J07142K51208N5193J58950L32550
6380D420099K21386K68889L88693N00050L80688P46608Q19918R87352J846630
6371A0580313K240664K430526K051188J538314R47973Q23130Q98908N37522J12934
6362B2161472j117558j609713j949010j543910j445257r73706q82110l05427r9916
6353A2234865J78561L01740P89796J073220J292465J993473L159942M955541O511946
6344C2491549P472166O625437M252357K058532J673378K565208K339362N32357
$$ plain form
6336 60010346 56962555 51054916 44277842 37958744 32634363 28316627 24912168 22209188
6328 22209188 20366879 19293840 18750343 18633667 19010226 19875553 21479079 24209143 28869234
6319 28869234 35242596 42616694 49064701 53218559 54863126 56052203 58080799 60436434
6311 60436434 61410594 58755953 52904521 45729500 38889555 32951723 27827235 23861141
6303 23861141 20561662 18074989 16151940 14886348 14183292 13450903 13314291 13474884 14100721
6294 14100721 15219704 17265933 19337646 21186303 22366428 22655994 22893628 23353784 23819314
6285 23819314 24139292 23301667 21416218 19196552 16668480 14677981 12790060 11269423
6277 11269423 10055408 8981497 8175276 7515285 7230584 6732712 6646652 6346986 6278688
$$ packed form
6336F0010346l047791n907639o777074o319098n324381m317736l404459k702980
6328B2209188j842309j073039n43497j16676L76559Q65327J603526K730064M660091
6319B8869234O373362P374098O448007M153858J644567J189077K028596K355635
6311F0436434R74160k654641n851432p175021o839945n937832n124488l966094
6303B3861141l299479k486673j923049j265592p03056p32389j36612J60593O25837
6294A4100721J118983K046229K071713J848657J180125K89566K37634M60156M65530
6285B3819314L19978q37625j885449k219666k528072j990499j887921j520637
6277A1269423j214015j073911q06221o59991k84701m97872q6060k99666o8298
$$ plain form
6268 6278688 6178239 6126554 6150085 6009132 6029853 5927751 6250729 6628226 7095831 8133555
6258 8133555 8928397 9372017 9185752 8691568 8090557 7818656 7546566 7240780 7004788 6885601
6248 6885601 6731007 6704810 6583941 6790687 6961333 7388938 8136628 9219974 10099854 10661368
6238 10661368 10717369 10339008 10236383 10510814 10761512 11014577 10962664 10093560 9427361 9065876
6228 9065876 8687165 8374476 8405491 8365342 8548551 8817596 9296222 10037646 11013377 12628902
6218 12628902 15753146 20166914 25161479 29916227 32309585 31253042 28146316 25103504
6210 25103504 22300891 19848154 17834643 16344972 15296301 14856108 15080230 15714073 17250487
6201 17250487 20048065 24293471 29314124 34216476 37501787 37996440 37919760 39165934 41778249
$$ packed form
6268F278688j00449n1685K3531j40953K0721j02102L22978L77497M67605J037724
6258H133555P94842M43620j86265m94184o01011k71901k72090l05786k35992j19187
6248F885601j54594k6197j20869K06746J70646M27605P47690J083346Q79880N61514
6238A0661368N6001l78361j02625K74431K50698K53065n1913q69104o66199l61485
6228I065876l78711l12689L1015m0149J83209K69045M78626P41424R75731J615525
6218A2628902L124244M413768M994565M754748K393358j056543l106726l042812
6210B5103504k802613k452737k013511j489671j048671m40193K24122O33843J536414
6201A7250487K797578M245406N020653M902352L285311M94653p6680J246174K612315
$$ plain form
6192 41778249 45310109 49065262 50684111 50558791 48705389 43823323 38227187 33434432
6184 33434432 29483766 26529641 24398334 23142773 23020990 24111886 27573939 33074263
6176 33074263 39663023 46721412 51903148 53867396 54825749 54293550 52912301 51574004
6168 51574004 49480361 45232665 39683832 34108640 29253437 25197477 21676094 19269082
6160 19269082 17446165 16010576 15363952 15424165 16081476 17718884 21309368 25550369 29791751
6151 29791751 32860922 32768720 30151996 27215598 23708756 20255084 17207143 14374779
6143 14374779 12411869 10787113 9549218 8592111 8016825 7446049 7121954 7039869 6945403
6134 6945403 7374401 8130629 8900373 9840535 10651113 10812713 11148012 11458357 11359504 10549048
$$ packed form
6192D1778249L531860L755153J618849j25320j853402m882066n596136m792755
6184C3434432l950666k954125k131307j255561j21783J090896L462053N500324
6176C3074263O588760P058389N181736J964248R58353n32199j381249j338297
6168E1574004k093643m247696n548833n575192m855203m055960l521383k407012
6160A9269082j822917j435589o46624O0213O57311J637408L590484M241001M241382
6151B9791751L069171r2202k616724k936398l506842l453672l047941k832364
6143A4374779j962910j624756j237895r57107n75286n70776l24095q2085r4466
6134F945403M28998P56228P69744R40162Q10578J61600L35299L10345r8853q10456
$$ plain form
6124 10549048 9346740 8328710 7408825 6612144 5996557 5614147 5309037 4938811 4764671
6115 4764671 4698224 4549193 4766763 5050446 5619660 6448025 7191150 7717837 7616132 6771337
6105 6771337 6009015 5250048 4811159 4192931 3764519 3285792 2974972 2772756 2585247 2549178
6095 2549178 2349401 2260724 2099605 2175887 1968791 1969363 1899197 1880666 1814996 1810696 1703736
6084 1703736 1612514 1642677 1614607 1592561 1552107 1593017 1651907 1654184 1536017 1569513 1655364
6073 1655364 1697515 1610517 1665633 1508310 1414372 1420563 1481104 1361807 1418316 1195349 1242478
6062 1242478 1191790 1232717 1085827 1136635 1138954 1169195 1109103 1123597 1251160 1082349 1140941
6051 1140941 1110814 1116841 1178768 1059481 1158127 1119670 1090717 991852 1098283 1070338 1122921
$$ packed form
6124A0549048j202308j018030r19885p96681o15587l82410l05110l70226j74140
6115D764671o6447j49031K17570K83683N69214Q28365P43125N26687j01705q44795
6105F771337p62322p58967m38889o18228m28412m78727l10820k02216j87509l6069
6095B549178j99777q8677j61119P6282k07096N72p0166j8531o5670m300j06960
6084A703736r1222L0163k8070k2046m0454M0910N8890K277j18167L3496Q5851
6073A655364M2151q6998N5116j57323r3938O191O0541j19297N6509k22967M7129
6062A242478n0688M0927j46890N0808K319L0241o0092J4494J27563j68811N8592
6051A140941l0127O027O1927j19287R8646l8457k8953r8865J06431k7945N2583
$$ [...]
##END NTUPLES=NMR SPECTRUM
##END=
