##TITLE=abcd
##JCAMPDX= 6.0         $$ Bruker NMR JCAMP-DX V2.0
##DATA TYPE= NMR SPECTRUM
##DATA CLASS= NTUPLES
##ORIGIN= UXNMR, Bruker Analytische Messtechnik GmbH
##OWNER= root
$$ XWIN-NMR		Version 3.5
$$ Fri May 15 16:45:46 2026 Russian Standard Time (UT+4h)  servis@DPX200
##.OBSERVE FREQUENCY= 200.131235884673
##.OBSERVE NUCLEUS= ^1H
##.ACQUISITION MODE= SIMULTANEOUS
##.ACQUISITION SCHEME= undefined
##.AVERAGES= 32
##.DIGITISER RES= 18
##SPECTROMETER/DATA SYSTEM= spect
##.PULSE SEQUENCE= zg
##.SOLVENT NAME= CDCl3
##.SHIFT REFERENCE= (INTERNAL, CDCl3, 0, 16.4885)
##AUDIT TRAIL= $$ (NUMBER, WHEN, WHO, WHERE, WHAT)
$$ ##TITLE= Audit trail, XWIN-NMR		Version 3.5
$$ ##JCAMPDX= 5.01
$$ ##ORIGIN= Bruker BioSpin GmbH
$$ ##OWNER= servis
$$ F:\spectra/data/av/nmr/H1/1/pdata/1/auditp.txt
$$ ##AUDIT TRAIL=  $$ (NUMBER, WHEN, WHO, WHERE, WHAT)
(   1,<2026-05-15 16:45:08.00 +0400>,<servis>,<DPX200>,
      <created by zg, POWCHK disabled, PULCHK disabled
       configuration hash MD5:
       00 E9 B6 7A A2 85 ED C7 34 08 36 98 17 FE 4E 26
       data hash MD5: 32K
       81 40 5C 00 C4 78 B8 ED F7 C4 B5 99 7B FD 2A 3D>)
(   2,<2026-05-15 16:45:19.12 +0400>,<servis>,<DPX200>,
      <Start of raw data processing
       efp BC_mod = 2 LB = 0.05 FT_mod = 6 PKNL = 1 PHC0 = -411.19 PHC1 = 3.101563 SI = 16K 
       data hash MD5: 16K
       8C 4E 02 6E 61 FC C0 E0 7E DB 2F FF 5A AC 95 14>)
$$ ##END=
$$ 
$$ hash MD5
$$ 27 A7 FC 32 1C D5 8E AB 1B 87 CA B0 4E 9B 1A 88
##$RELAX= 
##$RELAX= 
##$RELAX= 
##$RELAX= 
##$RELAX= 
##$RELAX= 
##$RELAX= 
##$RELAX= 
$$ Bruker specific parameters
$$ --------------------------
##$DU= <F:\spectra>
##$EXPNO= 1
##$NAME= <H1>
##$PROCNO= 1
##$TYPE= <nmr>
##$USER= <av>
##$AMP= (0..31)
100 100 100 100 100 100 100 100 100 100 100 100 100 100 100 100 100 100 
100 100 100 100 100 100 100 100 100 100 100 100 100 100 
##$AQSEQ= 0
##$AQ_mod= 1
##$AUNM= <au_zg>
##$AUTOPOS= <>
##$BF1= 200.13
##$BF2= 200.13
##$BF3= 200.13
##$BF4= 200.13
##$BF5= 500.13
##$BF6= 500.13
##$BF7= 500.13
##$BF8= 500.13
##$BYTORDA= 1
##$CFDGTYP= 0
##$CFRGTYP= 5
##$CHEMSTR= <none>
##$CNST= (0..31)
1 1 145 1 1 1 1 1 1 1 1 1 1 1 1 1 1 1 1 1 1 1 1 1 1 1 1 1 1 1 1 1 
##$CPDPRG= <>
##$CPDPRG1= <>
##$CPDPRG2= <>
##$CPDPRG3= <>
##$CPDPRG4= <mlev>
##$CPDPRG5= <mlev>
##$CPDPRG6= <mlev>
##$CPDPRG7= <mlev>
##$CPDPRG8= <mlev>
##$CPDPRGB= <>
##$CPDPRGT= <>
##$D= (0..31)
0 2 0 0 0 0 0 0 0 0.06 0 0 0 0 0 0 0.0002 0 0 0 0 0 0 0 0 0 0 0 0 0 0 
0 
##$DATE= 1778849107
##$DBL= (0..7)
120 120 120 120 120 120 120 120 
##$DBP= (0..7)
150 150 150 150 150 150 150 150 
##$DBP07= 0
##$DBPNAM0= <>
##$DBPNAM1= <>
##$DBPNAM2= <>
##$DBPNAM3= <>
##$DBPNAM4= <>
##$DBPNAM5= <>
##$DBPNAM6= <>
##$DBPNAM7= <>
##$DBPOAL= (0..7)
0.5 0.5 0.5 0.5 0.5 0.5 0.5 0.5 
##$DBPOFFS= (0..7)
0 0 0 0 0 0 0 0 
##$DE= 6
##$DECBNUC= <off>
##$DECIM= 32
##$DECNUC= <off>
##$DECSTAT= 4
##$DIGMOD= 1
##$DIGTYP= 9
##$DL= (0..7)
0 120 120 120 120 120 120 120 
##$DP= (0..7)
150 150 150 150 150 150 150 150 
##$DP07= 0
##$DPNAME0= <>
$$ [...]
##$SUBNAM4= <"">
##$SUBNAM5= <"">
##$SUBNAM6= <"">
##$SUBNAM7= <"">
##$SUBNAM8= <"">
##$SUBNAM9= <"">
##$SW= 20.6817932712277
##$SWIBOX= (0..15)
0 0 3 0 0 0 0 0 0 0 0 0 0 0 0 0 
##$SW_h= 4139.07284768212
##$TD= 32768
##$TD0= 1
##$TE= 0
##$TE2= 300
##$TE3= 300
##$TEG= 300
##$TL= (0..7)
0 120 120 120 120 120 120 120 
##$TP= (0..7)
150 150 150 150 150 150 150 150 
##$TP07= 0
##$TPNAME0= <>
##$TPNAME1= <>
##$TPNAME2= <>
##$TPNAME3= <>
##$TPNAME4= <>
##$TPNAME5= <>
##$TPNAME6= <>
##$TPNAME7= <>
##$TPOAL= (0..7)
0.5 0.5 0.5 0.5 0.5 0.5 0.5 0.5 
##$TPOFFS= (0..7)
0 0 0 0 0 0 0 0 
##$TUNHIN= 0
##$TUNHOUT= 0
##$TUNXOUT= 0
##$USERA1= <user>
##$USERA2= <user>
##$USERA3= <user>
##$USERA4= <user>
##$USERA5= <user>
##$V9= 5
##$VALIST= <valist>
##$VCLIST= <CCCCCCCCCCCCCCC>
##$VD= 0
##$VDLIST= <DDDDDDDDDDDDDDD>
##$VPLIST= <PPPPPPPPPPPPPPP>
##$VTLIST= <TTTTTTTTTTTTTTT>
##$WBST= 1024
##$WBSW= 30
##$XGAIN= (0..3)
0 0 0 0 
##$XL= 0
##$YL= 0
##$YMAX_a= 220783
##$YMIN_a= -444270
##$ZGOPTNS= <>
##$ZL1= 120
##$ZL2= 120
##$ZL3= 120
##$ZL4= 120
##$ABSF1= 0
##$ABSF2= 0
##$ABSG= 0
##$ABSL= 0
##$ALPHA= 0
##$AQORDER= 0
##$ASSFAC= 0
##$ASSFACI= 0
##$ASSFACX= 0
##$ASSWID= 0
##$AUNMP= <proc_1d>
##$AZFE= 0.1
##$AZFW= 0.1
##$BCFW= 0
##$BC_mod= 2
##$BYTORDP= 0
##$COROFFS= 0
##$CY= 18.4799938201904
##$DATMOD= 1
##$DC= 0
##$DFILT= <>
##$DTYPP= 0
##$F1P= 9.9274215381318
##$F2P= -0.165520771350173
##$FCOR= 1
##$FTSIZE= 16384
##$FT_mod= 6
##$GAMMA= 0
##$GB= 0
##$INTBC= 1
##$INTSCL= 4.127829e-11
##$ISEN= 128
##$LB= 0.05
##$LEV0= 0
##$LPBIN= 0
##$MAXI= 10000
##$MC2= 0
##$MEAN= 0
##$ME_mod= 0
##$MI= 50
##$NCOEF= 0
##$NC_proc= -5
##$NLEV= 6
##$NOISF1= 3.799351
##$NOISF2= 2.8
##$NSP= 0
##$NTH_PI= 0
##$NZP= 0
##$OFFSET= 16.48848
##$PC= 4
##$PHC0= -411.19
##$PHC1= 3.101563
##$PH_mod= 1
##$PKNL= yes
##$PPARMOD= 0
##$PSCAL= 4
##$PSIGN= 0
##$REVERSE= no
##$SF= 200.130005582386
##$SI= 16384
##$SIGF1= 3
##$SIGF2= 2
##$SINO= 400
##$SIOLD= 16384
##$SREGLST= <1H.CDCl3>
##$SSB= 0
##$STSI= 16384
##$STSR= 0
##$SW_p= 4139.07284768211
##$SYMM= 0
##$S_DEV= 0
##$TDeff= 32768
##$TDoff= 0
##$TI= <>
##$TILT= no
##$TM1= 0
##$TM2= 0
##$TOPLEV= 0
##$USERP1= <user>
##$USERP2= <user>
##$USERP3= <user>
##$USERP4= <user>
##$USERP5= <user>
##$WDW= 1
##$XDIM= 16384
##$YMAX_p= 302585735
##$YMIN_p= -799365
$$ End of Bruker specific parameters
$$ ---------------------------------
##NTUPLES= NMR SPECTRUM
##VAR_NAME=  FREQUENCY,     SPECTRUM/REAL,   SPECTRUM/IMAG
##SYMBOL=    X,             R,               I
##VAR_TYPE=  INDEPENDENT,   DEPENDENT,       DEPENDENT
##VAR_FORM=  AFFN,          ASDF,            ASDF
##VAR_DIM=   16384,         16384,           16384
##UNITS=     HZ,            ARBITRARY UNITS, ARBITRARY UNITS
##FACTOR=    0.252644378177508, 1,           1
##FIRST=     3299.83951724647, 0,            0
##LAST=      -839.233330435636, 0,           0
##MIN=       -839.233330435636, -799365,     0
##MAX=       3299.83951724647, 302585735,    0
$$ Real data points
##PAGE= N=1
##DATA TABLE= (X++(R..R)), XYDATA
$$ [...]
10199A39990r4153o4116J9772k27684j08859K82328J14829j29313k25638K39485
10189e3359J36491l83475J8888k61595L07246R9717J07554j228J22375j99020
10179a06406j81412J02073K6447J25998Q7954o3755J71485m90163L59905j3453
10169A8673J71831k45764j01698j67400L67215n05692J81639M73810k2757k61066
10159i1209J09494P8545k10174K16850j18608N0606l40350n9074K95173L8552
10149c0195K30505o93493O83614k78056q5216N2469J25187k75147K83439l03463
10139b90356K3836K55362j60600O0122k61360K99820j68770K1904j43441L15342
10129d8141k8817j52980J41568n0922k3902k07109M04371l27143K64862r8297
$$ plain form
10199 139990 45837 -18279 1493 -226191 -335050 -52722 62107 -67206 -292844 -53359
10189 -53359 83132 -300343 -281455 -543050 -235804 -136087 -28533 -29761 92614 -106406
10179 -106406 -287818 -185745 -159298 -33300 54654 -9101 162384 -327779 32126 18673
10169 18673 190504 -55260 -156958 -324358 42857 -462835 -281196 192614 169857 -91209
10159 -91209 18285 96830 -113344 103506 -15102 35504 -304846 -363920 -68747 -30195
10149 -30195 200310 -493183 190431 -87625 -172841 -120372 4815 -270332 13107 -290356
10139 -290356 -266520 -11158 -171758 -111636 -372996 -73176 -241946 -220042 -363483 -48141
10129 -48141 -76958 -229938 -88370 -139292 -163194 -370303 34068 -293075 -28213 -126510
10119a26510J70264k34257P2196J79218j46307R622K42077j79396k22526K35975
10109C56k6548m39667K04564K52138o6418J06801j37300J1151J77235k22066k23404
10098c63158K33335O8708P6152l87698K52480J18308N4773j71336j31707J73810
10088g6333N6646m9309o5614J3169K29677j78770K05490k44797K89217j02131
10078G7245Q9882n5455q9032j33142j00914J23910J40572n8013j86376K27770
10068C6447l73544j32893L90944J34212m08014L25449j18031k96364N12135n7112
10058A3229n1875r814J97543m26099N2870L03604K13516j86716j36041K11176
10048A81393m74059k19947N25717j54549k59793L73837J45348k96454n7086K4913
$$ plain form
10119 -126510 43754 -190503 -118307 60911 -85396 -75774 166303 -13093 -235619 356
10109 356 -26192 -465859 -261295 -9157 -75575 31226 -106074 -94923 82312 -139754 -363158
10098 -363158 -129823 -61115 15037 -372661 -120181 -1873 52900 -118436 -250143 -76333
10088 -76333 -19687 -68996 -134610 -121441 108236 -70534 134956 -109841 179376 77245
10078 77245 167127 111672 22640 -110502 -211416 -87506 53066 -4947 -191323 36447
10068 36447 -337097 -469990 -79046 55166 -352848 -27399 -145430 -441794 70341 13229
10058 13229 -38646 -48460 149083 -277016 -224146 79458 292974 106258 -29783 181393
10048 181393 -292666 -512613 13104 -141445 -401238 -27401 117947 -178507 -235593 -210680
10038b10680K13768P0792K22395k47045K98509l86371k8566K75714j73214n21644
10028d86342K89259J67718j11522k44760K27258M88765k35640j91950J49286k03411
10018a51339j20518N2624P2012Q4905K31634k33158K14281k1996p6781p4021J96998
10007A74641k31516o1351K39397p2656n77131J00148K46913K01863P4083M7428
9997A41819j02458j85618j9814m5096L63496j03879k97729L30325N0947j40568
9987h575J43127J22042k8414n36933J96571L62392k55682O5432n2809L1172l1725
9976F598Q534J86591j54690R6107n166J5000J12051k19209k2268j922K22013k57906
9964a4267L3998L12415O3764l18322P7642j24286P7485J17992k68600K97471k7307
$$ plain form
10038 -210680 3088 73880 296275 49230 347739 -38632 -67198 208516 35302 -486342
10028 -486342 -197083 -29365 -140887 -385647 -158389 330376 94736 -97214 52072 -151339
10018 -151339 -271857 -219233 -147221 -62316 169318 -63840 150441 128445 51664 -22357 174641
10007 174641 -56875 -118226 121171 48515 -528616 -428468 -181555 20308 94391 141819
9997 141819 39361 -146257 -166071 -211167 152329 48450 -249279 81046 131993 -8575
9987 -8575 134552 256594 228180 -308753 -112182 250210 -5472 59960 7151 38323 6598
9976 6598 15132 201723 47033 143140 137974 152974 265025 45816 23548 21626 243639 -14267
9964 -14267 19731 332146 395910 77588 155230 30944 108429 226421 -42179 255292 227985
9953B27985j86213N0102j35483M7018L03684k34550L0788k55665R19627o32988
9943A34305j2397j145J71296J6199j15156M9226k5058n9613k9366J51695r5053
9932A84933K72167j97969L51423k43566l30198K95394K51624j56635k15585M19643
9922F31231j71545R027k81953K61826K38301k31596N1580J13779L8552l0293L2619
9911F61528m25039L61771j55800M52045m87091j11448P13119o0592j89928P2839
9901H31404j72096J19147J7644r7238K42185j20077M82426J8401k44329l9380
9891A038087J72438J68492J77126J3076L67856N17077j22006L65487n8538M18328
9881C057423J44102O72793k6332O20160J061315J827361K871671L467032K220754
$$ plain form
9953 227985 41772 91874 -43609 3409 307093 72543 103331 -152334 767293 134305
9943 134305 121908 120763 292059 308258 193102 242328 217270 157657 128291 279986 184933
9932 184933 457100 259131 610554 366988 36790 332184 583808 427173 211588 631231
9922 631231 459686 468713 186760 448586 686887 455291 506871 620650 659202 628909 661528
9911 661528 236489 598260 442460 894505 407414 295966 1009085 948493 758565 831404
9901 831404 659308 778455 796099 698861 941046 820969 1303395 1321796 1077467 1038087
9891 1038087 1210525 1379017 1556143 1569219 1937075 2454152 2332146 2697633 2639095 3057423
9881 3057423 3201525 3874318 3847986 4468146 5529461 7356822 10228493 13695525 15916279
9872A5916279O93201M77626M36594Q8909j048661j597046j533096p63774n17728
9863A2152304m67216o60515j468435j510291j265534q31413p95653n40117k25758
9854D387372J50718m2585M58927M04056Q23818N85018P13419K78765l5594M89265
9844H213179Q19713K066221K886272M264237L177730L22258j998599k160835r14556
9835A6675620R2461L09283j560497j675302j526156j168594j692138j183350j580585
9826F690742j024145o90695n77131k75060l44451K19242n0264j15087M71310R77361
9816E281822P20179P84352N52994L31145K35792m28465j072405r76805q48745
9807D579864o04901n80476o2341n23477J0852K56436n70955r7056p8458j17341
$$ plain form
9872 15916279 16609480 17087106 17523700 17612609 16563948 14966902 13433806 12670032 12152304
9863 12152304 11685088 11024573 9556138 8045847 6780313 5948900 5153247 4613130 4387372
9854 4387372 4538090 4495505 4954432 5358488 6182306 6767324 7480743 7759508 7723914 8213179
9844 8213179 9032892 11099113 13985385 18249622 21427352 21749610 19751011 17590176 16675620
9835 16675620 16768081 17077364 15516867 13841565 12315409 11146815 9454677 8271327 6690742
9826 6690742 5666597 4975902 4398771 4123711 3779260 3998502 3948238 3833151 4304461 5281822
9816 5281822 6002001 6786353 7339347 7670492 7906284 7477819 6405414 5428609 4579864
9807 4579864 3974963 3394487 3332146 2808669 2819521 3075957 2505002 2407946 2329488 2212147
9797B212147l53065J34140l07394M5489J16600m47693J22882j22799l0911j58367
9787A211029j14008j66681M58536m1193k74452j99002j20127O53094k27235J810
9777A181771j66544q6006k02877K92015l78013Q7205J85715k13598Q7237P3775
9767H60680l9997k33770L47342L84046j73575K12819k18827n5469j2454l15423
9757G55372J45440J00455q1178j70759j30603k6273L6374N22858m91470k89379
9747C70837K83265K03350j63515L56050p3578j71451k19372J24521p8447Q0337
9737G11997l49587Q4507J50776l22380O1851J83612J40915j29861n99246N83536
9727E16120j60021o0567j90973M36989j17178j46076n6726Q1577j27332K57437
$$ plain form
9797 2212147 1859082 1993222 1685828 1731317 1847917 1400224 1523106 1400307 1369396 1211029
9787 1211029 1097021 930340 1388876 1347683 1073231 874229 754102 1407196 1179961 1181771
9777 1181771 1015227 929221 726344 1018359 640346 727551 913266 699668 786905 860680
9767 860680 820683 586913 934255 1318301 1144726 1357545 1138718 1083249 1070795 755372
9757 755372 900812 1001267 920089 749330 618727 592454 628828 1151686 660216 370837
9747 370837 654102 857452 693937 1049987 976409 804958 585586 710107 631660 711997
9737 711997 362410 446917 597693 275313 337164 520776 661691 531830 -67416 516120
9727 516120 356099 295532 104559 541548 424370 278294 221568 303145 175813 433250
9717D33250j57709J62842j21955R4747l53736O0492n6544M18130n9745k18838
9707B00934J96705J02332j64517k42635J02992R3728N6083l76498K61079J15130
9697C45333j55313j25143k79004L76900k71335J97573j67348Q7950K16249p8869
9687A46993j12024K66933n3892j51642J73672k97694M0002j34309M6906o1121
9677a36176L3820o1458L7350N40047k9178n52293J630N3383j2759k5906L40357
9666A88817J91323m26256k09751M32772j5876k69213K04316n7245J94987q9216
9656A44658k28499K79849k29628K41249K38642l17851n01423M55991L7872o6739
9646E4121J12179j96111M4611J03398j14595j27864L65138j9168j55183R2929
$$ plain form
9717 433250 275541 438383 316428 411175 57439 117931 61387 479517 419772 200934
9707 200934 397639 499971 335454 92819 195811 289539 345622 -30876 230203 345333
9697 345333 190020 64877 -214127 162773 -108562 89011 -78337 9613 225862 146993
9687 146993 34969 301902 248010 96368 270040 -27654 12348 -121961 -75055 -136176
9677 -136176 -102356 -163814 -126464 413583 384405 -167888 -166258 -112875 -125634 -151540 188817
9666 188817 380140 -46116 -255867 176905 161029 -108184 96132 38887 233874 144658
9656 144658 -83841 196008 -33620 207629 446271 128420 -373003 82988 120860 54121
9646 54121 166300 -29811 14800 118198 3603 -124261 240877 221709 66526 159455
9636A59455k46322P0855q9347J44249J53379K8956j83728L93661m97510j47144
9626b13496L50653k64056J37317N9459M0296r5623L2317p0766P8562n1573J80630
9615A83720r8575r5076K51753k8228l06596L12485q267k5175m9265l38317K01434
9604a07K59084l67739L02998P7804k52198p5763N0738j8968n760m5741K83174
9593B07522k23665j14594K50243J27865j97769J43204n970l03072M06839o16696
9583c26093M67100J66351n7331j81279P812l809j13911J24345J53487M3010l57552
9572g7870K47187M8750k33030k44538L14154J6499k4882J16902j48979M7649o2947
9561a105J88634m40836K21185Q7437k51988L29614j91224M52255l4991m13841
$$ plain form
9636 159455 -86867 -16012 -105359 38890 192269 221225 37497 431158 -66352 -213496
9626 -213496 137157 -126899 10418 69877 110173 14550 46867 -23899 54663 3090 183720
9615 183720 85145 -9931 241822 213594 -93002 219483 211216 186041 136776 -201541 -107
9604 -107 258977 -108762 194236 272040 19842 -55921 -5183 -24151 -29911 -75652 207522
9593 207522 -16143 -130737 119506 247371 49602 192806 186836 -116236 290603 -326093
9583 -326093 141007 307358 250027 68748 76560 72751 -41160 83185 236672 279682 -77870
9572 -77870 169317 218067 -14963 -259501 54653 71152 46270 163172 14193 61842 -1105
9561 -1105 187529 -253307 -32122 55315 -196673 132941 -58283 393972 358981 -54860
9551e4860J29100P0384l60209M07845j19297k33172L17798j27289J23380m59976
9541c06296K37118L2261K69188r7401J04219L9966K4908j73855j65369L39727
9531C04466j47736J96200l32173j82877K96513J2132k98808K76687J9499M8361
9521A92264j03610m8140J10740J33071j21176J26490j40408j80051L56619K60727
9511E86526l32450K88077k3747O9555j27551J3024k57428K26503m50518K00387
9501A92378L25367J58647j84598j37958Q6991q859M0378K9493J03199K5639k61279
9490C69398J30126K28491k29569J9561K32182Q1546k09447K5959J65270K42821
9480A056338K82333J57592O99050K92740j10693L90384N41323M18647L65312m94739
$$ plain form
9551 -54860 74240 144624 -215585 192260 72963 -160209 157589 30300 153680 -306296
9541 -306296 -69178 -36917 232271 134870 239089 279055 303963 130108 -35261 304466
9531 304466 156730 352930 20757 -162120 134393 146525 -152283 124404 143903 192264
9521 192264 88654 40514 151254 284325 163149 289639 149231 -30820 325799 586526
9511 586526 254076 542153 518406 587961 460410 473434 216006 442509 -8009 192378
9501 192378 517745 676392 491794 353836 440827 431968 472346 501839 605038 630677 369398
9490 369398 499524 728015 498446 518007 750189 831735 622288 648247 813517 1056338
9480 1056338 1338671 1496263 2195313 2488053 2377360 2767744 3309067 3727714 4093026 3598287
9470C598287l66428K7077m7424p0288r14577k99864Q809j74171k39163L24545
9460A846803l36848k27599L33723K75471o9144L87269K82369Q83209q3971k52379
9450C038903K34906N99233L03819J218823J929568K263920J697739O72644n97398
9441A1362157r91250j875752j844491j382258k16053k60938p5640m33777l94237
9432C887761q92513k95978J73822j08366m21602K8113k76863K94442K24253K71802
9422B884871O50942J240478R28375N68089k2550L92882J081904J165273P61493
9413I651757q63956q87601o23584m69397o6024j127575j100831o77298n01902
9404C333589r21888n9573k45644l68437n40766K39860J26188L75786j69822m56061
$$ plain form
9470 3598287 3231859 3258936 3211512 3141224 2226647 1926783 1935592 1761421 1522258 1846803
9460 1846803 1509955 1282356 1616079 1891550 1822406 2209675 2492044 3375253 3291282 3038903
9450 3038903 3273809 3873042 4176861 5395684 7325252 9589172 11286911 11959555 11362157
9441 11362157 10370907 8495155 6650664 5268406 5052353 4791415 4715775 4281998 3887761
9432 3887761 2995248 2699270 2873092 2764726 2343124 2371237 2094374 2388816 2613069 2884871
9422 2884871 3535813 4776291 5704666 6272755 6250205 6643087 7724991 8890264 9651757
9413 9651757 8787801 7900200 7276616 6807219 6741195 5613620 4512789 3835491 3333589
9404 3333589 2411701 2352128 2106484 1738047 1197281 1437141 1563329 1939115 1769293 1313232
9394A313232l9371K43967L090k00492J29636K53428k59634n40084Q6760O44179
9384A634711M7991l48917j2594j78877J67073L24300k85581n1178J0431Q5588
9374A392947m10328M34120J3677Q8910j47692R9665L04612k9833J1201J4170m2707
9363A728742J13819j93138Q3936Q44286M11109L90312N27352K57418p1071J53656
9353D246421Q26835J193659K362687K740381K891041J547862P20500l68889j517380
9344A4643117j793363j869932n10642n36758r17435j093232j236045j410120o33253
9335D642337k02677k17762k81060l78100K10430J63347O5046P36251R45759L26238
9325F009809Q18974J311808J737516J997775J354897J009629L35870J747277K030375
$$ plain form
9394 1313232 1273861 1517828 1520918 1320426 1450062 1703490 1443856 903772 990532 1634711
9384 1634711 1682702 1333785 1321191 1142314 1309387 1633687 1348106 1296928 1307359 1392947
9374 1392947 982619 1416739 1430416 1519326 1371634 1471299 1775911 1746078 1757279 1771449 1728742
9363 1728742 1842561 1649423 1733359 2577645 2988754 3379066 3906418 4163836 4092765 4246421
9353 4246421 5073256 6266915 8629602 11369983 14261024 15808886 16529386 16160497 14643117
9344 14643117 12849754 10979822 10469180 9932422 9014987 7921755 6685710 5275590 4642337
9335 4642337 4439660 4221898 3940838 3562738 3773168 3936515 4001561 4737812 5683571 6009809
9325 6009809 6828783 8140591 9878107 11875882 13230779 14240408 14576278 16323555 18353930
9316A8353930K190684P05528m19002j097037k589756k468113k376509k101113
9308A0198612j697307j143083q78918o66901O4855j065083n38252k85487O1236
9299D049672n77869P0723J07033J102819r702M20753K11376L55491k02046L67600
9289E895850R39685R58382J460576k6449l80197l21095k17249o14274j229193
9280F466036j199226o22604k44691m28107o78686m8684k93742p45940J15080m05624
9270A913812j81449k33224J88665J94789l92985J42434m08743J81638q4900M0302
9260A360339k90873j88742L45392L09444k79331j75602K49726l22949n3155l7954
9250I16295r3490J06478j47470j89910L26244j7069k10288J10683j95175M8330
$$ plain form
9316 18353930 20544614 21250142 20831140 19734103 17144347 14676234 12299725 10198612
9308 10198612 8501305 7358222 6479304 5812403 5877258 4812175 4273923 3988436 4049672
9299 4049672 3471803 3542526 3649559 4752378 4742676 5163429 5374805 5730296 5528250 5895850
9289 5895850 6835535 7793917 9254493 9228044 8847847 8526752 8309503 7695229 6466036
9280 6466036 5266810 4644206 4399515 3971408 3292722 3244038 2950296 2204356 2319436 1913812
9270 1913812 1732363 1499139 1687804 1882593 1489608 1632042 1223299 1404937 1320037 1360339
9260 1360339 1069466 880724 1226116 1535560 1256229 1080627 1330353 1007404 954249 916295
9250 916295 822805 929283 781813 591903 918147 901078 690790 801473 606298 654628
9240F54628o1931O5759j57273K32459m41123L25837K8487l32081M48764j86695
9230E76831J96127m78549j70690K34107k0602J53613J00860O4155p4739k97002
9220B84111J67237o2956j95428J55361j0928j15272K07503j16509J30088j7263
9210D25944L03030o25497N47177n60061L15127m02786L11026N00399l19674m83480
9200A1205K25674K06769J7370k34499K2886J81241k1794l94649L26630n898j96558
9189A38377j32690M3217j16567L67548P8007k63743j57283N43109p776l46813
9179A45386M2761J04152j39058O3843o5198r1597j0049L00621l34885k46178L07090
9168G6888M56006k71424k90154L55839k04272m5067K41117J36288m9635J96948
$$ plain form
9240 654628 592697 658456 501183 733642 292519 618356 646843 314762 763526 576831
9230 576831 772958 294409 123719 357826 337224 490837 591697 655852 581113 284111
9220 284111 451348 388392 192964 348325 337397 222125 429628 313119 443207 425944
9210 425944 728974 103477 650654 90593 405720 2934 313960 814359 494685 11205
9200 11205 236879 443648 461018 226519 249405 430646 408852 14203 340833 334935 138377
9189 138377 5687 48904 -67663 299885 377892 114149 -43134 499975 492199 145386
9179 145386 188147 292299 153241 217084 151886 60289 50240 350861 15976 -230202 76888
9168 76888 532894 261470 -28684 327155 122883 77816 318933 455221 405586 602534
9158F02534k43328l60495M26699k39247p5441M0840N904k26802K11167O0974M27945
9147F30750Q0811m19711j67819J92639J09785l12042L66825L6665j08417n32117
9137a22631L39975j08890O4020O2834J07440k59896L05770k04653M7169R100K15923
9126D56161m13146J49412M72247J41380p65062J37668J60475K14172l90950K28943
9116C91300J4659k953j17120M2354N7764K95845j26886j21298J57334j790J15499
9105G04708L9745k0945N2006r8801J0825k82023O14145Q8334K69867l13151L32534
9094A397244M51818L27017L08408M60429R34789J158237K801988M424713P053605
9085A9318248N535600o04055m900284n278030l708338l096142k061277j367716
$$ plain form
9158 602534 359206 -1289 425410 186163 110722 151562 157466 -69336 141831 202805 630750
9147 630750 711561 291850 124031 316670 426455 114413 481238 517903 409486 -122631
9137 -122631 217344 108454 172474 235308 342748 82852 388622 183969 231138 240238 456161
9126 456161 43015 192427 664674 806054 40992 178660 339135 553307 162357 391300
9116 391300 405959 403006 285886 328240 386004 681849 554963 433665 590999 589209 704708
9105 704708 744453 723508 775514 676713 687538 405515 1019660 1107994 1377861 1064710 1397244
9094 1397244 1849062 2176079 2484487 2944916 3879705 5037942 7839930 12264643 19318248
9085 19318248 24853848 24249793 19349509 14071479 10363141 7266999 5205722 3838006
9077C838006n09549o44309j18029n67521n5225l89113j72504O7655j25856l8510
9067A285045l56959j73623L1392K43791k93415J48401l59171m7945K83363n3577
9057G07302m8546J31526n8619O023M0019n54339m598L23179J85943k93010r2726
9046C42154M45850l10540j06619J39429K30958k32155k19090l61168M75625J7330
9036D21774K3521n3704J8958L3869r2403P2677J3289j63633m26618P10657j69500
9025C88887r6974k88376L05421m4888r2123j37081M99341k04236r7358j72506
9015F0107K067R891p7222J54361J59400J90335j63864k66948J69072l12757m3319
9004a18877L95159m02301J84513J59567L9915k65918J63374J9466j1221J70671
$$ plain form
9077 3838006 3328457 2684148 2566119 1998598 1943373 1554260 1381756 1449411 1323555 1285045
9067 1285045 928086 754463 785855 1029646 736231 884632 525461 477516 760879 707302
9057 707302 658756 790282 731663 737686 777705 223366 218768 541947 727890 434880 342154
9046 342154 788004 477464 370845 510274 741232 509077 289987 -71181 404444 421774
9036 421774 445295 391591 410549 444418 352015 424692 437981 274348 -152270 558387 388887
9025 388887 291913 3537 308958 264070 171947 34866 534207 329971 232613 60107
9015 60107 62174 72065 -5157 149204 308604 498939 335075 68127 237199 -75558 -118877
9004 -118877 276282 -126019 58494 218061 257976 -7942 155432 174898 163677 334348
8994C34348m07435K84161n386q1085J85767j64006k86580L33100o8225K8781q643
8983A44797l2363J00376k49076p7990j1873O94655o75137J548J59690q2044J0919
8972a6498R862J69116j44166k01743R3949M70383k66435l8854l75318J67810p8682
8961b10576N17921Q7330p97398J36269J91117J6814j46886M28105o7565L3906
8951A89037J1873r7822n7113J37472K27817l39910l01845L38984j48179k27089
8941b66775K11342K95671p2423j97561j03083j59390K93412j58963M56090O3809
8931C62129q42801L16835L19970R6170l22119N4102L9263l28539J555R1290K27357
8920A5212j8635k3244k02836M15548j15642K29728n10410J94197j60423K78868
$$ plain form
8994 334348 -73087 211074 205688 124603 310370 146364 -140216 192884 124659 153440 144797
8983 144797 112434 212810 -36266 -114256 -126129 568526 -106611 -105063 54627 -27417 -16498
8972 -16498 -6636 162480 18314 -183429 -89480 380903 114468 75614 -299704 -131894 -210576
8961 -210576 307345 394675 -402723 -266454 -75337 -58523 -205409 222696 155131 189037
8951 189037 200910 103088 45975 183447 411264 71354 -230491 108493 -39686 -266775
8941 -266775 -55433 240238 167815 -29746 -132829 -292219 1193 -157770 298320 362129
8931 362129 -480672 -163837 156133 252303 -69816 -15714 23549 -304990 -303435 -212145 15212
8920 15212 -3423 -26667 -229503 186045 70403 300131 -210279 -16082 -176505 102363
8910A02363j50206j20750q5316K63606K5545K36273l28998J86043m4414q0405
8900C741K8604P3167l58205J54806K60927r4405j44692J59117J1828m39693Q2730
8889b62075N29866j70302J7270p1873J08543J91453m8455l79914P7230o1638j33825
8878b03720J64476p138J11240k58243k72905N90002l4621k29327J99186j35270
8868g6320Q1891M683k43442M7414J19489j46610p8011L02707p1062J49820J37830
8857B28389k44544n33142K74358M50894k72237K66827O426k16060n162k12464
8847b56715K34470J02476l09276L17359k59514L53868j01680r7998m7498M72209
8837D07701p80412J78480L5428J398j40452L60346j18324k68915K43954L82847
$$ plain form
8910 102363 -47843 -168593 -253909 9697 35242 271515 -57483 128560 84146 3741
8900 3741 32345 105512 -252693 -97887 163040 68635 -76057 83060 94888 -344805 -262075
8889 -262075 267791 97489 114759 42886 151429 342882 294427 -85487 -8257 -69895 -203720
8878 -203720 -39244 -46382 64858 -193385 -466290 123712 89091 -140236 58950 -76320
8868 -76320 5571 10254 -233188 -185774 -66285 -212895 -290906 11801 -59261 90559 228389
8857 228389 -16155 -549297 -274939 175955 -96282 170545 176971 -39089 -44251 -256715
8847 -256715 -22245 80231 -229045 88314 -171200 182668 80988 -17010 -64508 407701
8837 407701 -372711 -194231 -158803 -157405 -297857 62489 -55835 -324750 -80796 302051
8827C02051m24382l12623L92973K34022o4803k47182J5033M8987k38678J22286
8817a72316K34062m26758J30306K53905l29908J12138K09894k83527L33541l30763
8807b69426J43516K88093L2100l9921j38087k9920m3784m12625k7925P17135k59196
8796d0040J4750J24306j48070j28047R634J56498O7163k55730O80915j05532n62982
8785a87135j19329M45969m22356p8233L13012J05704m17644O3051N51275k22252
8775C2062P1061J0030l13397O7228R0389q3563M9470L02838n04188L36899J18787
8764A77616J44125n70067L47165N6685k44682L18614M3454J39420k84790K26777
8754C54317j8693j61737K15533j68431q0130j69605L67491O7005j51012k40558
$$ plain form
8827 302051 -122331 -434954 -41981 192041 127238 -119944 -104911 -55924 -294602 -172316
8817 -172316 61746 -365012 -234706 19199 -310709 -198571 11323 -272204 61337 -269426
8807 -269426 -125910 162183 194283 154362 16275 -13645 -57429 -470054 -497979 219156 -40040
8796 -40040 -25290 99016 -49054 -177101 -167467 -10969 56194 -199536 481379 375847 -187135
8785 -187135 -306464 139505 -282851 -361084 -48072 57632 -360012 -296961 254314 32062
8775 32062 103123 113153 -200244 -133016 -42627 -126190 -76720 226118 -278070 58829 177616
8764 177616 321741 -248326 98839 155524 -89158 229456 272910 412330 127540 354317
8754 354317 335624 173887 389420 220989 140859 -28746 338745 405750 254738 14180
8744A4180l9121p5600n2536K15447k50783K03697q4281K98743k87480P6486j09655
8733i0903k82100L43431j06151K83219M4465q9474l94298L96025j71650L31644
8723B64208J07794n12265R5501L0087n9814K23790Q0788m47022M39895j05208
8713A17754L1620j6098j77616J66388R6396k26958K30575r8162k79693L0149J37365
8702A1720J85797K28425l47265j51420l0689M07930k82701K75607k26703K19670
8692B90371j99531J59793l32493J77442K91784o0421M5856l97949J42694M3938
8682A61484n2992j62K41182R3205k46535M4268K27287k67913L18015q5477r8298
8671C34064L12925m3681P7750n9673n1608m0453O4252J10251J99190k49742r1062
$$ plain form
8744 14180 -24941 -100541 -153077 62370 -188413 15284 -68997 229746 -57734 18752 -90903
8733 -90903 -373003 -29572 -135723 147496 191961 102487 -291811 104214 -67436 264208
8723 264208 372002 -140263 -44762 -14675 -74489 149301 230089 -216933 222962 117754
8713 117754 149374 133276 -44340 122048 218444 -8514 222061 123899 -155794 -125645 11720
8702 11720 197517 425942 78677 -72743 -103432 304498 21797 297404 70701 290371
8692 290371 90840 250633 -81860 95582 387366 326945 372801 -25148 117546 161484
8682 161484 108492 108330 349512 442717 196182 240450 467737 199824 517839 432362 334064
8671 334064 646989 603308 681058 621385 569777 529324 593576 703827 903017 653275 562213
8660E62213k15977K01293L24066l64905j44570J00634L22358k91686K40550j53605
8650E80371n4445J91770j51461m3217l33003K68685M14131k43103k0508J57915
8640G67135J98801K2737L80218j1420M53986N42195Q53199R56769Q33845P3012
8630E070477n89091l54783o00747j26031M89527M48920M99447O22964l92794o83075
8620D384814p42044q50567m17793l43870J38028p01250m5068k04440j22469K9210
8610A124551j8299O207k65644L29849r1441o6836J90583j41589j34364J43313
8600A076330R8628J11351l05752R7760m0701p77M01878j58427o6783L84378j09457
8589A488428m1917n4483K13548M8915m36844K59975P69846k48844k37368P3536
$$ plain form
8660 562213 346236 547529 871595 506690 362120 462754 785112 493426 733976 580371
8650 580371 525926 717696 566235 523018 190015 458700 872831 629728 609220 767135
8640 767135 965936 988673 1368891 1357471 1811457 2353652 3206851 4163620 4997465 5070477
8630 5070477 4481386 4126603 3525856 3399825 3889352 4338272 4837719 5460683 5067889 4384814
8620 4384814 3642770 2792203 2374410 2030540 2168568 1467318 1422250 1217810 1095341 1124551
8610 1124551 1106252 1112459 846815 1176664 1085223 1018387 1208970 1067381 933017 1076330
8600 1076330 1174958 1286309 980557 1078317 1037616 1036839 1438717 1280290 1213507 1597885 1488428
8589 1488428 1446511 1392028 1605576 1654491 1217647 1477622 2247468 1998624 1761256 1834792
8579A834792M74941m6684L47108J45181N87978O2476O32104J016420J239681J950842
8569H244839L034597M067317L778142K432351K07915K424035M696023M931938
8561C3817157K058013k955575m407980k355777o92144j478365k825152m684464
8553A6475713l182876k919308k295687j514105r37559q34427n98294l82172p0891
8544C740394k98851l05803m07432P6400k16166j45787l32848K89423l21354L2990
8534B110966P4991j75314m78606M77199N9933j45054O796l27139J94495l23947
8524A474320n4176P8257O836r3273l72351M31959o5094j02824P3288J24845k80845
8513A220942q6525J68462k41456K48610j63980m1302q3959L0940j64067J47835
$$ plain form
8579 1834792 2309733 2263049 2610157 2755338 3343316 3405792 4037896 5054316 6293997 8244839
8569 8244839 11279436 15346753 19124895 21557246 21765161 24189196 28885219 33817157
8561 33817157 35875170 32919595 28511615 26155838 25463694 23985329 21160177 16475713
8553 16475713 13292837 10373529 8077842 6563737 5626178 4791751 4193457 3811285 3740394
8544 3740394 3441543 3135740 2728308 2804708 2588542 2442755 2109907 2399330 2077976 2110966
8534 2110966 2185957 2010643 1532037 2009236 2069169 1924115 1930911 1603772 1798267 1474320
8524 1474320 1420144 1498401 1505237 1411964 1039613 1471572 1406478 1303654 1376942 1501787 1220942
8513 1220942 1134417 1302879 1061423 1310033 1146053 1104751 1020792 1051732 887665 1035500
8503A035500Q9706j96455K22193k58498n2838J62079o6447j05650p5846k036j96025
8492E55683j16698L07934J00712j92756k96715K69375Q2957P1326k54428J71426
8482F98816K57428k96701j8772p9784K37864j50412p2495J19365j77749k1913
8472D95647J4615K3687J79093K1824j20326l86843J52654L011K81688j15071L40409
8461H90388o94913J63733j165o7378N9483J34328j72611P2118K43567k38487k08044
8450A81019J47441K78131q0184l697L12430j54294n02319j94783O74325M4811
8440G02880O1961j21880O1059l20981M4255J40118P1037l36915L21018K62446
8430H84998n1516k34775L25249j24997m67202K12746K54731K9142m0960k53531
$$ plain form
8503 1035500 1125206 928751 1150944 892446 839608 1001687 935240 829590 753744 751708 555683
8492 555683 438985 746919 847631 654875 358160 627535 710492 781818 527390 698816
8482 698816 956244 659543 640771 560987 798851 648439 575944 695309 517560 495647
8472 495647 510262 533949 713042 734866 614540 227697 380351 383362 665050 549979 890388
8461 890388 195475 359208 358043 290665 350148 484476 311865 383983 627550 389063 181019
8450 181019 328460 606591 526407 522710 835140 680846 178527 -16256 658069 702880
8440 702880 764841 642961 704020 383039 427294 567412 638449 301534 622552 884998
8430 884998 833482 598707 923956 798959 331757 544503 799234 828376 787416 533885
8420E33885L33940j01847j24194O921J03701N2092n0661l394O4505J84335p9885
8409I19398K8136K11955J0057j81379M50962L7170J69831k08165J32457r7732
8399A472690j2481J78931K02816Q6455o0946M69529k25546K10204K32884O2085
8389B616621J3529M59945M54821M26925Q16650O33820J435132K399331L554102
8380A2810876N641021P025722N563316N657104O355139K093714k838286l882923
8372C8425683m251235o342228o919010n234303l755415k501271k082751j224560
8364F114910r79416k6496o35169o60175K1887m87165q4704J16053j54076m74889
8354B750760J31257r7031J22388m08768n5538L39985j32054l09231j37548O9524
$$ plain form
8420 533885 867825 765978 641784 648705 752406 804498 753837 750443 814948 999283 919398
8409 919398 947534 1159489 1169546 988167 1439129 1476299 1646130 1437965 1570422 1472690
8399 1472690 1460209 1639140 1841956 1928411 1867465 2336994 2111448 2321652 2554536 2616621
8389 2616621 2630150 3090095 3544916 3971841 4788491 5422311 6857443 9256774 12810876
8380 12810876 18451897 25477619 31040935 36698039 43053178 45146892 42308606 38425683
8372 38425683 34174448 27832220 20913210 15678907 11923492 9422221 7339470 6114910
8364 6114910 5135494 5108998 4473829 3813654 3835541 3348376 3263672 3379725 3225649 2750760
8354 2750760 2882017 2784986 2907374 2498606 2443068 2783053 2650999 2341768 2204220 2273744
8344B273744k82634n5899j82193N23260q19407J9493N6252L37784j51201o1984
8334A657215J06882K18355n0934p56666N05412j01291j49767J51734j74690j03513
8324A302737j55368J7212j1949n1839k17131K00995l21871J50562l3879K68531
8314A148000k2788L1152m57412J05331J34465k94927L54626r3816K18660P2451
8304A195742N4327j61055j78941K15231l3354P1883p9966m88644j8897K89849
8294H66175L7425l45031N15380J41253k50302n82326N16804j28433j76252l515
8284E91178J82338J16372j21485j54570j07667K90271l80018J60123j51568M87362
8274I12336k5458N34628K57502j98566N8330R8607J48821K08769N8877j81592
$$ plain form
8344 2273744 1991110 1935211 1753018 2276278 1456871 1476364 1532616 1870400 1719199 1657215
8334 1657215 1764097 1982452 1931518 1174852 1680264 1578973 1429206 1580940 1406250 1302737
8324 1302737 1147369 1164581 1152632 1100793 883662 1084657 762786 913348 879469 1148000
8314 1148000 1125212 1156364 698952 804283 938748 643821 998447 904631 1123291 1195742
8304 1195742 1250069 1089014 910073 1125304 1091950 1163833 1083867 595223 576326 866175
8294 866175 903600 558569 1073949 1215202 964900 382574 899378 770945 594693 591178
8284 591178 773516 889888 768403 613833 506166 796437 416419 576542 424974 912336
8274 912336 886878 1421506 1679008 1480442 1538772 1637379 1786200 1994969 2053846 1872254
8264A872254L0073j71340j91403N04594M64819J96675J80103P12291N00005n3541
8254D044530k36865q388l28026o18899n26053k16060j79458k94759l2563O7044
8244A670503K42833L97925N99546M73509K59973N97873j19740j55028l98965j85274
8234C383155n18404p87009l57150j08385J15672o56040l41727J25766R5971k49413
8224G02436P6487p3568l1071l09213L81672K24816j84894k34808J14602j10457
8214E56002J64164j88794L99779k71749P1164j58411j01813j8113J98327R2680
8204G43236j10529j02038K95001l09332J57753k97679M72523j77721n64233K90456
8194C97437N00662Q9993j599159J107177N69104n90717Q2243K61368j80720N0602
$$ plain form
8264 1872254 1902327 1730987 1539584 2044178 2508997 2705672 2885775 3598066 4098071 4044530
8254 4044530 3807665 3799277 3471251 2852352 2326299 2110239 1930781 1636022 1603459 1670503
8244 1670503 1913336 2311261 2910807 3384316 3644289 4242162 4122422 3967394 3568429 3383155
8234 3383155 2864751 2077742 1720592 1612207 1727879 1071839 730112 855878 951849 702436
8224 702436 778923 705355 674284 365071 746743 971559 786665 551857 666459 556002
8214 556002 720166 531372 931151 659402 730566 572155 470342 452229 650556 743236
8204 743236 632707 530669 825670 516338 674091 376412 848935 671214 106981 397437
8194 397437 898099 988092 -611067 496110 1065214 474497 556740 818108 637388 687990
8184F87990p6246K66396n53386J7848L00476l75586L10218k08458K54018j42066
8174D81204J73654k83382L78185k31336k82870R8232j23547J0659o7573J89123
8164C42349J28623j54668l56608N85218l65008J23938l76365M28157p2841l5153
8154B47642J36290j93283l04756O6849L73988j83371k47407K77720P8338m85889
8144b33879J63192J41803J44552k39674J99165j18293J17740L2502p5766J7917
8134A49259j69055k29490N56705K156l2547N5501j40015J08030k76709O5908j646
8123H8097K31797n2813L1051n2007k52899L80860l68259L46190K1871J8992k3403
8112C69477J402k85552K62252J89089n5088k46597L01530L65160o67129R6427
$$ plain form
8184 687990 611744 878140 324754 342602 643078 267492 577710 369252 623270 481204
8174 481204 654858 371476 749661 518325 235455 333687 210140 220799 153226 342349
8164 342349 470972 316304 -40304 544914 179906 303844 -72521 355636 282795 247642
8154 247642 383932 190649 -114107 -47258 326730 143359 -104048 173672 252010 -233879
8144 -233879 -70687 71116 215668 -24006 175159 56866 174606 207108 131342 149259
8134 149259 -19796 -249286 307419 309575 277028 332529 192514 300544 23835 89743 88097
8123 88097 319894 267081 298132 246125 -6774 374086 5827 352017 373888 392880 369477
8112 369477 370879 85327 347579 536668 481580 234983 536513 901673 234544 330971
8102C30971L73272k06468j68271J99992k22861j729o6046j86154M02990j38752
8092C16944J19257j72175m1407R5740M196M42739r6602j7510j4814k79572O33365
8081I90161K46247k39467k93301P50688J72434K24427J96588M58517M93273Q1247
8071C080814K80130L80748j53250J90719J5960j28214J09401k72587J32192L88368
8061D024281k96750k52324m16099q5233m79570k84008L3873j21724n60392o83020
8051H79034K57539l7576l94252o4103O8602k05830m10397O00793R3234n45900
8041B41144J97951K14606j60670k38736p1931M43929j8436j71599k4233j81499
8031B30526N3780l49854K52969J16929J84251R056l02683J3306p4256K31132m0124
$$ plain form
8102 330971 704243 497775 329504 529496 306635 304906 238860 52706 455696 316944
8092 316944 436201 264026 222619 318359 322555 765294 668692 651182 636368 356796 990161
8081 990161 1236408 996941 703640 1454328 1626762 1851189 2047777 2506294 2999567 3080814
8071 3080814 3360944 3741692 3588442 3779161 3795121 3666907 3776308 3503721 3635913 4024281
8061 4024281 3727531 3475207 3059108 2973875 2494305 2210297 2244170 2122446 1562054 879034
8051 879034 1136573 1098997 704745 640642 709244 503414 93017 693810 787044 241144
8041 241144 439095 653701 493031 254295 182364 626293 607857 436258 412025 230526
8031 230526 284306 -65548 187421 304350 488601 497657 194974 208280 134024 365156 325032
8020C25032j36848l50035J20008L15364n9843j79105P0767k10745J79398Q083
8010H2076M9884j05549l89985N12116J07524j26934j0586J26288k41325J12618
8000A16127m37870N45331k89363l58179M78080J46815l6058j52620j37293K8968
7990i6062J94211j82285q0912L08976R4843m35996K72568L66701l42325n267p9196
7979A5256K80198l55684l9773J08273K88454k16230l649L13421l93489l57643
7969c60866L09626J44633j03970J00847k1512j00682J35768p9462J99307m01307
7959a77618L60012P9341L3276n24304Q1174m27099N15489k16184Q2084J4315k3306
7948b02820J1740n1335L00136N141j74796q4136K12918O6538j57404K43532k02011
$$ plain form
8020 325032 188184 -161851 -41843 273521 213678 34573 105340 -105405 73993 82076
8010 82076 131960 26411 -363574 148542 256066 129132 118546 244834 3509 116127
8000 116127 -321743 223588 -65775 -423954 54126 200941 164883 12263 -125030 -96062
7990 -96062 98149 -84136 -165048 143928 238771 -197225 75343 442044 99719 94452 15256
7979 15256 295454 -60230 -100003 8270 296724 80494 76845 390266 -3223 -360866
7969 -360866 -51240 93393 -10577 90270 68758 -31924 103844 24382 223689 -177618
7959 -177618 182394 261735 295011 -229293 -148119 -575218 -59729 -275913 -193829 -179514 -202820
7948 -202820 -191080 -242415 57721 62862 -111934 -196070 16848 83386 -74018 169514 -32497
7937c2497L8172m3263j92223j753K77281p337l71186J64779J08139K2246m64643
7926e02285R7128L40084O3550j22077O4663M04816m01707j77849M4045M7878m7495
7915a89249K06520K18283l13276q0974J17212J19265k04916P1156o0853N9757
7905e7075J00726p0153k817J76137J7292l16462K25409J29737n6099n38009J27093
7894b64221J96632o9678J98572K31109k26829k36833O5748N1074p6808j23639
7884b54873K09245j15521J96776J80581l79578K90638j56421j95232R4286K11180
7874H1081q2629m35885m5474M42772N1164m13684N49764M52607p21989l98267
7864e20540M92708R7774P7452m93925K67396j57803q4037J92746J59210o7769
$$ plain form
7937 -32497 5675 -37588 -229811 -231564 45717 38380 -332806 -168027 -59888 -37642 -502285
7926 -502285 -405157 -65073 -1523 -123600 -58937 345879 -55828 -233677 -189632 -141754 -189249
7915 -189249 17271 235554 -77722 -158696 -41484 77781 -127135 -55979 -116832 -57075
7905 -57075 43651 -26502 -29319 146818 164110 -152352 73057 202794 146695 -391314 -264221
7894 -264221 -67589 -137267 61305 292414 65585 -171248 -105500 -54426 -131234 -254873
7884 -254873 -45628 -161149 35627 216208 -163370 127268 -29153 -224385 -130099 81081
7874 81081 -1548 -437433 -482907 -40135 11029 -402655 147109 599716 -122273 -520540
7864 -520540 -27832 69942 147394 -346531 -79135 -236938 -320975 -128229 30981 -36788
7854c6788k4420M18294L2034p48009M16744J38394k20912K36642l94437j12226
7844b94684L00369J54526O6215R9891k0317o82588J74998K11795J42014n28156
7834c75937K42576K04541m93089L96844n3500J38207l6558l1255K68647p9827
7824A80649l25447K59918j01109R9449j77177J92517o1153m058j69758M5093k35306
7813b96382J73359M69934m29352l61395M90451K57355k43691L6208J4820M0908
7803A52215j87867M6325m71860P52402k35513j67966J54156R7029l61308M3237
7793a79150L32074n5738Q0493k46241K71690L9389k15844L35673Q8219k43359
7783B07206K14447j92908J4428J05479j56252J20619m15437R8203K69876p0800
$$ plain form
7854 -36788 -61208 357086 389120 -358889 57855 196249 -24663 211979 -182458 -294684
7844 -294684 5685 160211 226426 326317 306000 -376588 -201590 10205 152219 -375937
7834 -375937 -133361 71180 -421909 -25065 -78565 59642 23084 -8171 260476 180649
7824 180649 -144798 115120 14011 113460 -63717 128800 67647 63589 -106169 -61076 -296382
7813 -296382 -123023 346911 -82441 -443836 46615 303970 60279 96487 111307 152215
7803 152215 -35652 10673 -461187 291215 55702 -112264 41892 138921 -222387 -179150
7793 -179150 152924 97186 177679 -68562 203128 242517 26673 362346 450565 207206
7783 207206 421653 228745 243173 348652 192400 313019 -102418 -4215 265661 194861
7773A94861J1377L7033L453l49026L54322k04036K93104j28339k234m25655M63998
7762B48858L10803N9690m00346q3732j7110K38874m7143m75150N76336n11532
7752a00452J56130M40094k60401k37391K0768K19596m942J17498Q4131J80172
7742F15203l53665j11333N5556J83057m0930l84967J87382R1740j60297k95645
7732b13899N91063k34532K16974j29292J54263r3758j90581K27679L13627n01521
7722A40023L50871K1672q2746j5202m11834K68281j48375L24201k90881N46397
7712G02407l27854L9639k85644k13569K65056k38968K43224j01509M07984k27616
7702B63150m5387l27994M17417J34048M00815j54041N541l36485j09618o0463
$$ plain form
7773 194861 206238 243271 246724 -102302 252020 47984 341088 212749 210515 -215140 248858
7762 248858 559661 619351 219005 135273 118163 357037 309894 -165256 411080 -100452
7752 -100452 55678 495772 235371 -2020 18748 238344 233402 350900 435031 615203
7742 615203 261538 150205 205761 388818 347888 -37079 150303 242043 81746 -213899
7732 -213899 377164 142632 359606 230314 384577 290819 100238 327917 641544 140023
7722 140023 490894 512566 429820 414618 2784 271065 122690 446891 156010 702407
7712 702407 374553 414192 128548 -85021 180035 -58933 184291 82782 490766 263150
7702 263150 217763 -110231 307186 441234 842049 688008 693549 357064 247446 186983
7692A86983J30881K49261j1964l3321l96246K89246K12892R2855M137k24026k0388
7681D80310k88862O4868N10465N3429j17500K51128m87655M15722l25725L77927
7671I34107n5297m318k39080K69241l4020K72708Q8258N96846r4154L50061N68858
7660B653210J88084K27297K32060j74707L04602p6872j82901o10849q8938p62006
7650A708980N14721j89038n3451m14488M9228j49234k85152q7462K69424L96083
7640A759611J562M66731j77574N06041n9414j00389j47625n6320L10939k24122
7630B279440m87809L6498J7311j51478r3899k24285K60311k54988l38205j79224
7620H63672N12036j1921k54512K6076p7004J40156o9319Q6715m3411L40906m8908
$$ plain form
7692 186983 317864 567125 555161 521840 125594 414840 627732 720587 724724 500698 480310
7681 480310 191448 256316 766781 820210 702710 953838 466183 881905 556180 934107
7671 934107 878810 874492 635412 904653 870633 1143341 1231599 1828445 1734291 2084352 2653210
7660 2653210 2841294 3068591 3300651 3125944 3430546 3353674 3170773 2559924 2470986 1708980
7650 1708980 2223701 2034663 1981212 1566724 1615952 1466718 1181566 1094104 1363528 1759611
7640 1759611 1761173 2227904 2050330 2556371 2496957 2396568 2248943 2192623 2503562 2279440
7630 2279440 1791631 1828129 1845440 1693962 1600063 1375778 1636089 1381101 1042896 863672
7620 863672 1375708 1363787 1109275 1135351 1058347 1198503 1129184 1215899 1172488 1513394 1464486
7609A464486L52453m99869N08647J41808J88107j44172L54140k68736N18756N89327
7599C204947J09714K49716L19462o73764k59031j81817J42963k34984l79499L65614
7589B663321L12674M0803q0558J70599M40126M8004O5603l31212K79589p74052
7579B834897k50717j47507O708J98214M87947j85861J02617k11219L05655K36846
7569C377580k2165O8491M09972L19201J09390L97269m6961l13701n7692k12483
7559D028901m31585k60135k61514k16033m36622J85377j86523P9274j33217l39606
7549B028317K91483K72807O18409M27627K04070n4740L69987m2080k09782j0406
7539C895692L60716L9908n54166k53989L85736K13139l80544K55050L59488L89239
$$ plain form
7609 1464486 1816939 1317070 1825717 1967525 2155632 2011460 2365600 2096864 2615620 3204947
7599 3204947 3314661 3564377 3883839 3210075 2951044 2769227 2912190 2677206 2297707 2663321
7589 2663321 2975995 3016798 2936240 3106839 3546965 3594969 3660572 3329360 3608949 2834897
7579 2834897 2584180 2436673 2443381 2641595 3129542 2943681 3046298 2835079 3140734 3377580
7569 3377580 3355415 3423906 3833878 4153079 4262469 4659738 4612777 4299076 4241384 4028901
7559 4028901 3597316 3337181 3075667 2859634 2423012 2608389 2421866 2501140 2367923 2028317
7549 2028317 2319800 2592607 3211016 3638643 3842713 3787973 4157960 4115880 3906098 3895692
7539 3895692 4256408 4296316 3742150 3488161 3873897 4087036 3706492 3961542 4321030 4710269
7529D710269J08319M1107N35337k84633L08001M0942J06275n99309k19490J95067
7519D941885k52490m71363j79705n54501k47758j9039l27191l97166K04207j53278
7509B543601j79787J99849P1863j98762j6224l93881L09222j12986j18157J82429
7499B287167l59478J07976M21563l22888Q7712K46605J53650j90698o6060J73253
7489B538802r6337k57993L35442K36920q08116R5002O11784O7060J17202L80395
7479C220161J30630q7208K81036N84392L29076l37206k49777l0114m79435l90165
7469B971390k37008M38071l91096P5787J02676R1585m1463J00123l36763L74072
7459C147374L49922r2210j44381J8892L18506K755M72394J82265K40821k33252
$$ plain form
7529 4710269 4818588 4859695 5395032 5110399 5418400 5459342 5565617 4966308 4746818 4941885
7519 4941885 4689395 4218032 4038327 3483826 3236068 3217029 2889838 2492672 2696879 2543601
7509 2543601 2363814 2563663 2635526 2436764 2420540 2026659 2335881 2222895 2104738 2287167
7499 2287167 1927689 2035665 2457228 2134340 2222052 2468657 2622307 2431609 2365549 2538802
7489 2538802 2442465 2184472 2519914 2756834 1948718 2043720 2655504 2722564 2839766 3220161
7479 3220161 3350791 3263583 3544619 4129011 4458087 4120881 3871104 3840990 3361555 2971390
7469 2971390 2734382 3172453 2781357 2857144 2959820 3051405 3009942 3110065 2773302 3147374
7459 3147374 3497296 3405086 3260705 3279597 3598103 3600858 4073252 4255517 4496338 4263086
7449D263086N26760N44897J34061p7951J64508m7210M10589m9794L49857J56639
7439F375442K27483P06564O24231P73254P62732R96854J267589J639519K150099
7430A5523767L506660M084626M659871O102173N897146N522628M450770L673747
7422E3421388L166165J297823q69354j510627k753737m709793m972691o002801
7414C7066373n897266n161998l992224k870940k438296k017895j433815p76948
7406A2476991j142788r30687m51799p4127l28265L40763R77554O15066Q31783
7397A2314491M74257n15859o64803p22498j173658p12364o38234m03430m69000
7388G488902p46342j76030k57066l52945l52041l87147k67012k06502L18646l48406
$$ plain form
7449 4263086 4789846 5334743 5468804 5390853 5555361 5508151 5918740 5868946 6218803 6375442
7439 6375442 6602925 7309489 7933720 8706974 9469706 10466560 11734149 13373668 15523767
7430 15523767 19030427 23115053 27774924 33877097 39774243 45296871 49747641 53421388
7422 53421388 56587553 57885376 57016022 55505395 52751658 48041865 43069174 37066373
7414 37066373 31169107 26007109 22014885 19143945 16705649 14687754 13253939 12476991
7406 12476991 11334203 10403516 9951717 9877590 9549325 9890088 10867642 11482708 12314491
7397 12314491 12788748 12272889 11608086 10885588 9711930 8999566 8361332 7957902 7488902
7388 7488902 6742560 6566530 6309464 5956519 5604478 5217331 4950319 4743817 5062463 4714057
7378D714057N4794m44580j21656K46835n27790o0198K29437p8015m39085N90010
7368D163809L3508p8530l51365j41139j92330q6714K06233m5890K67117k02798
7358C571901J87251j58841m310J63045L79164J36717n83575r5757Q6852M9644
7348C732091j1804O8583j22135N7170k08153p3404J13523L19535J90755k94551
7338C771610j07083J4058k3252j86052k341K15424j01110M36928k78971J76213
7328C915424j28375L53060N9296J7474J38731l9528M3762L54469J05428k57445
7318D562296J43181J83895M7520L1305K29127J56639L59160L53803N27934M42589
7308G037449K56736O22386M94110N63179L26089L91279j68051m41575l84515K50739
$$ plain form
7378 4714057 4768851 4324271 4202615 4449450 3921660 3861462 4090899 4012884 3573799 4163809
7368 4163809 4197317 4118787 3767422 3626283 3433953 3347239 3553472 3507582 3774699 3571901
7358 3571901 3759152 3600311 3596001 3759046 4138210 4274927 3691352 3595595 3682447 3732091
7348 3732091 3720287 3788870 3666735 3723905 3515752 3442348 3555871 3875406 4066161 3771610
7338 3771610 3664527 3678585 3655333 3469281 3466940 3682364 3581254 4018182 3739211 3915424
7328 3915424 3787049 4140109 4199405 4216879 4355610 4316082 4359844 4714313 4819741 4562296
7318 4562296 4705477 4889372 4936892 4968197 5197324 5353963 5713123 6066926 6594860 7037449
7308 7037449 7294185 7916571 8410681 8973860 9299949 9691228 9523177 9081602 8697087 8947826
7298H947826M7776k18817M58663K66952P19667J059909R42583R02648R22368P57308
7288A4806883l07754l30460o38214j086204o97240K51980l29426Q32551N71692
7279A3073808L25686N68394M98490M20055m07097N04043O78348J414921J244651
7270A8321299J910329J280097J74113j016403j64152K37015j86450O95243J032820
7261B2283911N82692k53458k42422o0874M76541O29008R96714K645479K902752
7252B9960343L300982K582762K499491L321440M160361N653172Q540953J2806719
7244G2826223J9720211L1000814M6261416O0621963N3487217J8667891k2395902
7237B80189833m5319255m7703363l9949094l0465815k2966126j5708488j1655755
$$ plain form
7298 8947826 8995602 8776785 9235448 9502400 10222067 11281976 12224559 13127207 14049575 14806883
7288 14806883 14499129 14168669 13530455 12444251 11747011 11998991 11669565 12502116 13073808
7279 13073808 13399494 13967888 14466378 14886433 14479336 14983379 15661727 17076648 18321299
7270 18321299 20231628 21511725 21685838 20669435 20505283 20742298 20555848 21251091 22283911
7261 22283911 22866603 22613145 22370723 22309849 22786390 23415398 24412112 27057591 29960343
7252 29960343 33261325 35844087 38343578 41665018 45825379 51478551 60019504 72826223
7244 72826223 92546434 123547248 169808664 230430627 283917844 302585735 280189833
7237 280189833 234870578 187167215 147218121 116752306 93786180 78077692 66421937
7230F6421937q516487p154438m431742m007870k405995j055500M69502J785958
7222D1105365M740187O497190N142466p08211n003392o055120n469210m341938
7214C5907337k980252k279467j976728j616916j516891j220817j256463j314013
7206B1745790m61579q79343o66950k7254k42913k23763l47089L50390M65222M49229
7196B0161740Q45134K272167L055372M532630M212736J753652q96911l293266
7188C2643254k716495j536413j349932k134996k104593k436542j820525j060783
7180A7482975j183970n34333l81450Q7448L37946j710l13854k85402k26530n1535
7170A4929585o2135M88637Q85077J026022J789327R32247p1305j389812r81158
$$ plain form
7230 66421937 57905450 50751012 46319270 42311400 39905405 38849905 39319407 41105365
7222 41105365 45845552 52342742 57485208 56776997 51773605 45718485 40249275 35907337
7214 35907337 32927085 30647618 28670890 27053974 25537083 24316266 23059803 21745790
7206 21745790 21284211 20404868 19737918 19710664 19467751 19243988 18896899 19247289 19712511 20161740
7196 20161740 21006874 23279041 26334413 30867043 35079779 36833431 35936520 32643254
7188 32643254 29926759 28390346 27040414 24905418 22800825 20364283 18543758 17482975
7180 17482975 16299005 15764672 15383222 15470670 15808616 15806906 15493052 15207650 14981120 14929585
7170 14929585 14867450 15356087 16241164 17267186 19056513 19988760 19917455 18527643 17546485
7161A7546485r28573q70649p71013M32648R55205R94472J026225L57663o83632
7152A8058831o07738p76919p41174k94238m87859k55188k72025L06262N16639
7143A5446591P20820P77962n06329p62656p38285q44731p1362n3245N67240J242794
7133A5778799J139708J646506Q14688m77643j074522n38359p37697j090005o68836
7124A4792639j098299m55343J68807k81827N19013L17400J201739J334484J434782
7115A7933395J070681K17435o89014r83477q32883r28568m67161m5597p66112
7106A4508699p44775L51415m07068n93339m24872n50191l48957k56966L65572
7097A1899518P3489M83224K20137P4505K21936q9350K86195N12573J8367O07293
$$ plain form
7161 17546485 16617912 15747263 14976250 15408898 16364103 17358575 18384800 18742463 18058831
7152 18058831 17451093 16674174 15933000 15638762 15150903 14895715 14623690 14929952 15446591
7143 15446591 16167411 16945373 16439044 15676388 14938103 14093372 14022010 13968765 14536005 15778799
7133 15778799 16918507 18565013 19379701 18902058 17827536 17289177 16551480 15461475 14792639
7124 14792639 13694340 13238997 13407804 13125977 13644990 13962390 15164129 16498613 17933395
7115 17933395 19004076 19221511 18532497 17549020 16716137 15787569 15320408 15274811 14508699
7106 14508699 13763924 14115339 13708271 13114932 12690060 12139869 11790912 11533946 11899518
7097 11899518 11973007 12456231 12676368 12750873 12972809 12883459 13169654 13682227 13700594 14307887
7087A4307887Q05340j41508j37252q4179J45075n43645l4650O4124n10085m4242
7077A3826865L33621J78411K72742R91132P36916O93594M87083K42719J87031
7068A7950114k56005m41919k35141J14433J69268J127707J248266K190484J416623
7059B3283830L02940j013854j738274j423756j045398m22949p5357K86501M32574
7050A8586257J398521P35444M37666R50262O06238M84707K96085J18257L43295
7041B3956732J243845K63939P00284J146298J551628K660357L588815L201663
7033C8313561K659116P02515l01080p54696j028489p95281m72856o39188K22769
7024C7906371O93319R15832K863116M222150N282763K690194K23746o66244K37102
$$ plain form
7087 14307887 15113227 14971719 14834467 14750288 14895363 14351718 14317068 14381192 13871107 13826865
7077 13826865 14160486 14338897 14611639 15602771 16339687 17033281 17520364 17763083 17950114
7068 17950114 17694109 17252190 17017049 17131482 17300750 18428457 19676723 21867207 23283830
7059 23283830 23586770 22572916 20834642 19410886 18365488 17942539 17867182 18153683 18586257
7050 18586257 19984778 20720222 21157888 22108150 22714388 23199095 23495180 23613437 23956732
7041 23956732 25200577 25464516 26164800 27311098 28862726 31523083 35111898 38313561
7033 38313561 40972677 41675192 41374112 40619416 39590927 38795646 38322790 37683602 37906371
7024 37906371 38599690 39515522 42378638 46600788 51883551 54573745 54797491 54131247 54368349
7015E4368349J300684K327786M305860O881282P524234L554993k678287p032830
7007G0552071p337824o220007m693598l410594j691698j670976j195593n70528
6999D3761253j367649j263292o68132k15915O98765J046671J965330K928264L087054
6990D9972349M982025P250450Q243930P828846M685839r49632l948839m830622
6982G3234346l939176k061171k87051J645756K362900L246170M439179P445221
6974H6086174J2688568K1630026L5652536M9925217M9716807J6000181k4998435
6967B46701074m1760562l9498448l2435436k5457682j9019403j3842158r870521
6960F4816864p177511n312151l558041j973596o28173l29290j020368j559484
$$ plain form
7015 54368349 55669033 57996819 62302679 69183961 76708195 80263188 77584901 70552071
7007 70552071 63214247 56994240 52300642 48890048 47198350 45527374 44331781 43761253
6999 43761253 42393604 41130312 40462180 40246265 40945030 41991701 43957031 46885295 49972349
6990 49972349 54954374 62204824 70448754 78277600 82963439 82013807 78064968 73234346
6982 73234346 69295170 67233999 66946948 68592704 70955604 74201774 78640953 86086174
6974 86086174 98774742 120404768 156057304 205982521 255699328 271699509 246701074
6967 246701074 204940512 165442064 133006628 107548946 88529543 74687385 64816864
6960 64816864 57639353 52327202 48769161 46795565 46167392 45838102 44817734 43258250
6952D3258250k294652k149106k137222j989585j310202j250645q21542p2638n95364
6943C0637294n81671j204544m76074j94031M73552O02359N42004j68428o57440
6934B8973021j701881j710451j395474j397429j675433j039066o01370q05066
6926A8646851j80045k31977r15260q30125q78886l98367o21507m69497p26496
6917A3394691l45555Q4053k62447o9700j52553N15166J33583j10725J55429j49538
6907A3192404p36683o09733l81527m20986k5794k6785j71696j26724M87222K10987
6897A1390685q3026k82286l80574n41790n84781k47336l75880n27211j40819J28329
6887H355311K99192L27582j31298o89321o60142o67152k93960L15058k19505k07422
$$ plain form
6952 43258250 40963598 38814492 36677270 34687685 33377483 32126838 31305296 31232658 30637294
6943 30637294 30055623 28851079 28375005 28180974 28654526 29256885 29798889 29630461 28973021
6934 28973021 27271140 25560689 24165215 22767786 21092353 20053287 19451917 18646851
6926 18646851 18466806 18234829 17319569 16489444 15610558 15212191 14590684 14121187 13394691
6917 13394691 13049136 13133189 12870742 12801042 12648489 13163655 13297238 13186513 13341942 13192404
6907 13192404 12455721 11845988 11464461 11043475 11017681 10990896 10819200 10692476 11179698 11390685
6897 11390685 11307659 11025373 10644799 10103009 9518228 9270892 8895012 8367801 8226982 8355311
6887 8355311 8654503 8982085 8850787 8161466 7501324 6834172 6540212 6855270 6635765 6428343
6877F428343m12403J43930M58272k906j55150K18625m48221m12894l9876K88620
6867F066340l13525J21114K43385j51561l96631n53564Q3317J29856o54191l51370
6857D223170Q5164n7135l17829K11807r2586J4449k12523K54260k99547j19096
6847C690134K26199N7286j9223j22889K34265m7835J53719l21641l2764P5071
6837C892322k2511r6826K57070k8641J628k67431l00811J54271k58076P30887
6827D061882J92683j83901L55113J38576N6713j86117k88017m48347J49080l87720
6817C459945m06655M1419L86245k91122m9770k44947N9759r6335n2175j18943
6807B687421O60534r2228j08039L44280o04385l66096J464M86226k14052J01924
$$ plain form
6877 6428343 6015940 6159870 6618142 6615236 6460086 6678711 6230490 5817596 5777720 6066340
6867 6066340 5752815 5873929 6117314 5965753 5569122 5015558 5098875 5228731 4574540 4223170
6857 4223170 4308334 4251199 3933370 4145177 4052591 4067040 3854517 4108777 3809230 3690134
6847 3690134 3916333 3973619 3954396 3831507 4065772 4017937 4171656 3850015 3817251 3892322
6837 3892322 3869811 3772985 4030055 4001414 4003042 3735611 3434800 3589071 3330995 4061882
6827 4061882 4254565 4070664 4425777 4564353 4621066 4434949 4146932 3698585 3847665 3459945
6817 3459945 3053290 3094709 3480954 3189832 3140062 2895115 2954874 2858539 2806364 2687421
6807 2687421 3347955 3255727 3147688 3491968 2887583 2521487 2522951 3009177 2795125 2897049
6797B897049j35565K95926J49523k86277K42391k37226j07060k90489J56796N4237
6787B739305J11799m49924M83610M32081m9533R85368K36557L72104j47869n5287
6777D658211k95336j82675m18324m89568l5874J52751j33696l65844J3757k09407
6767B693995r0537o311j79999J16369J26940m83818K11023K17368j67561K00644
6757B638113K17548N5862j20449J83232j42721j7205O8418l89901R587m9186J35249
6746B588547K95275K49730r0443L6853k49932L51101O18373k506k23678N170J27816
6735C706306L16149K98497K60256O05948k37543j60391m55035l54205l28535K7958
6725C679405l89036p7213R7111j0885r1347j39738J48655L02134N14594j10476
$$ plain form
6797 2897049 2761484 3057410 3206933 2920656 3163047 2925821 2818761 2528272 2685068 2739305
6787 2739305 2851104 2401180 2884790 3316871 3267338 4252706 4489263 4861367 4713498 4658211
6777 4658211 4362875 4180200 3761876 3272308 3236434 3389185 3255489 2889645 2903402 2693995
6767 2693995 2603458 2597147 2417148 2533517 2660457 2176639 2387662 2605030 2437469 2638113
6757 2638113 2855661 2911523 2791074 2974306 2831585 2814380 2882798 2492897 2502484 2453298 2588547
6746 2588547 2883822 3133552 3043109 3079962 2830030 3181131 3799504 3796998 3573320 3578490 3706306
6735 3706306 4022455 4320952 4581208 5187156 4949613 4789222 4334187 3979982 3651447 3679405
6725 3679405 3290369 3213156 3310267 3299382 3208035 3068297 3216952 3519086 4033680 3923204
6715C923204N90420O48684O73752j78290J15781L07049n03502n36152l84746K46531
6705D902731j79570l4766J03345K59079o26939q2157j53823j92508m88459J27685
6695C634618N1553m58248j59658L48144l79544j27635M03905N7081J1244J51884
6685C533344o0281L3573J83327J68884K01807R8693J15693N84908j43698J73610
6675D889860P33607O4090j46366k85409j65915M44747L32186Q00464Q94434J029831
6665H591529J27198j70945j092819q09135n16194n02165n64025K93400m90235
6656D866609k39884q213O12781J26809N39638J99381K46966j90372n22031l78892
6646E252792q04482l85014q6550J97181m77891Q7394L15864P8259N30730q5045
$$ plain form
6715 3923204 4513624 5162308 5836060 5657770 5773551 6080600 5577098 5040946 4656200 4902731
6705 4902731 4723161 4688395 4791740 5050819 4423880 4341723 4187900 3995392 3506933 3634618
6695 3634618 3686171 3227923 3068265 3416409 3036865 2909230 3313135 3370216 3381460 3533344
6685 3533344 3473063 3506636 3689963 3858847 4060654 4159347 4275040 4859948 4716250 4889860
6675 4889860 5623467 5687557 5541191 5255782 5089867 5534614 5866800 6667264 7561698 8591529
6665 8591529 8718727 8547782 7454963 6645828 6129634 5627469 5063444 5356844 4866609
6656 4866609 4626725 4618512 5231293 5358102 5897740 6097121 6344087 6153715 5631684 5252792
6646 5252792 4448310 4063296 3976746 4173927 3696036 3783430 4099294 4177553 4708283 4623238
6636D623238j72197k33396N27030j70794J21442L80764J51427o7445m41430l92856
6626D325783j96608l6907m01226k38678K61747M4149n18522K10123L4801J17821
6616C602483Q3505m50811L22632k16513j43193k1471n8777J18451J4067J75365
6606C425738M02092j75467J3425O14607M79599q1772R3591J49757q1181l78330
6596D462059m71214k12716R8660l25605m01822P6809J49121j06566P4240j95392
6586C147574L32617L89607l54950m9925J48999J37396j39671L43761r8237j67658
6576C689513K67543K95500l67022k93162M96382O0388o05819J99144o6183J12047
6566C788331j77785L3908K88250o262n3741j64470K36902m5166J53126K62708
$$ plain form
6636 4623238 4451041 4217645 4744675 4573881 4695323 5076087 5227514 5160069 4718639 4325783
6626 4325783 4129175 4092268 3691042 3452364 3714111 3758260 3239738 3449861 3484662 3602483
6616 3602483 3685988 3235177 3557809 3341296 3198103 3176632 3117855 3236306 3250373 3425738
6606 3425738 3827830 3652363 3665788 4280395 4759994 4678222 4771813 4921570 4840389 4462059
6596 4462059 3990845 3778129 3876789 3551184 3149362 3226171 3375292 3268726 3342966 3147574
6586 3147574 3480191 3869798 3514848 3464923 3613922 3751318 3611647 3955408 3857171 3689513
6576 3689513 3957056 4252556 3885534 3592372 4088754 4149142 3543323 3742467 3676284 3788331
6566 3788331 3610546 3644454 3932704 3926442 3872701 3708231 3945133 3899967 4053093 4315801
6556D315801P0581j12415J47918J26972M46439J49701k1146M39096N00454O17154
6546F680555P4521M75960M93231K59722Q09509M54729J710430J231674P21842
6537A2912173j02016m8623q49947o05991p99202m81444O4732K1815N86414M16730
6527A1114641J088246R88695R80281J589620K525942L024153M234282O706664
6519C2252524J0342351J6349158K1698645K1355464O924296j0380552j7615988
6512H0925898j6917107j3526097j1042444q011027n418871l650061k717564j873943
6504A7768784q46306q56657o92289o95792k64262l89047m65504l38588n46108
6495A2674231p29175n58514J15010q71045o55485j07639P3744K4506k34962M88452
$$ plain form
6556 4315801 4386382 4273967 4421885 4548857 4995296 5144997 5123851 5562947 6063401 6680555
6546 6680555 6755076 7231036 7724267 7983989 8793498 9248227 10958657 12190331 12912173
6537 12912173 12810157 12761534 11911587 11305596 10506394 10024950 10089682 10111497 10697911 11114641
6527 11114641 12202887 13191582 14171863 15761483 18287425 21311578 25545860 32252524
6519 32252524 42594875 58944033 80642678 101998142 108922438 98541886 80925898
6512 80925898 64008791 50482694 39440250 31429223 26010352 22360291 19642727 17768784
6504 17768784 16922478 16065821 15373532 14677740 14413478 14024431 13558927 13220339 12674231
6495 12674231 11945056 11386542 11501552 10630507 9975022 9867383 9941127 9965633 9730671 10219123
6485A0219123k55283N619l17574Q8642p06424l76170N27319j46571l41500o70379
6475H026802p84239l99613l66872m11670M02308o2485l41789k59958L20501K02808
6465F325793m35369P6525K83470j37633k57249K20228K04130P1169j36168J70436
6455F385332L55061q4100J60586J57670m26561L3049k17032l7439O5124m23780
6445E967910p1396j25419l92828j34449j98310J85846j73085j0882p6429L48386
6435E319344m27160j03387J13416j26497k0650M20223q0708L13769K98929M76865
6425F184144k93153l04132K07809m5107n85348l65420Q8026K28585j83265O3000
6415D995139J15548k40337k64321M03906j95695J43178Q1143M43569l87061l31090
$$ plain form
6485 10219123 9963840 9969459 9651885 9740527 9034103 8657933 9185252 9038681 8697181 8026802
6475 8026802 7242563 6842950 6476078 6064408 6466716 6404231 6062442 5802484 6122985 6325793
6465 6325793 5890424 5966949 6250419 6112786 5855537 6075765 6279895 6351064 6214896 6385332
6455 6385332 6740393 6656293 6816879 6974549 6547988 6581037 6364005 6326566 6391690 5967910
6445 5967910 5896514 5771095 5378267 5243818 5045508 5231354 5058269 5047387 4970958 5319344
6435 5319344 4892184 4788797 4902213 4775716 4755066 5175289 5094581 5408350 5707279 6184144
6425 6184144 5890991 5586859 5794668 5749561 5164213 4798793 4886819 5115404 4932139 4995139
6415 4995139 5110687 4870350 4606029 5009935 4814240 4957418 5038561 5482130 5095069 4763979
6405D763979j72802J67985l76195l80952k2672J22798R3715k58825M90218L2075
6395D459324j63332j67956O06124m06649J72003K48265j74786J58219L11870J03096
6385E146178Q1472n31654m60007J44951j71497J38697l86039k0L55288R3418L57062
6374D767849J1445N62157K73610l3097l31404j30350k16193J57175k6741j68429
6364D866022n08517L47962o417n90044l5745L12009j16467l43081o6315J05176
6354C964583j8989J46265J14254J79689L00672O31889O79392J094174K358380
6345I450309J946735O80325o35743j549718j251970j190985j424121r34821m60652
6336D629359j60552n41588l5412l25142k72478k47112J61597j4487j16085P7712
$$ plain form
6405 4763979 4591177 4759162 4382967 4002015 3979343 4102141 4195856 3937031 4427249 4459324
6395 4459324 4295992 4128036 4734160 4327511 4499514 4747779 4572993 4731212 5043082 5146178
6385 5146178 5227650 4695996 4235989 4380940 4209443 4348140 3962101 3962081 4317369 4410787 4767849
6374 4767849 4779294 5341451 5615061 5581964 5250560 5120210 4904017 5061192 5034451 4866022
6364 4866022 4357505 4705467 4699050 4109006 4073261 4385270 4268803 3925722 3859407 3964583
6354 3964583 3945594 4091859 4206113 4385802 4686474 5318363 5997755 7091929 9450309
6345 9450309 11397044 12077369 11441626 9891908 8639938 7448953 6024832 5090011 4629359
6336 4629359 4468807 3927219 3891807 3566665 3294187 3047075 3208672 3194185 3078100 3155812
6326C155812Q0379K46588L3219n7864J44699m89696o07154K86493L53739l28127
6316B818088j55203J14866r9075K70347P163n20060J9651J21044J41390n5324
6306B662887j93880L34128J23759o07108O7290K12030O1552m6106J6367L35641
6296B966560j97483l90444Q2928k01885J41894M47767k72121m27815J40454J45390
6286B435245l62388M6929P1019K84619l74487k40K61291L22328J92756n79979
6276B297093J38919M20294k20680j95627N46815K57958L49334N01067O11243M30454
6266E136870m44002m2383l78202j45378m9381L42222J84181j45853r0223J30488
6256D498339m51250p82048j0570k07106k41171k03031K212Q5113j05747k00899
$$ plain form
6326 3155812 3236191 3482779 3515998 3458134 3602833 3113137 2505983 2792476 3146215 2818088
6316 2818088 2662885 2777751 2678676 2949023 2956186 2436126 2455777 2576821 2718211 2662887
6306 2662887 2469007 2803135 2926894 2319786 2387076 2599106 2660658 2614552 2630919 2966560
6296 2966560 2769077 2378633 2461561 2259676 2401570 2849337 2577216 2149401 2289855 2435245
6286 2435245 2072857 2119786 2190805 2475424 2100937 2100697 2361988 2684316 2877072 2297093
6276 2297093 2436012 2856306 2635626 2439999 2986814 3244772 3594106 4095173 4706416 5136870
6266 5136870 4692868 4650485 4272283 4126905 4077524 4419746 4603927 4458074 4367851 4498339
6256 4498339 4047089 3265041 3254471 3047365 2806194 2603163 2605375 2690488 2584741 2383842
6246B383842L57036j03928N4898N3414j31955p1008p1563k17567J16081J91728
6236B560978j31172q7374o6797J81361m2287l3959k2639m468K4634k70048J11695
6225B219924K09019J51179j59669m1303K76229q8718j52234J40632N0486K55352
6215B860897J77055J76699K77215K99840J91727l03744j06626J23209l25192j17696
6205C253384j32287j00268q54233q7932q8204j63865N6410j13070R3371R940K22690
6194B095936q9221j28340k62243K00294r4122K51027p5058o526k43585k49288
6184A398874K62271K17630m5968j74777K01894N17955l15110j32419O5719n3587
6174A942482j68138K53300m17851N58378n10988M58537j94043l528n07857N33431
$$ plain form
6246 2383842 2740878 2636950 2691848 2745262 2613307 2542299 2470736 2253169 2369250 2560978
6236 2560978 2429806 2342432 2275635 2456996 2414709 2380750 2358111 2353643 2378277 2108229 2219924
6225 2219924 2428943 2580122 2420453 2379150 2655379 2566661 2414427 2555059 2605545 2860897
6215 2860897 3037952 3214651 3491866 3791706 3983433 3679689 3573063 3696272 3371080 3253384
6205 3253384 3121097 3020829 2166596 2078664 1990460 1826595 1883005 1769935 1863306 1873246 2095936
6194 2095936 2006715 1878375 1616132 1816426 1722304 1973331 1898273 1891747 1648162 1398874
6184 1398874 1661145 1878775 1832807 1658030 1859924 2377879 2062769 1930350 1996069 1942482
6174 1942482 1774344 2027644 1609793 2168171 1657183 2115720 1921677 1918149 1410292 1943723
6164A943723j73735P054j73676J32659q8737q5814Q2576Q8957j37214j81529O3338
6153A477602M85700p4761j60189k38513K82750j23645K31278l42176K28025j62565
6143A603506J36316l58278K06082L12129k68226K0247J52297j5609k98686J10128
6133A599906l03109R7566L040K85005l51193L4487R515L26812m19770j73865M30661
6122A539055k51432K5541j62878L02509l3187P5888j69586m8544K56869k2046
6112A512189J15631o5409q0078k46433K28893k05139M17950L2108l77537l0338
6102A301837j35592L2739k8262k4470J25579k37579L06734m0999m9920j24728
6092A125339M36833j42018k3703m31339J97188j05216k1768K08316J99601p8525
$$ plain form
6164 1943723 1769988 1777042 1603366 1736025 1647288 1561474 1644050 1733007 1595793 1414264 1477602
6153 1477602 1963302 1888541 1728352 1489839 1772589 1648944 1880222 1538046 1766071 1603506
6143 1603506 1739822 1381544 1587626 1899755 1631529 1651776 1804073 1788464 1489778 1599906
6133 1599906 1296797 1394363 1397403 1682408 1331215 1365702 1375217 1702029 1282259 1108394 1539055
6122 1539055 1287623 1313164 1150286 1452795 1419608 1495496 1325910 1277366 1534235 1512189
6112 1512189 1627820 1562411 1482333 1235900 1464793 1259654 1677604 1709712 1332175 1301837
6102 1301837 1166245 1198984 1170722 1146252 1271831 1034252 1340986 1299987 1250067 1125339
6092 1125339 1562172 1420154 1396451 965112 1162300 1057084 1035316 1243632 1443233 1364708
6082A364708j50185K4465k05057r194L48311Q0274j45126k50899l5884j2657J109
6071A009865j28938M68488l60772L54774k05373L1291l1182p3294p8089K38400
6061A225170J15494k68602K15782L3474m54420L30306J13235l21278K85590k74898
6051I99853j67524j13632M79252l2165j12079N6894j60049L8112J32074m3711
6041A077025K12991l5455j48505N98217p10611J14337n65555L89839j935k72907
6031F57441J99793K23048K50720n25910J98386m41429M09769k71621O03139j93269
6021A110067l76719l12912N35713n5272L2196K54002j95746n8879j95026M48536
6011A185960N4959o7884m3814k67584J91854n62356K13156J53196j05416n2883
$$ plain form
6082 1364708 1214523 1238988 1033931 1024737 1373048 1453322 1308196 1057297 1021413 1008756 1009865
6071 1009865 880927 1349415 988643 1343417 1138044 1169335 1138153 1064859 986770 1225170
6061 1225170 1340664 1072062 1287844 1321318 866898 1197204 1310439 989161 1274751 999853
6051 999853 832329 718697 1197949 1165784 1053705 1110599 950550 988662 1120736 1077025
6041 1077025 1290016 1254561 1106056 1704273 993662 1107999 542444 932283 930348 657441
6031 657441 857234 1080282 1331002 805092 1003478 562049 971818 700197 1303336 1110067
6021 1110067 733348 420436 956149 900877 933073 1187075 991329 932450 737424 1185960
6011 1185960 1240919 1173035 1129221 861637 1053491 491135 704291 857487 752071 699188
6001F99188K83081k82937J6026k0480j8532L63630j13915M9638j17423m927Q9062
5990I42411o887j4058j2002j07594J68278K40443m91953J47433J16474j67343
5980H15202j12031O5864M20871k57108l94832K09505k0561j81862J49452K45098
5970I39598k1194j19967K78270j65635k12123l5463P31778k17642k66638j91404
5960G19580K13799k45920j02003J50126K2778J25439l72067N60255k08689N30654
5950A393952n43833K85826k06496R1549j07034k00130M83860j76364j74755l42826
5940E03749J60865P0031J87138k45973L21567J2305o2546r5874k6751k0092L1224
5929H35643K76632m63410M64988j83795j02527P3517J33149j10504j42518L12589
$$ plain form
6001 699188 982269 699332 715358 694878 676346 1039976 926061 975699 858276 853349 942411
5990 942411 935524 921466 909464 801870 970148 1210591 718638 866071 982545 815202
5980 815202 703171 769035 1189906 932798 537966 747471 726910 545048 694500 939598
5970 939598 918404 798437 1076707 911072 698949 663486 1395264 1177622 910984 719580
5960 719580 933379 687459 585456 735582 758360 883799 511732 1071987 863298 1393952
5950 1393952 850119 1135945 929449 1020998 913964 713834 1197694 1021330 846575 503749
5940 503749 664614 734645 921783 675810 997377 1009682 947136 851262 824511 804419 835643
5929 835643 1112275 648865 1113853 930058 827531 901048 1034197 923693 781175 1093764
5919A093764K49766j50220j24055k9033N58324l33359k30961K25956L708O0789
5909A324679j2193l24787J22889k88766k6384L93986P4195p9405O2037K2330J2286
5898A280867L50253J54078k33086Q36535K28910O22335j21869m53538P8036J8081
5888B760602r89072n6711L12592l08303k82183j59003J6640K5021k9435O7989
5878A358137K83067l0933K30075J16175L33691M68708N20026P45714J74437q75934
5868C323163n72075M2462p54986l56199K32851m04591j65148N315J7070j53505
5858A214357O61135k74968l2533k75677N39970j8907N17444j89785J87910L77232
5848B706178K73551k96845m19997m07322O3351p9920k2481l52413n1835J11433
$$ plain form
5919 1093764 1343530 1193310 1069255 1040222 1598546 1265187 1034226 1260182 1263890 1324679
5909 1324679 1312486 987699 1110588 821822 795438 1189424 1263619 1184214 1246251 1268581 1280867
5898 1280867 1631120 1785198 1552112 2388647 2617557 3239892 3118023 2664485 2742521 2760602
5888 2760602 1771530 1714819 2027411 1719108 1436925 1277922 1294562 1319583 1290148 1358137
5878 1358137 1641204 1610271 1840346 1956521 2290212 2758920 3278946 4024660 4199097 3323163
5868 3323163 2751088 2793550 2038564 1682365 1915216 1510625 1345477 1350792 1367862 1214357
5858 1214357 1875492 1600524 1567991 1292314 1832284 1813377 2330821 2141036 2328946 2706178
5848 2706178 2979729 2682884 2262887 1855565 1918916 1838996 1816515 1464102 1412267 1523700
5838A523700k45271r8100O4098r3205J7518k83400L04012K77717J36581J21610
5828A725260K75594k30456m44768N13434l68887o3084k8423k0468P084r0381k52717
5817A022188J34326J22151O3726n0806k11380L37472k45935J51245k2965J4011
5807A314033l1604j74280r4329p3663M85267O5070o3724j93437L01695k75957
5797A259071k3282J38827j91921k29872J25277j04965M97016R5266m39672l7284
5787A088461K69996l84802J97075J39501q5206j8140K63181j44268l03947J61377
5777A183228L67317m35547R9378K76823L8088N5074J25587o13795J158J98303
5767A295614J96307o6807J80512J32104k62233k20058L56409j23578N7978J67037
$$ plain form
5838 1523700 1278429 1180329 1244427 1151222 1168740 885340 1189352 1467069 1603650 1725260
5828 1725260 2000854 1770398 1325630 1839064 1470177 1407093 1378670 1358202 1365286 1274905 1022188
5817 1022188 1156514 1278665 1342391 1291585 1080205 1417677 1171742 1322987 1300022 1314033
5807 1314033 1282429 1108149 1013820 940157 1425424 1490494 1426770 1233333 1535028 1259071
5797 1259071 1235789 1374616 1182695 952823 1078100 973135 1470151 1565417 1125745 1088461
5787 1088461 1358457 973655 1170730 1310231 1225025 1206885 1470066 1325798 1021851 1183228
5777 1183228 1550545 1114998 1214376 1491199 1529287 1584361 1709948 1096153 1097311 1295614
5767 1295614 1491921 1425114 1605626 1737730 1475497 1255439 1611848 1488270 1546248 1713285
5757A713285j50757o8573K04460l89877Q2787K34109r849K51822j31085k46280
5747A490042K02200M5816k27024L36718m68994j89469k40661P03331k39920K72170
5737A684209j58709M20421k81800K275K47505k03870J33120m3693j67985J07754
5727A739227J22331j81800J79880M9495q4536K57574l05020M78814J24878J83312
5717B564155n32117K73329L6061K23575k43860K09784l6141k36616L91735J01360
5707B751265J51842R8375N63623n69572N32465K96756o0359N50948K50684N09703
5697E075730L22334O40658P04944J117347J880404K457968M064575P814411J1962687
5688C6041058J6395528J3516993L92114j0641319j3088629j0113929p907364o388973
$$ plain form
5757 1713285 1562528 1493955 1698415 1308538 1391325 1625434 1615585 1867407 1736322 1490042
5747 1490042 1692242 1738058 1511034 1847752 1378758 1189289 948628 1651959 1412039 1684209
5737 1684209 1525500 1945921 1664121 1666396 1913901 1710031 1843151 1799458 1631473 1739227
5727 1739227 1861558 1679758 1859638 1909133 1824597 2082171 1777151 2255965 2380843 2564155
5717 2564155 2032038 2305367 2341428 2565003 2321143 2530927 2494786 2258170 2649905 2751265
5707 2751265 2903107 3001482 3565105 2995533 3527998 3824754 3764395 4315343 4566027 5075730
5697 5075730 5398064 6038722 6743666 7861013 9741417 12199385 16263960 24078371 36041058
5688 36041058 52436586 65953579 66345693 55704374 42615745 32501816 24594452 18205479
5680A8205479m074201l021918j497637j488502r86497o58559k10506l43710o26891
5671E297058J07504j45296n71278K8654j39931j74693k72907j41944k58727j82844
5661C545596k4821L30815l37017j53665j83675o4352R8064J91645J16440p21915
5651B797115l5745J24818K39775k67245j79854K46590k07059l17184Q5387M63208
5641B949806k07563r744r7336M75831k00289n07187K2421k82563L97259M3006
5631B583641j08812J01867j99566j14740o7076K38126n5278j33049q0739K38267
5621B402641j64392q5331M38969J4470m68294N3617J96863N3810k50521j96568
5611A995264K48340k93169O610M8180k0560J97930j74348J05107r3278j03391
$$ plain form
5680 18205479 14131278 11109360 9611723 8123221 7136724 6478165 6267659 5923949 5297058
5671 5297058 5404562 5259266 4687988 4716642 4576711 4402018 4129111 3987167 3728440 3545596
5661 3545596 3520775 3851590 3514573 3360908 3177233 3112881 3210945 3402590 3519030 2797115
5651 2797115 2761370 2886188 3125963 2858718 2678864 2925454 2718395 2401211 2486598 2949806
5641 2949806 2742243 2732499 2635163 3110994 2910705 2403518 2425939 2143376 2540635 2583641
5631 2583641 2474829 2576696 2377130 2262390 2195314 2433440 2378162 2245113 2164374 2402641
5621 2402641 2238249 2152918 2591887 2606357 2138063 2191680 2388543 2442353 2191832 1995264
5611 1995264 2243604 1950435 1957045 2005225 1984665 2182595 2008247 2113354 2020076 1916685
5601A916685J67098J02466p2466k36737K86528Q8801j84042p5249k80907R0515
5591A802692L03840L9713l23951L3604K50760N3279m32695l0307L31695L49060
5581B377690o24124L2118o5116L21512j68695K18313j6164j00342l69797M32127
5571B037522k21697K7942l3133J48209J65996k13657j50136J16832K44706k92148
5561A830436k79898L26787k36785O51234n55778J41557l37313M73772o215j39165
5551A868632m76854N39939k03878m77651O20999n5537m9607k46032r0662R0689
5541A520038K86593Q6582k22316J98286k62175O14463p11562L66972j03857l5171
5531A737853J07179k22128o1021m57098K56445K40454K66972j06128P3408r1196
$$ plain form
5601 1916685 2083783 2186249 2113783 1877046 2163574 2252375 2068333 1993084 1712177 1802692
5591 1802692 2106532 2146245 1822294 1855898 2106658 2159937 1727242 1696935 2028630 2377690
5581 2377690 1753566 1785684 1720568 2042080 1873385 2091698 2075534 1975192 1605395 2037522
5571 2037522 1815825 1843767 1810634 1958843 2124839 1911182 1761046 1877878 2122584 1830436
5561 1830436 1550538 1877325 1640540 2291774 1735996 1877553 1540240 2014012 2007797 1868632
5551 1868632 1391778 1931717 1727839 1250188 1871187 1815650 1766043 1520011 1429349 1520038
5541 1520038 1806631 1893213 1670897 1869183 1607008 2221471 1509909 1876881 1773024 1737853
5531 1737853 1845032 1622904 1561883 1104785 1361230 1601684 1868656 1762528 1835936 1744740
5521A744740J83379j52607k32297L22561N3422k11640l3954K86361j91159P0792
5511A839598m51216K71750K03377j39865j27960J45146J31312Q796M0164Q5635
5501B006737j42928L6931J44167k58437R4098J62000k59339j00196J5955N04044
5491B203032L84961k75494j71297j58931j8617J86972m8456o52977N86850J19880
5481B155923K23094m18960l53497K13040M55915o6212J63685M26925n42490R9564
5471B356987K9208M86900J5898J23563J72655k81696k19693M7828O04951j52159
5461C184442j64459j18812M56925n90039J72140j09492K54442O9890J16645K2101
5451C293783K45553L22746l2903K86736J62668k61662k39814Q2443O06919k9679
$$ plain form
5521 1744740 1928119 1775512 1543215 1865776 1919198 1707558 1673604 1959965 1768806 1839598
5511 1839598 1388382 1660132 1863509 1723644 1595684 1740830 1872142 1880938 1921102 2006737
5501 2006737 1863809 1900740 2044907 1786470 1880568 2042568 1783229 1683033 1698988 2203032
5491 2203032 2587993 2312499 2141202 1982271 1963654 2150626 2102170 1449193 2036043 2155923
5481 2155923 2379017 1960057 1606560 1819600 2275515 2209303 2372988 2799913 2257423 2356987
5471 2356987 2386195 2873095 2888993 3012556 3185211 2903515 2683822 2731650 3336601 3184442
5461 3184442 3019983 2901171 3358096 2768057 2940197 2830705 3085147 3155037 3271682 3293783
5451 3293783 3539336 3862082 3829179 4115915 4278583 4016921 3777107 3859550 4466469 4436790
5441D436790q5147n3613J43525l72046J0710j06518K19328J58451k49747J25788
5431D227521K66702m5546j30263K22339K99831q2776J39206j4451J41206K65789
5421E289558j02051k87400K49352K0669l70251M0413M26078K26101l78554j78891
5411D935024J22090M25197r0552n06499O74125r6565k90673k01806O40106j86659
5401E423788k99220n7853L95743L7007k37839K19888J78529m27923J90295J49172
5391E571587K2365j16555J44806J93252K49629k87822J55515k35484j92038Q0589
5381E585844J13400O1674m51638K54665r7406m50891O7871J95257j7626n2262
5371E208888M6236J6371L49020j94417J72587J36325j42815j03951K88115p1365
$$ plain form
5441 4436790 4351643 4298030 4441555 4069509 4080219 3973701 4193029 4351480 4101733 4227521
5431 4227521 4494223 4448677 4318414 4540753 4840584 4757808 4897014 4882563 5023769 5289558
5421 5289558 5187507 4900107 5149459 5170128 4799877 4840290 5266368 5492469 5113915 4935024
5411 4935024 5057114 5482311 5391759 4885260 5559385 5462820 5172147 4970341 5610447 5423788
5401 5423788 5124568 5066715 5462458 5499465 5261626 5481514 5660043 5232120 5422415 5571587
5391 5571587 5593952 5477397 5622203 5815455 6065084 5777262 5932777 5697293 5505255 5585844
5381 5585844 5699244 5760918 5309280 5563945 5466539 5015648 5083519 5278776 5261150 5208888
5371 5208888 5255124 5271495 5620515 5426098 5598685 5735010 5592195 5488244 5776359 5704994
5361E704994J96040p4488k41551l73506j26567L74691p0035j84283J30951l64341
5351D971905R5847n21304K56743P0206N4430R8439K47100k74825J56555L21769
5341E476865R8592L05946k14085k30478j81797R74m48718L14620J15401j78644
5331E058676j63212j79744M93505j7853j98176m92460O4164N4923J34707K8344
5321D782874J1394k65932j04257M59114J19918j38489l70483K58656o16154J82409
5311D319050p9698J54649k13910k59778k25423L22607J65912m12974K61050l01152
5301C730333J92319o42348K86008K02375R2373m8065J59026j7163k44904k74000
5291C435954j31330M45556m70040k5256j16544J67242l25552J47108m5278l69453
$$ plain form
5361 5704994 5901034 5826546 5584995 5211489 5084922 5459613 5389578 5205295 5336246 4971905
5351 4971905 5067752 4546448 4803191 4873397 4927827 5026266 5273366 4998541 5155096 5476865
5341 5476865 5575457 5881403 5667318 5436840 5255043 5256017 4807299 5121919 5237320 5058676
5331 5058676 4895464 4715720 5209225 5191372 4993196 4500736 4564900 4619823 4754530 4782874
5321 4782874 4794268 4528336 4424079 4883193 5003111 4864622 4494139 4752795 4136641 4319050
5311 4319050 4239352 4394001 4180091 3920313 3694890 4017497 4183409 3770435 4031485 3730333
5301 3730333 3922652 3280304 3566312 3768687 3861060 3812995 3972021 3954858 3709954 3435954
5291 3435954 3304624 3750180 3280140 3254884 3138340 3305582 2980030 3127138 3081860 2712407
5281B712407L08402p2142M49139l15117N18033k54346m41546L06058J70239j52218
5271C228909k36193n7457K80272N5840n14738J19792j60874Q0247l41264P38937
5261C193471q3459n47383J46156O0713K47075m01718J58164J92174k14037n4995
5251B696161L15428m1321J21278l49344m6145K82621J78180n83283k80400L84233
5241B677408o0287j62086J92087k10184M3724R097j19444J73787j7009R7169O7395
5230B691657j39800J39662O0423K3506l08900k5890K07453M1390J7596j73770
5220B533327J29967j99230Q4714N8758J71788J84090j10036l20670L95797K89567
5210C218072p34730M29118p9490k56845k05347O65534j15670n54487L06246K80509
$$ plain form
5281 2712407 3020809 2948667 3397806 3082689 3600722 3346376 2904830 3210888 3381127 3228909
5271 3228909 2992716 2935259 3215531 3271371 2756633 2876425 2715551 2795798 2454534 3193471
5261 3193471 3110012 2562629 2708785 2769498 3016573 2614855 2773019 2965193 2751156 2696161
5251 2696161 3011589 2970268 3091546 2742202 2696057 2978678 3156858 2573575 2293175 2677408
5241 2677408 2617121 2455035 2647122 2436938 2480662 2489759 2370315 2544102 2527093 2624262 2691657
5230 2691657 2551857 2691519 2751942 2775448 2466548 2440658 2648111 2689501 2707097 2533327
5220 2533327 2663294 2464064 2548778 2607536 2779324 2963414 2853378 2532708 2928505 3218072
5210 3218072 2483342 2912460 2832970 2576125 2370778 3036312 2920642 2366155 2672401 2952910
5200B952910j00151j42318K4377L7406M48256k98775J8980m6677K57055n58662
5190B592401K84101K95846m17781N37857l76329j94653K93773M23961j35601k91625
5180C011950l4074j17189J46804q9214K31921j39406K22017m80866J02460L8273
5170B892676K82073k78995k8662M51349k08289j05928k03341J85569K79133Q5388
5160C350973m21353K21781K13708k10883j66005N66197l29429J86741m2831l04773
5150C064126m1927N6801k09552j1117J15208J66660J02505j84922L92444l21175
5140C129051N99234m26000o0610l69605L41723K4101j22205J62212k89972N75192
5130C563121j37642J7553l89778M06268k6151M9862M33634k30631J62513k84122
$$ plain form
5200 2952910 2852759 2710441 2734818 2772224 3220480 2921705 2940685 2894008 3151063 2592401
5190 2592401 2876502 3172348 2754567 3292424 2916095 2721442 3015215 3439176 3303575 3011950
5180 3011950 2977876 2860687 3007491 2918277 3150198 3010792 3232809 2751943 2854403 2892676
5170 2892676 3174749 2895754 2867092 3318441 3110152 3004224 2800883 2986452 3265585 3350973
5160 3350973 2929620 3151401 3365109 3154226 2988221 3554418 3224989 3411730 3368899 3064126
5150 3064126 3022199 3079000 2869448 2858331 2973539 3140199 3242704 3057782 3450226 3129051
5140 3129051 3728285 3302285 3241675 2872070 3213793 3237894 3115689 3277901 2987929 3563121
5130 3563121 3425479 3443032 3053254 3459522 3433371 3483233 3916867 3686236 3848749 3564627
5120C564627M01734m64576P1621K16449O0423l99287o2496K97661J11894k53662
5110C544388k79755K64012L15589k5593l75258O99108j95867l60500M03887k54448
5100C735563K38929l02719J94910r846j4142J48917K44036q8969Q2051K24439
5090D453169K85403k23603M5143J27029k63177J8405k94169M57978k91916O17
5080D314879j0526j40536l6748J90943J00893J57858J42585J61292l82963P8554
5070D576231L56419m64982L06170k10325l9467J04924p8604K57392Q2630K19269
5060E109657k11853O28318j70304L1833l69898K38831l7373k1467K4324K11437
5050E433505k59684j13476j0998o0064L7231k64002M17433r1q2672K569K41407
$$ plain form
5120 3564627 3966361 3501785 3573406 3789855 3850278 3450991 3388495 3686156 3798050 3544388
5110 3544388 3264633 3528645 3844234 3818641 3443383 4142491 3946624 3586124 3990011 3735563
5100 3735563 3974492 3671773 3866683 3856837 3842695 3991612 4235648 4146679 4228730 4453169
5090 4453169 4738572 4514969 4560112 4687141 4423964 4442369 4148200 4606178 4314262 4314879
5080 4314879 4304353 4163817 4127069 4318012 4418905 4576763 4719348 4880640 4497677 4576231
5070 4576231 4932650 4467668 4773838 4563513 4524046 4628970 4550366 4807758 4890388 5109657
5060 5109657 4897804 5526122 5355818 5387651 5017753 5256584 5219211 5197744 5222068 5433505
5050 5433505 5173821 5060345 5049347 4989283 5026514 4762512 5179945 5179854 5097182 5099751 5341158
5039E341158l79456j7582J19529k18794J98312P7890K76835m92792m56455P05420
5029E154065l3538o2071l9350j2892K99569k97882n8076J69300J62849j28750
5019E153224n08644M64784J49349k42411j13998K18925m5317M8985k76663L1870
5009D880104J11881J61505m40410L1861J26791k68574K15817L3810J82590k90772
4999D744603j78397L43531j71120L05309j00096K2570k00891p2999J09807J0927
4989D813244j16380J29132k14997O2567k68312L02289L95596m25343m4720L80299
4979E013375k56155M0111M5189p3199r2628N26741l64174r2590P0288K5850Q6241
4968D929049M2805j50069k4861K97934j17019n01264O22L93845k28941k07911
$$ plain form
5039 5341158 4961702 4944120 5063649 4844855 5043167 5121057 5397892 4905100 4448645 5154065
5029 5154065 5120527 5058456 5019106 5006214 5305783 5007901 4949825 5119125 5281974 5153224
5019 5153224 4644580 5109364 5258713 5016302 4902304 5121229 5075912 5124897 4848234 4880104
5009 4880104 4991985 5153490 4713080 4744941 4871732 4603158 4818975 4852785 5035375 4744603
4999 4744603 4566206 4909737 4738617 5043926 4943830 4966400 4765509 4692510 4802317 4813244
4989 4813244 4696864 4825996 4610999 4673566 4405254 4707543 5103139 4677796 4633076 5013375
4979 5013375 4757220 4797331 4842520 4769321 4676693 5203434 4839260 4746670 4816958 4842808 4929049
4968 4929049 4971854 4821785 4796924 5094858 4977839 4476575 4477197 4871042 4642101 4434190
4958D434190J47030K04109k02878L24572l37654j71715J68293k31600M89914j98792
4948D625469j58467J73714N0067n9102j08214J70646j57980r6602r572Q2925m06727
4937D106157L46783j2812J38299k63632R5142k92230k8999J27192j74196M23496
4927D465200j77001l3118M2160l5228j15854j16474L93854o9597k72115N1273
4917D133100L62343l24946J36046l29499J23497k47094L52977l16768J62250J60908
4907D212814j44920n5950n66518M96374J24869k08448j00389K00777l46665l10388
4897C301556L46021J31461l29339n8337K54452l00150K72722k38276J83288k54667
4887C308731K65437M4295j46984O8599r2017l49730K0242K13603o9006j24909
$$ plain form
4958 4434190 4581220 4785329 4582451 4907023 4569369 4397654 4565947 4334347 4824261 4625469
4948 4625469 4467002 4640716 4690783 4631681 4523467 4694113 4536133 4439531 4429959 4512884 4106157
4937 4106157 4452940 4440128 4578427 4314795 4409937 4117707 4088708 4215900 4041704 4465200
4927 4465200 4288199 4255081 4297241 4262013 4146159 4029685 4423539 4353942 4081827 4133100
4917 4133100 4495443 4170497 4306543 3977044 4100541 3853447 4206424 3889656 4051906 4212814
4907 4212814 4067894 4011944 3445426 3941800 4066669 3858221 3757832 3958609 3611944 3301556
4897 3301556 3647577 3779038 3449699 3391362 3645814 3345664 3618386 3380110 3563398 3308731
4887 3308731 3574168 3618463 3471479 3540078 3448061 3098331 3118573 3332176 3263170 3138261
4877C138261J5660R2841l44828L82977j79239J09145m3178j69662j04804M044
4867B901217o0078Q8328j05998K4333J1100K31630k00900k12438K48176J12772
4857C038142k43037l24122K16214J52193L2125j52981j20199J99892l8683n3511
4847B706033j18470L78468k43050m29023P3336L67394n3657q4315k2411k37116
4837B337189j02430K91549m2020j73249J776n9583J83943m14325L36297M5183
4827B404330O7293k53063j54079L71727j70333K8426J45988M5242m4698j8728
4817B422105L5396J33258l63809L48695l78952L02022l77876j91275K89623P6287
4807B295474k6473j75383J16755k84345O2405L22829m37297k65191N7104L82937
$$ plain form
4877 3138261 3153921 3246762 2901934 3284911 3105672 3214817 3171639 3001977 2897173 2901217
4867 2901217 2841139 2929467 2823469 2847802 2858902 3090532 2889632 2677194 2925370 3038142
4857 3038142 2795105 2470983 2687197 2839390 2871515 2718534 2598335 2798227 2759544 2706033
4847 2706033 2587563 2966031 2722981 2293958 2367294 2734688 2681031 2596716 2574305 2337189
4837 2337189 2234759 2526308 2484288 2311039 2312815 2253232 2437175 2022850 2359147 2404330
4827 2404330 2471623 2218560 2064481 2436208 2265875 2294301 2440289 2485531 2440833 2422105
4817 2422105 2457501 2590759 2226950 2575645 2196693 2498715 2120839 1929564 2219187 2295474
4807 2295474 2269001 2093618 2210373 1926028 1988433 2311262 1873965 1608774 1665878 2048815
4797B048815j19729J01164m62210K05565J16487N0379l05416K98543J0350K02822
4787B146770m31394K2974j57224j85323O69182k30988j59268q3452J70264l07335
4777A454206k10405N35379K60905l66350j97765J56134j38924J20523J0019J15452
4767A739174o03799K68915K07081k06743l08610J41881Q13851p66386L62571l35359
4757A312576R2485j95568K10330M4207P8918J88295m45183N5670l20087K83508
4747A305151N6065J47651l63672J40478j37421J90616L48574p07004N58425j42994
4737A395869j26012m85702N43330L1161j82187j38187M18681k68859j03024J19336
4727A204406K25006l16235k5997O17506l78786j3062l49694o5146M41052k03933
$$ plain form
4797 2048815 1929086 2030250 1568040 1773605 1890092 1940471 1635055 1933598 1943948 2146770
4787 2146770 1715376 1738350 1581126 1395803 2064985 1833997 1674729 1591277 1761541 1454206
4777 1454206 1243801 1779180 2040085 1673735 1475970 1632104 1493180 1613703 1623722 1739174
4767 1739174 1135375 1404290 1611371 1404628 1096018 1237899 2051750 1285364 1647935 1312576
4757 1312576 1405061 1209493 1419823 1464030 1542948 1731243 1286060 1341730 1021643 1305151
4747 1305151 1361216 1508867 1145195 1285673 1148252 1338868 1687442 980438 1538863 1395869
4737 1395869 1269857 784155 1327485 1358646 1176459 1038272 1456953 1188094 1085070 1204406
4727 1204406 1429412 1113177 1087180 1704686 1325900 1312838 963144 897998 1339050 1135117
4717A135117q4339L40983l015l86840J00007k86668K9864N32575L58605q20426
4707I15863J20626m483K10129J74595j43165j49750j40512L21599j20954M4371
4697A228319Q5301k61720K40186M1851n8354R8791k16382N3147l31956K34696
4687A113879K10890j83473Q0252l79864J93944K30917R5817o2868L2548O7845
4677A399887l08225L12699L27561K223j88305L81269l51023j07128l03007n7476
4667A108475J17548L24863j53490j35463M47749j89637l60959L14620P1343j51214
4657A393835J98404j70258k10514N88510k95385L12773m20575J75814J78459J42705
4647A893768o11225o8159J31537o4875L41535n38418K43547k6131L16918l15085
$$ plain form
4717 1135117 1050778 1391761 1388746 1001906 1101913 815245 845109 1377684 1736289 915863
4707 915863 1036489 1032006 1242135 1416730 1273565 1123815 983303 1304902 1183948 1228319
4697 1228319 1313620 1051900 1292086 1333937 1275583 1374374 1157992 1211139 879183 1113879
4687 1113879 1324769 1141296 1221548 841684 1035628 1266545 1362362 1299494 1332042 1399887
4677 1399887 1091662 1404361 1731922 1734145 1545840 1927109 1576086 1468958 1165951 1108475
4667 1108475 1226023 1550886 1397396 1261933 1709682 1520045 1159086 1473706 1545049 1393835
4657 1393835 1592239 1421981 1211467 1799977 1504592 1817365 1396790 1572604 1751063 1893768
4647 1893768 1282543 1214384 1345921 1281046 1622581 1084163 1327710 1301579 1618497 1303412
4637A303412r919J25367J77270m30213P879M55335j07638J76267l97790N7702
4627A357672M302k29108J45848R6025R2645m7041J24237M7997N3824J53830M36691
4616B236922J08729l85138j06245n0264l33759K98018Q2934K13260J07296K15643
4606B387396r5134m42863q0765N24667j93773l26540M0310K63350j20750m65321
4596A490577K18109P0646P6449k83921l68255P3920j01401L9221k72198L08052
4586A251199j02951J36425L48995k63176Q7759L19580k76248M84414l28141J84334
4576A842190o11190j3637n8838K69303j59813J17071m30502J71203K57996J17214
4566A500997K4963K3592k73993K55592L52141j52444j47884J12265K78310J90254
$$ plain form
4637 1303412 1293493 1418860 1596130 1165917 1173796 1629131 1521493 1697760 1299970 1357672
4627 1357672 1361974 1132866 1278714 1374739 1467384 1420343 1544580 1592577 1646401 1800231 2236922
4616 2236922 2345651 1960513 1854268 1804004 1470245 1768263 1851197 2064457 2171753 2387396
4606 2387396 2292262 1849399 1768634 2293301 2099528 1772988 1813298 2076648 1955898 1490577
4596 1490577 1708686 1779332 1855781 1571860 1203605 1277525 1176124 1215345 943147 1251199
4586 1251199 1148248 1284673 1633668 1370492 1458251 1777831 1501583 1985997 1657856 1842190
4576 1842190 1231000 1217363 1158525 1427828 1268015 1385086 954584 1125787 1383783 1500997
4566 1500997 1525960 1549552 1275559 1531151 1883292 1730848 1582964 1695229 1973539 2163793
4556B163793n40544k2395k97442J2569k73268m1490J32158p6647n03992J30004
4546F82746L08813l25477K90655k7314J059l37246K42964J65722O7776k73249
4536G96449M0356j19050J55363J87328M43312j40513j80784j66894K54014l09416
4526I60165k75086L70339J13556m30375j0453J58375j9254j71092R2079M32864
4516A221118p22744J24173N2820K69498k03680O0265J91114J07347m93613K2704
4506F29002J05533o1410n64391M51813K56814k86085Q854K1624J412k7674P3639
4495F09131O4135l8844n0219m5887o4284R4750j4539R6915q487k35232R0590k14418
4483B83611L49794J84366k03777O6060O0664j03306k92371J83323j07785R1163
$$ plain form
4556 2163793 1623249 1600854 1303412 1315981 1042713 1001223 1133381 1056734 552742 682746
4546 682746 991559 666082 956737 929423 930482 593236 836200 1001922 1069698 796449
4536 796449 836805 717755 873118 1060446 1503758 1363245 1182461 1015567 1269581 960165
4526 960165 685079 1055418 1168974 738599 728146 886521 867267 696175 788254 1221118
4516 1221118 498374 622547 675367 944865 741185 801450 992564 1099911 606298 629002
4506 629002 734535 673125 108734 560547 817361 531276 540130 561754 563166 535492 609131
4495 609131 673266 634422 584203 538316 474032 568782 554243 651158 642671 407439 498029 283611
4483 283611 633405 817771 613994 680054 740718 637412 345041 528364 420579 511742
4473E11742j6254J89692j71344Q5776J9309j33973P8370o8994M88070J31244k57866
4462H55772k08666l6765N94461J98831N4947j34000l16334o0586Q7757l95574
4452F39843K91732o5762O6296k85269J62810K35804j51287N4662k96164K26041
4442H78706J74927k8661k97254M83727L95750l59998j04928k28828J3003j48468
4432G77976K68379k09185J2735J42922Q9595k41029Q3616j14965K68310j55488
4422I22866J48130k18972K1420j3687j35969L74303J38621j03916L90509l52675
4412A170630Q6640j71961K25481K7915m26981k47939J35734L18424o1645q9832
4402I66466k8804l22316J59845L01955j31290L86478o31633N29757J37566l9295
$$ plain form
4473 511742 495488 685180 513836 599612 618921 484948 563318 494324 982394 1113638 855772
4462 855772 647106 610341 1204802 1403633 1458580 1324580 1008246 947660 1035417 639843
4452 639843 931575 865813 932109 646840 809650 1045454 894167 948829 652665 878706
4442 878706 1053633 1024972 727718 1211445 1607195 1247197 1142269 913441 926444 777976
4432 777976 1046355 837170 849905 992827 1082422 841393 925009 810044 1078354 922866
4422 922866 1070996 852024 873444 859757 723788 1098091 1236712 1132796 1523305 1170630
4412 1170630 1257270 1085309 1310790 1338705 911724 663785 799519 1117943 1056298 966466
4402 966466 937662 615346 775191 1077146 945856 1332334 700701 1230458 1368024 1328729
4392A328729O08363j85687n28840J51413J24864k53877m6876M46863j99247m56204
4382I89501K27208J62846j61421j64003J25844k2257R4248J72807q6858K1624
4372A359539O7642J7867j43174m5892K56420L08149K26880L46800K18132l1053
4362B581310j71101l51929J61916J46472p65714J93048R4164j24308r4749J53951
4352A823060K5531k55133O5173L34720J96593k76270P1O7152q6242L24332M81081
4341B700068L1269j39488k02683L61233K35397n6655O65058L68384M09057n16601
4331C855039r5474k2959l72118J35781m35936k3313N24844L35250k71519M40104
$$ plain form
4392 1328729 1937092 1751405 1222565 1373978 1498842 1244965 1198089 1644952 1445705 989501
4382 989501 1216709 1379555 1218134 1054131 1179975 1157718 1251966 1424773 1337915 1359539
4372 1359539 1427181 1445048 1301874 1255982 1512402 1820551 2047431 2394231 2612363 2581310
4362 2581310 2410209 2058280 2220196 2366668 1600954 1794002 1888166 1763858 1669109 1823060
4352 1823060 1848591 1593458 1658631 1993351 2189944 1913674 1913745 1980897 1894655 2218987 2700068
4341 2700068 2731337 2591849 2389166 2750399 2985796 2929141 3594199 3962583 4371640 3855039
4331 3855039 3759565 3736606 3364488 3500269 3064333 3041020 3565864 3901114 3629595 4069699
$$ [...]
##END NTUPLES=NMR SPECTRUM
##END=
