##TITLE=abcd
##JCAMPDX= 6.0         $$ Bruker NMR JCAMP-DX V2.0
##DATA TYPE= NMR SPECTRUM
##DATA CLASS= NTUPLES
##ORIGIN= UXNMR, Bruker Analytische Messtechnik GmbH
##OWNER= root
$$ XWIN-NMR		Version 3.5
$$ Mon Mar 16 18:41:47 2026 Russian Standard Time (UT+4h)  servis@DPX200
##.OBSERVE FREQUENCY= 200.131235884673
##.OBSERVE NUCLEUS= ^1H
##.ACQUISITION MODE= SIMULTANEOUS
##.ACQUISITION SCHEME= undefined
##.AVERAGES= 32
##.DIGITISER RES= 18
##SPECTROMETER/DATA SYSTEM= spect
##.PULSE SEQUENCE= zg
##.SOLVENT NAME= CDCl3
##.SHIFT REFERENCE= (INTERNAL, CDCl3, 0, 16.4885)
##AUDIT TRAIL= $$ (NUMBER, WHEN, WHO, WHERE, WHAT)
$$ ##TITLE= Audit trail, XWIN-NMR		Version 3.5
$$ ##JCAMPDX= 5.01
$$ ##ORIGIN= Bruker BioSpin GmbH
$$ ##OWNER= servis
$$ F:\spectra/data/av/nmr/H1/1/pdata/1/auditp.txt
$$ ##AUDIT TRAIL=  $$ (NUMBER, WHEN, WHO, WHERE, WHAT)
(   1,<2026-03-16 18:35:49.01 +0400>,<servis>,<DPX200>,
      <created by zg, POWCHK disabled, PULCHK disabled
       configuration hash MD5:
       00 E9 B6 7A A2 85 ED C7 34 08 36 98 17 FE 4E 26
       data hash MD5: 32K
       94 23 53 24 E4 29 2D F2 C0 FB 0D 41 34 32 6D 1C>)
(   2,<2026-03-16 18:41:19.40 +0400>,<servis>,<DPX200>,
      <Start of raw data processing
       efp BC_mod = 2 LB = 0.05 FT_mod = 6 PKNL = 1 PHC0 = -256.1951 PHC1 = -0.898437 SI = 16K 
       data hash MD5: 16K
       6E 52 74 9A F0 48 21 9B 6F 00 15 AF CC A9 62 3F>)
$$ ##END=
$$ 
$$ hash MD5
$$ 63 43 93 64 EF 9D F1 C9 38 0E 21 8A F9 13 BF 77
##$RELAX= 
##$RELAX= 
##$RELAX= 
##$RELAX= 
##$RELAX= 
##$RELAX= 
##$RELAX= 
##$RELAX= 
$$ Bruker specific parameters
$$ --------------------------
##$DU= <F:\spectra>
##$EXPNO= 1
##$NAME= <H1>
##$PROCNO= 1
##$TYPE= <nmr>
##$USER= <av>
##$AMP= (0..31)
100 100 100 100 100 100 100 100 100 100 100 100 100 100 100 100 100 100 
100 100 100 100 100 100 100 100 100 100 100 100 100 100 
##$AQSEQ= 0
##$AQ_mod= 1
##$AUNM= <au_zg>
##$AUTOPOS= <>
##$BF1= 200.13
##$BF2= 200.13
##$BF3= 200.13
##$BF4= 200.13
##$BF5= 500.13
##$BF6= 500.13
##$BF7= 500.13
##$BF8= 500.13
##$BYTORDA= 1
##$CFDGTYP= 0
##$CFRGTYP= 5
##$CHEMSTR= <none>
##$CNST= (0..31)
1 1 145 1 1 1 1 1 1 1 1 1 1 1 1 1 1 1 1 1 1 1 1 1 1 1 1 1 1 1 1 1 
##$CPDPRG= <>
##$CPDPRG1= <>
##$CPDPRG2= <>
##$CPDPRG3= <>
##$CPDPRG4= <mlev>
##$CPDPRG5= <mlev>
##$CPDPRG6= <mlev>
##$CPDPRG7= <mlev>
##$CPDPRG8= <mlev>
##$CPDPRGB= <>
##$CPDPRGT= <>
##$D= (0..31)
0 2 0 0 0 0 0 0 0 0.06 0 0 0 0 0 0 0.0002 0 0 0 0 0 0 0 0 0 0 0 0 0 0 
0 
##$DATE= 1773671748
##$DBL= (0..7)
120 120 120 120 120 120 120 120 
##$DBP= (0..7)
150 150 150 150 150 150 150 150 
##$DBP07= 0
##$DBPNAM0= <>
##$DBPNAM1= <>
##$DBPNAM2= <>
##$DBPNAM3= <>
##$DBPNAM4= <>
##$DBPNAM5= <>
##$DBPNAM6= <>
##$DBPNAM7= <>
##$DBPOAL= (0..7)
0.5 0.5 0.5 0.5 0.5 0.5 0.5 0.5 
##$DBPOFFS= (0..7)
0 0 0 0 0 0 0 0 
##$DE= 6
##$DECBNUC= <off>
##$DECIM= 32
##$DECNUC= <off>
##$DECSTAT= 4
##$DIGMOD= 1
##$DIGTYP= 9
##$DL= (0..7)
0 120 120 120 120 120 120 120 
##$DP= (0..7)
150 150 150 150 150 150 150 150 
##$DP07= 0
$$ [...]
##$SUBNAM4= <"">
##$SUBNAM5= <"">
##$SUBNAM6= <"">
##$SUBNAM7= <"">
##$SUBNAM8= <"">
##$SUBNAM9= <"">
##$SW= 20.6817932712277
##$SWIBOX= (0..15)
0 0 3 0 0 0 0 0 0 0 0 0 0 0 0 0 
##$SW_h= 4139.07284768212
##$TD= 32768
##$TD0= 1
##$TE= 0
##$TE2= 300
##$TE3= 300
##$TEG= 300
##$TL= (0..7)
0 120 120 120 120 120 120 120 
##$TP= (0..7)
150 150 150 150 150 150 150 150 
##$TP07= 0
##$TPNAME0= <>
##$TPNAME1= <>
##$TPNAME2= <>
##$TPNAME3= <>
##$TPNAME4= <>
##$TPNAME5= <>
##$TPNAME6= <>
##$TPNAME7= <>
##$TPOAL= (0..7)
0.5 0.5 0.5 0.5 0.5 0.5 0.5 0.5 
##$TPOFFS= (0..7)
0 0 0 0 0 0 0 0 
##$TUNHIN= 0
##$TUNHOUT= 0
##$TUNXOUT= 0
##$USERA1= <user>
##$USERA2= <user>
##$USERA3= <user>
##$USERA4= <user>
##$USERA5= <user>
##$V9= 5
##$VALIST= <valist>
##$VCLIST= <CCCCCCCCCCCCCCC>
##$VD= 0
##$VDLIST= <DDDDDDDDDDDDDDD>
##$VPLIST= <PPPPPPPPPPPPPPP>
##$VTLIST= <TTTTTTTTTTTTTTT>
##$WBST= 1024
##$WBSW= 30
##$XGAIN= (0..3)
0 0 0 0 
##$XL= 0
##$YL= 0
##$YMAX_a= 2955351
##$YMIN_a= -2286586
##$ZGOPTNS= <>
##$ZL1= 120
##$ZL2= 120
##$ZL3= 120
##$ZL4= 120
##$ABSF1= 0
##$ABSF2= 0
##$ABSG= 0
##$ABSL= 0
##$ALPHA= 0
##$AQORDER= 0
##$ASSFAC= 0
##$ASSFACI= 0
##$ASSFACX= 0
##$ASSWID= 0
##$AUNMP= <proc_1d>
##$AZFE= 0.1
##$AZFW= 0.1
##$BCFW= 0
##$BC_mod= 2
##$BYTORDP= 0
##$COROFFS= 0
##$CY= 18.4799938201904
##$DATMOD= 1
##$DC= 0
##$DFILT= <>
##$DTYPP= 0
##$F1P= 9.9274215381318
##$F2P= -0.165520771350173
##$FCOR= 1
##$FTSIZE= 16384
##$FT_mod= 6
##$GAMMA= 0
##$GB= 0
##$INTBC= 1
##$INTSCL= 4.127829e-11
##$ISEN= 128
##$LB= 0.05
##$LEV0= 0
##$LPBIN= 0
##$MAXI= 10000
##$MC2= 0
##$MEAN= 0
##$ME_mod= 0
##$MI= 50
##$NCOEF= 0
##$NC_proc= -4
##$NLEV= 6
##$NOISF1= 3.799351
##$NOISF2= 2.8
##$NSP= 0
##$NTH_PI= 0
##$NZP= 0
##$OFFSET= 16.48848
##$PC= 4
##$PHC0= -256.1951
##$PHC1= -0.898437
##$PH_mod= 1
##$PKNL= yes
##$PPARMOD= 0
##$PSCAL= 4
##$PSIGN= 0
##$REVERSE= no
##$SF= 200.130005582386
##$SI= 16384
##$SIGF1= 3
##$SIGF2= 2
##$SINO= 400
##$SIOLD= 16384
##$SREGLST= <1H.CDCl3>
##$SSB= 0
##$STSI= 16384
##$STSR= 0
##$SW_p= 4139.07284768211
##$SYMM= 0
##$S_DEV= 0
##$TDeff= 32768
##$TDoff= 0
##$TI= <>
##$TILT= no
##$TM1= 0
##$TM2= 0
##$TOPLEV= 0
##$USERP1= <user>
##$USERP2= <user>
##$USERP3= <user>
##$USERP4= <user>
##$USERP5= <user>
##$WDW= 1
##$XDIM= 16384
##$YMAX_p= 515390852
##$YMIN_p= -1133267
$$ End of Bruker specific parameters
$$ ---------------------------------
##NTUPLES= NMR SPECTRUM
##VAR_NAME=  FREQUENCY,     SPECTRUM/REAL,   SPECTRUM/IMAG
##SYMBOL=    X,             R,               I
##VAR_TYPE=  INDEPENDENT,   DEPENDENT,       DEPENDENT
##VAR_FORM=  AFFN,          ASDF,            ASDF
##VAR_DIM=   16384,         16384,           16384
##UNITS=     HZ,            ARBITRARY UNITS, ARBITRARY UNITS
##FACTOR=    0.252644378177508, 1,           1
##FIRST=     3299.83951724647, 0,            0
##LAST=      -839.233330435636, 0,           0
##MIN=       -839.233330435636, -1133267,    0
##MAX=       3299.83951724647, 515390852,    0
$$ Real data points
##PAGE= N=1
##DATA TABLE= (X++(R..R)), XYDATA
$$ [...]
8939 14314127 14327756 14299937 14277456 14221803 14199943 14251328 14222558 14154849 14156195 14115970 14075253
8928 14075253 13982924 13880907 13797863 13735803 13670787 13538143 13528640 13431140 13377748 13340469 13243530
8917 13243530 13199801 13152883 13108515 13103102 13067962 13052643 12981439 12863428 12809075 12768979 12691100
8906 12691100 12600251 12561456 12501984 12468986 12368125 12297394 12292921 12252529 12221202 12081917 12047312
8895 12047312 12001209 11975597 11854484 11791996 11760463 11716537 11673104 11678850 11610110 11611580 11630634
8884 11630634 11575009 11444949 11413492 11270091 11221395 11134884 11053264 10962783 10956627 10878439 10807344
8873 10807344 10757251 10713600 10674829 10608865 10497839 10493269 10380537 10339148 10342120 10221534 10201643
8862 10201643 10144058 10066060 10020221 9988390 9887177 9845342 9808095 9737156 9675022 9589719 9570213
8851 9570213 9486620 9516999 9444473 9371784 9306125 9274396 9188741 9145609 9136017 9045657 8970718 8983758
8839 8983758 8921362 8840044 8762287 8767446 8691865 8634209 8592065 8560074 8529279 8399435 8402025 8331657
8827 8331657 8273872 8228980 8167132 8156283 8061729 8086542 7976466 7960529 7915268 7835869 7796227
8816 7796227 7738221 7700652 7660351 7618311 7549004 7489048 7473334 7484305 7401979 7361915 7265145
8805 7265145 7277264 7257123 7207799 7130683 7069507 7013597 6963913 6932764 6868508 6856731 6807475
8794 6807475 6741219 6686598 6667391 6609700 6609868 6512025 6459697 6439347 6371215 6397277 6320297 6267263
8782 6267263 6258529 6220404 6206481 6119758 6145785 6049945 5989929 6003438 5974411 5867711 5875762 5820813
8770 5820813 5769593 5795735 5720986 5708526 5686450 5570909 5526417 5561187 5495438 5450223 5415666
8759 5415666 5355630 5335447 5281663 5283760 5268079 5198175 5163027 5151799 5060144 5073514 5048295 4996194
8747 4996194 4932997 4962283 4942850 4894851 4835679 4847831 4833875 4811592 4738869 4698683 4666936
8736 4666936 4633835 4599791 4555019 4550923 4532546 4454717 4405118 4398466 4346406 4339081 4301977 4274873
8724 4274873 4251625 4195279 4213185 4188920 4112862 4114127 4095212 4057664 4001010 3978119 3975701 3970285
8712 3970285 3976819 3991817 3875178 3888561 3881036 3810737 3767277 3726914 3736118 3677334 3682301 3668892
8700 3668892 3630289 3619131 3573502 3538795 3506213 3505754 3462396 3496444 3446592 3440446 3415381 3421620
8688 3421620 3355985 3385063 3334502 3284990 3243975 3211061 3220523 3216954 3161232 3151373 3144669 3164766
8676 3164766 3102289 3102762 3119799 3096751 3070833 3085154 3062643 3022270 3026205 2952795 2909682 2914675
8664 2914675 2905546 2856843 2864462 2875449 2838156 2841063 2746014 2745750 2756281 2749425 2793882 2761433 2862796
8651 2862796 2876175 3016543 3001324 2888258 2840421 2724345 2652168 2603260 2600870 2483774 2458953
8640 2458953 2497016 2480108 2454038 2412604 2381101 2381211 2400941 2351195 2369979 2360777 2335599 2290319
8628 2290319 2274015 2289242 2278266 2291295 2188641 2227524 2192435 2197513 2155790 2136129 2160208
8617 2160208 2129366 2070851 2111355 2077981 2037274 2054044 2028946 2018191 2028990 1983521 2012269
8606 2012269 2003068 1973385 1972847 1908134 1935380 1975307 1910235 1938212 1927195 1877039 1870820 1853251
8594 1853251 1812520 1814601 1793080 1823747 1777323 1780707 1785932 1792206 1732748 1788330 1714423 1735185
8582 1735185 1750124 1697675 1747294 1686903 1654671 1710126 1703431 1670783 1658630 1683622 1653710 1620855
8570 1620855 1618577 1655255 1628266 1624179 1658939 1602726 1597624 1631218 1563567 1551476 1573725 1590072
8558 1590072 1573703 1589291 1573096 1530022 1543441 1580678 1566477 1539145 1571276 1564907 1560736 1488651
8546 1488651 1547884 1512639 1569966 1573339 1567464 1602958 1550408 1553328 1537243 1555862 1574468 1539771
8534 1539771 1543691 1512376 1573336 1548374 1563217 1601171 1532779 1584505 1553148 1537477 1529028 1554079
8522 1554079 1553445 1614088 1554100 1591822 1557495 1615203 1591174 1654747 1683125 1638880 1581748 1633043
8510 1633043 1617762 1654202 1661950 1620311 1623147 1606016 1611489 1653717 1594271 1602549 1666471 1655322
8498 1655322 1642965 1647614 1593005 1571822 1612895 1596800 1563191 1552110 1574484 1534025 1475805 1542363
8486 1542363 1503587 1481897 1453475 1472682 1427162 1455060 1394153 1418952 1373640 1331343 1382301
8475 1382301 1312507 1307393 1296080 1250281 1211640 1227606 1186022 1275644 1253117 1202614 1188828 1128293
8463 1128293 1082062 1084220 1073035 1046763 1015981 1018918 1019414 1056456 1016694 1018321 930412 884133
8451 884133 854268 888805 884778 911204 888970 834320 863053 829386 803388 814806 791339 736089
8439 736089 759980 708220 742625 721226 670868 659536 660321 676764 651337 621679 670061 593850
8427 593850 637586 612957 563154 617340 618572 611509 612174 562614 529508 625948 583680 526328
8415 526328 554092 579480 546284 474364 527254 538332 511888 491412 508642 439019 431872 452335
8403 452335 428578 428571 388370 364036 400026 386694 376026 355051 356326 334520 337062 314629 324713
8390 324713 285569 250243 260172 247711 246926 287992 259397 260337 254122 271844 250708 205040 255548
8377 255548 235023 170122 252827 183602 186104 212037 229587 200805 153429 136282 169855 125681
8365 125681 147308 177503 99936 143836 157934 121001 101687 121970 104894 105794 126724 91233
8353 91233 87706 145542 108706 119920 56236 41819 27497 55115 30393 60141 89667 31578
8341 31578 57642 699 10175 24258 5675 13313 61766 25852 17606 -27907 4688 -17276
8329 -17276 -8270 44037 -4302 -6968 -8001 -22221 8129 -2649 -9224 -14033 -6843 -28200 -21797
8316 -21797 -45001 -50668 -4194 -31820 -29371 -74766 -39777 -2300 -60568 -81638 -104924 -30446
8304 -30446 -70007 -95605 -85073 -98483 -129658 -79717 -145637 -132631 -99928 -95486 -137097 -110069
8292 -110069 -140059 -152887 -142759 -118553 -122892 -162112 -113581 -141227 -99444 -185711 -151880 -144753
8280 -144753 -176873 -147646 -175412 -155287 -134560 -137215 -187160 -169219 -154565 -212442 -192601 -187201
8268 -187201 -177874 -167866 -218663 -198635 -184971 -198046 -182946 -233625 -231533 -169588 -187544 -189276
8256 -189276 -203401 -221537 -207157 -210869 -214616 -229675 -247898 -213191 -226826 -276936 -188663 -189623
8244 -189623 -214288 -238016 -221845 -203722 -211663 -232364 -219655 -238427 -233096 -233917 -247541 -278613
8232 -278613 -250226 -219645 -263369 -304745 -255320 -224465 -237755 -251136 -216728 -256702 -234612 -251758
8220 -251758 -178765 -254749 -252250 -237866 -289235 -209654 -244296 -233967 -209225 -235500 -170208 -212808
8208 -212808 -214426 -250850 -250574 -209987 -204660 -234272 -184122 -257038 -261354 -265831 -240427 -262951 -297456
8195 -297456 -256445 -266375 -250403 -384287 -251504 -324806 -243195 -333143 -295971 -264907 -239002
8184 -239002 -252196 -267935 -190055 -214436 -173588 -163916 -247764 -195997 -153863 -193908 -179075 -146703
8172 -146703 -178992 -160221 -167370 -166735 -96988 -84327 -158863 -127881 -93276 -35457 1482 -8360
8160 -8360 13147 28513 105803 118568 145680 175228 231448 303750 352017 397897 374745 462835
8148 462835 498926 544524 586930 564272 615160 601318 569359 615443 588872 496940 439247 417626
8136 417626 358579 323541 306941 210430 233039 136086 105024 40537 38257 -21264 -13838 -38117
8124 -38117 -96104 -44183 -120955 -119921 -146003 -181992 -180568 -185811 -232286 -250874 -257601 -319371 -250823
8111 -250823 -306001 -289361 -304881 -305397 -301958 -289562 -281439 -272926 -319662 -269128 -293563 -338655 -357764
8098 -357764 -330759 -339081 -341348 -359028 -367498 -366463 -382362 -392310 -367925 -374577 -384514 -413353 -410404
8085 -410404 -406000 -407765 -400202 -422168 -419486 -401179 -419343 -401635 -469744 -414402 -451280 -454841 -447822
8072 -447822 -416038 -472150 -443557 -451284 -505237 -446209 -441067 -460185 -427461 -475822 -441997 -513542
8060 -513542 -468001 -494007 -489961 -536185 -514394 -530148 -476638 -450752 -513637 -488107 -526252 -527385
8048 -527385 -523249 -505317 -526210 -534253 -526009 -578943 -561583 -531726 -547631 -445833 -521369 -502919
8036 -502919 -564789 -535412 -522451 -538475 -501848 -533707 -537335 -513239 -555536 -520902 -561569 -542137
8024 -542137 -580251 -538767 -533119 -546859 -550535 -566535 -556363 -549051 -556492 -606122 -583473 -547924
8012 -547924 -613944 -553094 -555750 -631047 -563139 -590364 -553805 -591234 -560324 -567753 -561649 -592782
8000 -592782 -637616 -635660 -582147 -574360 -598121 -557211 -542904 -591932 -604499 -611319 -588185 -578212
7988 -578212 -572241 -571773 -616110 -607198 -601450 -636097 -600416 -588923 -638872 -630948 -597759 -560417 -584497
7975 -584497 -595664 -569032 -624641 -604255 -611896 -625004 -618486 -595353 -596574 -626829 -570962 -561184
7963 -561184 -593750 -606432 -605296 -633749 -611076 -614502 -591163 -625668 -612263 -642802 -631847 -583323
7951 -583323 -615057 -635377 -602451 -661134 -660807 -659222 -678153 -656743 -646898 -646497 -642179 -595332 -615511
7938 -615511 -596884 -620346 -613422 -632864 -611937 -636707 -628793 -638848 -654663 -644389 -632187 -613836
7926 -613836 -611819 -635631 -610576 -681718 -691965 -672492 -689238 -661828 -648343 -688349 -666372 -683826
7914 -683826 -678042 -635473 -615936 -695422 -696630 -700157 -717352 -726868 -664677 -700305 -683900 -714350
7902 -714350 -647307 -633358 -731007 -710047 -660954 -703639 -684268 -661525 -713911 -675971 -674245 -706888
7890 -706888 -640287 -627668 -647014 -663126 -689740 -673550 -685525 -693309 -673898 -678700 -704181 -695012
7878 -695012 -695348 -669632 -711755 -746607 -717411 -719251 -698808 -717186 -694991 -733714 -712650 -706310
7866 -706310 -708773 -719738 -708856 -684488 -702204 -674496 -644120 -646043 -642983 -650517 -702424 -694536 -755350
7853 -755350 -741534 -715233 -733023 -755282 -756336 -741852 -719662 -748146 -671789 -726721 -711320 -732072
7841 -732072 -699898 -751903 -712539 -719656 -708741 -715580 -752197 -794097 -768056 -761291 -735826 -762276
7829 -762276 -747833 -745213 -749005 -755538 -807803 -728830 -813187 -730528 -720069 -706705 -651394 -737443
7817 -737443 -677312 -699203 -723226 -738705 -726315 -748554 -755492 -757436 -753350 -764059 -766223 -787781
7805 -787781 -724080 -748518 -765715 -765261 -748058 -748787 -755942 -735809 -768282 -750714 -752886 -679500 -775731
7792 -775731 -732403 -723168 -783039 -706818 -753890 -804143 -759919 -735448 -739690 -779131 -751593 -742481
7780 -742481 -786064 -772131 -813619 -801572 -800499 -820602 -812322 -789739 -735497 -800704 -788785 -726532
7768 -726532 -775843 -739253 -784120 -786839 -841569 -716115 -785688 -766209 -788275 -783583 -776506 -806792
7756 -806792 -784708 -819071 -783353 -753543 -802606 -806781 -739581 -803788 -735438 -784520 -784249 -796368
7744 -796368 -755821 -786468 -773778 -821780 -775063 -779952 -794932 -771637 -783681 -818729 -826633 -822807
7732 -822807 -762684 -802002 -802827 -779846 -819656 -771263 -795842 -830096 -804789 -864108 -860400 -780573
7720 -780573 -776731 -737540 -742866 -743060 -764432 -713811 -705775 -734741 -669377 -715202 -729083 -734816 -753120
7707 -753120 -781540 -793246 -768729 -814303 -849538 -780091 -791618 -855533 -820809 -797948 -840769 -848490
7695 -848490 -782496 -807764 -814367 -795344 -803004 -801838 -839679 -854910 -796009 -823244 -793347 -841703
7683 -841703 -825054 -800321 -827313 -819228 -828355 -824918 -845165 -833405 -803158 -865068 -797639 -805686
7671 -805686 -834530 -815510 -798699 -847292 -826517 -771193 -781409 -767113 -851931 -783241 -777162 -787001
7659 -787001 -842177 -804209 -835340 -815374 -842854 -810380 -826783 -820593 -845329 -821704 -819410 -813280
7647 -813280 -793469 -776202 -856903 -835792 -860204 -845135 -848031 -822290 -777700 -812088 -779079 -814081
7635 -814081 -821383 -811487 -830644 -822748 -816705 -856334 -843525 -840448 -835851 -861372 -889411 -832940 -861667
7622 -861667 -836428 -829504 -876465 -875841 -851819 -848195 -826431 -820665 -775225 -866888 -811747 -798969 -865174
7609 -865174 -814151 -874057 -839999 -831783 -867105 -784961 -813904 -802979 -860930 -835185 -834094 -826533
7597 -826533 -801536 -843869 -778185 -820821 -807927 -876998 -811255 -816902 -830234 -808355 -836071 -784969
7585 -784969 -814930 -787517 -828158 -797940 -804482 -831706 -798631 -807102 -828517 -885424 -818744 -811638
7573 -811638 -776016 -837725 -830702 -801697 -813160 -766482 -813703 -776486 -752866 -770224 -801037 -755484
7561 -755484 -763751 -811402 -773079 -763479 -742345 -792663 -797200 -746317 -782137 -793474 -723870 -787284
7549 -787284 -765855 -719831 -731112 -753738 -704812 -744407 -736950 -753447 -703046 -688757 -667304 -693935
7537 -693935 -678773 -679377 -688869 -714008 -699854 -753182 -700103 -690858 -657010 -653863 -615668 -594085 -650375
7524 -650375 -630716 -586580 -586441 -552171 -479552 -525358 -493238 -486473 -490403 -478895 -502075 -508392 -573464
7511 -573464 -534824 -521869 -557406 -601631 -527249 -517549 -512046 -432630 -438372 -394639 -424613 -438825
7499 -438825 -405956 -455129 -461176 -528643 -518790 -524889 -540763 -561957 -577139 -576881 -641608 -593986 -643046
7486 -643046 -636626 -638589 -658145 -632575 -642898 -591947 -602589 -619891 -614859 -631357 -646251 -649416
7474 -649416 -714700 -665275 -698335 -648072 -683068 -753255 -716140 -724558 -728348 -771961 -706764 -711413
7462 -711413 -710697 -693104 -693807 -695763 -682392 -717576 -745111 -731180 -742323 -714708 -701723 -693180 -675575
7449 -675575 -759486 -700840 -697808 -672391 -723826 -654682 -643770 -610985 -580418 -565072 -520787 -523304
7437 -523304 -553340 -598267 -638188 -598088 -633699 -730821 -669404 -692645 -647458 -691098 -713885 -692399
7425 -692399 -749593 -750390 -709334 -760562 -735084 -722547 -747130 -762446 -783344 -802073 -780613 -766708
7413 -766708 -804065 -833323 -831671 -839873 -804324 -819745 -872831 -866229 -815161 -818236 -806647 -783569
7401 -783569 -808004 -834168 -840800 -807800 -810901 -889229 -834716 -920044 -813552 -898244 -844587 -838635
7389 -838635 -849879 -836623 -837933 -827200 -833241 -874956 -850469 -819608 -824812 -896078 -815823 -872150
7377 -872150 -837865 -868562 -849371 -782829 -845290 -865961 -827721 -836621 -773474 -839632 -810500 -821185
7365 -821185 -828321 -811517 -813663 -825522 -813261 -775410 -801441 -788019 -787757 -789467 -771042 -790947 -800200
7352 -800200 -802629 -791248 -744511 -753542 -764255 -729762 -741726 -753272 -743434 -743301 -742909 -712693 -701877
7339 -701877 -765949 -734307 -751481 -756433 -693045 -752521 -794437 -730237 -728374 -752081 -712989 -745423
7327 -745423 -712489 -718588 -694670 -723265 -694166 -703486 -702496 -743880 -705612 -705629 -696839 -696366 -695656 -727871
7313 -727871 -699111 -721849 -717724 -742567 -764995 -725935 -704731 -689480 -755482 -675623 -691993 -713763
7301 -713763 -682000 -712093 -729584 -717751 -788233 -680237 -711180 -718334 -724024 -745540 -723437 -697906
7289 -697906 -763080 -748116 -705260 -778263 -796633 -813895 -745876 -756362 -714965 -740043 -743397 -782934
7277 -782934 -794599 -777831 -764904 -834202 -753866 -797821 -798533 -820742 -785628 -764234 -798214 -738060
7265 -738060 -797523 -806908 -785127 -844471 -767835 -791102 -765945 -765968 -767904 -734128 -732112 -798558 -696538
7252 -696538 -651207 -733607 -719805 -718075 -695939 -731623 -796793 -808002 -811099 -800017 -831351 -842894
7240 -842894 -799418 -838352 -799348 -805973 -824381 -870658 -799761 -859971 -835754 -849726 -835590 -821338
7228 -821338 -831053 -819395 -833177 -816978 -794056 -831103 -796075 -810639 -840962 -841991 -826470 -821375
7216 -821375 -842748 -825172 -863917 -792288 -863700 -816766 -811098 -788375 -787737 -790698 -780792 -791375 -722640
7203 -722640 -768618 -703853 -709400 -677842 -648947 -630988 -609704 -562911 -554791 -514104 -442675 -366715
7191 -366715 -320106 -246466 -146923 -143623 -80826 -36138 -23521 -61635 -100994 -108206 -195617 -216749
7179 -216749 -314460 -375098 -359633 -408948 -439224 -461493 -410860 -395402 -425485 -424431 -441929 -447901
7167 -447901 -473020 -480417 -525461 -479122 -431135 -456606 -497981 -508218 -492166 -450578 -494439 -470453
7155 -470453 -508590 -511029 -519881 -504854 -428466 -489219 -461478 -487119 -517172 -518014 -477449 -464820
7143 -464820 -476938 -452058 -431286 -494495 -505648 -518111 -484112 -527125 -582119 -536693 -589106 -600346
7131 -600346 -607909 -586729 -547388 -566495 -569297 -629663 -648021 -673581 -696780 -711862 -673330 -682485
7119 -682485 -705010 -727450 -739511 -710502 -702262 -750753 -746870 -733020 -748603 -706438 -825078 -816243
7107 -816243 -816586 -775151 -792110 -801076 -791113 -796356 -854714 -809112 -807991 -838937 -865920 -809047 -791955
7094 -791955 -829254 -852412 -812030 -814324 -765799 -789687 -800972 -840360 -788014 -830966 -778178 -751648
7082 -751648 -789448 -816148 -798500 -815877 -820826 -857620 -839819 -818743 -851534 -788888 -747201 -774709
7070 -774709 -761514 -764435 -758471 -722782 -777802 -756152 -783969 -794377 -807271 -791888 -805290 -809467
7058 -809467 -765873 -755402 -730314 -732710 -735078 -734144 -684679 -696230 -681540 -659647 -674931 -618628
7046 -618628 -697616 -622185 -621719 -638309 -605477 -615954 -569735 -586405 -599610 -522533 -555114 -575576
7034 -575576 -547776 -580993 -540175 -557487 -569937 -613871 -566853 -591760 -529510 -595188 -576249 -625830
7022 -625830 -576738 -603147 -595486 -547834 -556300 -516429 -553481 -595973 -557499 -520373 -580448 -616350
7010 -616350 -590813 -565130 -579622 -589068 -561899 -577180 -599542 -564407 -531134 -545102 -552360 -540154
6998 -540154 -472768 -498419 -470368 -457408 -429939 -400970 -448318 -447301 -447456 -370105 -323503 -349262
6986 -349262 -238154 -256765 -221697 -191138 -172716 -184749 -142291 -188760 -152345 -159935 -163248 -161626
6974 -161626 -188629 -267967 -197159 -258549 -237302 -299912 -293170 -264839 -321906 -357639 -376165 -355521
6962 -355521 -291916 -260306 -309955 -327269 -326824 -275318 -292087 -303061 -237044 -196882 -208119 -234377
6950 -234377 -122837 -131530 -128340 -156589 -101262 -121008 -96491 -85409 -85803 -11089 -26403 -57063
6938 -57063 -83 13994 26323 29646 55895 74910 104642 91252 149500 221974 235986 310314
6926 310314 241253 332279 349090 412962 472241 516472 616939 738225 842762 937947 1071131
6915 1071131 1244218 1423689 1711406 2045000 2527533 3092945 3963266 5245108 6676245
6906 6676245 7769080 8147580 7885262 7040403 6123428 5210822 4472205 3866638 3467290
6897 3467290 3107120 2946269 2791338 2737956 2852044 2936842 3041959 3246841 3503515 3774530
6887 3774530 4224588 4700557 5345060 6177738 7279878 9042769 11670404 15816238 21099495
6878 21099495 25476869 27015557 25671157 22569051 18861807 15636986 13064361 11329476
6870 11329476 10507195 10310478 10296575 10237869 9874164 9068278 8204765 7482668 6883365 6550520
6860 6550520 6440153 6466261 6710503 7073775 7675027 8534216 9960572 12295582 16135786
6851 16135786 21347928 25936650 27982285 26915809 23730986 19911721 16297107 13307948
6843 13307948 11040639 9395551 8233147 7618152 7492251 7674043 8269543 9437150 10876735
6834 10876735 11908861 11964772 11333980 10303624 9588780 9183364 8921334 8890613 8845214 9017251
6824 9017251 9541937 10305689 11009453 11191407 10592812 9476155 8159105 6910620 5777668
6815 5777668 4876959 4174331 3640369 3261029 3018703 2866204 2699161 2652393 2647668 2644654
6805 2644654 2751165 2824597 3042108 3275853 3904486 4889415 6218863 7294477 7626587
6796 7626587 7334413 6361463 5243445 4189023 3354888 2661365 2235490 1791102 1571482
6787 1571482 1417517 1243114 1112296 1136561 1070570 1013681 1041240 1057751 1119438 1146305 1242611
6776 1242611 1230947 1266282 1250645 1190981 1105527 1121765 993058 1000427 967224 803824 756803
6765 756803 697352 602431 567545 502315 466863 516226 440357 438991 376523 411326 434138 375893
6753 375893 436142 429700 450397 493878 485339 475034 554177 542752 590787 618313 631618 660738
6741 660738 645599 605113 507552 475429 434657 397057 433650 423787 398413 415507 354639 420289
6729 420289 305049 356567 411600 491565 527707 550101 619005 705126 952122 1261334 1540300
6718 1540300 1745714 1756455 1572089 1344872 1075781 953815 844614 711046 698665 590921
6708 590921 650290 608305 594774 600000 626334 671605 785709 814383 811208 886232 865172 869204
6696 869204 893471 928875 1037328 1289800 1613981 1942353 2194924 2494300 2686034 2661859
6686 2661859 2517087 2260242 2059717 1899865 1980850 1999917 1993188 1846777 1730962 1665329
6676 1665329 1648114 1639604 1617870 1568604 1600632 1476037 1485299 1516764 1482736 1465677 1520665 1580181
6664 1580181 1615275 1722739 1769047 1817532 1925209 2058884 2428696 2778499 3353895 3745233
6654 3745233 3911035 3894561 3730161 3548527 3434073 3439521 3469290 3649550 3906555 4396060
6644 4396060 5218653 6317290 7180025 7497848 7276790 6789757 6108414 5496541 5002145
6635 5002145 4609288 4349673 4137445 4038775 3999623 3977978 3991596 4067418 4173144 4297637
6625 4297637 4473606 4646013 4907112 5267588 5668095 6117157 6739176 7612870 9187187
6616 9187187 11780429 15427853 18748985 20077008 19298085 17159225 14625103 12263287
6608 12263287 10353877 8911532 7769556 7003255 6377935 6049617 5806850 5663912 5573951
6599 5573951 5533985 5596907 5661529 5786089 5981164 6242308 6555263 7025989 7660303 8500727
6589 8500727 9948276 12378097 15955269 19414663 21190379 20645771 18533042 15958053
6581 15958053 13420519 11387141 9790779 8629348 7713129 7178613 6922132 6756059 6834260
6572 6834260 7265536 7922177 8382612 8316240 8006516 7636179 7334610 7215282 7213851 7218955
6562 7218955 7285952 7544440 8094954 8895754 9806072 10297487 10223159 9605631 8852165 8122126
6552 8122126 7470536 7063292 6715145 6569524 6446109 6568691 6772514 7461868 9105309
6543 9105309 11407715 13391157 13971470 13228010 11908110 10755947 10184505 9923798 9622657
6534 9622657 9030103 8305242 7621849 7088946 6720830 6510225 6440064 6397454 6419599 6538602
6524 6538602 6606302 6708062 6819594 6907166 7022681 7152162 7447021 8092201 9540089 11896189
6514 11896189 14194492 15308497 15023160 13937101 12775733 12099743 11749132 11347875 10760367
6505 10760367 9839069 9179592 8566511 8085359 7884649 7756480 7748643 7738576 7785980 7787514
6495 7787514 7759937 7696845 7683612 7652596 7669247 7758843 7940965 8442323 9186261 10112874 10805385
6484 10805385 10916618 10868822 10754098 10668439 10577262 10463777 10186090 9886353 9647002 9523363
6474 9523363 9436802 9432620 9493289 9466370 9530567 9608149 9665699 9751946 9845053 9913778 10063726
6463 10063726 10147887 10253387 10377375 10502567 10669258 10804818 10942893 11231562 11459526 11703674
6453 11703674 11903797 12127930 12286807 12513696 12648690 12865132 13064805 13308559 13551670
6444 13551670 13772233 13958334 14227302 14482094 14750964 14955298 15252973 15532993 15880455
6435 15880455 16112962 16464487 16807410 17141500 17562863 17962946 18393173 18804134 19411339
6426 19411339 20077345 20700843 21279505 21642540 21951408 22157790 22338303 22678455 22938333
6417 22938333 23312070 23799832 24275740 24873824 25437025 26095025 26801367 27372014 28054327
6408 28054327 28825977 29620478 30437959 31299538 32285372 33158789 34095146 35089817 36097578
6399 36097578 37252440 38496753 39832408 41233830 42752303 44416426 46215008 48084988
6391 48084988 50127547 52383666 54748869 57358903 60112381 63106016 66268564 69690702
6383 69690702 73378976 77343598 81497107 86022257 90839550 95998448 101476568 107301979
6375 107301979 113354590 119601375 126090049 132551959 138984686 145154748 151006152 156271484
6367 156271484 160696767 164335537 166950769 168568448 169223488 168900705 167770340 166012242
6359 166012242 163733641 161160133 158529661 155975914 153600002 151281191 149251656 147258831
6351 147258831 145359557 143373992 141210544 138964794 136438315 133797696 131038992 128042600
6343 128042600 124858129 121535004 118081002 114530595 110890314 107127662 103445233 99682584
6335 99682584 96031730 92547909 89588587 87190131 85246960 83401143 81380677 78898251
6327 78898251 76100203 73210104 70198220 67316031 64394342 61480715 58621008 55821586
6319 55821586 53147986 50693464 48322571 46167464 44175203 42273534 40748529 39302868
6311 39302868 37971388 36870009 35964611 35187326 34393455 33799474 33305081 33015368 32856372
6302 32856372 32711314 32677007 32589105 32351992 31996651 31858890 32145349 32850996 33653211 34041081
6292 34041081 33565699 32583997 31226778 29818933 28492390 27370044 26494858 25807569 25304264
6283 25304264 24894957 24598020 24247623 23872680 23490599 23067367 22702613 22399795 22272602
6274 22272602 22230802 22319188 22394821 22499814 22505299 22532161 22486154 22455320 22483062 22642982 23138984
6263 23138984 23974626 25045351 26055927 26712217 26759793 26235934 25347219 24377537 23481117
6254 23481117 22892313 22563187 22550688 22677847 22763442 22812277 22677713 22350232 22029578 21670547
6244 21670547 21279962 21023268 20669421 20473363 20304549 20197884 20176871 20236276 20365257 20685418
6234 20685418 21085035 21557541 22133233 22787802 23379156 23853291 24185382 24342249 24373044 24150541
6224 24150541 23951981 23524489 23248730 22976735 22799500 22630169 22584600 22539405 22622728 22751968
6214 22751968 22938255 23098026 23363945 23595849 23930170 24214382 24462030 24592910 24679179 24636284
6204 24636284 24550704 24446136 24302261 24189081 24124694 24077874 24066577 24102810 24067232 24081702 24098250
6193 24098250 24176414 24264076 24257678 24334963 24429550 24485943 24649163 24716395 24872381 25015091 25161731
6182 25161731 25257087 25406300 25571347 25695376 25850719 25951666 26080846 26195828 26286298 26317357
6172 26317357 26457772 26681974 26864969 26968600 27058920 27087852 27216609 27200568 27162153 27207479
6162 27207479 27278545 27373933 27588287 27746046 27711487 27548902 27347242 26912706 26608687 26156081
6152 26156081 25812743 25386009 25007111 24559359 24146882 23867965 23586485 23356643 23107220
6143 23107220 22928751 22867929 22869994 23045936 23278111 23690038 23800559 23693936 23508353 23330691
6133 23330691 23244093 23054480 22930239 22776434 22466786 22161500 21864586 21579494 21285256 21046393
6123 21046393 20854268 20699175 20529237 20352062 20291742 20156083 20117946 20060464 20001695 20040945
6113 20040945 20147988 20378745 20480696 20468545 20410661 20342356 20410984 20513056 20556627 20427972
6103 20427972 20199810 19934996 19569938 19115845 18692328 18238753 17965834 17766980 17685660 17604767
6093 17604767 17489692 17385917 17199520 17020965 16886301 16773676 16692465 16641935 16613833 16590783
6083 16590783 16497036 16468010 16440370 16536459 16733843 17038739 17449420 18015981 18608818 19165069
6073 19165069 19358825 19289432 19019923 18679207 18393217 18273456 18317372 18454688 18681340 18929684
6063 18929684 19124517 19095613 19080434 18977278 18811519 18671823 18534805 18432636 18407342 18407872
6053 18407872 18398577 18319336 18284200 18109380 18036220 17980315 17928131 18029492 18119068 18220378 18295715
6042 18295715 18311286 18364612 18287898 18226202 18212448 18204609 18330889 18580070 18898322 19210857 19600386
6031 19600386 20007108 20495975 21079449 21827206 22595947 23392189 24211376 25044656 25853587
6022 25853587 26563014 27214240 27854668 28398247 29024280 29617930 30347119 31116613 32111476
6013 32111476 33175661 34516064 36046659 37747225 39683608 41916608 44489889 47460622
6005 47460622 50979060 55165139 59854509 65293752 71481710 78757582 87332605 97564500
5997 97564500 109837990 124642883 142450276 164546726 192593796 229600288 278939642
5990 278939642 344274121 421565724 486764152 515390852 500569746 455447253 395638271
5983 395638271 334335933 279128949 232187424 193952351 163530084 139727392 120997765
5976 120997765 105997636 93909784 84237140 76482473 70049790 64794540 60244590 56292305
5968 56292305 52802466 49757339 46944655 44456317 42216071 40233497 38456837 36739594
5960 36739594 35228572 33739557 32344340 31054973 29877320 28725460 27593540 26607234
5952 26607234 25672164 24896849 24173828 23377600 22715293 22108451 21454516 20882027 20353545
5943 20353545 19805345 19331953 18886241 18372644 17939533 17542025 17139192 16754589 16407188
5934 16407188 16047656 15721628 15364751 15015162 14881935 14768341 14928169 15137452 15142450 14887076
5924 14887076 14522513 14066828 13594570 13189807 12765407 12397406 12079902 11803777 11530711
5915 11530711 11308233 11096315 10871465 10653475 10506786 10355775 10197501 10054578 9924981
5906 9924981 9761365 9627322 9448984 9254008 9027409 8820257 8598564 8456320 8310518 8110711
5896 8110711 8013195 7879504 7828745 7816415 7756713 7710971 7680427 7601337 7637411 7630175 7591075
5885 7591075 7574427 7591138 7664489 7773593 7908283 8008156 8147471 8111774 8053991 7895953 7795618
5874 7795618 7619249 7565254 7472108 7503392 7425555 7487629 7472529 7511193 7530436 7579812 7571420
5863 7571420 7636667 7633336 7715389 7854788 7906619 7971348 8007732 7957647 7898424 7764082 7657938
5852 7657938 7674606 7573214 7524489 7570582 7600782 7640048 7694686 7714009 7809775 7823257 7882366
5841 7882366 7994285 8076274 8170180 8255518 8311762 8371909 8390616 8473609 8583538 8827438 9048558
5830 9048558 9320051 9541216 9885910 10273554 10650630 11180116 11853315 12520982 13256024 14183511
5820 14183511 15636985 18826872 25833045 36492283 46166614 50423970 48738949 43373886
5812 43373886 36672012 30233317 25036404 21052538 18074810 16009423 14683709 13719306
5804 13719306 13043544 12566156 12228388 12023479 11877034 11842124 11782987 11777486 11797978 11796408 11800847
5793 11800847 11811145 11875701 11950533 11947414 11925047 12028570 12060033 12123017 12215032 12317645 12414224
5782 12414224 12437594 12579907 12730085 12820500 12939948 13058288 13197982 13383502 13559266 13735297
5772 13735297 13888516 14071502 14258283 14438027 14576888 14724446 14920689 15107324 15300600
5763 15300600 15473189 15748071 15941376 16227472 16442801 16703968 16970423 17293831 17649753
5754 17649753 17943409 18328261 18740649 19132139 19518324 20028388 20482251 20946790 21544245
5745 21544245 22111376 22783804 23588117 24374908 25372121 26624542 28306801 30458894 32610829
5736 32610829 34303539 35267544 35875806 36444795 37123760 38068600 39241060 40555527 41802029
5727 41802029 42998956 44146698 45036003 45788733 46531229 47131716 47884683 48821923 49992415
5718 49992415 51422381 52736098 53919196 54921625 55855880 56842653 58089807 59752629
5710 59752629 61915449 64069394 65243582 65128911 64017698 62443408 60984248 59622403
5702 59622403 58449333 57350724 56301369 55245643 54270009 53323854 52499725 51832487 51322826
5693 51322826 50915634 50676685 50482755 50317241 50097520 49753284 49185295 48474886 47646673
5684 47646673 46601255 45680501 44766789 43984644 43275549 42635383 41786520 40846364 39821144
5675 39821144 38856323 37992486 37344229 36769994 36287339 35916473 35711496 35504923 35369335
5666 35369335 35256455 35221645 35122977 35059024 35072476 35065991 35068311 34987647 35036277 35002071 35076414
5655 35076414 35209987 35424793 35638759 35973183 36326066 36665768 37096338 37575645 38048051
5646 38048051 38589011 39359010 40221855 41088030 42022905 43009824 43973492 44848535 45591468
5637 45591468 46228759 46775001 47166231 47406992 47586901 47745146 47909109 48199121 48578543
5628 48578543 49083620 49698947 50534680 51406137 52422357 53643395 55096265 56761742 58572658
5619 58572658 60660806 62970982 65661152 68844025 72579240 76700615 80227893 82856205
5611 82856205 84189613 84628452 84573610 84271535 83800627 83108139 82387595 81526700 80751563
5602 80751563 80109459 79674364 79509186 79619391 80154744 81173718 82631375 84718403 87076325
5593 87076325 89485349 91789653 93814516 95597059 97266268 98922313 100600981 102162314
5585 102162314 103687401 104963007 105978777 106688601 107029367 107123876 107011040 106683832 106288136
5576 106288136 105878032 105557783 105553960 105756558 106360746 107002370 107423750 107315464 107103001 106904316
5566 106904316 106921596 107251027 107792141 108583080 109612241 110725242 111809778 112675137 113270561
5557 113270561 113598494 113792518 114129530 115501715 118555000 121318612 122330028 121187131
5549 121187131 119347883 117433525 115941032 114849476 114084494 113669000 113404323 113440842 113608688
5540 113608688 113961348 114392101 114966510 115626575 116397677 117161450 117968758 118809091 119633824
5531 119633824 120558248 121517181 122540259 123634755 124819038 126204887 127782058 129468463
5523 129468463 131251185 133017911 134623531 135998183 136938194 137492004 137610486 137370897 136909459
5514 136909459 136320992 135765818 135392518 135277127 135528227 136160717 137156330 138481556 140158362
5505 140158362 141973763 143833146 145606643 147073456 148233709 148829153 148892814 148357465 147229644
5496 147229644 145620027 143489272 140980467 138160847 135000178 131740825 128339527 124825106
5488 124825106 121305595 117893199 114733045 111682509 108978227 106606246 104449972 102605339
5480 102605339 100960406 99541284 98129194 96699388 95234478 93648522 91890126 89942922
5472 89942922 87795935 85435145 83008826 80428556 77765598 75192751 72524136 69955707
5464 69955707 67509569 65191873 63129090 61115711 59343964 57690151 56164887 54750949
5456 54750949 53551064 52574682 51686813 50930747 50288133 49785207 49284757 48873851 48542515
5447 48542515 48220042 48004250 47801384 47709932 47586720 47558003 47613690 47728442 47875915 48110525
5437 48110525 48504940 48859676 49347413 49812010 50269664 50779411 51312973 51986444 52777430
5428 52777430 53553779 54411924 55402955 56455878 57539137 58852329 60238222 61794765 63561159
5419 63561159 65554898 67745979 70324016 73152005 76346960 80111140 84513392 89743203
5411 89743203 96031467 103725071 113288915 125157722 139419721 155351552 170863346 182777239
5403 182777239 188444787 186934301 179391917 167900423 154817966 141916701 130114410
5396 130114410 120038990 111641806 104798735 99213326 94659121 91047604 87990277 85468416
5388 85468416 83380835 81699350 80235610 79001610 77962384 77141384 76465142 76092780 75866806
5379 75866806 75862291 76227398 76731987 77467897 78396791 79555723 80971263 82600804 84479316
5370 84479316 86595165 88912492 91717851 95755268 102049975 111319964 123437379 136830519
5362 136830519 148713551 155825468 156312798 150249855 139242075 126241198 113503332 102496282
5354 102496282 93833220 87355727 82702362 79299704 76870098 75024575 73583394 72332110
5346 72332110 71206392 70106174 68998406 67861024 66637000 65377347 64058285 62837840
5338 62837840 61658584 60472332 59342954 58341504 57384221 56511920 55777435 55077243 54505150
5329 54505150 53909669 53435059 52935514 52522057 52106443 51673250 51217474 50717295 50239558
5320 50239558 49734826 49238438 48710984 48262786 47815638 47403596 47051150 46626937 46317197
5311 46317197 45975238 45675377 45492068 45284486 45053614 44821647 44647185 44440937 44282032
5302 44282032 44075652 43883147 43764875 43536091 43363547 43110569 42934965 42695915 42478317
5293 42478317 42298734 42031190 41764616 41518950 41224208 40925430 40678041 40286723 40031872
5284 40031872 39690137 39348386 38947271 38587903 38191425 37835401 37436396 37065596 36605085
5275 36605085 36148679 35657583 35169353 34643246 34195012 33704347 33215001 32759737 32293535
5266 32293535 31826492 31356500 30900087 30486631 30049952 29635042 29278465 28887686 28563760
5257 28563760 28300737 28017020 27802962 27505879 27248436 26877268 26480769 26024397 25501244
5248 25501244 25016484 24656067 24386925 24243448 24157858 23928433 23661494 23238749 22778281 22260994
5238 22260994 21835046 21406420 21086556 20771935 20547581 20265423 20064218 19810521 19507967
5229 19507967 19380721 19330184 19371953 19911749 20850215 21592145 21781149 21249512 20401348 19487394
5219 19487394 18755013 18141914 17642280 17262595 16888007 16639883 16503862 16397122 16414809 16476489
5209 16476489 16517064 16346954 16143499 15852342 15495103 15216013 15113825 15187113 15402342 15603809
5199 15603809 15705832 15562458 15210658 14729339 14287559 13945059 13717146 13526676 13432720 13326947
5189 13326947 13278776 13243861 13191489 13050537 12922743 12621737 12340995 12208616 12000467 11838118
5179 11838118 11649170 11487187 11313079 11145310 11041068 10928091 10819971 10643144 10556944 10467233
5169 10467233 10431233 10395144 10514160 10631254 10641459 10527268 10328887 10022096 9793501 9538355
5159 9538355 9354625 9251336 9207173 9272836 9305269 9353241 9385011 9421102 9457467 9462106 9477254
5148 9477254 9606012 9632041 9637503 9652106 9658776 9576625 9485478 9574489 9690428 9663618 9591028
5137 9591028 9331435 9138144 8919396 8743489 8773579 8955513 9203740 9708938 9960487 9928132
5127 9928132 9595036 9230348 8869736 8527015 8288503 8165010 8050575 7996849 7888872 7858345
5117 7858345 7833857 7833113 7851545 7832853 7901892 7808550 7731839 7642703 7596531 7438991 7303798
5106 7303798 7258329 7158834 7005415 6938077 6877099 6892609 6857639 6952485 7043383 7110665 7231798
5095 7231798 7326334 7515450 7651531 7901716 7975396 7928147 7737207 7507647 7202434 6962965
5085 6962965 6788953 6691376 6613150 6513009 6468758 6484779 6505857 6495653 6451465 6453401 6418386
5074 6418386 6376914 6369952 6403344 6366682 6400601 6389741 6406382 6445286 6508543 6598371 6675047 6762247
5062 6762247 6851513 6997905 7111340 7181315 7293846 7312664 7378603 7478684 7540512 7486153 7489014
5051 7489014 7461738 7507422 7527340 7618152 7652819 7750350 7813822 7951606 8028359 8147748 8303521
5040 8303521 8414807 8531125 8662720 8831575 9027789 9159779 9383311 9534973 9725292 9909289
5030 9909289 10108747 10394415 10677644 11042425 11436893 11833963 12268907 12610844 13123341 13563108
5020 13563108 14080671 14738721 15491759 16454054 17479222 18713260 20044788 21503452 23048594
5011 23048594 24744260 26719094 29092438 32302880 37117240 46846373 64899187 91799890
5003 91799890 124925380 151320036 163778517 157034663 138526994 114195228 92001148
4996 92001148 75051372 66431487 70942898 79911818 83132099 75526081 65258721 54380547
4988 54380547 45395629 39315332 34874355 31999734 30039665 29169409 28827125 28533039 28404461
4979 28404461 28438805 28527294 28630423 28793951 28963459 29222632 29397841 29590042 29907739 30294684
4969 30294684 30711295 31262986 31864973 32578183 33465922 34518101 35730733 36973385 38119721
4960 38119721 38916989 39284032 39422201 39538574 39715690 40152162 40793705 41664831 42663532
4951 42663532 43680430 44819155 45830975 46755268 47572953 48167637 48631886 49072350 49507087
4942 49507087 50000931 50454629 50994192 51618845 52314753 53032235 53779507 54528296 55590108
4933 55590108 57185760 59187114 60915402 61789964 61510794 60732347 59889891 59358614 59201121
4924 59201121 59472297 60029698 60711739 61542028 62369092 63127756 63672833 64033544 64111727 64103713
4914 64103713 64010809 63914453 63840193 63907995 63980574 64031201 64131367 64194264 64286506 64276219 64005994
4903 64005994 63548065 62971592 62420793 61985339 61782902 61724676 61870460 62272747 63141515 65353638
4893 65353638 71253031 82646622 94280458 99446883 96398145 88999800 80776168 73514827
4885 73514827 68057859 64027578 60990760 58922033 57536648 56555464 55776657 54998199 54293865
4876 54293865 53583609 52701886 51878336 51041921 50178999 49345489 48540623 47829544 47149335
4867 47149335 46474547 45923498 45362920 44853108 44342313 43825814 43341020 42813051 42259691
4858 42259691 41699838 41103862 40498333 39895177 39266832 38712911 38118965 37506910 36976559
4849 36976559 36473103 35980493 35461251 35009362 34554561 34064118 33582617 33157849 32740361
4840 32740361 32376937 31935613 31606989 31266322 31031999 30752693 30476740 30265385 30105575
4831 30105575 29899017 29717657 29566263 29497569 29447232 29507617 29571333 29748729 30045414 30397634
4821 30397634 30855076 31524582 32336255 33464398 35040750 37146736 40448805 45371910 52817902
4812 52817902 62741274 72833268 79141034 79526502 74675338 66862613 58362403 50529468
4804 50529468 43827700 38484555 34316317 31174749 28724912 26895981 25391145 24218663
4796 24218663 23221767 22372901 21609788 21052064 20534164 20031337 19596374 19195615 18884574
4787 18884574 18568392 18309127 18085621 17922479 17702510 17517303 17323657 17255903 17135959 17058323
4777 17058323 17036134 17014266 17032327 17089068 17123549 17169818 17333489 17463022 17583138 17767018
4767 17767018 17937126 18083057 18296089 18499365 18663163 18917519 19228584 19464646 19758596
4758 19758596 20023011 20399772 20771295 21128890 21569099 21988132 22446146 22932266 23527048
4749 23527048 24179108 24799871 25315382 25839551 26262818 26724378 27297817 27856841 28564370
4740 28564370 29261258 30069908 30857904 31727849 32630909 33568914 34695395 35793691 37046142
4731 37046142 38304630 39604651 40723710 41975366 43182516 44389856 45671732 46980667
4723 46980667 48308460 49695424 51079278 52462304 53847294 55272192 56755076 58308123
4715 58308123 59900806 61594511 63365065 65226940 67141274 69263181 71598785 74102409
4707 74102409 76610592 79237086 81545963 83581898 85349300 86872482 88113495 89385512
4699 89385512 90602903 91887500 93201210 94458744 95766904 97123066 98395501 99554873
4691 99554873 100751763 101728566 102525932 103343683 103962902 104526956 104906467 105322731 105771509
4682 105771509 106369132 106946759 107458371 107835851 107942837 107638978 107120792 106483508 105793780
4673 105793780 105274514 104831500 104677440 104745556 105058700 105526571 106011239 106668600 107346597
4664 107346597 108084390 108670897 109272418 109838999 110276182 110709873 111098449 111582866 111939438
4655 111939438 112398373 112870321 113321807 113741771 114089989 114292103 114546022 114748891 114953282
4646 114953282 115119956 115297077 115349318 115422287 115478653 115441871 115424052 115402520 115329281 115276062 115243825
4635 115243825 115155911 115137805 115066104 114947785 114822340 114573062 114258508 113817651 113136788 112439616
4625 112439616 111543712 110520671 109425571 108162808 106850408 105483550 104026352 102497530
4617 102497530 100952461 99420176 97856577 96295076 94789344 93223418 91700898 90098690
4609 90098690 88580173 87040814 85482735 83963083 82409640 80871965 79326227 77755722
4601 77755722 76238825 74656606 73143764 71621111 70231800 68796946 67458887 66062234
4593 66062234 64647179 63292498 61928697 60530148 59023746 57575523 56114144 54632521
4585 54632521 53079519 51643879 50162208 48810121 47461935 46162609 44964951 43744728
4577 43744728 42562385 41379726 40192348 38980897 37792866 36665973 35533094 34456090
4569 34456090 33400171 32425246 31470053 30518743 29579930 28725004 27792263 26926523 26136971
4560 26136971 25331305 24649050 23896633 23214359 22565909 21863132 21298013 20630925 20044667
4551 20044667 19483313 18925644 18337350 17747807 17243893 16731609 16315679 15956101 15556864
4542 15556864 15243141 14901869 14569309 14272691 13975994 13684001 13359280 13045454 12732360
4533 12732360 12437082 12046709 11712951 11488098 11186750 10934396 10704312 10558061 10314810
4524 10314810 10180758 10073203 9882541 9744347 9600861 9449167 9369657 9315697 9242808 9167180
4514 9167180 9098713 8999320 9002697 9072372 9195805 9373616 9474355 9488037 9355577 9137348 8862837
4503 8862837 8583302 8326214 8099203 7889375 7779030 7600949 7498697 7442881 7347170 7287140
4493 7287140 7243389 7206730 7154740 7131560 7101388 7044450 7023535 6992425 6992232 6918959 6930406 6938534
4481 6938534 6889228 6863046 6802236 6843534 6764326 6777838 6856478 6821958 6912209 6936517 7042902
4470 7042902 7079333 7152102 7268971 7404527 7582636 7772870 7987511 8175569 8292832 8381083
4460 8381083 8390520 8294311 8231779 8029454 7899040 7840121 7797186 7736656 7670367 7572191 7587192
4449 7587192 7583604 7604983 7637937 7710737 7860559 8008462 8173510 8373259 8699280 9044338
4439 9044338 9452400 9964259 10488271 10960321 11235001 11308962 11128894 10821246 10418413 9972416
4429 9972416 9613319 9255673 8929664 8762891 8627938 8499120 8360045 8320898 8252868 8223992
4419 8223992 8234915 8265772 8344870 8379592 8537214 8828805 9069932 9500213 9830117 10131078
4409 10131078 10170396 10144617 10030607 9857467 9594451 9357143 9003421 8771900 8614455 8499992
4399 8499992 8398067 8331983 8310129 8277307 8284398 8174881 8208703 8191626 8134809 8144205 8101749
4388 8101749 8094997 8125367 8184952 8232677 8291984 8288845 8398631 8442944 8563159 8677340 8832031
4377 8832031 8935978 9071990 9201698 9369846 9483905 9656806 9915304 10125302 10401555 10662291
4367 10662291 10912793 11199385 11536949 11873258 12287461 12786463 13437692 14133953 15126657
4358 15126657 16516135 18531307 21639594 26083423 31072426 34720411 35849633 34468167
4350 34468167 31586260 28373270 25423318 23004044 21259329 20090078 19255816 18874017
4342 18874017 18778311 18896010 19273982 19725504 20331800 21157401 22217023 23546788 25534991
4333 25534991 28407537 32878086 38572279 44017148 48355079 52673085 59115302 67399654
4325 67399654 73485731 74212664 69577905 61984621 53765802 46554765 40774493 36430264
4317 36430264 33390496 31471891 30349661 29704049 29305536 29160583 29291988 29661148 30335601
4308 30335601 31378337 32897137 35175160 38923764 45897763 55990455 65228210 69960522
4300 69960522 70176307 68970398 68043157 67874632 68189123 67733708 65352417 60872556 55769149
4291 55769149 51165847 47532057 45186287 43895747 43462259 43548048 43835853 44488517 45367939
4282 45367939 46719982 48341882 50310390 52865220 56226303 60762611 67074807 75124202
4274 75124202 83663098 91325764 97746173 103894219 110934844 120288764 133822196 151684049
4266 151684049 169268555 184697146 201347663 232338061 290388992 361224642 405603885
4259 405603885 399980489 353801309 291243104 230412265 180966409 143872153 116971127
4252 116971127 97763492 84328099 74592492 66977712 60793858 56010777 52478441 50236972
4244 50236972 48954954 48171600 47297543 46102473 45653724 46597751 47595434 47145932 44906306
4235 44906306 41982073 38956508 36258863 34040595 32124739 30556288 29137918 27995757
4227 27995757 26842156 25934170 25099891 24427346 23821839 23164296 22585615 22005415 21428923
4218 21428923 20950802 20496104 20071321 19609771 19142462 18685130 18179234 17652978 17267533
4209 17267533 16719031 16293778 15785024 15341188 14941900 14574484 14149760 13825731 13596871
4200 13596871 13370894 13138702 12986736 12764752 12579728 12357446 12151260 11905972 11583164
4191 11583164 11284323 11061358 10854296 10658847 10561657 10437585 10367355 10386061 10311489 10320820
4181 10320820 10393100 10444440 10573344 10680397 10860115 10948979 11157945 11324580 11361644 11414030
4171 11414030 11264569 10995498 10681773 10294921 9949434 9612422 9360967 9139975 8921021
4162 8921021 8792928 8638435 8538741 8544596 8526183 8496157 8551295 8713401 8722789 8858138 8976920
4151 8976920 9072365 9329757 9564693 9874944 9986675 10035785 9955360 9747702 9333808 8909757
4141 8909757 8467921 8090440 7791270 7527013 7318260 7093043 6930355 6635457 6465986 6315696
4131 6315696 6229122 6113787 6014605 5965374 5852836 5772214 5646939 5481634 5372297 5327062
4121 5327062 5261187 5249403 5239768 5276631 5256188 5099750 5075229 4962568 4916501 4885230 4820502
4110 4820502 4765914 4714649 4724634 4639303 4599637 4535662 4528602 4467888 4459160 4396972 4317188 4311176
4098 4311176 4295135 4205399 4102559 4066010 4057729 4011727 4063213 3970421 3943564 3915163 3899855
4087 3899855 3926607 3944084 3862534 3849564 3854106 3830098 3869329 3841876 3848192 3921403 4005214 4020374
4075 4020374 4015915 4003327 3983818 3991862 3913955 3843411 3743688 3726328 3755506 3701140 3693583 3762552
4063 3762552 3716485 3862006 3976542 4067684 4168731 4215551 4209691 4141094 4058917 3954316 4005183
4052 4005183 3986059 4017093 4085762 4200598 4250492 4295344 4256478 4239352 4232384 4278489 4303687
4041 4303687 4258054 4261624 4311706 4306594 4248756 4296866 4299505 4346013 4571194 4793222 5174550
4030 5174550 5432871 5625585 5742370 5758556 5737925 5709741 5555294 5459240 5382036 5410437 5441614
4019 5441614 5511225 5520460 5552798 5593419 5618491 5667738 5907044 6209354 6575789 6875708 6998456
4008 6998456 7064698 7011707 6886964 6771299 6698628 6691422 6764968 6889903 7113480 7369101 7602563
3997 7602563 7855165 7952086 8101718 8239975 8420508 8607157 8794101 8976697 9209003 9276615
3987 9276615 9348161 9371103 9373873 9440866 9465089 9507950 9565088 9618339 9692035 9826851 9938701
3976 9938701 10081124 10343426 10575194 10819950 11175276 11517718 11977420 12662156 13275337 14001812
3966 14001812 14839918 15569655 16022674 16013374 15540982 14682997 13835328 13014066 12432624 11967431
3956 11967431 11679325 11565915 11546906 11594250 11643840 11770500 11810514 11897406 11962910 12100567
3946 12100567 12212557 12308887 12507468 12762078 12873361 12876896 12831958 12687312 12490675 12241311
3936 12241311 11875829 11464138 11006531 10558527 10263859 9860322 9677189 9499711 9402338 9278802
3926 9278802 9188025 9055249 8922676 8785117 8577982 8266589 8027781 7747015 7507929 7213700
3916 7213700 6956569 6561219 6355695 6006318 5737799 5479235 5251844 5063063 4889983 4745924
3906 4745924 4643350 4503402 4354817 4284659 4176393 4052632 4039659 3980027 3858788 3830086
3896 3830086 3748735 3730789 3654358 3577142 3480078 3440259 3312629 3230884 3175028 3098864 3027459
3885 3027459 2958493 2897297 2814254 2808494 2769214 2762351 2697196 2645032 2607700 2618874 2552086 2527911
3873 2527911 2442735 2383855 2366139 2372948 2419090 2302332 2381727 2362674 2384840 2426673 2441878
3862 2441878 2470834 2463465 2456407 2391289 2281740 2180590 2081139 2003856 1933436 1897008 1821351
3851 1821351 1793688 1738546 1728607 1744601 1740338 1731916 1733492 1670588 1685022 1660892 1633711 1694636
3839 1694636 1634211 1702199 1787431 1794743 1880561 1944313 1981883 1971452 1905737 1815564 1691199
3828 1691199 1596244 1450678 1315381 1239873 1197635 1114651 1120891 1076860 1062526 1020245 1034589
3817 1034589 1000868 988369 979898 967070 927515 920618 910972 957141 914602 970992 958704 975199
3805 975199 1054589 965057 1027325 1052173 1024443 1025068 911852 872519 817361 711383 690650 640051
3793 640051 589418 596635 579574 606788 569453 556088 501239 526815 492036 513568 470265 474270
3781 474270 465682 491415 485180 444462 485129 457321 499251 507719 446884 424183 471055 389427
3769 389427 410052 436322 453509 383155 396544 402347 421063 412771 389028 391222 366051 380015
3757 380015 352989 394339 386517 416423 363559 433130 407418 459416 418544 497403 449064 450617
3745 450617 462852 454489 440641 443788 429794 415950 410306 381829 446936 434418 487254 451395
3733 451395 517038 462353 453048 474475 483938 472367 583955 527496 500820 519561 519972 523095
3721 523095 508567 545830 578040 568550 598799 605231 611733 600426 641593 561048 542584 604454
3709 604454 511827 551177 539579 553031 513511 519884 538178 530108 588862 570702 659014 644044
3697 644044 686545 672194 677444 672375 630245 622364 557167 550956 550257 534665 562186 504656 521997
3684 521997 486042 514346 494297 556470 553849 545783 517834 504551 492950 474693 464067 468247
3672 468247 441869 434512 480201 416184 395875 462328 526435 493171 444180 468771 425159 366388
3660 366388 344105 356911 301676 237177 239180 270806 250283 224047 237108 204949 218282 213172
3648 213172 200227 221431 207958 223643 182629 128813 146388 164442 168630 157759 137861 171806
3636 171806 181260 188605 161126 148639 177173 193574 177918 139919 110071 88331 94368 39628
3624 39628 -4341 29185 50902 74144 38849 29707 72243 65589 60529 74852 52169 15923
3612 15923 59946 19595 1275 -8944 -5957 -22162 2660 -3967 5204 -19531 22147 15273 -23365
3599 -23365 -15654 -24901 -81902 30959 -19108 -60930 -84291 -88289 -45903 -14226 -34306 -26826
3587 -26826 -37020 4313 -35442 -47680 -34679 -64366 -16577 -9796 -56009 -27173 -48533 -62803
3575 -62803 -43939 -68087 -38841 -42806 -37844 -42644 -36133 -58865 -40385 -23955 -73261 -53391 -67072
3562 -67072 9631 -56476 -49509 -9620 -64449 4995 -29747 -91053 -23318 -63809 -75246 -59181
3550 -59181 -90225 -22787 -90517 -50946 -53936 -114648 -103280 -83032 -80437 -85274 -78462 -94481 -87606
3537 -87606 -109480 -114487 -106361 -102296 -126836 -93286 -89150 -88367 -114146 -141346 -108857 -153989 -142196
3524 -142196 -182568 -117734 -108279 -105311 -128905 -115667 -176790 -103056 -131103 -108075 -99611 -98774 -91889
3511 -91889 -162288 -151158 -177829 -87855 -100309 -92616 -77735 -83063 -98821 -148235 -109639 -122293
3499 -122293 -79629 -68227 -101118 -75982 -142706 -109589 -64723 -117038 -106490 -148872 -125521 -132226
3487 -132226 -123753 -156713 -124998 -119811 -84839 -108406 -94554 -134274 -101004 -87088 -91629 -62926
3475 -62926 -92503 -88357 -76119 -51944 -86763 53873 132264 265399 187342 177683 127957 61018
3463 61018 16806 -29990 -44555 -107828 -51174 -54565 -43725 -18649 46324 -1931 40975 76884
3451 76884 87639 132507 103390 88861 4902 -34032 -74275 -84876 -99783 -85689 -122097 -106679
3439 -106679 -95796 -130793 -125661 -83984 -90325 -78433 -134278 -140577 -134148 -123895 -128951 -91431 -87771
3426 -87771 -146768 -140060 -122678 -134944 -102760 -102687 -125057 -84644 -140319 -138753 -117303 -109102 -101074
3413 -101074 -124961 -101275 -89151 -123632 -135781 -101216 -79552 -53890 -18398 -102250 -76622 -65805
3401 -65805 -47792 -128708 -112864 -114511 -113909 -117618 -76775 -52837 -100263 -112008 -78370 -104599 -48070
3388 -48070 -72882 -91438 -64124 -37073 18641 45260 713 17112 11063 48290 56914 26430
3376 26430 63358 97444 158146 149292 217594 304451 534979 1061159 1583455 1828023 1703856
3365 1703856 1383244 1058484 767996 568259 457665 330610 243265 244342 216217 254784
3355 254784 202741 219377 258238 291474 292893 364015 418212 442049 586454 614324 638525 723826
3343 723826 741989 828306 971488 1098422 1285842 1638884 2293134 3535025 5080619 6174107
3333 6174107 6337866 5710920 4731956 3677684 2731023 2002263 1444840 1053615 887787
3324 887787 777040 658544 519697 510778 424442 446582 377085 337719 287166 289212 224262
3313 224262 240632 167545 193029 197518 99993 117475 75270 68936 10641 26637 -1998 62183
3301 62183 33298 23799 13049 -32395 -6851 -29492 -25680 -20739 -56597 -61786 -28138 -36580 39429
3288 39429 35427 22262 17503 19157 28389 37208 71129 139673 144389 157168 238654 249152 251939
3275 251939 265163 305335 383573 493398 714479 1453718 2822868 3696838 3849385 3155457
3265 3155457 2455086 1740876 1142705 822117 609392 384901 239314 159683 115203 64686
3255 64686 66805 86191 -9361 23201 -13546 16762 -57107 -68527 -60335 -87807 -66357 -95275
3243 -95275 -141840 -120909 -122980 -115779 -145350 -150375 -124585 -165861 -181360 -159189 -147976 -154792 -210907
3230 -210907 -141823 -168658 -196030 -228137 -169233 -142888 -169040 -179055 -174002 -179984 -178956 -247269
3218 -247269 -213179 -245183 -196620 -218526 -225662 -202193 -226338 -220240 -227344 -236453 -198003 -211054
3206 -211054 -220356 -177201 -228744 -257259 -250063 -224069 -240269 -197613 -215503 -196069 -265892 -199119
3194 -199119 -288356 -244686 -233658 -205719 -214640 -251908 -232558 -304544 -217462 -232538 -264163 -197430
3182 -197430 -279509 -251146 -212948 -220412 -240580 -224626 -228055 -219579 -233922 -260052 -236122 -292233
3170 -292233 -236827 -251475 -219935 -262253 -193624 -234963 -254758 -250328 -255435 -246774 -212153 -220954
3158 -220954 -227776 -245346 -257486 -294093 -254009 -245547 -267347 -244766 -270356 -234183 -266302 -239684
3146 -239684 -263342 -280946 -250737 -234051 -281627 -240451 -236139 -251533 -272606 -254346 -300247 -317495
3134 -317495 -288166 -267692 -285893 -245154 -233954 -266768 -254734 -288331 -261048 -282126 -264847 -290153
3122 -290153 -260434 -294840 -229785 -241798 -270250 -260608 -264456 -251989 -214560 -230891 -252119 -230335
3110 -230335 -294497 -271946 -267736 -279772 -271477 -255042 -262586 -268686 -281606 -258443 -238690 -240499 -291749
3097 -291749 -231757 -215207 -258123 -232740 -253486 -244942 -271795 -298429 -311681 -266337 -269604 -245376
3085 -245376 -286401 -261924 -289109 -302093 -269138 -253475 -276645 -297146 -267916 -288683 -291131 -284922
3073 -284922 -298373 -278112 -319428 -285458 -322192 -281413 -280460 -300070 -297120 -318232 -303917 -253667
3061 -253667 -302225 -304565 -306796 -321285 -285472 -318483 -317303 -317011 -320544 -329896 -360166 -317469 -308742
3048 -308742 -344441 -330565 -333464 -309487 -240699 -356521 -309604 -342935 -327869 -321374 -274538 -303410
3036 -303410 -314369 -250575 -276385 -295298 -274538 -287608 -317255 -264605 -321293 -303193 -302268 -268413
3024 -268413 -328988 -290955 -337893 -401004 -302466 -308522 -283813 -337452 -296534 -327231 -321666 -325203
3012 -325203 -286513 -325769 -272206 -355897 -349040 -309767 -338239 -336442 -330939 -371567 -323924 -360448
3000 -360448 -300855 -362326 -370895 -300225 -303014 -296928 -381769 -304574 -303203 -333188 -332105 -324096 -316887
2987 -316887 -327205 -316797 -348245 -355353 -322414 -276540 -295592 -290563 -324489 -294095 -292575 -313975
2975 -313975 -314762 -284068 -329132 -313753 -313358 -316062 -334174 -372310 -305095 -312940 -319228 -323221 -344385
2962 -344385 -340182 -295714 -285538 -276966 -326042 -340380 -313241 -332363 -307787 -317886 -318197 -318468 -309544
2949 -309544 -324860 -356264 -348316 -289362 -331296 -327372 -304373 -320754 -311147 -319913 -334142 -325166 -379207
2936 -379207 -313202 -300252 -323658 -322587 -330968 -345718 -313368 -316254 -313050 -312108 -299876 -295061 -283939
2923 -283939 -307180 -373741 -320887 -311767 -362402 -378455 -337310 -346536 -356358 -322441 -306733 -338469
2911 -338469 -328852 -322651 -346865 -315786 -383866 -325912 -332051 -311801 -351355 -322659 -353329 -290914
2899 -290914 -317912 -370105 -387256 -390587 -362049 -348722 -343507 -345621 -280974 -335783 -381775 -349535
2887 -349535 -366413 -369411 -337785 -323526 -329375 -295532 -372378 -337693 -330206 -378370 -342510 -339494
2875 -339494 -356050 -352081 -360603 -324642 -302948 -301575 -329907 -351503 -343222 -302182 -363672 -340110
2863 -340110 -344777 -318550 -313591 -317846 -304875 -318291 -332233 -326061 -340901 -387753 -346713 -351854 -352672
2850 -352672 -407768 -345881 -379592 -359318 -372007 -353293 -354167 -333061 -377574 -414396 -321378 -363523
2838 -363523 -369880 -334565 -347472 -326644 -377647 -338412 -321858 -384415 -368880 -382273 -327518 -373601
2826 -373601 -376124 -350776 -364833 -333367 -342208 -345060 -370935 -369446 -345001 -325772 -354661 -371606
2814 -371606 -372169 -361027 -352647 -349998 -320318 -337304 -346015 -379750 -336113 -344269 -343927 -368220 -353331
2801 -353331 -401217 -358343 -344212 -343664 -372271 -303366 -352138 -374689 -363852 -365905 -337084 -376304
2789 -376304 -376880 -385258 -343745 -347527 -387863 -402616 -369118 -355455 -342651 -390263 -360965 -342807
2777 -342807 -344302 -340304 -389618 -418527 -349821 -388320 -360470 -357072 -345696 -339656 -388201 -373693
2765 -373693 -371949 -353478 -388610 -383609 -379571 -359883 -298572 -354535 -368723 -350646 -378925 -359813
2753 -359813 -409994 -370547 -337724 -377007 -374167 -388323 -337675 -381006 -365024 -359537 -341712 -392186
2741 -392186 -384714 -359910 -349556 -380442 -360314 -397920 -393329 -347327 -370277 -362107 -369512 -397724
2729 -397724 -353361 -344414 -397835 -358273 -342833 -359831 -357000 -385814 -351402 -375004 -390642 -402195
2717 -402195 -347523 -318196 -400691 -342993 -340399 -362975 -393663 -384376 -369909 -341733 -343452 -333847
2705 -333847 -377468 -403297 -402399 -332524 -320294 -362965 -367055 -387366 -384483 -458684 -358741 -383724
2693 -383724 -377745 -379793 -364105 -376916 -340936 -425651 -397741 -407701 -404134 -400186 -381308 -388278 -386182
2680 -386182 -384237 -365812 -411106 -379724 -381237 -412291 -378460 -361035 -348653 -387260 -366282 -345046
2668 -345046 -325714 -399343 -413908 -394616 -359752 -405362 -352015 -378342 -375945 -368675 -405579 -363171
2656 -363171 -321772 -389178 -375388 -385728 -377687 -388733 -334401 -421332 -438504 -427357 -416612 -377282
2644 -377282 -432528 -415682 -425568 -401052 -375213 -384435 -375074 -387908 -403521 -341752 -393352 -383198
2632 -383198 -410986 -382810 -336557 -390369 -327456 -364548 -390202 -412556 -377987 -403775 -399077 -388136
2620 -388136 -417802 -430294 -393373 -419870 -400750 -352357 -357771 -377070 -352524 -361068 -374097 -374998
2608 -374998 -380015 -426144 -368521 -386914 -408649 -370356 -382936 -354447 -344575 -325038 -359321 -414285
2596 -414285 -382969 -415732 -364764 -342926 -415792 -373683 -423843 -391393 -392083 -380084 -373103 -380548
2584 -380548 -359660 -393042 -389110 -467375 -413146 -361020 -350668 -358491 -408538 -326392 -445527 -385825
2572 -385825 -416779 -409275 -340563 -381539 -367120 -408058 -389689 -466306 -373419 -350701 -401263 -381937
2560 -381937 -389583 -356489 -392947 -389113 -395813 -416854 -399228 -433856 -373657 -404501 -396642 -426432
2548 -426432 -439558 -417964 -413491 -414305 -382483 -405998 -419633 -425585 -443236 -421267 -407997 -358008
2536 -358008 -327511 -320582 -342718 -344598 -403798 -387008 -311018 -316852 -384617 -345413 -410293 -444356
2524 -444356 -406532 -416590 -397315 -452774 -438736 -409026 -380227 -377152 -413743 -426788 -406722 -409002
2512 -409002 -359134 -387417 -378475 -363239 -414019 -417801 -384099 -429645 -387821 -385620 -410782 -455330
2500 -455330 -411789 -403683 -435576 -458000 -439047 -436541 -412339 -416944 -420336 -450996 -440478 -395636
2488 -395636 -385718 -439081 -420183 -414058 -439546 -392424 -407562 -363427 -328001 -398444 -442391 -395935
2476 -395935 -355988 -450470 -435741 -435736 -406158 -425516 -412336 -389307 -389409 -366464 -425485 -410950 -411839
2463 -411839 -421720 -401650 -435082 -418553 -372667 -435755 -391023 -436734 -432508 -433891 -399623 -444221
2451 -444221 -432129 -422647 -460483 -431579 -406885 -409893 -461942 -426291 -362970 -404803 -434345 -406271
2439 -406271 -405258 -431225 -404816 -462274 -442892 -418588 -418837 -383613 -422091 -444852 -440541 -426828
2427 -426828 -407412 -436663 -426380 -421073 -384836 -405454 -439648 -394154 -393522 -429753 -412812 -458827
2415 -458827 -418745 -423038 -448700 -365227 -401460 -443728 -405627 -405405 -360948 -431845 -446477 -468723
2403 -468723 -447627 -442870 -388201 -449311 -390703 -404095 -415247 -451514 -422759 -432892 -421794 -415063
2391 -415063 -401221 -417319 -386399 -399465 -431371 -421902 -420815 -433609 -418410 -397586 -437715 -437301
2379 -437301 -468681 -416447 -455974 -449034 -396639 -414373 -451287 -400621 -448747 -439556 -418489 -408163
2367 -408163 -418549 -439740 -444823 -428958 -444154 -425444 -408185 -471595 -389162 -405709 -417950 -432603
2355 -432603 -464521 -409870 -390147 -416268 -390488 -433051 -429481 -410564 -409931 -352032 -397451 -422534
2343 -422534 -426615 -388444 -414890 -441434 -446061 -437514 -468236 -431936 -400667 -441355 -406709 -434776
2331 -434776 -452717 -435709 -371855 -440608 -409717 -426043 -401100 -498362 -495914 -446843 -436711 -447719
2319 -447719 -443779 -386850 -450335 -425976 -455690 -461202 -425799 -423430 -420570 -454424 -444322 -446608 -423890
2306 -423890 -456703 -395440 -457094 -395391 -381357 -459569 -402796 -417744 -461756 -426304 -438151 -481186
2294 -481186 -422925 -441995 -457427 -418887 -426985 -418918 -442529 -409055 -429558 -447308 -424632 -454852
2282 -454852 -395688 -417266 -408464 -441763 -400595 -457708 -428613 -432784 -467258 -446043 -422855 -439534
2270 -439534 -401476 -425130 -445183 -466365 -473869 -463109 -444988 -390700 -420905 -407428 -464724 -397819
2258 -397819 -427303 -471343 -432393 -472888 -437387 -477330 -452204 -426805 -370278 -469969 -423594 -440598
2246 -440598 -416442 -434309 -454669 -428816 -466724 -435908 -412343 -444850 -438452 -435226 -424981 -429414
2234 -429414 -399710 -425249 -458330 -430148 -434776 -431176 -479327 -403820 -424422 -418780 -449291 -431490
2222 -431490 -432739 -439758 -453542 -403861 -442221 -454861 -423115 -455781 -461274 -459429 -405855 -458695
2210 -458695 -454669 -466381 -426152 -491731 -425447 -455374 -444635 -450912 -432267 -405308 -480660 -474259
2198 -474259 -461172 -433361 -458823 -475348 -452903 -472112 -436155 -433128 -449653 -434846 -464588 -447996
2186 -447996 -421639 -434222 -437755 -420043 -442600 -412763 -443906 -417904 -449540 -437928 -503529 -455217
2174 -455217 -443419 -474538 -458415 -440324 -463952 -450156 -481926 -448531 -415749 -455334 -438552 -387767
2162 -387767 -440616 -427966 -451122 -450329 -429008 -427040 -443855 -438763 -410132 -420268 -440889 -457800
2150 -457800 -464478 -467856 -462354 -431137 -429385 -434058 -404228 -514369 -459558 -471312 -441174 -468614
2138 -468614 -473934 -454754 -451412 -425139 -485591 -465988 -445048 -468120 -502503 -452051 -462079 -448664
2126 -448664 -484660 -420086 -439848 -437941 -454788 -442867 -433161 -420440 -478939 -458851 -454372 -423270
2114 -423270 -471660 -449396 -476732 -476256 -463752 -451623 -437461 -467482 -441937 -457893 -443206 -481266
2102 -481266 -443724 -456932 -480413 -495544 -432329 -446809 -440532 -470319 -455274 -460535 -431640 -437529
2090 -437529 -433937 -438636 -465632 -470173 -485155 -471598 -419264 -473176 -456466 -459338 -444231 -449778 -452367
2077 -452367 -449240 -461876 -467612 -459622 -468576 -428229 -505470 -419973 -461943 -412292 -410737 -478374 -457643
2064 -457643 -506838 -493454 -461041 -460261 -428970 -473048 -446616 -449223 -508380 -477089 -454731 -470550
2052 -470550 -452790 -493087 -453516 -480375 -478302 -482514 -479259 -451927 -492580 -449252 -509748 -507616
2040 -507616 -443998 -441066 -469480 -403098 -420123 -465088 -487561 -461078 -464019 -452377 -470015 -470317
2028 -470317 -531685 -450907 -468897 -454464 -512827 -413808 -478987 -440815 -438954 -472769 -456700 -443155
2016 -443155 -461639 -445657 -481875 -472189 -447879 -428916 -453461 -513753 -465720 -464249 -488107 -481066
2004 -481066 -459104 -480634 -498606 -433408 -448446 -461610 -424048 -463276 -459624 -466675 -457519 -479334
1992 -479334 -448348 -470745 -465433 -471893 -470776 -467961 -482467 -523062 -453647 -477671 -438414 -464005
1980 -464005 -476721 -394591 -481438 -441805 -465736 -453047 -480638 -450571 -489138 -462321 -472465 -489327
1968 -489327 -443832 -434460 -507381 -444501 -456533 -493883 -469717 -454902 -455997 -440274 -456128 -450190
1956 -450190 -478914 -447197 -498853 -426359 -489546 -506937 -475645 -502225 -448269 -459294 -465165 -476679
1944 -476679 -455552 -449604 -449160 -474112 -433885 -505347 -480267 -475287 -449554 -489872 -483843 -446395 -464719
1931 -464719 -439576 -484079 -473783 -449395 -526929 -468594 -519986 -495365 -540875 -483172 -513362 -470476
1919 -470476 -492574 -448514 -510516 -451431 -483572 -443020 -475298 -492917 -450199 -492242 -506131 -460590
1907 -460590 -489091 -473076 -503525 -456078 -493829 -484146 -536963 -505298 -516466 -528266 -462805 -492306
1895 -492306 -485606 -454680 -511186 -475689 -499320 -461856 -472046 -504785 -487131 -468812 -482898 -493993
1883 -493993 -444618 -455236 -465505 -518287 -484883 -476626 -467077 -485394 -462826 -475238 -425726 -480131
1871 -480131 -485026 -462686 -480890 -462060 -446293 -472494 -428241 -447969 -462243 -490717 -459194 -498621
1859 -498621 -432008 -436613 -481065 -491350 -505043 -449686 -457952 -449794 -507124 -457098 -523443 -451204
1847 -451204 -468942 -471088 -518674 -494919 -489659 -475559 -472707 -510908 -466625 -443766 -470957 -455320
1835 -455320 -478963 -464672 -455107 -449164 -488684 -449838 -489714 -444513 -485755 -486536 -468574 -506102
1823 -506102 -492019 -501160 -486884 -428608 -434988 -477182 -491216 -499284 -482984 -461669 -474138 -506640
1811 -506640 -495954 -429319 -519908 -454887 -465417 -516710 -461938 -486663 -462820 -474790 -470130 -503750
1799 -503750 -497418 -432029 -486885 -502607 -538364 -486153 -532279 -482474 -504212 -489794 -462284 -500318
1787 -500318 -476188 -461843 -483781 -491467 -521171 -510167 -452698 -474445 -478759 -450894 -491027 -507273
1775 -507273 -489287 -489218 -479433 -496494 -469629 -480553 -475257 -439563 -455848 -506034 -485336 -464622 -518872
1762 -518872 -472704 -491943 -500085 -466273 -489960 -526342 -503691 -463099 -485075 -496151 -510279 -516385
1750 -516385 -498305 -489740 -502646 -492228 -459064 -478753 -456396 -439684 -483993 -490659 -459651 -465002
1738 -465002 -493012 -448902 -541110 -473802 -501542 -461844 -505022 -447646 -497692 -482399 -478674 -473690
1726 -473690 -475091 -488459 -438920 -487080 -518253 -505475 -513381 -497205 -522885 -509531 -481779 -467409
1714 -467409 -483051 -470528 -513247 -465294 -484754 -496205 -469100 -507113 -471262 -517443 -489041 -474163
1702 -474163 -513475 -472679 -488585 -512088 -426202 -491431 -504307 -437301 -494545 -489590 -477127 -455935
1690 -455935 -493164 -480396 -522691 -537936 -474415 -455535 -487861 -490631 -505635 -454720 -500923 -502071
1678 -502071 -496151 -505398 -492926 -481295 -485468 -452992 -478740 -506753 -516186 -503135 -476702 -498963
1666 -498963 -516791 -491393 -489728 -487758 -525931 -481167 -498972 -481386 -489124 -467161 -518653 -488704
1654 -488704 -543765 -527753 -510533 -488528 -517692 -513457 -552174 -503950 -520398 -431786 -513684 -470951
1642 -470951 -479350 -520580 -483180 -558520 -539139 -494158 -516098 -505248 -520333 -533617 -535560 -497146
1630 -497146 -458875 -406508 -515085 -472730 -453988 -511621 -473589 -476313 -484830 -493657 -505520 -471901
1618 -471901 -564482 -486080 -505345 -519795 -487494 -491260 -478989 -497964 -495409 -510094 -448130 -462097
1606 -462097 -498889 -475377 -513570 -487636 -449221 -471391 -499848 -505447 -503392 -508544 -493080 -510802
1594 -510802 -514550 -492337 -470234 -509604 -534578 -482960 -524478 -489990 -481992 -484870 -516246 -500352
1582 -500352 -528225 -476193 -532155 -497873 -514370 -512605 -492525 -481472 -499629 -524302 -519320 -552500
1570 -552500 -488948 -465255 -540323 -505858 -531855 -526087 -521631 -506912 -500922 -485143 -496703 -538876
1558 -538876 -514308 -489328 -495309 -513796 -503978 -482662 -519185 -544612 -529418 -509524 -515916 -476460
1546 -476460 -515718 -486547 -520407 -528479 -550507 -537915 -527569 -482328 -457886 -418630 -438920 -479313
1534 -479313 -538265 -496671 -519737 -546535 -492549 -518416 -480338 -499908 -478846 -486785 -512748 -543902
1522 -543902 -572337 -545490 -558144 -518141 -565047 -476014 -486297 -513543 -495649 -499124 -496950 -483170
1510 -483170 -517812 -507280 -465384 -481076 -510824 -520084 -484719 -492756 -478211 -490483 -498945 -474554
1498 -474554 -500364 -488695 -486936 -554008 -512036 -509004 -521117 -531787 -475453 -502706 -487921 -493866
1486 -493866 -475798 -500417 -497446 -535394 -483766 -527152 -518530 -496222 -516285 -523691 -489006 -486373
1474 -486373 -519013 -501921 -522806 -523719 -460945 -521417 -492549 -522873 -514590 -526206 -524332 -553814
1462 -553814 -454644 -486410 -533981 -534835 -508861 -522009 -494435 -489356 -475886 -490096 -508424 -504573
1450 -504573 -524350 -490607 -498609 -536251 -525637 -498957 -489657 -460549 -496509 -557709 -447136 -490028
1438 -490028 -510157 -512606 -501871 -490548 -508803 -515640 -504102 -569116 -513968 -506586 -521400 -526220
1426 -526220 -534170 -544972 -492995 -493321 -505230 -511649 -548718 -530106 -530734 -496415 -527604 -486885 -515656
1413 -515656 -534285 -549199 -514980 -486842 -467406 -509783 -488698 -547517 -527065 -480519 -546164 -508615
1401 -508615 -462121 -479289 -484654 -489160 -529344 -533683 -480500 -525626 -494446 -490815 -483967 -592326
1389 -592326 -492699 -525260 -493464 -469270 -549751 -538818 -531179 -522807 -550255 -525084 -511933 -519433
1377 -519433 -505868 -555180 -538754 -513253 -521256 -522578 -504749 -505384 -491886 -475850 -491638 -499892 -542187
1364 -542187 -529599 -512350 -531325 -502815 -538897 -547787 -479457 -563249 -499212 -480589 -478037 -517323
1352 -517323 -558034 -524906 -495208 -478570 -497958 -482891 -540071 -534651 -540906 -518850 -511030 -510208 -493171
1339 -493171 -536267 -515134 -480286 -487218 -490768 -540267 -519666 -496350 -467220 -500552 -549667 -501618
1327 -501618 -497970 -541296 -548869 -509118 -508352 -488954 -461695 -516838 -501561 -479606 -514870 -522239 -536796
1314 -536796 -502645 -503991 -504913 -540096 -483241 -479528 -524259 -505087 -510777 -495622 -538725 -521977 -547195
1301 -547195 -517645 -496758 -508729 -513891 -522383 -561408 -527065 -507159 -530680 -496668 -558175 -536512
1289 -536512 -504810 -503386 -533825 -541527 -518341 -517345 -509472 -494328 -477710 -568451 -547391 -528248 -512160
1276 -512160 -522738 -528924 -516034 -519856 -516810 -562450 -512393 -504817 -549119 -514621 -513584 -501582 -502046
1263 -502046 -529061 -519448 -543496 -485329 -542353 -538803 -536769 -505998 -485595 -506699 -530356 -534860
1251 -534860 -561332 -554980 -509746 -545377 -473400 -539860 -511563 -558112 -537103 -496274 -505327 -563092
1239 -563092 -517231 -525949 -565783 -519193 -525245 -522789 -551932 -524005 -559783 -527704 -525210 -517581 -577200
1226 -577200 -510460 -520631 -530059 -572451 -506861 -527203 -512541 -535614 -561616 -484849 -487805 -538083
1214 -538083 -507875 -517275 -525614 -562638 -487877 -573713 -533175 -545742 -523750 -524808 -503888 -526519
1202 -526519 -497427 -577050 -523674 -502348 -509333 -505028 -546671 -510703 -555269 -558590 -520851 -526694
1190 -526694 -544922 -508140 -560992 -527682 -567032 -548777 -527024 -514614 -563751 -496863 -532390 -512464
1178 -512464 -507738 -499650 -571712 -555954 -522685 -537487 -491429 -503800 -556177 -554819 -548326 -539931 -520960
1165 -520960 -520308 -539307 -545331 -510717 -511535 -528465 -536802 -549408 -499660 -504224 -490817 -538646 -553951
1152 -553951 -500213 -528251 -527668 -539053 -506170 -486583 -529651 -524031 -513479 -523441 -495509 -534739
1140 -534739 -547603 -530064 -550653 -531672 -550919 -513646 -505908 -514233 -560432 -516595 -501361 -536602
1128 -536602 -566683 -523998 -495941 -519725 -570273 -535900 -510917 -560381 -530323 -512397 -560639 -505882
1116 -505882 -547356 -514731 -515824 -507290 -545684 -538185 -513160 -520672 -545455 -582686 -537561 -565050
1104 -565050 -490020 -536960 -574601 -534812 -540473 -542246 -540956 -522190 -536005 -543828 -531849 -563350
1092 -563350 -533042 -493488 -547764 -529207 -528085 -513287 -564590 -539482 -532611 -517116 -572074 -549481
1080 -549481 -560130 -533218 -501207 -528833 -575713 -547683 -507811 -517758 -520624 -542265 -537174 -520423
1068 -520423 -576297 -580615 -535437 -584715 -561326 -502646 -508067 -530879 -556444 -491019 -523792 -508425
1056 -508425 -499460 -550083 -494966 -526911 -557332 -524297 -521710 -523835 -521250 -536938 -574080 -500727
1044 -500727 -540371 -525314 -529716 -533018 -497411 -542126 -522666 -538984 -521571 -583723 -565388 -549214
1032 -549214 -486012 -511075 -499658 -503203 -557098 -547125 -573348 -492074 -543619 -495980 -530856 -542107
1020 -542107 -549092 -491188 -566100 -549345 -523002 -536949 -569676 -552847 -526892 -533059 -584889 -561581
1008 -561581 -536848 -549241 -496329 -558911 -528029 -490189 -534635 -524999 -525510 -519870 -516961 -520928 -541360
995 -541360 -544719 -555787 -543047 -541208 -509099 -537219 -535778 -548962 -561881 -567828 -489586 -544963 -562334
982 -562334 -573815 -586177 -552011 -551098 -565075 -534914 -564351 -564821 -551532 -548642 -564018 -570357 -520270
969 -520270 -524338 -505366 -540712 -521317 -556369 -583723 -568116 -528005 -575581 -529192 -506161 -494334
957 -494334 -555129 -542674 -545955 -559171 -594347 -578303 -597953 -525081 -548348 -547961 -524671 -541858
945 -541858 -546032 -501381 -530565 -570798 -562088 -573102 -541102 -585025 -534398 -563921 -601902 -537607
933 -537607 -558580 -527224 -547446 -540504 -561357 -543325 -556108 -580126 -569447 -545364 -516211 -484257
921 -484257 -507973 -510372 -512087 -559346 -500092 -500338 -548514 -569033 -547294 -542977 -501872 -551772 -568550
908 -568550 -567502 -575738 -557556 -481828 -529703 -533508 -542737 -528962 -549447 -537904 -535851 -543590 -534982
895 -534982 -597058 -500637 -525784 -509870 -555113 -520496 -550597 -544390 -510081 -549377 -550683 -509443
883 -509443 -610269 -569511 -578589 -564796 -533596 -536441 -568341 -591203 -560020 -547302 -562818 -542055
871 -542055 -525026 -563493 -594094 -532255 -542948 -565175 -530509 -509904 -593199 -581959 -551124 -454710
859 -454710 -567414 -553565 -525833 -549110 -608816 -519610 -538891 -544856 -538810 -583331 -614616 -581951
847 -581951 -535899 -527658 -542025 -554110 -536850 -555720 -576747 -569588 -561219 -532974 -571250 -538692
835 -538692 -550032 -527803 -565251 -545398 -534324 -553779 -543603 -534435 -607226 -545887 -552435 -515876
823 -515876 -577674 -578847 -584297 -568926 -549287 -587394 -600608 -513862 -562279 -572402 -537170 -514682
811 -514682 -545498 -586864 -551249 -557148 -600694 -564197 -552470 -529083 -510709 -532320 -563449 -554400
799 -554400 -508898 -580693 -523068 -541605 -542122 -522121 -553145 -558553 -564729 -563834 -589003 -527171 -592009
786 -592009 -564091 -567571 -572215 -560299 -561857 -601131 -531064 -572108 -513996 -552242 -541033 -522693
774 -522693 -499788 -540912 -531990 -532589 -525754 -541061 -539136 -592826 -541866 -507060 -552359 -561712 -577094
761 -577094 -536845 -613290 -558365 -562463 -532744 -568694 -572279 -552154 -514691 -544300 -558160 -550290
749 -550290 -556153 -524750 -592312 -551165 -560575 -533240 -538687 -591788 -558850 -567667 -522807 -581065 -527344
736 -527344 -519293 -601914 -578916 -533724 -510925 -582079 -548692 -549938 -561337 -567662 -536712 -564766
724 -564766 -536410 -552558 -531446 -527733 -530888 -538768 -559123 -537095 -566530 -565689 -530300 -551081 -494170
711 -494170 -537119 -572413 -503995 -555182 -542338 -547205 -555776 -540148 -540127 -545933 -502731 -550703 -539289
698 -539289 -553981 -574210 -574621 -542043 -575619 -548630 -610011 -561015 -526045 -538829 -599913 -560617
686 -560617 -553579 -556644 -583558 -533126 -580372 -538992 -506040 -577984 -541293 -557808 -594288 -551155
674 -551155 -584548 -492059 -566323 -534148 -551499 -571212 -609002 -568097 -576458 -602165 -518969 -553216
662 -553216 -516485 -526451 -551947 -572039 -554197 -551450 -566338 -590552 -515397 -541906 -575532 -554541
650 -554541 -571095 -573459 -517808 -532245 -550103 -576316 -550512 -564504 -555046 -554685 -519871 -578974 -609635
637 -609635 -566341 -565233 -555812 -560206 -571272 -578571 -583012 -556634 -552099 -546808 -590294 -626296 -576788
624 -576788 -618616 -589821 -575725 -499965 -523430 -568767 -624876 -551651 -563354 -567674 -563701 -557673
612 -557673 -584462 -592181 -574961 -468874 -528369 -583819 -569589 -584016 -563860 -531313 -574897 -616838
600 -616838 -566721 -538192 -571175 -553892 -563247 -577531 -540580 -548463 -537903 -546986 -547019 -529286 -565067
587 -565067 -545315 -533680 -552730 -546655 -522684 -546462 -574551 -560586 -537902 -549059 -554819 -560319
575 -560319 -549729 -551085 -598356 -581760 -606971 -496563 -558818 -518721 -555600 -580537 -554138 -571762
563 -571762 -594141 -595089 -563871 -543572 -499840 -558827 -526137 -580815 -543797 -520677 -581963 -594942
551 -594942 -571393 -551653 -593330 -569878 -584177 -581932 -571893 -506184 -573279 -559390 -567503 -524347
539 -524347 -559896 -555217 -551860 -537570 -539855 -570190 -569992 -556406 -569609 -549803 -621624 -550200 -565263
526 -565263 -567170 -573585 -552180 -572412 -569359 -596538 -536285 -511196 -569568 -534358 -630310 -557490
514 -557490 -596863 -509630 -571461 -561703 -602351 -580794 -578348 -524230 -557876 -564917 -516407 -565245
502 -565245 -549263 -572948 -537018 -521617 -586226 -598112 -566452 -517655 -606976 -560427 -587880 -567499
490 -567499 -564955 -520180 -569850 -546598 -582981 -574247 -564733 -564347 -540170 -545604 -571309 -557495 -566677
477 -566677 -566913 -557657 -527223 -546301 -567958 -538055 -588257 -580814 -620373 -567439 -572707 -605864 -555317
464 -555317 -546182 -572424 -576259 -519131 -539205 -538467 -573775 -580647 -556450 -606373 -541976 -555328 -582775
451 -582775 -616782 -529209 -589648 -557666 -594617 -568493 -590951 -573057 -574032 -533390 -593143 -544632
439 -544632 -542406 -583480 -571511 -578242 -558026 -564535 -536016 -539442 -561050 -562058 -561658 -611245 -573804
426 -573804 -610355 -583976 -544281 -564596 -547595 -547565 -556434 -565241 -574210 -584538 -561626 -533542 -574459
413 -574459 -509075 -552173 -615543 -570871 -553280 -567624 -570468 -576973 -595671 -586721 -563298 -597117
401 -597117 -542333 -554213 -585013 -573402 -571357 -557820 -586069 -565948 -569046 -589646 -563999 -540947
389 -540947 -530024 -571978 -559396 -601802 -559731 -542017 -569471 -547459 -529867 -519503 -579316 -613161
377 -613161 -549094 -568516 -551758 -562628 -590188 -556173 -582951 -556870 -547435 -589073 -594984 -584480
365 -584480 -578933 -600112 -541755 -533431 -576835 -554973 -581999 -608659 -570528 -546242 -581591 -598533
353 -598533 -558655 -582238 -554168 -541549 -524372 -593785 -540703 -597915 -546465 -573572 -542715 -574899
341 -574899 -632800 -620605 -611340 -617848 -598002 -573829 -526268 -628755 -617573 -558312 -563512 -587297
329 -587297 -581016 -571610 -545060 -556452 -538457 -571036 -579614 -573996 -595196 -555583 -554775 -591455 -602678
316 -602678 -564816 -549842 -572018 -576533 -564666 -589326 -581546 -600506 -631445 -585860 -548543 -602096
304 -602096 -561355 -617197 -622797 -556654 -607185 -550797 -593023 -603960 -563246 -613300 -588099 -555972
292 -555972 -619161 -610337 -589659 -552338 -525213 -590053 -601737 -569657 -553664 -562825 -583225 -601733
280 -601733 -601987 -538299 -548458 -555346 -525360 -586061 -576441 -590694 -551260 -607294 -565667 -606077 -593654
267 -593654 -574497 -613866 -544999 -606724 -605382 -564476 -607261 -589199 -568312 -578445 -628608 -566624
255 -566624 -568964 -607096 -577494 -621041 -580870 -594763 -638222 -556333 -620697 -623287 -597587 -578917
243 -578917 -600945 -587984 -579553 -636495 -612566 -612455 -588810 -578194 -585730 -586385 -628595 -587085 -602562
230 -602562 -628621 -559366 -607209 -563501 -626607 -613175 -596457 -574299 -552164 -548492 -596211 -573647
218 -573647 -591491 -572376 -554611 -638548 -579002 -601031 -609376 -582819 -583295 -596983 -580992 -572283 -582869
205 -582869 -598124 -615797 -649389 -605535 -596396 -675893 -604888 -685783 -611856 -607374 -628322 -636380
193 -636380 -586539 -554689 -592392 -642719 -577566 -624705 -646668 -650603 -624973 -650995 -602520 -629381
181 -629381 -635858 -649531 -605543 -605252 -655200 -655723 -645062 -633277 -636373 -650786 -603387 -638600 -623770
168 -623770 -623834 -637467 -668233 -640916 -647843 -649656 -661083 -685351 -649018 -674287 -632827 -654930 -630717
155 -630717 -669317 -683342 -633996 -693481 -694326 -666891 -602371 -690098 -640648 -669887 -674457 -660225
143 -660225 -646392 -653286 -651880 -688125 -683797 -665048 -684574 -692532 -669703 -675604 -660617 -682611 -673038
130 -673038 -752710 -703681 -685650 -685506 -729366 -724447 -709038 -678144 -714482 -688609 -651676 -728293
118 -728293 -710805 -707732 -742614 -731449 -769975 -720373 -731863 -704745 -697450 -724725 -727236 -743332
106 -743332 -714090 -683898 -728551 -725304 -726973 -726623 -751046 -716160 -751964 -723745 -769788 -765237 -765625
93 -765625 -751640 -763319 -756190 -762973 -742295 -763427 -740013 -755019 -769473 -738651 -816904 -756085
81 -756085 -789182 -790146 -801141 -768467 -762370 -795443 -813333 -781289 -806725 -802381 -790496 -798999 -780026
68 -780026 -795889 -806773 -813474 -807718 -844401 -824394 -823335 -829569 -804695 -818341 -798585 -854216 -804532
55 -804532 -816195 -871916 -791984 -852763 -827246 -814582 -826733 -854713 -826025 -869379 -885727 -851851
43 -851851 -874763 -860439 -867858 -865784 -884533 -865251 -864775 -882449 -873046 -882044 -883307 -846683 -887327
30 -887327 -879447 -866456 -842576 -907347 -921272 -934275 -882805 -918044 -906673 -926919 -908872 -908944 -908441
17 -908441 -946755 -922711 -929615 -910757 -912988 -951765 -927666 -942561 -923443 -924663 -931443 -922080 -957068
4 -957068 -936616 -892684 -914302 -932767
0 -932767
$$ Imaginary data points
##PAGE= N=2
##DATA TABLE= (X++(I..I)), XYDATA
16383 -1655435 -1639408 -1617208 -1560528 -1559653 -1484257 -1482271 -1400040 -1370286 -1331406 -1346994 -1314515 -1278221
16371 -1278221 -1217152 -1201614 -1141126 -1134340 -1091344 -1033532 -1023726 -991344 -923570 -891914 -861004 -837939
16359 -837939 -775635 -755651 -715410 -710087 -683432 -646026 -572828 -570697 -527472 -497447 -464816 -425155
16347 -425155 -391186 -364883 -315605 -292595 -273876 -222983 -206032 -152897 -115694 -54128 -43203
16336 -43203 -18128 17949 68799 121243 120573 178431 197165 216851 264209 288032 274073 328843
16324 328843 392952 412862 422713 458279 526296 511765 552304 628522 598040 708080 702576 734474
16312 734474 699312 769035 802768 816637 872274 868678 870423 1001058 1014568 1015508 1041919 1048866
16300 1048866 1084384 1120327 1165269 1176289 1210365 1250929 1256188 1278479 1308925 1373329 1364274 1419680
16288 1419680 1455879 1471589 1496999 1512880 1534247 1572464 1628824 1599522 1672668 1642853 1683129
16277 1683129 1719402 1724536 1773957 1791234 1827216 1834085 1875452 1903090 1898749 1922008 1964914 1994602
16265 1994602 2004847 2045950 2035541 2075934 2125745 2108244 2110251 2181581 2169885 2215678 2179454
16254 2179454 2208075 2250714 2265087 2345012 2313788 2354817 2384395 2414213 2429020 2424174 2433822 2473026
16242 2473026 2485802 2553909 2511535 2530580 2576777 2581678 2627260 2613319 2636638 2690710 2680243
16231 2680243 2718833 2715778 2717380 2768688 2794565 2798292 2822024 2802427 2801267 2841888 2868440 2879936
16219 2879936 2894278 2924983 2899654 2959209 2971297 2958918 2996798 2996248 3016756 3066103 3007641 3066494
16207 3066494 3085358 3115537 3070429 3132923 3101164 3203142 3168147 3169016 3235615 3160080 3255773
16196 3255773 3179606 3263923 3237202 3249561 3269368 3318283 3293579 3280739 3303474 3357007 3376445
16185 3376445 3364648 3349618 3379025 3383066 3401226 3430511 3447695 3442681 3436751 3504413 3450643 3473548
16173 3473548 3516010 3515728 3519864 3525187 3532892 3534064 3545619 3583282 3554357 3582084 3583112 3608667 3595117
16160 3595117 3594173 3619954 3578970 3671736 3623288 3621094 3622035 3659439 3610669 3670118 3641800 3642948
16148 3642948 3722497 3681552 3683903 3690774 3701467 3722804 3725928 3729171 3695161 3721015 3760337 3733430
16136 3733430 3719890 3720650 3770389 3726478 3777735 3736042 3718054 3737774 3788046 3777513 3797534 3799158
16124 3799158 3828774 3812629 3808075 3746849 3817611 3800548 3840880 3847322 3868216 3841968 3859020 3838576
16112 3838576 3837425 3904986 3861897 3870059 3851258 3910745 3900667 3906023 3886776 3895510 3903404 3893087
16100 3893087 3912781 3891406 3887085 3926999 3943675 3893730 3909596 3948532 3924805 3968118 3927907
16089 3927907 3912218 3920569 3892396 3923741 3955977 3933866 3950558 3927142 3972680 3961337 3932841
16078 3932841 3961622 3938600 3968296 3984699 3950446 3943232 3949501 3937920 3993807 3961849 3958320 3944780
16066 3944780 3960841 3954645 3947474 3957799 3958800 3963372 3953094 3996797 3965112 3990521 3977811 4005598
16054 4005598 3987095 3976232 3943306 3957456 3964472 3956861 3986470 3993361 3945487 3998957 4027827 4021870
16042 4021870 3961074 4006132 3970311 4030800 3967955 4003592 3991734 3997583 4043306 4027131 3986641
16031 3986641 4045249 3993268 4027264 3999369 4013548 3986216 4029023 4002254 4036521 3978818 4043831
16020 4043831 4032044 4036277 4055701 4027227 4028050 3985279 4005514 3994086 4034568 3987010 4093844 4081801
16008 4081801 4035519 4002254 4059922 4046304 4012910 4046765 4023896 4031488 4038127 4028324 4023705 3998721
15996 3998721 4018833 4062309 4046236 4004532 4005516 4065989 4000243 4048668 4061871 4061867 4033031 4047906
15984 4047906 4036093 4036312 4011828 4020976 4005033 4022767 4027517 4033351 3996355 3992110 4049818 4037082
15972 4037082 4063575 4049832 4046375 4034849 4056000 4028554 4054387 4091890 4003180 4049418 4074729
15961 4074729 4041258 4022766 4043958 4050832 4026832 4033412 4073577 4036219 4003071 3961882 4017815 4002560
15949 4002560 4062559 4027172 4102974 4014289 4046346 4069624 4073811 4066933 4078360 4046959 4005863 4026602
15937 4026602 4029853 4044725 4030221 4071183 4114057 4095764 4105298 4013844 4100066 4038745 4091180 4087453
15925 4087453 4064226 4081115 4100938 4085801 4109058 4044118 4091911 4089208 4026435 4070431 4066750 4056982
15913 4056982 4048094 4035684 4041258 4070651 4074447 4068855 4071660 4056827 4096269 4085580 4074141 4091339
15901 4091339 4068074 4024621 4139353 4059310 4043977 4061122 4074362 4020445 4088856 4061125 4079614
15890 4079614 4116717 4069925 4057622 4077515 4117874 4036525 4074681 4103438 4094810 4070721 4072471 4051047
15878 4051047 4107890 4082922 4060214 4092746 4087592 4081547 4110576 4103281 4104704 4082239 4130765 4086843
15866 4086843 4102248 4041563 4066524 4082395 4108845 4093947 4091807 4097272 4118751 4078944 4080639 4100328
15854 4100328 4100496 4104851 4111469 4087895 4111961 4157034 4104511 4105498 4120748 4118485 4122665 4115351 4104203
15841 4104203 4121857 4121914 4114922 4058037 4147989 4096236 4087860 4070525 4084060 4105691 4086080 4088745
15829 4088745 4119784 4136542 4139023 4066076 4113956 4072974 4080429 4095781 4117570 4099014 4066865 4130644
15817 4130644 4128361 4101305 4101586 4130653 4101321 4092007 4118165 4086508 4101628 4153102 4178159 4122763
15805 4122763 4110830 4126228 4092686 4121475 4128936 4074995 4172727 4124142 4103206 4164885 4170637 4158253
15793 4158253 4156646 4167664 4154840 4088239 4121587 4115398 4088518 4124195 4116215 4116419 4118719 4103710
15781 4103710 4122731 4168075 4122921 4110553 4109698 4124706 4123822 4127497 4138354 4109228 4162621 4138884
15769 4138884 4106043 4109734 4124674 4163701 4143475 4122774 4130848 4172074 4176140 4104868 4152108 4119996
15757 4119996 4139569 4165537 4145284 4106002 4114127 4114048 4126258 4129105 4168182 4126835 4166117 4163260
15745 4163260 4163534 4126431 4149748 4137350 4189026 4168327 4182548 4180033 4156438 4135379 4144332 4119211
15733 4119211 4161418 4147380 4122264 4166283 4145513 4129988 4135955 4101831 4148815 4154373 4194557 4122917
15721 4122917 4168195 4165859 4158734 4159090 4170823 4150124 4177316 4157309 4141764 4159128 4151367 4133755
15709 4133755 4162516 4153747 4138297 4128341 4164982 4101065 4168736 4167671 4166332 4164194 4139809 4111836
15697 4111836 4177472 4138205 4163846 4153858 4178951 4173723 4144138 4143074 4167604 4181506 4168042 4167011
15685 4167011 4142564 4123607 4184903 4172005 4176911 4144299 4205330 4154932 4179789 4199105 4143397
15674 4143397 4148415 4197715 4185714 4178866 4193214 4133477 4218538 4139161 4222684 4205722 4163625 4184992
15662 4184992 4216137 4175058 4224782 4228969 4215191 4216733 4204818 4165148 4179856 4178713 4204773 4200236
15650 4200236 4191126 4156123 4213310 4191250 4191972 4178486 4189774 4220163 4179967 4179168 4139893 4214595
15638 4214595 4188925 4201964 4194581 4142947 4161690 4223215 4206029 4190366 4189891 4201267 4214791 4167983
15626 4167983 4213500 4173414 4179950 4179860 4213939 4255437 4229619 4270152 4212261 4238134 4204912 4212886
15614 4212886 4180740 4197763 4217216 4195091 4233425 4232777 4155229 4240261 4198215 4214419 4237274 4209808
15602 4209808 4188406 4199098 4247448 4217075 4162429 4240031 4207586 4243083 4196897 4262530 4177687
15591 4177687 4182535 4188396 4204529 4239353 4176927 4209689 4232050 4224023 4225178 4287944 4199242 4276459
15579 4276459 4223153 4259500 4203654 4246576 4247939 4245487 4228877 4258380 4225414 4262156 4200171 4239773
15567 4239773 4259656 4205656 4223115 4255121 4268124 4242734 4282732 4224558 4233095 4217621 4213041 4258081
15555 4258081 4245051 4240710 4223048 4212944 4289462 4195457 4235068 4222588 4295098 4175097 4230880
15544 4230880 4228518 4227825 4239662 4248391 4270222 4280057 4263674 4229821 4223325 4244007 4209420 4246075
15532 4246075 4247413 4272413 4260935 4257191 4282037 4261815 4230104 4250288 4278110 4264944 4275280 4302071
15520 4302071 4298880 4251975 4275910 4334618 4236657 4274823 4277041 4231704 4239589 4237905 4243415 4256589
15508 4256589 4268374 4244211 4234983 4298755 4235732 4270244 4266272 4277320 4219091 4257274 4216580 4238211
15496 4238211 4266323 4247932 4278063 4273063 4240680 4292097 4246489 4276440 4229937 4287779 4297851
15485 4297851 4235405 4298826 4260752 4221416 4297157 4249604 4278773 4287635 4244383 4303213 4299649 4261674
15473 4261674 4255154 4253822 4291702 4290955 4282460 4267421 4288429 4287291 4313451 4284005 4309317 4304223 4262029
15460 4262029 4286664 4265144 4302364 4274519 4284199 4271273 4297660 4296768 4297891 4261901 4307850 4320878
15448 4320878 4338838 4313015 4274747 4252375 4333920 4321625 4250016 4300305 4339549 4294932 4288107
15437 4288107 4352347 4321604 4314237 4309242 4283890 4279191 4307190 4281296 4301638 4310034 4300443 4343999
15425 4343999 4326431 4248888 4284621 4278822 4312697 4276595 4315858 4322551 4341128 4303787 4330852 4317217
15413 4317217 4338219 4328656 4314096 4319928 4253262 4320123 4291949 4279113 4288318 4312582 4332762 4309874
15401 4309874 4315774 4327294 4306346 4350651 4323646 4344526 4366888 4362070 4310255 4329778 4352647 4320192
15389 4320192 4314504 4311233 4322390 4337219 4318625 4326930 4327108 4283924 4306330 4342874 4325497 4359966
15377 4359966 4358639 4311364 4316584 4255950 4317559 4302047 4320319 4331082 4334771 4318209 4359868 4345540
15365 4345540 4335439 4300191 4328955 4328853 4333759 4311808 4362069 4331083 4328482 4340201 4309019 4333503
15353 4333503 4289089 4352370 4330258 4347645 4350197 4307039 4336550 4333004 4309303 4320794 4321517 4347360
15341 4347360 4365430 4332527 4385284 4342227 4353828 4375582 4318449 4370128 4309897 4324056 4345020
15330 4345020 4357140 4370896 4381533 4352998 4350393 4359124 4320760 4334385 4326653 4335968 4346098 4393161
15318 4393161 4379392 4322189 4395718 4355489 4334198 4328246 4356254 4348414 4344132 4317324 4387334 4366998
15306 4366998 4358221 4371218 4437823 4423138 4301564 4314233 4336472 4388630 4338536 4403949 4388221
15295 4388221 4420344 4415357 4358473 4398087 4382492 4327685 4421970 4362989 4390354 4380297 4378046 4408460
15283 4408460 4356439 4352295 4375782 4365892 4400304 4378518 4377444 4369169 4389811 4388035 4443409 4354288
$$ [...]
##END NTUPLES=NMR SPECTRUM
##END=
