##TITLE=abcd
##JCAMPDX= 6.0         $$ Bruker NMR JCAMP-DX V2.0
##DATA TYPE= NMR SPECTRUM
##DATA CLASS= NTUPLES
##ORIGIN= UXNMR, Bruker Analytische Messtechnik GmbH
##OWNER= root
$$ XWIN-NMR		Version 3.5
$$ Thu Apr  2 17:10:15 2026 Russian Standard Time (UT+4h)  servis@DPX200
##.OBSERVE FREQUENCY= 200.131235884673
##.OBSERVE NUCLEUS= ^1H
##.ACQUISITION MODE= SIMULTANEOUS
##.ACQUISITION SCHEME= undefined
##.AVERAGES= 32
##.DIGITISER RES= 18
##SPECTROMETER/DATA SYSTEM= spect
##.PULSE SEQUENCE= zg
##.SOLVENT NAME= MeOD
##.SHIFT REFERENCE= (INTERNAL, MeOD, 0, 16.4885)
##AUDIT TRAIL= $$ (NUMBER, WHEN, WHO, WHERE, WHAT)
$$ ##TITLE= Audit trail, XWIN-NMR		Version 3.5
$$ ##JCAMPDX= 5.01
$$ ##ORIGIN= Bruker BioSpin GmbH
$$ ##OWNER= servis
$$ F:\spectra/data/av/nmr/H1/1/pdata/1/auditp.txt
$$ ##AUDIT TRAIL=  $$ (NUMBER, WHEN, WHO, WHERE, WHAT)
(   1,<2026-04-02 17:09:54.07 +0400>,<servis>,<DPX200>,
      <created by zg, POWCHK disabled, PULCHK disabled
       configuration hash MD5:
       00 E9 B6 7A A2 85 ED C7 34 08 36 98 17 FE 4E 26
       data hash MD5: 32K
       ED 8D 9F 5B DF A2 81 ED 99 BA 95 A8 8A AE B3 A9>)
(   2,<2026-04-02 17:09:55.54 +0400>,<servis>,<DPX200>,
      <Start of raw data processing
       efp BC_mod = 2 LB = 0.05 FT_mod = 6 PKNL = 1 PHC0 = -266.7951 PHC1 = -0.898437 SI = 16K 
       data hash MD5: 16K
       1D 8A 51 99 0F C5 DF AA 42 2C 0A A5 93 B6 B5 F5>)
$$ ##END=
$$ 
$$ hash MD5
$$ CF A5 34 F5 71 D4 4B 72 66 99 6A 63 09 D7 70 C4
##$RELAX= 
##$RELAX= 
##$RELAX= 
##$RELAX= 
##$RELAX= 
##$RELAX= 
##$RELAX= 
##$RELAX= 
$$ Bruker specific parameters
$$ --------------------------
##$DU= <F:\spectra>
##$EXPNO= 1
##$NAME= <H1>
##$PROCNO= 1
##$TYPE= <nmr>
##$USER= <av>
##$AMP= (0..31)
100 100 100 100 100 100 100 100 100 100 100 100 100 100 100 100 100 100 
100 100 100 100 100 100 100 100 100 100 100 100 100 100 
##$AQSEQ= 0
##$AQ_mod= 1
##$AUNM= <au_zg>
##$AUTOPOS= <>
##$BF1= 200.13
##$BF2= 200.13
##$BF3= 200.13
##$BF4= 200.13
##$BF5= 500.13
##$BF6= 500.13
##$BF7= 500.13
##$BF8= 500.13
##$BYTORDA= 1
##$CFDGTYP= 0
##$CFRGTYP= 5
##$CHEMSTR= <none>
##$CNST= (0..31)
1 1 145 1 1 1 1 1 1 1 1 1 1 1 1 1 1 1 1 1 1 1 1 1 1 1 1 1 1 1 1 1 
##$CPDPRG= <>
##$CPDPRG1= <>
##$CPDPRG2= <>
##$CPDPRG3= <>
##$CPDPRG4= <mlev>
##$CPDPRG5= <mlev>
##$CPDPRG6= <mlev>
##$CPDPRG7= <mlev>
##$CPDPRG8= <mlev>
##$CPDPRGB= <>
##$CPDPRGT= <>
##$D= (0..31)
0 2 0 0 0 0 0 0 0 0.06 0 0 0 0 0 0 0.0002 0 0 0 0 0 0 0 0 0 0 0 0 0 0 
0 
##$DATE= 1775135393
##$DBL= (0..7)
120 120 120 120 120 120 120 120 
##$DBP= (0..7)
150 150 150 150 150 150 150 150 
##$DBP07= 0
##$DBPNAM0= <>
##$DBPNAM1= <>
##$DBPNAM2= <>
##$DBPNAM3= <>
##$DBPNAM4= <>
##$DBPNAM5= <>
##$DBPNAM6= <>
##$DBPNAM7= <>
##$DBPOAL= (0..7)
0.5 0.5 0.5 0.5 0.5 0.5 0.5 0.5 
##$DBPOFFS= (0..7)
0 0 0 0 0 0 0 0 
##$DE= 6
##$DECBNUC= <off>
##$DECIM= 32
##$DECNUC= <off>
##$DECSTAT= 4
##$DIGMOD= 1
##$DIGTYP= 9
##$DL= (0..7)
0 120 120 120 120 120 120 120 
##$DP= (0..7)
150 150 150 150 150 150 150 150 
##$DP07= 0
##$DPNAME0= <>
$$ [...]
##$SUBNAM4= <"">
##$SUBNAM5= <"">
##$SUBNAM6= <"">
##$SUBNAM7= <"">
##$SUBNAM8= <"">
##$SUBNAM9= <"">
##$SW= 20.6817932712277
##$SWIBOX= (0..15)
0 0 3 0 0 0 0 0 0 0 0 0 0 0 0 0 
##$SW_h= 4139.07284768212
##$TD= 32768
##$TD0= 1
##$TE= 0
##$TE2= 300
##$TE3= 300
##$TEG= 300
##$TL= (0..7)
0 120 120 120 120 120 120 120 
##$TP= (0..7)
150 150 150 150 150 150 150 150 
##$TP07= 0
##$TPNAME0= <>
##$TPNAME1= <>
##$TPNAME2= <>
##$TPNAME3= <>
##$TPNAME4= <>
##$TPNAME5= <>
##$TPNAME6= <>
##$TPNAME7= <>
##$TPOAL= (0..7)
0.5 0.5 0.5 0.5 0.5 0.5 0.5 0.5 
##$TPOFFS= (0..7)
0 0 0 0 0 0 0 0 
##$TUNHIN= 0
##$TUNHOUT= 0
##$TUNXOUT= 0
##$USERA1= <user>
##$USERA2= <user>
##$USERA3= <user>
##$USERA4= <user>
##$USERA5= <user>
##$V9= 5
##$VALIST= <valist>
##$VCLIST= <CCCCCCCCCCCCCCC>
##$VD= 0
##$VDLIST= <DDDDDDDDDDDDDDD>
##$VPLIST= <PPPPPPPPPPPPPPP>
##$VTLIST= <TTTTTTTTTTTTTTT>
##$WBST= 1024
##$WBSW= 30
##$XGAIN= (0..3)
0 0 0 0 
##$XL= 0
##$YL= 0
##$YMAX_a= 2297715
##$YMIN_a= -2020235
##$ZGOPTNS= <>
##$ZL1= 120
##$ZL2= 120
##$ZL3= 120
##$ZL4= 120
##$ABSF1= 0
##$ABSF2= 0
##$ABSG= 0
##$ABSL= 0
##$ALPHA= 0
##$AQORDER= 0
##$ASSFAC= 0
##$ASSFACI= 0
##$ASSFACX= 0
##$ASSWID= 0
##$AUNMP= <proc_1d>
##$AZFE= 0.1
##$AZFW= 0.1
##$BCFW= 0
##$BC_mod= 2
##$BYTORDP= 0
##$COROFFS= 0
##$CY= 18.4799938201904
##$DATMOD= 1
##$DC= 0
##$DFILT= <>
##$DTYPP= 0
##$F1P= 9.9274215381318
##$F2P= -0.165520771350173
##$FCOR= 1
##$FTSIZE= 16384
##$FT_mod= 6
##$GAMMA= 0
##$GB= 0
##$INTBC= 1
##$INTSCL= 4.127829e-11
##$ISEN= 128
##$LB= 0.05
##$LEV0= 0
##$LPBIN= 0
##$MAXI= 10000
##$MC2= 0
##$MEAN= 0
##$ME_mod= 0
##$MI= 50
##$NCOEF= 0
##$NC_proc= -1
##$NLEV= 6
##$NOISF1= 3.799351
##$NOISF2= 2.8
##$NSP= 0
##$NTH_PI= 0
##$NZP= 0
##$OFFSET= 16.48848
##$PC= 4
##$PHC0= -266.7951
##$PHC1= -0.898437
##$PH_mod= 1
##$PKNL= yes
##$PPARMOD= 0
##$PSCAL= 4
##$PSIGN= 0
##$REVERSE= no
##$SF= 200.130005582386
##$SI= 16384
##$SIGF1= 3
##$SIGF2= 2
##$SINO= 400
##$SIOLD= 16384
##$SREGLST= <1H.CDCl3>
##$SSB= 0
##$STSI= 16384
##$STSR= 0
##$SW_p= 4139.07284768211
##$SYMM= 0
##$S_DEV= 0
##$TDeff= 32768
##$TDoff= 0
##$TI= <>
##$TILT= no
##$TM1= 0
##$TM2= 0
##$TOPLEV= 0
##$USERP1= <user>
##$USERP2= <user>
##$USERP3= <user>
##$USERP4= <user>
##$USERP5= <user>
##$WDW= 1
##$XDIM= 16384
##$YMAX_p= 335894617
##$YMIN_p= -97886
$$ End of Bruker specific parameters
$$ ---------------------------------
##NTUPLES= NMR SPECTRUM
##VAR_NAME=  FREQUENCY,     SPECTRUM/REAL,   SPECTRUM/IMAG
##SYMBOL=    X,             R,               I
##VAR_TYPE=  INDEPENDENT,   DEPENDENT,       DEPENDENT
##VAR_FORM=  AFFN,          ASDF,            ASDF
##VAR_DIM=   16384,         16384,           16384
##UNITS=     HZ,            ARBITRARY UNITS, ARBITRARY UNITS
##FACTOR=    0.252644378177508, 1,           1
##FIRST=     3299.83951724647, 0,            0
##LAST=      -839.233330435636, 0,           0
##MIN=       -839.233330435636, -97886,      0
##MAX=       3299.83951724647, 335894617,    0
$$ Real data points
##PAGE= N=1
##DATA TABLE= (X++(R..R)), XYDATA
$$ [...]
$$ plain form
10932 52733 52789 47841 47378 40853 47354 36200 55616 33514 38825 31976 29863 33787 22082 22960
10918 22960 25937 33208 20697 30950 12780 19426 -3874 -522 -332 -16667 -10768 -12434 -10067
10905 -10067 -23776 -7000 -10757 -25207 -16392 -7668 -17051 -12225 -20310 -27029 -39078 -26532 -28792
10892 -28792 -36058 -18943 -38520 -30580 -30538 -28677 -18839 -43269 -26588 -36481 -46003 -42244 -32810 -25639
10878 -25639 -40264 -24087 -33263 -25535 -33416 -24838 -30603 -39753 -31327 -37194 -56010 -41423 -39046
10865 -39046 -34220 -22619 -24142 -27570 -35370 -45426 -28419 -43120 -46648 -32428 -23383 -40869 -38137
10852 -38137 -39925 -34883 -40037 -35178 -27318 -47214 -58265 -37486 -20737 -44037 -38561 -47925 -31814
10839 -31814 -53731 -46812 -37359 -31323 -31941 -31631 -36479 -46034 -41742 -43754 -37084 -45407 -54762 -44104
$$ packed form
10932E2733N6m948m63o525O501j1154J9416k2102N311o849k113L924j1705Q78
10918B2960K977P271j2511J0253j8170O646k3300L352J90j6335N899j666K367
10905a0067j3709J6776l757j4450Q815Q724r383M826q085o719j2049J2546k260
10892b8792p266J7115j9577P940M2J861R838k4430J6681r893r522L759R434P171
10878b5639j4625J6177r176P728p881Q578n765r150Q426n867j8816J4587K377
10865c9046M826J1601j523l428p800j0056J7007j4701l528J4220R045j7486K732
10852c8137j788N042n154M859P860j9896j1051K0779J6749k3300N476r364J6111
10839c1814k1917O919R453O036o18L10m848r555M292k012O670q323r355J0658
$$ plain form
10825 -44104 -29132 -28463 -33469 -35965 -40468 -40385 -45591 -48649 -40064 -39272 -45092 -39953 -38962 -47074 -38957
10810 -38957 -38860 -28445 -34291 -30109 -39957 -46586 -37412 -43261 -43855 -31788 -32735 -45480 -25596 -32781
10796 -32781 -37870 -45073 -22885 -42767 -42554 -53901 -41089 -39535 -29993 -35749 -46146 -32778 -29438
10783 -29438 -25048 -38733 -32521 -32267 -47754 -32530 -39332 -50924 -41165 -38186 -38676 -41068 -31721 -51052
10769 -51052 -25014 -41740 -33260 -35847 -39976 -31263 -27325 -27164 -49675 -48444 -37002 -46459 -41474 -37856
10755 -37856 -41292 -34245 -45513 -42466 -53080 -37452 -55724 -34114 -44800 -45823 -56315 -31959
10743 -31959 -32194 -41701 -49396 -44356 -46496 -51400 -37814 -46594 -50765 -40151 -43336 -48565 -49943 -42566
10729 -42566 -49620 -54562 -46208 -52535 -52209 -41085 -37325 -56607 -45709 -33313 -51984 -48756 -44866
$$ packed form
10825d4104J4972O69n006k496m503Q3n206l058Q585P92n820N139R91q112Q117
10810c8957R7J0415n846M182r848o629R174n849n94J2067r47j2745J9884p185
10796c2781n089p203K2188j9882K13j1347J2812J554R542n756j0397J3368L340
10783b9438M390j3685O212K54j5487J5224o802j1592R759K979m90k392R347j9331
10769e1052K6038j6726Q480k587m129Q713L938J61k2511J231J1442r457M985L618
10755c7856l436P047j1268L047j0614J5628j8272K1610j0686j023j0492K4356
10743c1959k35r507p695N040k140m904J3586q780m171J0614l185n229j378P377
10729d2566p054m942Q354o327L26J1124L760j9282J0898J2396j8671L228L890
$$ plain form
10716 -44866 -39926 -56778 -47469 -50135 -46828 -52607 -55155 -38356 -56153 -54677 -67024 -45617 -45699 -52221
10702 -52221 -35172 -34202 -50178 -58139 -38531 -46775 -49076 -47068 -37048 -46617 -56430 -42974 -37582
10689 -37582 -39737 -42805 -47947 -52212 -60179 -66500 -55246 -41586 -47397 -42926 -42029 -35830 -48638 -47892
10675 -47892 -36913 -44065 -46280 -37546 -54962 -48553 -40743 -40251 -32772 -29616 -36715 -44632 -30093 -45318
10661 -45318 -50082 -52663 -42453 -55779 -50578 -40048 -43008 -46025 -47301 -36458 -44519 -46993 -54429
10648 -54429 -41222 -50269 -48763 -39470 -53671 -39328 -48887 -48464 -40329 -52432 -54439 -41396 -42985
10635 -42985 -44158 -53886 -50436 -59702 -31267 -55845 -41051 -46302 -60454 -35479 -35084 -42365 -51173
10622 -51173 -42439 -37027 -45421 -47660 -47937 -40912 -53995 -53353 -46119 -46097 -44777 -34302 -43833 -42104 -45085
$$ packed form
10716d4866M940j6852R309k666L307n779k548J6799j7797J476j2347K1407q2o522
10702e2221J7049R70j5976p961J9608q244k301K008J0020r569r813J3456N392
10689c7582k155l068n142m265p967o321J1254J3660n811M471Q97O199j2808P46
10675d7892J0979p152k215Q734j7416O409P810M92P479L156p099p917J4539j5225
10661d5318m764k581J0210j3326N201J0530k960l017j276J0843q061k474p436
10648e4429J3207r047J506R293j4201J4343r559M23Q135j2103k007J3043j589
10635d2985j173r728L450r266K8435k4578J4794n251j4152K4975L95p281q808
10622e1173Q734N412q394k239k77P025j3083O42P234K2J320J0475r531J729k981
$$ plain form
10607 -45085 -50928 -48751 -48475 -57585 -48133 -50226 -39378 -55080 -51564 -48662 -47779 -42182 -33546 -45979
10593 -45979 -56689 -55658 -50842 -51427 -47688 -37142 -51719 -41081 -48808 -51794 -49192 -42430 -56540
10580 -56540 -53579 -58490 -50145 -46031 -47893 -39109 -48031 -40294 -37596 -62464 -51233 -54022 -52562 -49969
10566 -49969 -33903 -40949 -57082 -36700 -48951 -52399 -67897 -44412 -62053 -51210 -68517 -43215
10554 -43215 -51064 -41503 -40217 -43949 -46848 -51214 -45381 -60795 -56944 -59886 -41051 -38867 -37219 -43710
10540 -43710 -61393 -43629 -48438 -53230 -53180 -48690 -66762 -60196 -32767 -35595 -52571 -34445 -29450
10527 -29450 -43313 -49733 -55871 -54929 -61605 -35019 -36218 -53374 -41362 -44253 -32934 -43476 -44170
10514 -44170 -49467 -53854 -47764 -54016 -41571 -51957 -49611 -46295 -45249 -53174 -45156 -45679 -34114 -50856
$$ packed form
10607d5085n843K177K76r110R452k093J0848j5702L516K902Q83N597Q636j2433
10593d5979j0710J031M816n85L739J0546j4577J0638p727k986K602O762j4110
10580e6540K961m911Q345M114j862Q784q922P737K698k4868J1231k789J460K593
10566d9969J6066p046j6133K0382j2251l448j5498K3485j7641J0843j7307K5302
10554d3215p849R561J286l732k899m366N833j5414L851k942J8835K184J648o491
10540d3710j7683J7764m809m792N0M490j8072O566K7429k828j6976J8126M995
10527b9450j3863o420o138R42o676K6586j199j7156J2012k891J1319j0542o94
10514d4170n297m387O090o252J2445j0386K346L316J046p925Q018n23J1565j6742
$$ plain form
10500 -50856 -48719 -46630 -47413 -48359 -49475 -55214 -59484 -40646 -44546 -22821 -35938 -39577 -50690 -45847
10486 -45847 -37542 -45688 -43934 -50177 -42914 -64430 -42830 -53834 -52804 -41443 -50272 -34539 -50010
10473 -50010 -57083 -59420 -51334 -55395 -47153 -52705 -45904 -43189 -48432 -36441 -37969 -52711 -54013 -46989
10459 -46989 -43499 -54756 -44064 -45950 -47202 -66390 -51417 -37079 -49060 -58650 -43784 -40790 -56064
10446 -56064 -42655 -36160 -63860 -55788 -35946 -54116 -37722 -46435 -46254 -57438 -35287 -61036 -49952
10433 -49952 -53344 -45691 -57951 -52643 -36419 -41009 -49017 -46957 -40494 -66628 -40517 -44995 -61928
10420 -61928 -62256 -56024 -49519 -47049 -43446 -40650 -48483 -39125 -48591 -42619 -55420 -48488 -56422 -52787
10406 -52787 -49896 -56663 -42913 -48980 -51313 -48893 -38508 -52433 -50324 -51643 -52844 -65992 -62842
$$ packed form
10500e0856K137K089p83r46j116n739m270J8838l900K1725j3117l639j1113M843
10486d5847Q305q146J754o243P263k1516K1600j1004J030J1361q829J5733j5471
10473e0010p073k337Q086m061Q242n552O801K715n243J1991j528j4742j302P024
10459d6989L490j1257J0692j886j252j9188J4973J4338j1981r590J4866K994j5274
10446e6064J3409O495k7700Q072J9842j8170J6394q713J81j1184K2151k5749J1084
10433d9952l392P653j2260N308J6224m590q008K060O463k6134K6111m478j6933
10420f1928l28O232O505K470L603K796p833R358r466N972j2801O932p934L635
10406e2787K891o767J3750o067k333K420J0385j3925K109j319j201j3148L150
$$ plain form
10393 -62842 -49787 -47082 -52809 -44284 -53077 -45628 -49716 -49341 -37968 -42489 -43103 -60317 -51452 -49464
10379 -49464 -70085 -55690 -52308 -42483 -43018 -56668 -55663 -51308 -37362 -57657 -56889 -60611 -41820
10366 -41820 -62191 -54931 -41798 -50322 -48548 -40134 -40779 -51149 -49907 -50528 -33025 -62267 -43196
10353 -43196 -51391 -49055 -50776 -44298 -50557 -53017 -41297 -56342 -51099 -47318 -41320 -42132 -49888 -39839
10339 -39839 -43980 -50045 -51656 -46575 -45020 -44186 -54262 -43758 -47373 -49776 -31919 -46223 -59779
10326 -59779 -45753 -38897 -42296 -57409 -52847 -48836 -52361 -41250 -50085 -54792 -39475 -40115 -39764 -52815
10312 -52815 -33578 -52148 -42411 -48845 -52617 -51307 -53114 -41432 -53478 -58959 -50269 -48143 -56403
10299 -56403 -48539 -38173 -55725 -45458 -48094 -32801 -54413 -49495 -35272 -61020 -43274 -56833
$$ packed form
10393f2842J3055K705n727Q525q793P449m088L75J1373m521o14j7214Q865J988
10379d9464k0621J4395L382R825n35j3650J005M355J3946k0295P68l722J8791
10366d1820k0371P260J3133q524J774Q414o45j0370J242o21J7503k9242J9071
10353d3196q195K336j721O478o259k460J1720j5045N243L781N998q12p756J0049
10339c9839m141o065j611N081J555Q34j0076J0504l615k403J7857j4304j3556
10326e9779J4026O856l399j5113M562M011l525J1111q835m707J5317o40L51j3051
10312e2815J9237j8570R737o434l772J310j807J1682j2046n481Q690K126q260
10299e6403P864J0366j7552J0267k636J5293k1612M918J4223k5748J7746j3559
$$ plain form
10287 -56833 -42510 -60146 -43166 -41467 -54935 -54134 -44407 -43373 -53528 -29471 -41917 -50776 -42836
10274 -42836 -49034 -57054 -51344 -52991 -38934 -39017 -43297 -48184 -34234 -43751 -48383 -51148 -48016 -42080
10260 -42080 -50251 -47643 -46272 -43027 -58656 -36582 -44557 -44171 -46531 -52135 -41560 -48218 -42452 -44339
10246 -44339 -47452 -47625 -69747 -37171 -45587 -46813 -48355 -45363 -40177 -57108 -45478 -41347 -45288 -47412
10232 -47412 -50114 -44428 -44142 -38922 -34184 -39143 -49111 -41712 -44391 -31068 -45826 -44184 -56488 -49788
10218 -49788 -33768 -39707 -44009 -41832 -46185 -46384 -38292 -44481 -45516 -45465 -39718 -51268 -49526 -50836 -35115
10203 -35115 -42218 -40468 -42165 -50063 -50849 -38712 -36377 -40974 -45089 -43528 -50949 -38477 -48512 -30298
10189 -30298 -43879 -36545 -31573 -49494 -28866 -42654 -41924 -41207 -35672 -44178 -16241 -29433 -39319
$$ packed form
10287e6833J4323j7636J6980J699j3468Q01R727J034j0155K4057j2446q859P940
10274d2836o198q020N710j647J4057q3m280m887J3950r517m632k765L132N936
10260d2080q171K608J371L245j5629K2074p975L86k360n604J0575o658N766j887
10246d4339l113j73k2122L2576q416j226j542K992N186j6931J1630M131l941k124
10232d7412k702N686K86N220M738m959r968P399k679J3323j4758J642j2304O700
10218d9788J6020n939m302K177m353j99Q092o189j035N1N747j1550J742j310J5721
10203c5115p103J750j697p898p86J2137K335m597m115J561p421J2472j0035J8214
10189c0298j3581P334M972j7921K0628j3788P30P17N535q506K7937j3192r886
$$ plain form
10176 -39319 -35370 -41320 -43928 -36092 -44130 -51222 -45678 -36280 -39235 -35464 -37679 -32922 -42918 -34867
10162 -34867 -38159 -40668 -52943 -41506 -43379 -52647 -35302 -29455 -25394 -44042 -36626 -40655 -39684 -46011
10148 -46011 -44939 -40997 -48350 -46784 -40764 -38839 -42141 -31924 -48392 -39622 -53505 -51314 -53372 -39711
10134 -39711 -37513 -41431 -26532 -40867 -42633 -51110 -29182 -47869 -48161 -44660 -41196 -45062 -32054
10121 -32054 -38366 -38836 -35442 -45425 -46025 -40446 -37560 -40622 -31601 -39750 -40908 -32069 -33028 -35433 -45685
10106 -45685 -34462 -45517 -36542 -32669 -21899 -34726 -32538 -23941 -27296 -18573 -20157 -19204 -32101
10093 -32101 -36517 -39487 -27317 -37947 -13155 -18212 -33658 -12631 -27912 -35352 -26706 -19417 -29457
10080 -29457 -32917 -28999 -31628 -26578 -31844 -14284 -7864 -21034 -16937 -12107 -19822 -16745 -18984 -22027
$$ packed form
10176c9319L949n950k608P836q038p092N544R398k955L771k215M757r996Q051
10162c4867l292k509j2275J1437j873r268J7345N847M061j8648P416m029R71o327
10148d6011J072L942p353J566O020J925l302J0217j6468Q770j3883K191k058J3661
10134c9711K198l918J4899j4335j766q477K1928j8687k92L501L464l866J3008
10121c2054o312m70L394r983o00N579K886l062R021q149j158Q839r59k405j0252
10106d5685J1223j1055Q975L873J0770j2827K188Q597l355Q723j584R53j2897
10093c2101m416k970J2170j0630K4792n057j5446K1027j5281p440Q646P289j0040
10080b9457l460L918k629N050n266J7560O420j3170M097M830p715L077k239l043
$$ plain form
10066 -22027 -14663 -21256 -14800 -13159 -3728 7083 -573 27433 17641 15621 8142 39150 38717 23125
10052 23125 27034 33795 50689 33005 57803 55045 72474 73001 82787 66114 83565 56837 79272
10039 79272 76266 77604 73727 83236 105273 90369 94711 101531 116745 106295 119345 130290 120997
10026 120997 125920 129125 131423 132172 118580 133851 126295 115108 112356 98614 102528 95934 88324
10013 88324 79099 93163 74801 75330 87556 87099 84942 70511 82514 87366 62186 69116 69061 68304
9999 68304 60244 54398 47991 57038 51127 26438 40009 23772 24336 23434 17558 12976 16725 4778
9985 4778 21346 13489 10478 6113 2262 -1104 -13085 -8452 -1318 -16400 -15660 -23295 -1657 -16983
9971 -16983 -9511 -4170 -10575 -14855 -33980 -3487 -25778 -34417 -22351 -10520 -14820 -19078 -28420
$$ packed form
10066b2027P364o593O456J641R431J0811p656K8006r792k020p479L1008m33j5592
10052B3125L909O761J6894j7684K4798k758J7429N27R786j6673J7451k6728K2435
10039G9272l006J338l877R509K2037j4904M342O820J5214j0450J3050J0945r293
10026A20997M923L205K298P49j3592J5271p556j1187k752j3742L914o594p610
10013H8324r225J4064j8362N29J2226m57k157j4431J2003M852k5180O930n5p57
9999F8304q060n846o407R047n911k4689J3571j6237N64r02n876m582L749j1947
9985D778J6568p857l011m365l851l366j1981M633P134j5082P40p635K1638j5326
9971a6983P472N341o405m280j9125L0493k2291q639J2066J1831m300m258r342
$$ plain form
9958 -28420 -17733 -19809 -34395 -24569 -21079 -16153 -24367 -4385 -31814 -33039 -24493 -20160 -28016 -20246
9944 -20246 -17965 -22793 -13516 -21757 -18246 -43074 -14972 -28408 -24729 -25520 -20639 -34569 -22679 -11008
9930 -11008 -29602 -36397 -20891 -12410 -33324 -36747 -23190 -21385 -25485 -29949 -28162 -40161 -35887
9917 -35887 -27794 -36866 -28434 -41460 -25939 -24983 -13168 -17574 -7645 -14137 -23316 -31981 -36838 -26464
9903 -26464 -22302 -18097 -25752 -29876 -20481 -23289 -15157 -27433 -24323 -9813 -21745 -32438 -21446
9890 -21446 -16118 -14963 -39175 -18351 -25864 -15990 -15307 -10176 -16115 -28979 1568 -29125 -21476 -29551
9876 -29551 -23475 -26797 -27709 -9435 -15493 -31056 -20709 -10476 -31277 -22732 -22219 -35774 -18239
9863 -18239 -26880 -34510 -28788 -16309 -19134 -22354 -17285 -11415 -22432 -19181 -10893 -22544 -27688 -34192
$$ packed form
9958b8420J0687k076j4586R826L490M926q214J9982k7429j225Q546M333p856P770
9944b0246K281m828R277q241L511k4828K8102j3436L679p91M881j3930J1890J1671
9930a1008j8594o795J5506Q481k0914l423J3557J805m100m464J787j1999M274
9917c5887Q093r072Q432j3026J5521R56J1815m406R929o492r179q665m857J0374
9903b6464M162M205p655m124R395k808Q132j2276L110J4510j1932j0693J0992
9890b1446N328J155k4212K0824p513R874O83N131n939j2864L0547l0693P649q075
9876b9551O076l322r12J8274o058j5563J0347J0233k0801Q545N13j3555J7535
9863a8239q641p630N722J2479k825l220N069N870j1017L251Q288j1651n144o504
$$ plain form
9849 -34192 -13502 -28680 -29865 -17521 -14807 -11552 -20131 -20685 -21537 -21416 -23362 -20912 -4139 -17843
9835 -17843 -15636 10424 -9283 -11233 -16963 -1002 -13296 -13148 -10289 -12924 -12131 -14706 748 6231
9821 6231 -5638 -5288 -9682 12014 -14356 -3757 -6013 9936 -9132 1172 10099 5043 7502
9808 7502 99 5091 -12725 7454 13 -1370 13224 -367 8652 6346 13400 -4367 9547
9795 9547 2453 24942 7634 8793 16356 -1009 11610 18675 10311 10130 25454 19977 11797 29931
9781 29931 19744 34776 14907 31218 30024 12100 22276 13505 18024 7684 30999 9049
9769 9049 15477 35933 21467 21903 26355 32023 11626 29549 24700 39754 18628 41502 44359
9756 44359 36249 38852 34864 50967 47316 43716 44909 47875 67996 67805 89113 60286 75371 56016
$$ packed form
9849c4192K0690j5178j185J2344K714L255q579n54q52J21j946K450J6773j3704
9835a7843K207K6060j9707j950n730J5961j2294J48K859k635P93k575J5454N483
9821F231j1869L50m394K1696k6370J0599k256J5949j9068J0304Q927n056K459
9808G502p403M992j7816K0179p441j383J4594j3591R019k306P054j7767J3914
9795I547p094K2489j7308J159P563j7365J2619P065q364j81J5324n477q180J8134
9781B9931j0187J5032j9869J6311j194j7924J0176q771M519j0340K3315k1950
9769I049O428K0456j4466M36M452N668k0397J7923m849J5054k1126K2874K857
9756D4359q110K603l988J6103l651l600J193K966K0121j91K1308k8827J5085j9355
$$ plain form
9742 56016 69065 49020 45346 33441 56871 40910 31530 51636 37890 45896 49763 60874 42101
9729 42101 39532 44064 48723 44382 44919 48178 46041 58647 51544 62795 59487 68311 66356 55853
9715 55853 58466 58826 67374 76226 76319 68895 71014 70227 63188 65724 70070 65501 79612 80070 81513 80900
9699 80900 87272 83624 76707 81648 76819 92135 80593 89733 99477 88140 101062 86847 93520
9686 93520 108097 78854 102509 103835 90356 86048 123910 106211 109900 116929 121893 103814 108263
9673 108263 120978 115094 125030 115743 134294 118719 146003 131169 131839 153945 145829 139252 136238
9660 136238 153604 135520 138861 160535 145980 146796 162539 163579 158644 174422 175287 171339 170117
9647 170117 164365 169161 158228 178049 168576 184328 177010 187476 193395 191425 196738 203695 202500
$$ packed form
9742E6016J3049k0045l674j1905K3430j5961r380K0106j3746Q006L867J1111j8773
9729D2101k569M532M659m341N37L259k137J2606p103J1251l308Q824j955j0503
9715E5853K613L60Q548Q852R3p424K119p87p039K536M346m569J4111M58J443o13
9699H0900O372l648o917M941m829J5316j1542R140R744j1337J2922j4215O673
9686I3520J4577k9243K3655J326j3479m308L7862j7699L689P029M964j8079M449
9673A08263J2715n884R936r287J8551j5575K7284j4834O70K2106q116o577l014
9660A36238J7366j8084L341K1674j4555Q16J5743J040m935J5778Q65l948j222
9647A70117n752M796j0933J9821r473J5752p318J0466N919j970N313O957j195
$$ plain form
9634 202500 191483 195669 207676 202160 207913 213587 203633 224493 221645 229238 229576 222116 224532 225216
9620 225216 241490 235517 231347 234776 252601 244120 250092 252153 272837 250504 272719 267737 270283
9607 270283 261222 267100 269381 257845 275073 289913 279857 296057 278384 288263 297059 288714 280927
9594 280927 276052 288012 281830 300901 295681 303026 293675 299152 308005 296552 294556 307582 300124
9581 300124 298609 305489 297209 302972 316019 312767 302064 307341 306268 306771 305415 293653 309905 302661
9567 302661 309111 293634 293273 303557 301840 303974 297627 312753 296841 305349 302451 302714 293611 293875
9553 293875 278211 284545 281572 284922 292053 292959 290320 292827 291252 282029 271136 274385 278345 269353
9539 269353 273231 275537 270983 252384 280194 265569 252168 253042 255127 246838 241742 250001 251279 237248
$$ packed form
9634B02500j1017M186J2007n516N753N674r954K0860k848P593L38p460K416O84
9620B25216J6274n973m170L429J7825q481N972K061K0684k2333K2215m982K546
9607B70283r061N878K281j1536J7228J4840j0056J6200j7673R879Q796q345p787
9594B80927m875J1960o182J9071n220P345r351N477Q853j1453j996J3026p458
9581C00124j515O880q280N763J3047l252j0703N277j073N03j356j1762J6252p244
9567C02661O450j5477l61J0284j717K134o347J5126j5912Q508k898K63r103K64
9553B93875j5664O334k973L350P131R06k639K507j575r223j0893L249L960q992
9539B69353L878K306m554j8599K7810j4625j3401Q74K085q289n096Q259J278j4031
$$ plain form
9525 237248 235675 250152 238496 221027 223216 218759 220093 219445 225833 215057 207347 197555 196934 210787
9511 210787 195051 185836 198474 186929 181747 169439 184424 191562 177451 170017 176418 189523 164104
9498 164104 165918 148904 152181 147341 162633 156071 135477 139452 155191 153932 142273 142005 130077
9485 130077 133986 139351 131552 123640 127154 136068 114850 120653 108339 126489 122848 118475 115123 112918
9471 112918 122077 102729 104905 98757 107343 109169 96601 105199 80713 94034 108046 102665 107273
9458 107273 97500 100174 89152 78314 86927 88430 83551 78147 83119 80141 79768 82609 78277 79911
9444 79911 74450 80582 82330 71887 71561 74720 69512 73365 75709 59864 55517 56186 73409 57718
9430 57718 64933 59052 51131 63496 67291 65243 54148 58954 38346 45834 46706 35615 38420 35131
$$ packed form
9525B37248j573J4477j1656j7469K189m457J334o48O388j0776p710r792o21J3853
9511B10787j5736r215J2638j1545n182j2308J4985P138j4111p434O401J3105k5419
9498A64104J814j7014L277m840J5292o562k0594L975J5739j259j1659k68j1928
9485A30077L909N365p799p912L514Q914k1218N803j2314J8150l641m373l352k205
9471A12918R159j9348K176o148Q586J826j2568Q598k4486J3321J4012n381M608
9458A07273r773K674j1022j0838Q613J503m879n404M972k978l73K841m332J634
9444G9911n461O132J748j0443l26L159n208L853K344j5845m347O69J7223j5691
9430E7718P215n881p921J2365L795k048j1095M806k0608P488Q72j1091K805l289
$$ plain form
9416 35131 66161 51650 44191 52892 57642 33659 47251 35370 30558 38481 35542 32290 29160
9403 29160 38747 46775 37603 34855 27965 36939 37463 34698 23777 26857 31421 23839 23414 32932 22899
9388 22899 24468 34460 32519 36811 11968 28891 28168 14914 30414 11128 28838 11528 11239
9375 11239 13975 21504 17998 6343 23418 17978 1699 25903 26376 11123 -3172 6929 20378
9362 20378 7743 8665 16655 11340 21167 95 12566 -3170 -2757 -236 2781 9316 -808 4844
9348 4844 -1026 2541 -3348 5384 14963 -2246 -3517 -2405 284 12237 2807 8600 1941 8641
9334 8641 1948 4705 -2363 -10593 -4128 353 -1013 -2351 -9768 -1825 7032 -6272 -2422 -5248 -12655
9319 -12655 -23408 839 -9315 1758 -5306 -7937 -681 -11786 1435 -1978 -14937 -7560 -4160
$$ packed form
9416C5131L1030j4511p459Q701M750k3983J3592j1881m812P923k939l252l130
9403B9160R587Q028r172k748o890Q974N24k765j0921L080M564p582m25R518j0033
9388B2899J569R992j941M292k4843J6923p23j3254J5500j9286J7710j7310k89
9375A1239K736P529l506j1655J7075n440j6279K4204M73j5253j4295J0101J3449
9362B0378j2635R22P990n315R827k1072J2471j5736M13K521L017O535j0124N652
9348D844n870L567n889Q732R579j7209j271J112K689J1953r430N793o659O700
9334H641o693K757p068q230O465M481j366j338p417P943Q857j3304L850k826p407
9319a2655j0753K4247j0154J1073p064k631P256j1105J3221l413j2959P377L400
$$ plain form
9306 -4160 -4534 -14051 -1519 -7067 -16840 -2903 -8052 5633 844 -92 -3064 -11038 1968 6401
9292 6401 -2332 2130 -6207 7794 -2999 11995 12574 -5203 2774 9947 16560 5299 -7942 9948
9278 9948 7276 5652 348 2041 14749 -14887 11461 8110 11822 8760 9553 14022 -7542 7033
9264 7033 10512 -7876 -4874 3897 1722 -11463 -1117 9263 -16844 -4513 -3199 -4357 -10800
9251 -10800 -2271 -12098 -21003 5024 -1669 -16723 -14037 -12838 -24299 -18223 -5260 -16003 -25739
9238 -25739 -1469 -6761 -18239 -10567 -26614 -14273 -20412 -6547 -26335 -29202 -5289 -22791 -20767
9225 -20767 -17921 -14967 -19571 -13251 -10017 -29195 -26169 -10173 -14786 -23937 -15397 -26712 -29307 -26696
9211 -26696 -16952 -21617 -20274 -4796 -6177 -6668 -10161 -19415 -4952 -25960 -22313 -34404 -15986 -18777
$$ packed form
9306d160l74r517J2532n548r773J3937n149J3685m789r36k972p974J3006M433
9292F401q733M462q337J4001j0793J4994N79j7777P977P173O613j1261j3241J7890
9278I948k672j624n304J693J2708k9636K6348l351L712l062P93M469k1564J4575
9264G033L479j8388L002Q771k175j3185J0346J0380k6107J2331J314j158o443
9251a0800Q529r827q905K6027o693j5054K686J199j1461O076J2963j0743r736
9238b5739K4270n292j1478P672j6047J2341o139J3865j9788k867K3913j7502K024
9225b0767K846K954m604O320L234j9178L026J5996m613r151Q540j1315k595K611
9211b6696R744m665J343J5478j381m91l493r254J4463k1008L647j2091J8418k791
$$ plain form
9197 -18777 -13715 -10724 4551 -15437 -236 -17457 -16906 -23904 -20260 -22924 -16784 -12550 -27114 -8567
9183 -8567 -11390 -7940 -14384 -13689 -12254 -17761 -29530 -19684 -22972 -26659 -29248 3101 -23384 -27259
9169 -27259 -18580 -11362 -13964 -26045 -18389 9653 -21428 -16049 -5979 -17818 -31959 -26614 -5677
9156 -5677 -26045 -21611 -12230 -24903 -16944 -26531 -21186 -34356 -19832 -5712 -40025 -11064 -21737
9143 -21737 -29537 -19044 -24834 -12215 -25481 -14635 -24057 -15127 -26263 -22195 -29264 -27579 -15788
9130 -15788 -21323 -12219 -13494 -13700 -28152 -17881 -14930 -31494 -23560 -17271 -22226 -19567 -9966 -20964
9116 -20964 -30465 -13258 -19191 -30627 -17465 -32721 -31050 -30275 -25951 -13358 -24506 -24853 -12036
9103 -12036 -37850 -12828 -20288 -22997 -22527 -19491 -26863 -28440 -22545 -17162 -12483 -34466 -21263 -18691
$$ packed form
9197a8777N062K991J5275j9988J5201j7221N51o998L644k664O140M234j4564J8547
9183h567k823L450o444O95J435n507j1769R846l288l687k589L2349k6485l875
9169b7259Q679P218k602j2081P656K8042l1081N379J0070j1839j4141N345K0937
9156e677k0368M434R381j2673P959r587N345j3170J4524J4120l4313K8961j0673
9143b1737p800J0493n790J2619j3266J0846r422Q930j1136M068p069J685J1791
9130a5788n535R104j275k06j4452J0271K951j6564P934O289m955K659R601j0998
9116b0964r501J7207n933j1436J3162j5256J671P75M324J2593j1148l47J2817
9103a2036k5814K5022p460k709M70L036p372j577N895N383M679k1983J3203K572
$$ plain form
9089 -18691 -17684 -22128 -11192 -21823 -14590 -30656 -16322 -30845 -15919 -21189 -18824 -15180 -26279
9076 -26279 -9995 -17330 -15510 -7120 -11632 -8978 -15229 -20914 -30954 -19637 -13394 -25169 -14330
9063 -14330 -19887 -27022 -11857 -15431 -21799 -11424 -32456 -12301 -19686 -19582 -11589 -20825 -14655 -12856
9049 -12856 -13061 -19322 -9235 -14308 -7201 -11016 -17850 -21419 -17409 -23177 -17485 -10038 -23805 -29241
9035 -29241 -15472 -9226 -15844 -20304 -1821 -15826 -35515 -8792 -21775 -14052 -25490 -29369 -26715
9022 -26715 -35711 -28960 -24693 -13004 -16298 -24386 -11775 -8881 -6342 -26430 -7724 -10532 -18202 -25102
9008 -25102 -18085 -10545 -12749 -14332 -2286 -8152 -19598 -23915 -6423 -12054 -25544 -15239 -16356
8995 -16356 -13269 -24323 -20902 -6661 -10604 -11443 -10421 -8582 -22701 -25962 -11598 -19816 -32289 -19731
$$ packed form
9089a8691J007m444J0936j0631P233j6066J4334j4523J4926n270K365L644j1099
9076b6279J6284p335J820Q390m512K654o251n685j0040J1317O243j1775J0839
9063a4330n557p135J5165l574o368J0375k1032K0155p385J04P993r236O170J799
9049a2856k05o261J0087n073P107l815o834l569M010n768N692P447j3767n436
9035b9241J3769O246o618m460J8483j4005j9689K6723j2983P723j1438l879K654
9022b6715q996O751M267J1689l294q088J2611K894K539k0088J8706k808p670o900
9008b5102P017P540k204j583J2046n866j1446m317J7492n631j3490J0305j117
8995a6356L087j1054L421J4241l943q39J022J839j4119l261J4364q218j2473J2558
$$ plain form
8981 -19731 -14824 -10414 -25698 -15564 -10659 -25599 -13075 -12471 -16961 -22263 -16192 -25058 -31025 -13664
8967 -13664 -31907 -19668 -14968 -12024 -30419 -18180 -19446 -30702 -20158 -17943 -32020 -26254 -25858
8954 -25858 -17277 -31756 -14541 -26450 -28260 -23795 -29071 -11593 -24361 -29813 -14264 -13156 -17229
8941 -17229 -9616 -17937 -13535 -14024 -18419 -27174 -17465 -25397 -22953 -15841 -21960 5142 -16862 -6814
8927 -6814 -12132 -9456 -24570 -23594 -23028 -8792 -25701 -27876 -22808 -22236 -13468 -27763 -14777 -4266
8913 -4266 -19695 -19966 -21968 -22345 -34972 -24713 -32263 -16703 -36537 -33775 -15791 -27359 -10697
8900 -10697 -26066 -23048 -26316 -39410 -30104 -20951 -40365 -42129 -21169 -28091 -48081 -33528 -14708
8887 -14708 -15121 -28994 -23666 -19714 -36947 -41903 -29927 -36593 -41873 -36726 -31998 -19126 -12722 -29373
$$ packed form
8981a9731M907M410j5284J0134M905j4940J2524O04m490n302O071q866n967J7361
8967a3664j8243J2239M700K944j8395J2239j266j1256J0544K215j4077N766L96
8954b5858Q581j4479J7215j1909j810M465n276J7478j2768n452J5549J108m073
8941a7229P613q321M402m89m395q755R709p932K444P112o119K7102k2004J0048
8927f814n318K676j5114R76N66J4236j6909k175N068N72Q768j4295J2986J0511
8913d266j5429k71k002l77j2627J0259p550J5560j9834K762J7984j1568J6662
8900a0697j5369L018l268j3094R306R153j9414j764K0960o922j9990J4553J8820
8887a4708m13j3873N328L952j7233m956J1976o666n280N147M728J2872O404j6651
$$ plain form
8873 -29373 -21462 -22301 -19646 -38375 -38256 -22833 -46224 -25760 -32244 -32795 -24606 -38800 -33439 -33328
8859 -33328 -20539 -47966 -24759 -33928 -36233 -27936 -28673 -35621 -28964 -29755 -29417 -45876 -34012 -14753
8845 -14753 -32092 -36645 -29246 -32793 -42515 -30480 -35272 -35825 -39269 -36769 -33335 -27366 -25074 -31373
8831 -31373 -19275 -11765 -31799 -33535 -30661 -37215 -36406 -17743 -30499 -36927 -36951 -32774 -25409 -33921
8817 -33921 -36292 -30562 -27827 -30783 -30177 -15041 -23327 -16871 -23559 -23531 -19045 -43384 -23626 -27305 -27400
8802 -27400 -34098 -15858 -7645 -12789 -15858 -12797 -22755 -23970 -18191 -19663 -26638 -25969 -14166 -21183
8788 -21183 -13797 -18593 -15552 -23247 -26448 -22354 -18637 -11279 -25824 -21095 -16611 -15504 -35363 -554
8774 -554 -18597 -26093 -34968 -8236 -18852 -28271 -15397 -27447 -28726 -33577 -24638 -41267 -31300 -16290
$$ packed form
8873b9373P911q39K655j8729J19J5423k3391K0464o484n51Q189j4194N361J11
8859c3328J2789k7427K3207r169k305Q297p37o948O657p91L38j6459J1864J9259
8845a4753j7339m553P399l547r722J2035m792n53l444K500L434N969K292o299
8831c1373J2098P510k0034j736K874o554Q09J8663j2756o428k4M177P365q512
8817c3921k371N730K735k956O06J5136q286O456o688K8M486k4339J9758l679r5
8802b7400o698J8240Q213n144l069L061r958j215N779j472o975O69J1803p017
8788b1183P386m796L041p695l201M094L717P358j4545M729M484J107j9859L4809
8774e54j8043p496q875K6732j0616r419J2874j2050j279m851Q939j6629R967J5010
$$ plain form
8760 -16290 -19498 -29654 -3934 -25532 -22428 -21611 -19608 -40275 -35286 -29971 -25705 -37366 -17909
8747 -17909 -22383 -22944 -41000 -31826 -41767 -23204 -16153 -33112 -25283 -12034 -24442 -32059 -34984 -24123
8733 -24123 -39222 -21242 -26493 -43887 -34849 -34389 -24122 -46651 -25493 -40283 -39189 -31017 -28666
8720 -28666 -32433 -34499 -29667 -23954 -24260 -37622 -34463 -29837 -37767 -37594 -33742 -38605 -31471 -27245 -11534
8705 -11534 -41547 -30230 -28044 -22201 -36306 -17771 -35710 -30163 -22952 -20645 -25257 -19377 -24745
8692 -24745 -26885 -20572 -25575 -27925 -32279 -29877 -1506 -30694 -28335 -25632 -6970 -31022 -12491
8679 -12491 -19170 -21992 -27916 -30616 -27079 -30636 -27693 -27149 -13368 -27676 -15347 -12329 3666 -12673
8665 -12673 -8790 -18986 -17584 -14049 -23325 -13054 -23094 -27994 -14986 -17027 -33155 -6064 -20689
$$ packed form
8760a6290l208j0156K5720k1598L104Q17K003k0667M989N315M266j1661J9457
8747a7909m474n61j8056R174r941J8563P051j6959P829J3249j2408p617k925J0861
8733b4123j5099J7980n251j7394R038M60J0267k2529K1158j4790J094Q172K351
8720b8666l767k066M832N713l06j3362L159M626p930J73L852m863P134M226J5711
8705a1534l0013J1317K186N843j4105J8535j7939N547P211K307m612N880n368
8692b4745k140O313n003k350m354K402K8371k9188K359K703J8662k4052J8531
8679a2491o679k822n924k700L537l557K943N44J3781j4308J2329L018J5995j6339
8665a2673L883j0196J402L535r276J0271j0040m900J3008k041j6128K7091j4625
$$ plain form
8652 -20689 -16313 -17378 -887 -18395 -15029 -16622 -11213 -17144 -5744 -10752 -35197 -11534 -12725
8639 -12725 -9043 -25292 -12474 -16784 -9418 -22827 -16522 -10510 -31424 -22237 -22313 -22420 -13222 -14661
8625 -14661 -21994 -8489 -8113 -20258 -27888 -19998 -25271 -23862 -20579 -26723 -23558 -27265 -14313 -29943
8611 -29943 -26304 -19110 -7523 -24376 -25674 -25995 -23329 -16676 -21805 -26255 -32289 -30733 -34985 -11505
8597 -11505 -33689 -30616 -10266 -15384 -18954 -26811 -30098 -25819 -23278 -19480 -18817 -30853 -37922 -14714
8583 -14714 -16236 -26786 -13332 -33174 -30428 -32624 -17148 -27092 -21201 -21436 -15794 -23172 -34570 -16116
8569 -16116 -11315 -18361 -22505 -24473 -18353 -32193 -23204 -24133 -25553 -26655 -1950 -7515 -21282 -18482
8555 -18482 -25727 -11006 -17215 -16527 -16742 -19081 -18643 -9156 -22651 -19883 -18425 -23643 -9708 -10075 -17934
$$ packed form
8652b0689M376j065J6491j7508L366j593N409n931J1400n008k4445K3663j191
8639a2725L682j6249J2818m310P366j3409O305O012k0914R187p6j07R198j439
8625a4661p333J3505L76j2145p630P890n273J409L283o144L165l707J2952j5630
8611b9943L639P194J1587j6853j298l21K666O653n129m450o034J556m252K3480
8597a1505k2184L073K0350n118l570p857l287M279K541L798O63j2036p069K3208
8583a4714j522j0550J3454j9842K746k196J5476r944N891k35N642p378j1398J8454
8569a6116M801p046m144j968O120j3840Q989r29j420j102K4705n565j3767K800
8555a8482p245J4721o209O88k15k339M38R487j3495K768J458n218J3935l67p859
$$ plain form
8540 -17934 -5606 -5766 -15765 -19121 1630 -28824 -3980 19963 -19361 -21597 -13803 -20488 -21623
8527 -21623 -20080 -33754 -13289 -19200 -18551 -10228 -31945 -12122 356 -5873 -16156 -10814 -14882
8514 -14882 -23252 -12441 -27173 -20628 -45013 -15677 -15184 -27217 -17695 -22537 -21132 -30556 -6418
8501 -6418 -20764 -9053 -14739 -16116 -21948 -19567 -3596 -20511 -26139 -22801 -28475 -33203 -18424 -21398
8487 -21398 -52587 -32125 -20860 -23759 -23812 -14525 -20447 -30335 -10801 -23107 -15733 -31131 -18090
8474 -18090 -35215 -17496 -18863 -30480 -23117 -18567 -20247 -40732 -15466 -34019 -23849 -17454 -24368
8461 -24368 -21002 -10327 -5664 -24936 -10438 -17768 -11752 -33375 -33398 -17423 -30433 -9519 -7222
8448 -7222 -16250 -33299 -10870 -31930 -19994 -2531 -29025 -19154 -17435 -29787 -15996 -11814 -22343
$$ packed form
8540a7934J2328j60r999l356K0751l0454K4844K3943l9324k236P794o685j135
8527b1623J543j3674K0465n911O49Q323k1717J9823J2478o229j0283N342m068
8514a4882q370J0811j4732O545k4385K9336M93j2033R522m842J405r424K4138
8501f418j4346J1711n686j377n832K381J5971j6915n628L338n674m728J4779k974
8487b1398l1189K0462J1265k899n3R287n922r888J9534j2306P374j5398J3041
8474a8090j7125J7719j367j1617P363M550j680k0485K5266j8553J0170O395o914
8461b4368L366J0675M663j9272J4498p330O016k1623k3J5975j3010K0914K297
8448g222r028j7049K2429k1060J1936J7463k6494R871J719j2352J3791M182j0529
$$ plain form
8435 -22343 -18493 -8113 -16707 -25992 -15328 -23256 -22023 -17485 -12638 -8474 -20811 -14422 -20352 -12457
8421 -12457 -7490 -11430 -15636 -20276 -20179 -11863 -21380 -20517 -27480 -26365 -26672 -20412 -11005 -20239 -712
8406 -712 -15471 -8865 -3455 -22422 -8394 -9042 -22127 -18476 -13342 -28837 -20875 -15101 -16889 -11636
8392 -11636 -8711 -21314 -15753 -11946 -20493 -12829 -6859 -19975 -21404 -14740 -21567 -21732 -13826 -7714
8378 -7714 -23318 -14658 -9564 -17995 -15567 -14505 -33819 -12665 -15643 -28565 -2538 -23158 -9545
8365 -9545 -15478 -6338 -15390 -27469 -19200 -22503 -20936 -22041 -23947 -17683 -21140 -4630 -24771 -28339
8351 -28339 -12776 -21776 -14460 -20727 -4406 -27565 -21352 142 -12298 -21174 -6394 -26171 -27704
8338 -27704 -17687 -33356 -18630 -20230 -18915 -26773 -5438 -15724 -16170 -12474 -21037 -9831 -26948
$$ packed form
8435b2343L850J0380q594r285J0664p928J233M538M847M164j2337O389n930P895
8421a2457M967l940m206m640R7Q316r517Q63o963J115l07O260R407r234J9527
8406g12j4759O606N410j8967J4028o48j3085L651N134j5495P962N774j788N253
8392a1636K925j2603N561L807q547P664N970j3116j429O664o827j65P906O112
8378g714j5604Q660N094q431K428J062j9314K1154k978j2922K6027k0620J3613
8365i545n933R140r052j2079Q269l303J567j105j906O264l457J6510k0141l568
8351b8339J5563r000P316o267J6321k3159O213K1494j2440q876J4780j9777j533
8338b7704J0017j5669J4726j600J315p858K1335j0286m46L696q563J1206j7117
$$ plain form
8325 -26948 -18366 -19082 -15829 -28534 -20602 -7734 -16548 -11835 -1974 -14336 -25936 -9522 -4279 -19278
8311 -19278 -9570 -16152 -14244 -6739 -17879 -7746 -20792 -7389 -3784 -12074 -15027 -8144 -13726 -22815
8297 -22815 -5848 -11133 -18511 -19224 -13799 -8459 -10223 -2225 -9309 -5432 -7669 -27437 -13243 -2668
8283 -2668 -25337 -7152 -6274 -16745 -23824 -15079 -19525 -4423 -15618 -10141 -12660 -15451 -18432 748
8269 748 -20661 -17591 -18128 -20227 986 -24659 -6295 -6920 3735 -15328 -14872 -15719 -12569 -17911 -19277
8254 -19277 -8025 -35794 -13092 -5875 452 -25031 -9920 -4312 -3118 -14900 -25079 -10370 -14585
8241 -14585 -6967 -15977 -12430 -24750 -12048 -4459 -30876 -23371 -27834 -29317 -30723 1961 -14396
8228 -14396 -8761 -2555 -15361 -15547 -24487 -17086 -17357 -26775 -20128 -28376 -23587 -31874 -12811 -8894 -6973
$$ packed form
8325b6948Q582p16L253j2705P932J2868q814M713R861j2362j1600J6414N243j4999
8311a9278R708o582J908P505j1140J0133j3046J3403L605q290k953O883n582r089
8297b2815J6967n285p378p13N425N340j764P998p084L877k237j9768J4194J0575
8283b668k2669J8185Q78j0471p079Q745m446J5102j1195N477k519k791k981J9180
8269G48k1409L070n37k099K1213k5645J8364o25J0655j9063M56q47L150n342j366
8254a9277J1252k7769K2702P217O327k5483J5111N608J194j1782j0179J4709m215
8241a4585P618r010L547j2320J2702P589k6417P505m463j483j406L2684j6357
8228a4396N635O206j2806j86q940P401k71r418O647q248M789q287J9063L917J921
$$ plain form
8213 -6973 -4459 -12595 -7264 827 8603 -8720 -28975 -963 -15046 -30031 -8262 -9350 -15220
8200 -15220 -2313 7247 -5699 -11789 -9556 -10221 -4647 -19654 -59436 12398 4258 16736 -473
8187 -473 -4146 7123 5540 11856 6504 811 -16532 -5100 2795 -5680 -8004 4699 -16232 -3185
8173 -3185 -2324 -9536 -8510 4646 9629 635 -12587 4542 -4837 3230 -13365 4044 -8894 -5977
8159 -5977 7893 3905 1012 -16372 71 -6441 -4614 -5862 -5771 -18563 -3968 -5575 -4844 -282
8145 -282 176 875 1805 -6985 8279 -12409 -591 3870 5726 -11961 -143 8472 -3501 10060
8131 10060 -7085 3002 -831 -5694 6907 -10385 -13229 -12582 -7524 -7459 -16278 -6416 -7046 -7021 -16823
8116 -16823 13625 -3189 1639 11000 1552 -7860 -3670 1718 -20039 1281 -17034 616 -12081
$$ packed form
8213f973K514q136N331Q091P776j7323k0255K8012j4083j4985K1769j088n870
8200a5220J2907R560j2946o090K233o65N574j5007l9782P1834q140J2478j7209
8187d73l673J1269j583O316n352n693j7343J1432P895q475k324J2703k0931J3047
8173c185Q61p212J026J3156M983q994j3222J7129r379Q067j6595J7409j2938K917
8159e977J3870l988k893j7384J6443o512J827j248R1j2792J4595j607P31M562
8145b82M58O99R30q790J5264k0688J1818M461J856j7687J1818Q615j1973J3561
8131A0060j7145J0087l833m863J2601j7292k844O47N058O5q819R862o30K5r802
8116a6823L0448j6814M828R361r448r412M190N388k1757K1320j8315J7650j2697
$$ plain form
8103 -12081 -10499 -4424 -13967 -4001 -15937 74 -7594 -3347 -1447 8120 -1926 -4302 9822 -976
8089 -976 2622 -6237 8432 2243 2411 -16559 -408 -4685 9294 -3604 3844 -1221 8385 1445
8075 1445 8879 -9964 -10151 4339 -1601 1129 4063 3349 4880 7812 6782 2938 3002 8991 -4958
8060 -4958 -3161 14008 12989 -1146 14293 11192 10682 6501 4028 9497 -1693 1687 10349 -622
8046 -622 747 9580 -5848 11011 8615 11622 12014 14861 10928 10368 20933 8903 17703 22279 20392
8031 20392 22433 16552 31244 13132 15855 20722 6507 12533 2984 7402 2670 16095 25906 20030
8017 20030 4084 9141 15534 4505 11287 28596 10969 1538 15314 13660 17246 1649 25141
8004 25141 14563 4751 2724 13551 4948 5578 -597 1832 8512 5230 -5380 10530 9555 870
$$ packed form
8103a2081J582O075r543R966j1936J6011p668M247J900R567j0046k376J4124j0798
8089i76L598q859J4669o189J68j8970J6151m277J3979j2898P448n065R606o940
8075A445P434j8843j87J4490n940K730K934p14J531K932j030l844O4N989j3949
8060d958J797J7169j019j4135J5439l101n10m181k473N469j1190L380Q662j0971
8046f22J369Q833j5428J6859k396L007L92K847l933n60J0565j2030Q800M576j887
8031B0392K041n881J4692j8112K723M867j4215O026r549M418m732J3425R811n876
8017B0030j5946N057O393j1029O782J7309j7627r431J3776j654L586j5597K3492
8004B5141j0578r812k027J0827q603O30o175K429O680l282j0610J5910r75q685
$$ plain form
7990 870 5310 9947 -4671 19968 9234 12585 9903 14950 10628 3698 10683 6303 10862 9151
7976 9151 14959 3769 9721 28750 8410 3204 4414 25260 -7915 22724 11688 16306 10021
7963 10021 27468 22485 2708 28147 17606 20708 5514 24291 12197 7331 26020 28961 13018
7950 13018 8358 14314 10319 10351 7938 11948 12678 11279 5809 22242 13624 14789 12204 21438 17173
7935 17173 18912 12557 39496 22547 10766 21806 12902 21141 15205 30788 18100 1521 10686
7922 10686 17349 20556 11518 31873 25295 18020 32558 20041 30386 15630 19490 27598 28064 22282
7908 22282 19446 40186 31791 26404 19269 31507 32037 18315 19257 23335 23786 18229 32770 25738
7894 25738 20491 26518 23456 21289 19392 21986 19897 26030 11600 16556 37523 27614 31396 30115
$$ packed form
7990H70M440M637j4618K4639j0734L351k682N047m322o930O985m380M559j711
7976I151N808j1190N952J9029k0340n206J210K0846l3175L0639j1036M618o285
7963A0021J7447m983j9777K5439j0541L102j5194J8777j2094m866J8689K941j5943
7950A3018m660N956l995L2k413M010P30j399n470J6433q618J165k585R234m265
7935A7173J739o355K6939j6949j1781J1040q904Q239n936J5583j2688j6579R165
7922A0686O663L207r038K0355o578p275J4538j2517J0345j4756L860Q108M66n782
7908B2282k836K0740q395n387p135J2238N30j3722R42M078M51n557J4541p032
7894B5738n247O027l062k167j897K594k089O133j4430M956K0967r909L782j281
$$ plain form
7880 30115 18845 21676 25004 21563 20346 17661 27078 29743 12718 11445 18807 22353 23806 19657
7866 19657 9181 3123 16996 21208 20044 27300 22427 30895 19708 13756 15358 17512 30659 -648
7852 -648 -34166 56716 31289 25699 34463 35936 16389 17700 26232 19058 24472 20117 25519 32976
7838 32976 28389 28633 15793 35361 19412 34922 38821 40763 22333 25848 31268 43694 26920
7825 26920 26499 30598 28083 24313 20730 32392 31222 20587 31651 40094 25179 32302 33708 32737
7811 32737 14195 32293 25243 39076 34733 28710 30612 32095 25522 20637 18791 28286 27114 16085
7797 16085 32503 19152 13553 18931 20453 14878 21438 23745 18230 19632 33686 29250 43591 23259
7783 23259 20092 31575 25541 38085 41915 24357 27528 38029 38507 25062 41316 39457 25799
$$ packed form
7880C0115j1270K831L328l441j217k685R417K665j7025j273P362L546J453m149
7866A9657j0476o058J3873M212j164P256m873Q468j1187n952J602K154J3147l1307
7852f48l3518R0882k5427n590Q764J473j9547J311Q532p174N414m355N402P457
7838C2976m587K44j2840J9568j5949J5510L899J942j8430L515N420J2426j6774
7825B6920m21M099k515l770l583J1662j170j0635J1064Q443j4915P123J406r71
7811C2737j8542J8098p050J3833m343o023J902J483o573m885j846R495j172j1029
7797A6085J6418j3351n599N378J522n575O560K307n515J402J4054m436J4341k0332
7783B3259l167J1483o034J2544L830j7558L171J0501M78j3445J6254j859j3658
$$ plain form
7770 25799 34134 39787 36677 29685 45933 50180 22235 46102 56538 50278 47907 55097 53254 48220
7756 48220 60947 54831 54841 59772 58066 49767 48050 43255 54148 49181 75323 50153 61649 48466
7742 48466 54518 66215 52188 58853 43155 63011 47238 49943 70624 70000 52979 63015 55505
7729 55505 57387 58200 65462 55697 56327 72917 60554 64322 49405 50853 61254 52566 65709 52777
7715 52777 54102 72549 59940 65873 59636 73995 69838 66359 78111 79080 73775 74287 82971 81965
7701 81965 71765 81039 73469 87153 72192 69147 96891 69859 77009 73223 82542 85541 91754
7688 91754 89193 81371 87747 76515 96701 80271 86025 78935 92508 87091 94421 86715 93965 104819
7674 104819 86592 100400 97999 96907 94312 90920 93510 87973 91903 106452 94974 100394 97034
$$ packed form
7770B5799Q335N653l110o992J6248M247k7945K3867J0436o260k371P190j843n034
7756D8220J2727o116J0M931j706q299j717m795J0893m967K6142k5170J1496j3183
7742D8466O052J1697j4027O665j5698J9856j5773K705K0681o24j7021J0036p510
7729E5505J882Q13P262r765O30J6590j2363L768j4917J448J0401q688J3143j2932
7715E2777J325J8447j2609N933o237J4359m157l479J1752R69n305N12Q684j006
7701H1965j0200R274p570J3684j4961l045K7744k7032P150l786R319K999O213
7688I1754k561p822O376j1232K0186j6430N754p090J3573n417P330p706P250J0854
7674A04819j8227J3808k401j092k595l392K590n537L930J4549j1478N420l360
$$ plain form
7661 97034 112114 98531 108065 88679 94756 94674 94597 90169 92894 95508 96261 109589 108165 106984 103263
7646 103263 107773 104080 107057 95947 108532 105095 106503 101834 108130 93993 100137 104386 108767 105230
7632 105230 121720 118491 110240 106061 106233 127116 114970 125406 122798 132972 118937 124062 121630
7619 121630 131216 125874 122261 138396 125600 129375 133747 141443 133328 139229 137351 140994 141600 144486
7605 144486 154683 155366 155628 168216 164451 155920 162439 171032 171464 170771 172520 166035 172523 174743 187522
7590 187522 181637 187338 187961 181848 183023 173531 176836 168950 188670 192363 185870 193907 198636 189764
7576 189764 200363 219977 209369 199610 232041 222890 214652 224387 227430 228426 237102 227663 231614 224113
7562 224113 234248 227042 228657 236842 240905 239518 251631 266353 246534 262643 256969 271681 281744
$$ packed form
7661I7034J5080j3583R534j9386O077q2p7m428K725K614P53J3328j424j181l721
7646A03263M510l693K977j1110J2585l437J408m669O296j4137O144M249M381l537
7632A05230J6490l229q251m179J72K0883j2146J0436k608J0174j4035N125k432
7619A21630R586n342l613J6135j2796L775M372P696q115N901j878L643O06K886
7605A44486J0197O83K62J2588l765q531O519Q593M32o93J749o485O488K220J2779
7590A87522n885N701O23o113J175r492L305p886J9720L693o493Q037M729q872
7576A89764J0599J9614j0608r759L2431r151q238R735L043R96Q676r439L951p501
7562B24113J0135p206J615Q185M063j387J2113J4722j9819J6109n674J4712J0063
$$ plain form
7549 281744 294131 278127 298052 290338 287243 284774 293510 291635 287127 287057 299098 282616 298736
7536 298736 307635 298808 292588 304103 300829 296939 313078 304871 305241 322607 317247 313557 318644 326980
7522 326980 326506 317837 338099 328950 319949 334442 342348 331399 332995 347143 346760 356481 365044 346556
7508 346556 354486 367909 357953 362592 387191 377180 374742 378956 405922 405920 421968 428954 422063 442266
7494 442266 423034 434053 435449 444614 438111 443907 441493 441008 447163 456638 466146 460505 471011 486876
7480 486876 482841 473846 481266 498131 495931 511148 524108 524987 535334 548825 569366 569686 573203
7467 573203 575526 599187 590440 598166 618432 605154 616620 619649 632745 623101 635172 645252 647074
7454 647074 655866 666097 679254 671350 673000 700840 697924 713912 731699 749006 749580 745275 770772
$$ packed form
7549B81744J2387j6004J9925p714l095k469Q736j875m508p0J2041j6482J6120
7536B98736Q899q827o220J1515l274l890J6139q207L70J7366n360l690N087Q336
7522C26980m74q669K0262r149r001J4493P906j0949J596J4148l83R721Q563j8488
7508C46556P930J3423r956M639K4599j0011k438M214K6966kJ6048O986o891K0203
7494D42266j9232J1019J396R165o503N796k414m85O155R475R508n641J0506J5865
7480D86876m035q995P420J6865k200J5217J2960Q79J0347J3491K0541L20L517
7467E73203K323K3661q747P726K0266j3278J1466L029J3096r644J2071J0080J822
7454F47074Q792J0231J3157p904J650K7840k916J5988J7787J7307N74m305K5497
$$ plain form
7441 770772 776699 791134 782125 802026 803443 810030 815051 824308 834946 837790 865043 874922 879829
7428 879829 897059 897681 919115 925572 940935 946453 946099 968630 964559 970623 1001054 1003563 1001372 1023381
7414 1023381 1038702 1028381 1052980 1072737 1073403 1081771 1100193 1119243 1107940 1121366 1137238 1148228
7402 1148228 1167688 1184713 1192880 1198289 1228387 1239263 1274915 1283714 1308922 1301221 1326373 1357019
7390 1357019 1382381 1400148 1425738 1445190 1444734 1494253 1505078 1513718 1519776 1528988 1525925 1536338 1544711
7377 1544711 1559596 1568121 1575284 1596136 1634143 1654330 1682990 1726543 1732830 1777404 1802584 1827877
7365 1827877 1840072 1868313 1875906 1897024 1924403 1941258 1955050 2001503 2029469 2072521 2115723 2151610
7353 2151610 2188413 2236351 2275658 2317092 2338901 2382108 2407770 2425725 2460455 2510447 2524127
$$ packed form
7441G70772N927J4435r009J9901J417O587N021R257J0638K844K7253R879M907
7428H79829J7230O22K1434O457J5363N518l54K2531m071O064L0431K509k191K2009
7414A023381J5321j0321K4599J9757O66Q368J8422J9050j1303J3426J5872J0990
7402A148228J9460J7025Q167N409L0098J0876L5652Q799K5208p701K5152L0646
7390A357019K5362J7767K5590J9452m56M9519J0825Q640O058R212l063J0413Q373
7377A544711J4885Q525P163K0852L8007K0187K8660M3553O287M4574K5180K5293
7365A827877J2195K8241P593K1118K7379J6855J3792M6453K7966M3052M3202L5887
7353B151610L6803M7938L9307M1434K1809M3207K5662J7955L4730M9992J3680
$$ plain form
7342 2524127 2578096 2633738 2691202 2742818 2792999 2840761 2903290 2936211 2979479 3034868 3093979
7331 3093979 3141554 3199925 3255915 3344620 3400008 3481575 3540176 3603528 3643154 3724500 3775696
7320 3775696 3836773 3910303 3989904 4100093 4178893 4284733 4377885 4485512 4568744 4673340 4781536
7309 4781536 4853690 4954394 5056323 5163584 5253699 5365113 5481660 5581834 5699681 5815782
7299 5815782 5952576 6081775 6214651 6358005 6507057 6661801 6814658 6992109 7161059 7336673
7289 7336673 7523039 7734315 7917957 8130314 8336525 8552745 8777932 9025838 9261443 9526455
7279 9526455 9804850 10112424 10420117 10743331 11089933 11460444 11812590 12195506 12608526 13021429
7269 13021429 13459852 13919281 14410625 14933164 15466333 16049259 16656171 17321146 17996544
$$ packed form
7342B524127N3969N5642N7464N1616N0181M7762O2529L2921M3268N5389N9111
7331C093979M7575N8371N5990Q8705N5388Q1567N8601O3352L9626Q1346N1196
7320C775696O1077P3530P9601J10189P8800J05840R3152J07627Q3232J04596J08196
7309D781536P2154J00704J01929J07261R0115J11414J16547J00174J17847J16101
7299E815782J36794J29199J32876J43354J49052J54744J52857J77451J68950J75614
7289G336673J86366K11276J83642K12357K06211K16220K25187K47906K35605K65012
7279I526455K78395L07574L07693L23214L46602L70511L52146L82916M13020M12903
7269A3021429M38423M59429M91344N22539N33169N82926O06912O64975O75398
$$ plain form
7260 17996544 18740466 19562364 20408357 21340769 22328808 23431896 24633850 25984578 27483931
7251 27483931 29139412 30997280 33066029 35392883 37995888 40921825 44233904 47997219
7243 47997219 52299206 57219313 62849763 69395426 77075720 86100640 96839474 109768997
7235 109768997 125545855 144981256 169008496 198316861 232566976 269331593 303467435
7228 303467435 327846000 335894617 325269603 299526022 265580282 229841272 196259718
7221 196259718 166611298 141251463 120001393 102518276 88307286 76877481 67769513
7214 67769513 60423354 54440201 49475924 45334730 41789466 38722872 36062276 33697772
7206 33697772 31598132 29684440 27982683 26435101 25011216 23750220 22588428 21541431
$$ packed form
7260A7996544P43922Q21898Q45993R32412R88039J103088J201954J350728J499353
7251B7483931J655481J857868K068749K326854K603005K925937L312079L763315
7243D7997219M301987M920107N630450O545663P680294R024920J0738834J2929523
7235A09768997J5776858J9435401K4027240K9308365L4250115L6764617L4135842
7228C03467435K4378565Q048617j0625014k5743581l3945740l5739010l3581554
7221A96259718k9648420k5359835k1250070j7483117j4210990j1429805r107968
7214F7769513p346159n983153m964277m141194l545264l066594k660596k364504
7206C3697772k099640j913692j701757j547582j423885j260996j161792j046997
$$ plain form
7198 21541431 20581327 19679431 18838999 18020786 17293653 16578674 15916776 15291219 14691173
7189 14691173 14128273 13597839 13100421 12619841 12177633 11779561 11411286 11045069 10705312
7180 10705312 10384224 10069352 9750838 9449237 9167954 8874229 8596308 8321550 8053311
7171 8053311 7785252 7551606 7320229 7090571 6889563 6667675 6478489 6300641 6133652 5974769
7161 5974769 5794920 5653705 5493056 5344705 5201214 5049172 4911581 4776003 4645691 4509613
7151 4509613 4378429 4285314 4176855 4063141 3984502 3890991 3813343 3703518 3666247 3575340 3500020
7140 3500020 3439420 3361156 3285560 3216734 3168733 3076092 3005411 2941816 2872280 2794679 2743149
7129 2743149 2668399 2609120 2550243 2507808 2436181 2396523 2361944 2314243 2269307 2225131 2172548
$$ packed form
7198B1541431r60104r01896q40432q18213p27133p14979o61898o25557o00046
7189A4691173n62900n30434m97418m80580m42208l98072l68275l66217l39757
7180A0705312l21088l14872l18514l01601k81283k93725k77921k74758k68239
7171H053311k68059k33646k31377k29658k01008k21888j89186j77848j66989j58883
7161E974769j79849j41215j60649j48351j43491j52042j37591j35578j30312j36078
7151D509613j31184r3115j08459j13714p8639r3511p7648j09825l7271r0907p5320
7140C500020o0600p8264p5596o8826m8001r2641p0681o3595o9536p7601n1530
7129B743149p4750n9279n8877m2435p1627l9658l4579m7701m4936m4176n2583
$$ plain form
7118 2172548 2124734 2087881 2044147 2003204 1939133 1912772 1877886 1837877 1781650 1759314 1702887
7107 1702887 1680259 1642669 1601767 1577250 1538516 1522867 1500679 1466956 1432047 1403587 1377063
7096 1377063 1346446 1318863 1288893 1253108 1244374 1220170 1186895 1171626 1144006 1127418 1096924 1082734
7084 1082734 1053101 1027748 1012737 992225 969521 941044 911409 893543 855479 830229 784966
7073 784966 772203 735298 705921 684462 657161 644079 621005 619893 610951 588630 587364 570490
7061 570490 562862 556836 537180 516660 502962 500120 467424 468443 449863 427878 424618 411290 417089
7048 417089 389867 395818 394826 380685 367531 374484 344450 338966 331066 336343 322874 313955 301266
7035 301266 287927 283814 286296 267590 279244 272021 262966 258536 276138 260248 232210 251338 229407
$$ packed form
7118B172548m7814l6853m3734m0943o4071k6361l4886m0009n6227k2336n6427
7107A702887k2628l7590m0902k4517l8734j5649k2188l3723l4909k8460k6524
7096A377063l0617k7583k9970l5785q734k4204l3275j5269k7620j6588l0494j4190
7084A082734k9633k5353j5011k0512k2704k8477k9635j7866l8064k5250m5263
7073G84966j2763l6905k9377k1459k7301j3082k3074j112q942k2321j266j6874
7061E70490p628o026j9656k0520j3698k842l2696J019j8580k1985l260j3328N799
7048D17089k7222N951r92j4141j3154O953l0034n484p900N277j3469q919j2689
7035C01266j3339m113K482j8706J1654p223r055m430J7602j5890k8038J9128k1931
$$ plain form
7022 229407 213334 223756 220201 225423 218610 228091 250364 259522 278006 272476 257412 225187 215488
7009 215488 190102 192611 174458 168946 168578 163105 154143 144742 155844 136875 152875 109028 125876
6996 125876 128960 115012 106394 104632 110185 93805 98350 100519 99649 97906 111898 121876 132582 148394
6982 148394 157827 165872 188450 176822 147645 140985 128471 111685 85800 82862 78764 71709 81428
6969 81428 70892 63069 65803 60302 49267 65556 59913 64101 68215 84013 85133 100142 129838
6956 129838 150034 194003 248100 315581 359501 374507 346200 288418 224348 195014 154202 127803
6944 127803 105666 98779 80046 77323 74733 68242 47427 74423 62129 62411 82269 91192 93397
6931 93397 107300 140909 153895 174021 227342 276513 332465 375721 415929 365479 311982 253775
$$ packed form
7022B29407j6073J0422l555N222o813R481K2273R158J8484n530j5064l2225r699
7009B15488k5386K509j8153n512l68n473q962r401J1102j8969J6000m3847J6848
6996A25876L084j3948q618j762N553j6380M545K169q70j743J3992R978J0706J5812
6982A48394R433Q045K2578j1628k9177o660j2514j6786k5885k938m098p055R719
6969H1428j0536p823K734n501j1035J6289n643M188M114J5798J120J5009K9696
6956A29838K0196M3969N4097O7481M3920J5006k8307n7782o4070k9334m0812k6399
6944A27803k2137o887j8733k723k590o491k0815K6996j2294K82J9858Q923K205
6931I3397J3903L3609J2986K0126N3321M9171N5952M3256M0208n0450n3497n8207
$$ plain form
6919 253775 204361 167977 124835 108621 78573 63491 47173 49495 34462 42930 25179 31239
6907 31239 42038 29635 23565 38905 35518 22720 43544 48606 45055 66843 93954 101049 103883
6894 103883 104218 83025 47758 63451 32152 24940 3316 5296 -13402 -18633 -19524 -16705 -29678
6881 -29678 -25291 -27974 -24983 -21908 -31076 -35903 -26034 -31549 -35345 -43698 -27853 -44516 -36643 -28368
6867 -28368 -29724 -28701 -25363 -15946 -28268 -26406 -14614 -38537 -33622 -34564 -40963 -35237 -22760 -32773
6853 -32773 -22237 -35038 -28067 -44475 -31537 -33641 -31239 -53918 -44525 -31543 -43357 -31823 -31449
6840 -31449 -45321 -46131 -40288 -39740 -42424 -44511 -32509 -31236 -50425 -49183 -47694 -50290 -54431 -46518
6826 -46518 -45627 -56838 -49700 -47462 -50413 -57266 -47769 -50279 -48672 -49455 -53994 -32007 -31723 -40575 -34674
$$ packed form
6919B53775m9414l6384m3142j6214l0048j5082j6318K322j5033Q468j7751O060
6907C1239J0799j2403o070J5340l387j2798K0824N062l551K1788K7111P095K834
6894A03883L35k1193l5267J5693l1299p212k1624J980j8698n231q91K819j2973
6881b9678M387k683K991L075r168m827R869n515l796q353J5845j6663P873Q275
6867b8368j356J023L338R417j2322J862J1792k3923M915r42o399N726J2477j0013
6853c2773J0536j2801O971j6408J2938k104K402k2679R393J2982j1814J1534L74
6840c1449j3872q10N843N48k684k087J2002J273j9189J242J489k596m141P913
6826d6518Q91j1211P138K238k951o853R497k510J607p83m539K1987K84q852N901
$$ plain form
6811 -34674 -30059 -44175 -37089 -34227 -51258 -57970 -49932 -43248 -44725 -48549 -48042 -59787 -43139 -48510
6797 -48510 -41960 -58049 -50019 -56277 -57750 -48411 -47527 -53603 -49268 -63673 -60459 -69872 -50682 -46009
6783 -46009 -54309 -36998 -52509 -53030 -58112 -46770 -47280 -45602 -52879 -48710 -66197 -50299 -41908 -36207
6769 -36207 -38561 -31809 -31118 -47455 -51584 -44061 -55658 -46301 -40506 -29895 -51457 -51310 -19628 -45029
6755 -45029 -43338 -49368 -44370 -61677 -48044 -42265 -48418 -48433 -38331 -46246 -52282 -43114 -43488 -42906 -21945
6740 -21945 -27763 -58303 -51357 -50714 -49487 -54338 -48682 -58820 -67745 -56468 -53633 -59440 -54311 -54414
6726 -54414 -48958 -45257 -41811 -64763 -48669 -38011 -50597 -45648 -23006 -20584 -23129 3954 6048
6713 6048 13106 12325 7166 6759 -20096 -33553 -23428 -32986 -33484 -38925 -23663 -52915 -28618 -42760
$$ packed form
6811c4674M615j4116P086K862j7031o712Q038O684j477l824N07j1745J6648n371
6797d8510O550j6089Q030o258j473R339Q84o076M335j4405L214r413J9190M673
6783d6009q300J7311j5511n21n082J1342n10J678p277M169j7487J5898Q391N701
6769c6207k354O752O91j6337m129P523j1597R357N795J0611k1562J47L1682k5401
6755d5029J691o030M998j7307J3633N779o153j5J0102p915o036R168l74N82K0961
6740b1945n818l0540O946O43J227m851N656j0138q925J1277K835n807N129j03
6726e4414N456L701L446k2952J6094J0658j2586M949K2642K422k545K7083K094
6713F048P058p81n159m07k6855j3457J0125r558m98n441J5262k9252K4297j4142
$$ plain form
6699 -42760 -52941 -44576 -52983 -37433 -48517 -37899 -40323 -33795 -29610 -22417 -23713 -12200 -191
6686 -191 12610 16235 26560 19165 -851 4977 -29494 -18859 -47756 -28250 -40542 -40141 -44313
6673 -44313 -48710 -43888 -61345 -57125 -62520 -39571 -48195 -59317 -48562 -54048 -52143 -36541 -39529
6660 -39529 -46753 -41529 -28377 -27532 -26785 -31766 -34950 -31664 -46674 -48556 -51593 -45440 -52793 -29616
6646 -29616 -39273 -50297 -52067 -39810 -48811 -54932 -39100 -60025 -57021 -62120 -41519 -46777 -48727
6633 -48727 -36347 -44972 -34031 -52674 -50999 -49000 -59832 -48456 -56532 -40657 -49897 -50039 -53813
6620 -53813 -48078 -53682 -74225 -49996 -47795 -69811 -65400 -68581 -64777 -64390 -55862 -57062 -66713 -54216
6606 -54216 -59300 -53090 -65830 -64258 -48907 -59566 -57438 -56160 -55062 -46751 -57530 -53557 -65279
$$ packed form
6699d2760j0181Q365q407J5550j1084J0618k424O528M185P193j296J1513J2009
6686a91J2801L625J0325p395k0016N828l4471J0635k8897J9506j2292M01m172
6673d4313m397M822j7457M220n395K2949q624j1122J0755n486J905J5602k988
6660c9529p224N224J3152Q45P47m981l184L286j5010j882l037O153p353K3177
6646b9616r657j1024j770J2257r001o121J5832k0925L004n099K0601n258j950
6633d8727J2380q625J0941j8643J675J999j0832J1376q076J5875r240j42l774
6620e3813N735n604k0543K4229K201k2016M411l181L804L87Q528j200r651J2497
6606e4216n084O210j2740J572J5351j0659K128J278J098Q311j0779L973j1722
$$ plain form
6593 -65279 -71631 -65534 -62299 -55283 -59980 -59908 -57930 -54660 -61744 -50076 -55566 -50008 -51443 -46192 -57014
6578 -57014 -42165 -46148 -66493 -52287 -38311 -44667 -33776 -33384 -28206 -40932 -24183 -32428 -25675
6565 -25675 -27097 -47534 -38540 -48366 -47003 -50818 -28810 -39077 -33900 -37255 -34136 -43861 -38054 -24125
6551 -24125 -34616 -28699 -37860 -41841 -33673 -35943 -30140 -31211 -7588 -39667 -24046 -37730 -40725
6538 -40725 -35378 -55097 -46627 -55546 -42313 -59412 -38283 -33215 -38965 -33993 -32057 -43266 -38804
6525 -38804 -48643 -35425 -50941 -55205 -44763 -38432 -55194 -40772 -32411 -28427 -38715 -36573 -45068
6512 -45068 -56120 -55169 -64545 -44310 -49164 -40949 -48518 -42430 -40028 -51137 -45335 -51214 -51674 -60774
6498 -60774 -40985 -45106 -45812 -45024 -38788 -34130 -45161 -44360 -35431 -56570 -43063 -48162 -53435 -54985
$$ packed form
6593f5279o352O097L235P016m697P2J978L270p084J1668n490N558j435N251j0822
6578e7014J4849l983k0345J4206J3976o356J0891L92N178j2726J6749q245O753
6565b5675j422k0437Q994r826J363l815K2008j0267N177l355L119r725N807J3929
6551b4125j0491N917r161l981Q168k270N803j071K3623l2079J5621j3684k995
6538d0725N347j9719Q470q919J3233j7099K1129N068n750M972J936j1209M462
6525c8804r839J3218j5516m264J0442O331j6762J4422Q361L984j0288K142q495
6512d5068j1052R51r376K0235m854Q215p569O088K402j1109N802n879m60r100
6498f0774J9789m121p06P88O236M658j1031Q01Q929k1139J3507n099n273j550
$$ plain form
6484 -54985 -33760 -46523 -51906 -39917 -36757 -31599 -30748 -35960 -60246 -36145 -38546 -32429 -50668
6471 -50668 -33543 -43206 -48507 -37142 -41591 -35846 -48785 -28000 -51135 -46945 -49785 -56404 -54353
6458 -54353 -41312 -37461 -37656 -38531 -26380 -35178 -12902 -45762 -21930 -27719 -29924 -40975 -36267 -34673
6444 -34673 -38800 -46416 -45591 -42136 -38435 -35667 -28250 -37941 -24774 -38496 -33565 -38755 -41501 -42694
6430 -42694 -41917 -30538 -42638 -20519 -24678 -28648 -25027 -20745 -26236 -25070 -27559 -38742 -36072 -25209
6416 -25209 -40119 -25129 -32729 -37191 -36759 -21144 -36913 -45233 -48361 -28479 -34546 -46125 -18448
6403 -18448 -41060 -39839 -43772 -30723 -37291 -33910 -33733 -35924 -40891 -43259 -36070 -44057 -40830 -27382
6389 -27382 -50915 -45754 -55048 -54120 -38666 -38904 -37789 -38268 -34323 -45257 -29767 -37194 -34776 -31601
$$ packed form
6484e4985K1225j2763n383J1989L160N158Q51n212k4286K4101k401O117j8239
6471e0668J7125r663n301J1365m449N745j2939K0785k3135M190k840o619K051
6458e4353J3041L851j95q75J2151q798K2276l2860K3832n789k205j1051M708J594
6444c4673m127p616Q25L455L701K768P417r691J3167j3722M931n190k746j193
6430d2694P77J1379j2100K2119m159l970L621M282n491J166k489j1183K670J0863
6416b5209j4910J4990p600m462M32J5615j5769q320l128J9882o067j1579K7677
6403a8448k2612J221l933J3049o568L381J77k191m967k368P189p987L227J3448
6389b7382k3533N161r294R28J5454k38J115m79L945j0934J5490p427K418L175
$$ plain form
6375 -31601 -33928 -37498 -29783 -46027 -32321 -19217 -23837 -48648 -48335 -35275 -45159 -39537 -18285
6362 -18285 -25272 -46014 -21901 -14534 -36628 -44808 -4392 -22747 -22632 -21915 -23978 -32638 -35046 -23019
6348 -23019 -14595 -10090 -17830 -26236 -17966 -26011 -27918 -26739 -19326 -23944 -34051 -17415 -12723 -23641
6334 -23641 -17221 -5900 -28211 -24051 -23136 -15784 -15970 -14463 -11032 -7505 14948 12875 6919 2013
6320 2013 6162 -6696 4967 -6571 -7634 -8042 -11676 -1019 -4541 -5270 -6028 4771 -4918 2636
6306 2636 7619 7958 12011 1971 13509 15391 9487 -5770 9026 5226 15052 8681 17472 13681
6292 13681 11628 21911 23273 17597 29106 16463 27237 30847 35814 32805 35335 33324 34780 43973
6278 43973 37771 33094 35158 41792 45937 42292 52588 62880 57856 51339 62837 63144 60355 55275
$$ packed form
6375c1601k327l570P715j6244J3706J3104m620k4811L13J3060r884N622K1252
6362a8285o987k0742K4113P367k2094q180M0416j8355J15P17k063q660k408J2027
6348b3019Q424M505p740q406Q270q045j907J179P413m618j0107J6636M692j0918
6334b3641O420J1321k2311M160R15P352j86J507L431L527K2453k073n956m906
6320B013M149j2858J1663j1538j063m08l634J0657l522p29p58J0799r689P554
6306B636M983L39M053j0040J1538J882n904j5257J4796l800R826o371Q791l791
6292A3681k053J0283J362n676J1509j2643J0774L610M967l009K530k011J456R193
6278D3973o202m677K064O634M145l645J0296J0292n024o517J1498L07k789n080
$$ plain form
6264 55275 54768 54715 67607 76098 85682 82429 90845 79457 87399 97117 95244 95728 109936 115568 114850
6249 114850 120789 123052 140025 149958 149274 155528 157472 184376 179202 209645 225816 230759 251989
6236 251989 265833 302369 339107 421066 473357 526344 548926 535300 526362 490555 519854 502388
6224 502388 505014 513222 546756 561089 592671 650063 671474 724050 763662 811578 825973 871875
6212 871875 887047 905214 929301 944176 979995 998814 1092790 1217148 1358565 1461114 1469532
6201 1469532 1389108 1229048 1161842 1102477 1071392 1062166 1068194 1082647 1095824 1144982 1196932 1244590
6189 1244590 1283978 1364547 1409079 1430745 1462168 1487019 1474451 1458323 1454261 1436566 1453626 1485731
6177 1485731 1564038 1647982 1687340 1648594 1479690 1309420 1160074 1062964 997714 927311 886552
$$ packed form
6264E5275n07n3J2892Q491R584l253Q416j1388P942R718j873M84J4208N632p18
6249A14850N939K263J6973R933o84O254J944K6904n174L0443J6171M943K1230
6236B51989J3844L6536L6738Q1959N2291N2987K2582j3626q938l5807K9299j7466
6224E02388K626Q208L3534J4333L1582N7392K1411N2576L9612M7916J4395M5902
6212H71875J5172J8167K4087J4875L5819J8819R3976J24358J41417J02549Q418
6201A469532q0424j60060o7206n9365l1085r226O028J4453J3177M9158N1950M7658
6189A244590L9388Q0569M4532K1666L1423K4851j2568j6128m062j7695J7060L2105
6177A485731P8307Q3944L9358l8746j68904j70270j49346r7110o5250p0403m0759
$$ plain form
6166 886552 848439 852968 832464 840108 854227 862795 880334 900113 924332 910200 898498 901276
6154 901276 867780 849864 819005 782006 783670 786493 783239 757307 733575 647930 575996 513397
6142 513397 466691 427475 391368 355473 334998 315985 303724 292382 281964 268150 249840 248802
6130 248802 255182 239995 231723 225869 213892 209945 209120 200079 221580 202750 210494 208585 197085
6117 197085 196624 195881 195116 198127 187889 181770 191937 196476 186215 207711 197450 198924 195026 185664
6103 185664 204640 188845 203408 195765 205276 193773 209280 204284 200336 207444 212782 209593 217140
6090 217140 217724 219193 208147 221286 232801 216495 216845 226124 226578 235401 228268 242256 243402 242867
6076 242867 253707 250616 250419 268013 267115 265089 270331 268856 271022 287532 276064 284901 270722 295502
$$ packed form
6166H86552l8113M529k0504P644J4119Q568J7539J9779K4219j4132j1702K778
6154I01276l3496j7916l0859l6999J664K823l254k5932k3732q5645p1934o2599
6142E13397m6706l9216l6107l5895k0475j9013j2261j1342j0418j3814j8310j038
6130B48802O380j5187q272n854j1977l947q25r041K1501j8830P744j909j1500
6117A97085m61p43p65L011j0238o119J0167M539j0261K1496j0261J474l898r362
6103A85664J8976j5795J4563p643R511j1503J5507m996l948P108N338l189P547
6090B17140N84J469j1046J3139J1515j6306L50R279M54Q823p133J3988J146n35
6076B42867J0840l091j97J7594q98k026N242j475K166J6510j1468Q837j4179K4780
$$ plain form
6062 295502 297219 279966 277505 291507 289533 281960 282897 283821 280386 285313 291739 287827 289124 299721
6048 299721 298024 300509 306766 291741 298608 306896 308397 298725 297223 297261 300095 308163 307815 314931 322912
6033 322912 324917 325402 322686 324708 323402 337293 321002 326513 325831 317837 339621 340533 352272 349898
6019 349898 352255 347981 366383 349893 356046 364486 365657 378182 390136 393877 396067 416359 422426
6006 422426 436272 433423 444259 442642 448861 461630 469010 485413 494764 514016 529005 545762 559122
5993 559122 559473 585350 584654 608913 633731 648368 670661 696267 745631 770659 807973 849397
5981 849397 887593 907754 965692 1012532 1090630 1165222 1260448 1370321 1480744 1598799 1751057
5970 1751057 1969211 2276117 2723076 3297037 3921919 4427835 4587161 4606238 4849445 5441649
$$ packed form
6062B95502J717j7253k461J4002j974p573R37R24l435M927O426l912J297J0597
6048B99721j697K485O257j5025O867Q288J501r672j502L8K834Q068l48P116P981
6033C22912K005M85k716K022j306J3891j6291N511o82p994K1784R12J1739k374
6019C49898K357m274J8402j6490O153Q440J171J2525J1954L741K190K0292O067
6006D22426J3846k849J0836j617O219J2769P380J6403R351J9252J4989J6757J3360
5993E59122L51K5877o96K4259K4818J4637K2293K5606M9364K5028L7314M1424
5981H49397L8196K0161N7938M6840P8098P4592R5226J09873J10423J18055J52258
5970A751057K18154L06906M46959N73961O24882N05916J59326J9077K43207N92204
$$ plain form
5960 5441649 6324747 7166936 7569416 7254399 6940735 7157738 7947906 8948067 9674478
5951 9674478 9292294 8125010 7241293 6955024 7116127 7411742 7287342 6455448 5468901
5942 5468901 4834462 4576352 4535980 4452119 4078635 3445612 2852918 2427042 2125686 1931595
5932 1931595 1787278 1679577 1605219 1569611 1528177 1533409 1529027 1499172 1505026 1499498 1501159 1492245
5920 1492245 1492678 1488600 1478030 1492805 1500027 1498519 1479138 1470514 1461613 1415063 1395577 1368539 1321978
5907 1321978 1300049 1266384 1243184 1210097 1214484 1231114 1221164 1225363 1255507 1281507 1300569 1336087
5895 1336087 1374568 1408399 1451839 1500787 1549868 1609222 1662005 1730556 1787585 1833607 1872426
5884 1872426 1879832 1868413 1827390 1772581 1704953 1625475 1521010 1436601 1345349 1264523 1178184
$$ packed form
5960E441649Q83098Q42189M02480l15017l13664K17003P90168J000161P26411
5951I674478l82184j167284q83717k86269J61103K95615j24400q31894r86547
5942E468901o34439k58110m0372q3861l73484o33023n92694m25876l01356j94091
5932A931595j44317j07701p4358l5608m1434N232m382k9855N854n528J661q914
5920A492245M33m078j0570J4775P222j508j9381q624q901m6550j9486k7038m6561
5907A321978k1929l3665k3200l3087M387J6630r950M199L0144K6000J9062L5518
5895A336087L8481L3831M3440M8948M9081N9354N2783O8551N7029M6022L8819
5884A872426P406j1419m1023n4809o7628p9478j04465q4409r1252q0826q6339
$$ plain form
5873 1178184 1134533 1093354 1041743 1031476 995017 987356 968538 979610 971106 991778 994581 998887
5861 998887 1037795 1069923 1100592 1132922 1165505 1180399 1187128 1172876 1172747 1136152 1112428 1059609
5849 1059609 1011783 957508 913576 853014 801883 772592 741577 698446 673898 649925 617612
5838 617612 595179 570618 567444 539240 521573 518676 509661 497914 496130 498006 492979 474053 477982
5825 477982 481802 468290 474736 452796 467686 460146 463636 461355 473470 477290 465508 482499 494221
5812 494221 504997 492890 518853 514766 523647 522813 552047 558628 547662 576211 579276 588939 588046
5799 588046 607829 593447 632378 632862 644186 668059 664872 701006 714585 721631 753430 766848
5787 766848 766815 791390 805453 823277 864625 882216 915435 953005 986004 1033078 1088280 1126813
$$ packed form
5873A178184m3651m1179n1611j0267l6459p661j8818J1072q504K0672K803M306
5861I98887L8908L2128L0669L2330L2583J4894O729j4252j29l6595k3724n2819
5849A059609m7826n4275m3932o0562n1131k9291l1015m3131k4548k3973l2313
5838F17612k2433k4561l174k8204j7667k897r015j1747j784J876n027j8926L929
5825D77982L820j3512O446k1940J4890p540L490k281J2115L820j1782J6991J1722
5812D94221J0776j2107K5963m087Q881q34K9234O581j0966K8549L065R663q93
5799E88046J9783j4382L8931M84J1324K3873l187L6134J3579P046L1799J3418
5787G66848l3K4575J4063J7824M1348J7591L3219L7570L2999M7074N5202L8533
$$ plain form
5775 1126813 1189065 1237896 1306733 1373144 1437938 1520807 1588147 1653676 1729879 1792601 1855042
5764 1855042 1883753 1938279 1973998 2004147 2034632 2050002 2089286 2107779 2137705 2162496 2199243
5753 2199243 2222890 2251817 2312389 2338602 2388068 2434416 2484291 2551352 2622547 2701112 2786672
5742 2786672 2895182 2993569 3097120 3184917 3296396 3367276 3414176 3460415 3448851 3413099 3357627
5731 3357627 3285698 3183804 3096793 2987421 2911625 2825208 2750596 2696316 2653571 2618553 2595311
5720 2595311 2563792 2554827 2550353 2551748 2536210 2556746 2566808 2587397 2608387 2639304 2685827 2695969
5708 2695969 2738909 2762278 2771332 2754633 2755522 2718771 2677602 2639823 2615661 2605627 2617461 2649729
5696 2649729 2689246 2732932 2760132 2835437 2859472 2875435 2867376 2866435 2831309 2819412 2793077 2766647
$$ packed form
5775A126813O2252M8831O8837O6411O4794Q2869O7340O5529P6203O2722O2441
5764A855042K8711N4526L5719L0149L0485J5370L9284J8493K9926K4791L6747
5753B199243K3647K8927O0572K6213M9466M6348M9875O7061P1195P8565Q5560
5742B786672J08510R8387J03551Q7797J11479P0880M6900M6239j1564l5752n5472
5731C357627p1929j01894q7011j09372p5796q6417p4612n4280m2745l5018k3242
5720B595311l1519q965m474J395j5538K0536J0062K0589K0990L0917M6523J0142
5708B695969M2940K3369R054j6699Q89l6751m1169l7779k4162j0034J1834L2268
5696B649729L9517M3686K7200P5305K4035J5963q059r41l5126j1897k6335k6430
$$ plain form
5684 2766647 2780731 2773602 2790175 2786103 2799112 2808313 2817386 2827358 2845947 2883784 2920756 2959149
5672 2959149 2990376 3031035 3086952 3109421 3208589 3260444 3304065 3341214 3415175 3435828 3434892 3451032
5660 3451032 3438673 3412683 3364839 3335499 3250696 3188219 3111916 3053920 2967492 2913612 2833251
5649 2833251 2777801 2705081 2659498 2602869 2541801 2484717 2417871 2344639 2281317 2239867 2207627
5638 2207627 2197956 2193060 2198422 2195916 2209564 2212671 2187637 2163668 2106503 2044930 1967940 1897031
5626 1897031 1821983 1738677 1682213 1621534 1540942 1477430 1397551 1318402 1217000 1151079 1078808
5615 1078808 1001451 944710 883131 837810 802136 759733 713972 669852 643618 620935 581806
5604 581806 583920 565766 535502 536777 535378 513317 504854 513354 502563 473636 481018 480414 464439
$$ packed form
5684B766647J4084p129J6573m072J3009R201R073R972J8589L7837L6972L8393
5672B959149L1227M0659N5917K2469R9168N1855M3621L7149P3961K0653r36J6140
5660C451032j2359k5990m7844k9340q4803o2477p6303n7996q6428n3880q0361
5649B833251n5450p2720m5583n6629o1068n7084o6846p3232o3322m1450l2240
5638B207627r671m896N362k506J3648L107k5034k3969n7165o1573p6990p0909
5626A897031p5048q3306n6464o0679q0592o3512p9879p9149j01402o5921p2271
5615A078808p7357n6741o1579m5321l5674m2403m5761m4120k6234k2683l9129
5604E81806K114j8154l0264J275j399k2061q463Q500j0791k8927P382o04j5975
$$ plain form
5591 464439 460807 459664 463939 432938 443688 449614 436937 462607 456026 461103 470602 476976 480978
5578 480978 486630 506387 520678 533957 551928 566925 585050 620833 650811 676420 684468 710023
5566 710023 726990 751734 791313 802375 834667 878507 915286 940609 987488 1028906 1047361 1083822
5554 1083822 1127947 1150224 1189409 1201642 1227888 1250531 1252084 1257333 1268543 1275416 1303434 1301138
5542 1301138 1324859 1354394 1390157 1410452 1463018 1503213 1553456 1608795 1655701 1681457 1737856
5531 1737856 1766866 1810811 1822839 1826759 1815689 1798640 1789299 1733237 1676577 1627620 1571418 1522869
5519 1522869 1454425 1422286 1366281 1326130 1292594 1247680 1222797 1193808 1179301 1151606 1140452
5508 1140452 1104347 1087968 1062378 1031100 988645 951725 915949 860379 830842 760755 729395
$$ packed form
5591D64439l632j143M275l1001J0750N926j2677K5670o581N077R499O374M002
5578D80978N652J9757J4291J3279J7971J4997J8125L5783K9978K5609Q048K5555
5566G10023J6967K4744L9579J1062L2292M3840L6779K5323M6879M1418J8455L6461
5554A083822M4125K2277L9185J2233K6246K2643J553N249J1210O873K8018k296
5542A301138K3721K9535L5763K0295N2566M0195N0243N5339M6906K5756N6399
5531A737856K9010M3945J2028L920j1070j7049r341n6062n6660m8957n6202m8549
5519A522869o8444l2139n6005m0151l3536m4914k4883k8989j4507k7695j1154
5508A140452l6105j6379k5590l1278m2455l6920l5776n5570k9537p0087l1360
$$ plain form
5497 729395 668219 641484 587582 547342 508836 481924 452628 421798 396525 376072 347606 338333
5485 338333 318413 311068 303945 272721 269173 259322 242056 245046 244967 219658 214780 216632 201471 200274
5471 200274 196238 184577 160265 176790 159724 143309 145214 145660 143040 124110 139416 133210 114311
5458 114311 117227 107967 103540 102109 95327 76821 103117 91846 85753 104501 93880 89014 74911
5445 74911 81782 80319 85030 70222 84507 79389 86260 89873 84629 92983 83101 76247 79464 112705
5431 112705 79064 79802 94103 82213 78230 91292 103590 88653 88903 85077 91530 80904 79362
5418 79362 73643 64914 80560 69956 69576 66503 71355 45849 66660 66176 55570 50773 55468 54625
5404 54625 33370 37515 32348 37616 44278 48479 53226 42263 52235 38944 41476 50732 38280 38839
$$ packed form
5497G29395o1176k6735n3902m0240l8506k6912k9296l0830k5273k0453k8466r273
5485C38333j9920p345p123l1224l548r851j7266K990p9k5309m878J852j5161j197
5471B00274m036j1661k4312J6525j7066j6415J905M46k620j8930J5306o206j8899
5458A14311K916r260m427j431o782j8506K6296j1271o093J8748j0621m866j4103
5445G4911O871j463M711j4808J4285n118O871L613n244Q354r882o854L217L3241
5431A12705l3641P38J4301j1890l983J3062J2298j4937K50l826O453j0626j542
5418G9362n719q729J5646j0604l80l073M852k5506K0811m84j0606m797M695q43
5404E4625k1255M145n167N268O662M201M747j0963R972j3291K532R256j2452N59
$$ plain form
5390 38839 23082 41257 23673 34631 22059 33920 47170 31880 32245 43503 43564 43533 47820 37813
5376 37813 20982 34496 35042 34407 23749 31096 30983 32132 33531 29222 27894 29823 42091 23816
5362 23816 30102 16833 32064 16910 30127 37202 32114 26068 28332 25919 9572 12984 22221
5349 22221 3788 9483 16378 15281 2825 6142 24413 12790 9290 15517 6483 15050 10483 25354
5335 25354 7086 14418 20339 20827 13814 15237 23525 12173 18348 10868 16015 21757 16196 21545
5321 21545 20895 23946 17636 31122 39588 34339 36878 46145 44972 48400 50125 51099 42342 58008 52088
5306 52088 56886 67536 55114 72216 68548 73511 78473 67240 81073 75858 84955 78865 97828
5293 97828 82011 84916 97309 106212 103097 93692 113401 122900 110965 112092 125918 119136 109310
$$ packed form
5390C8839j5757J8175j7584J0958j2572J1861J3250j5290L65J1258O1l1M287j0007
5376C7813j6831J3514N46o35j0658P347j13J149J399m309j328J929J2268j8275
5362B3816O286j3269J5231j5154J3217P075n088o046K264k413j6347L412R237
5349B2221j8433N695O895j097j2456L317J8271j1623l500O227r034Q567m567J4871
5335B5354j8268P332N921M88p013J423Q288j1352O175p480N147N742n561N349
5321B1545o50L051o310J3486Q466n249K539R267j173L428J725R74q757J5666n920
5306E2088M798J0650j2422J7102l668M963M962j1233J3833n215R097o090J8963
5293I7828j5817K905J2393Q903l115r405J9709R499j1935J127J3826o782r826
$$ plain form
5280 109310 99344 110925 109843 89769 105017 103192 93822 80142 98882 86031 83081 72713 83280
5267 83280 79190 77600 72230 89735 85649 92377 84209 85701 75057 81437 73464 75439 59911 62720
5253 62720 65163 62287 58411 50331 66404 59633 64625 62253 45562 49851 65731 60425 54143 72918
5239 72918 65353 63034 63603 70891 52462 81658 71767 73603 65257 88822 77429 73906 96471 97042
5225 97042 93725 98335 110364 99448 122361 129724 161296 156810 157053 165348 161265 167142 162588 167234
5211 167234 156135 155556 163505 163990 192166 183471 208188 207509 203023 225414 225762 242309 256099 267111
5197 267111 288764 318735 336714 355259 382736 420884 467209 496582 515224 540231 563260 574147
5185 574147 571199 564589 567150 549797 538403 537679 528359 516389 532146 534146 539493 543602 569742
$$ packed form
5280A09310r966J1581j082k0074J5248j825r370j3680J8740j2851k950j0368J0567
5267H3280m090j590n370J7505m086O728q168J492j0644O380p973J975j5528K809
5253F2720K443k876l876q080J6073o771M992k372j6691M289J5880n306o282J8775
5239G2918p565k319N69P288j8429K9196r891J836q346K3565j1393l523K2565N71
5225I7042l317M610J2029j0916K2913P363L1572m486K43Q295m083N877m554M646
5211A67234j1099n79P949M85K8176q695K4717o79m486K2391L48J6547J3790J1012
5197B67111K1653K9971J7979J8545K7477L8148M6325K9373J8642K5007K3029J0887
5185E74147k948o610K561j7353j1394p24r320j1970J5757K000N347M109K6140
$$ plain form
5172 569742 566798 593513 619116 654670 672313 695799 755456 791252 838726 899505 957074 1003628
5160 1003628 1052610 1120751 1156058 1186272 1199774 1188919 1173618 1119762 1096649 1047120 1015935
5149 1015935 975736 934561 924502 903698 894449 880820 890367 876233 899051 908177 933321 957911
5137 957911 966876 1016416 1047887 1099681 1150880 1217174 1256424 1300535 1345438 1363684 1377510 1361397
5125 1361397 1338633 1278602 1243240 1183338 1104694 1053980 989227 946748 909003 881519 841924
5114 841924 812889 801169 792412 794011 769608 783950 775252 773106 773821 787541 795313 808422 826682
5101 826682 841588 849405 868930 863333 875602 844023 802799 782519 738081 697942 636112 612218
5089 612218 558215 529628 507968 474043 451496 427305 429640 402880 396035 381394 353072 353914
$$ packed form
5172E69742k944K6715K5603L5554J7643K3486N9657L5796M7474O0779N7569M6554
5160A003628M8982O8141L5307L0214J3502j0855j5301n3856k3113m9529l1185
5149A015935m0199m1175j0059k0804r249j3629R547j4134K2818R126K5144K4590
5137I57911Q965M9540L1471N1794N1199O6294L9250M4111M4903J8246J3826j6113
5125A361397k2764o0031l5362n9902p8644n0714o4753m2479l7745k7484l9595
5114H41924k9035j1720q757J599k4403J4342q698k146P15J3720P772J3109J8260
5101H26682J4906P817J9525n597J2269l1579m1224k0280m4438m0139o1830k3894
5089F12218n4003k8587k1660l3925k2547k4191K335k6760o845j4641k8322Q42
$$ plain form
5077 353914 334707 343595 324190 319720 316597 313831 301210 295974 302406 280919 281286 268215 275159
5064 275159 248046 241842 227159 215198 194343 185770 173445 161518 161167 150895 148961 134694 150998
5051 150998 141771 137091 117635 120563 116133 113098 95992 84033 86162 95621 98236 89757 97348 81791
5037 81791 92906 86186 89330 73238 70953 75875 78460 74402 80978 71939 74869 76774 85308 63215
5023 63215 66986 72088 79569 77409 73010 69531 68553 66065 62826 61947 63784 63627 57915 65870 57607
5008 57607 55700 65515 64616 52691 61328 54292 60183 65840 65575 67084 59258 72583 63046 51367
4994 51367 59885 66765 40178 58149 72302 68990 48975 71588 67544 74812 73997 77440 60043
4981 60043 64727 61382 84570 68037 81557 78461 84729 85885 87010 101924 88067 99052 67468
$$ packed form
5077C53914j9207Q888j9405m470l123k766j2621n236O432k1487L67j3071O944
5064B75159k7113o204j4683j1961k0855q573j2325j1927l51j0272j934j4267J6304
5051A50998r227m680j9456K928m430l035j7106j1959K129R459K615q479P591j5557
5037H1791J1115o720L144j6092k285M922K585m058O576r039K930J905Q534k2093
5023F3215L771N102P481k160m399l479r78k488l239q79J837j57n712P955q263
5008E7607j907R815q99j1925Q637p036N891N657k65J509p826J3325r537j1679
4994E1367Q518O880k6587J7971J4153l312k0015K2613m044P268q15L443j7397
4981F0043M684l345K3188j6533J3520l096O268J156J125J4914j3857J0985l1584
$$ plain form
4968 67468 96344 83792 87224 93576 101530 107043 107573 114563 114608 111919 109566 119324 125872 121978 133887
4953 133887 140080 132473 147986 142045 150356 155416 152224 152831 168508 176808 180429 182809 185090 203139
4939 203139 218520 240280 282129 267747 253096 252362 249593 260604 246296 265978 266411 280018 271808
4926 271808 289650 309409 308224 328124 355780 357790 362159 372177 402499 411396 427791 449453
4914 449453 476764 499973 525078 530915 538599 551974 555478 566031 587648 602347 621924 654427
4902 654427 655819 679406 703075 720282 744114 758655 763728 796054 819937 838636 849266 890919
4890 890919 918741 947741 992950 1034065 1073497 1092895 1144291 1201101 1241282 1305585 1365688 1432819
4878 1432819 1517129 1597729 1701963 1773815 1836801 1853564 1849196 1828655 1808331 1797233 1814974
$$ packed form
4968F7468K8876j2552L432O352P954N513N30O990M5k689k353R758O548l894J1909
4953A33887O193p607J5513n941Q311N060l192O07J5677Q300L621K380K281J8049
4939B03139J5381K1760M1849j4382j4651p34k769J1011j4308J9682M33J3607q210
4926B71808J7842J9759j185J9900K7656K010M369J0018L0322Q897J6395K1662
4914D49453K7311K3209K5105N837P684J3375L504J0553K1617J4699J9577L2503
4902F54427J392K3587K3669J7207K3832J4541N073L2326K3883J8699J0630M1653
4890H90919K7822K9000M5209M1115L9432J9398N1396N6810M0181O4303O0103O7131
4878A432819Q4310Q0600J04234P1852O2986J6763m368k0541k0324j1098J7741
$$ plain form
4867 1814974 1834985 1858408 1916412 1978818 2042234 2131900 2227992 2320211 2425257 2538882 2635923
4856 2635923 2729917 2810457 2871994 2902347 2902421 2918229 2904994 2905952 2899119 2914176 2897759 2891209 2916013
4843 2916013 2902025 2903530 2909707 2915504 2909373 2917998 2926523 2944629 2946083 2941123 2934977 2927681 2872271
4830 2872271 2826465 2741316 2649408 2556037 2449623 2343978 2249283 2145103 2056432 1970934 1914381
4819 1914381 1849053 1796669 1743733 1704076 1664255 1630423 1608436 1569245 1551803 1519248 1478103
4808 1478103 1452444 1419746 1372757 1330025 1297529 1234168 1201292 1163280 1133128 1079512 1044414
4797 1044414 1020312 980593 953696 923922 899113 853056 845583 828590 821919 808289 787221 756558
4785 756558 771399 744153 737201 708402 713599 695747 670009 671118 652487 656042 633583 638357 624979
$$ packed form
4867A814974K0011K3423N8004O2406O3416Q9666R6092R2219J05046J13625R7041
4856B635923R3994Q0540O1537L0353P4J5808j3235R58o833J5057j6417o550K4804
4843B916013j3988J505O177N797o131Q625Q525J8106J454m960o146p296n5410
4830B872271m5806q5149r1908r3371j06414j05645r4695j04180q8671q5498n6553
4819A914381o5328n2384n2936l9657l9821l3832k1987l9191j7442l2555m1145
4808A478103k5659l2698m6989m2732l2496o3361l2876l8012l0152n3616l5098
4797A044414k4102l9719k6897k9774k4809m6057p473j6993o671j3630k1068l0663
4785G56558J4841k7246o952k8799N197j7852k5738J109j8631L555k2459M774j3378
$$ plain form
4772 624979 616104 605059 591502 604184 578377 583774 580487 587697 572188 584991 583822 588481 582165
4759 582165 585543 589412 587983 590177 610941 618350 634870 641759 654355 685497 709743 719625 740930
4746 740930 779966 816018 829970 893362 906988 952144 973694 1044669 1040594 1074422 1114343 1146845
4734 1146845 1163170 1178306 1217299 1243357 1261051 1307385 1345606 1370022 1416989 1472846 1505927
4723 1505927 1563494 1625425 1692525 1764726 1818132 1888839 1977123 2061080 2160863 2247105 2330971
4712 2330971 2421498 2500639 2551819 2620939 2651430 2713612 2731604 2756464 2771566 2799519 2810323
4701 2810323 2825928 2819399 2827539 2839771 2860800 2872253 2906685 2954335 2989374 3045810 3103778 3164595
4689 3164595 3246296 3320995 3391066 3451057 3521913 3584534 3627713 3649418 3676306 3675213 3668229 3656602
$$ packed form
4772F24979q875j1045j3557J2682k5807N397l287P210j5509J2803j169M659o316
4759E82165L378L869j429K194K0764P409J6520O889J2596L1142K4246R882K1305
4746G40930L9036L6052J3952O3392J3626M5156K1550P0975m075L3828L9921L2502
4734A146845J6325J5136L8993K6058J7694M6334L8221K4416M6967N5857L3081
4723A505927N7567O1931O7100P2201N3406P0707Q8284Q3957R9783Q6242Q3866
4712B330971R0527P9141N1180O9120L0491O2182J7992K4860J5102K7953J0804
4701B810323J5605o529Q140J2232K1029J1453L4432M7650L5039N6436N7968O0817
4689C164595Q1701P4699P0071N9991P0856O2621M3179K1705K6888j093o984j1627
$$ plain form
4677 3656602 3620029 3592774 3559409 3524580 3467175 3423727 3370547 3328602 3277289 3235002 3188331
4666 3188331 3138377 3101472 3082518 3042410 3012344 3018911 3001390 2992015 2971005 2990205 2959380 2959841
4654 2959841 2958043 2942368 2893422 2871444 2817898 2759801 2687678 2613439 2533503 2447643 2372040 2268679
4642 2268679 2193965 2124235 2054885 1999431 1933964 1865352 1812195 1776581 1723885 1680146 1669238
4631 1669238 1610599 1594845 1559747 1562893 1524915 1518314 1481878 1446891 1398716 1349090 1311205 1235850
4619 1235850 1191160 1125157 1085384 1045176 994905 982096 944040 924525 893813 881648 857290
4608 857290 823317 828662 795651 797289 763504 785766 759700 751657 741872 728984 730292 710423 688051
4595 688051 679002 677459 644232 647717 636975 635657 626854 634647 630933 621251 615743 607198 608107 620099
$$ packed form
4677C656602l6573k7255l3365l4829n7405m3448n3180m1945n1313m2287m6671
4666C188331m9954l6905j8954m0108l0066O567j7521r375k1010J9200l0825M61
4654B959841j798j5675m8946k1978n3546n8097p2123p4239p9936q5860p5603j03361
4642B268679p4714o9730o9350n5454o5467o8612n3157l5614n2696m3739j0908
4631A669238n8639j5754l5098L146l7978o601l6436l4987m8175m9626l7885p5355
4619A235850m4690o6003l9773m0208n0271j2809l8056j9515l0712j2165k4358
4608H57290l3973N345l3011J638l3785K2262k6066q043r785j2888J308j9869k2372
4595F88051r049j543l3227L485j0742j318q803P793l714r682n508q545R09J1992
$$ plain form
4581 620099 612986 613634 615597 630206 640201 644470 654544 643532 664146 662195 661577 674705 681769 687244
4567 687244 677723 717599 721685 723191 729086 759247 762142 770499 787856 811609 808954 831607 849492
4554 849492 887428 891470 927535 944988 961213 955183 970677 998316 1013222 1020991 1032625 1070158
4542 1070158 1084252 1108860 1115359 1147093 1164622 1180801 1206797 1224682 1269850 1276233 1350187 1371054
4530 1371054 1433271 1466999 1543589 1610470 1685711 1781243 1889678 2001251 2112484 2235870 2374898
4519 2374898 2494218 2629664 2744709 2880160 2978752 3104705 3228791 3348176 3442270 3527751
4509 3527751 3592377 3620047 3652273 3697857 3742916 3788523 3871940 3948380 4035484 4098697 4175671
4498 4175671 4226165 4294595 4358432 4416450 4463528 4544786 4621561 4675574 4722783 4747999 4769476
$$ packed form
4581F20099p113O48J963J4609R995M269J0074j1012K0614j951o18J3128P064N475
4567F87244r521L9876M086J506N895L0161K895Q357J7357K3753k655K2653J7885
4554H49492L7936M042L6065J7453J6225o030J5494K7639J4906P769J1634L7533
4542A070158J4094K4608O499L1734J7529J6179K5996J7885M5168O383P3954K0867
4530A371054O2217L3728P6590O6881P5241R5532J08435J11573J11233J23386J39028
4519B374898J19320J35446J15045J35451R8592J25953J24086J19385R4094Q5481
4509C527751O4626K7670L2226M5584M5059M5607Q3417P6440Q7104O3213P6974
4498D175671N0494O8430O3837N8018M7078Q1258P6775N4013M7209K5216K1477
$$ plain form
4487 4769476 4758481 4777964 4780301 4792888 4786905 4753640 4678491 4570988 4444742 4291672 4157570
4476 4157570 4037729 3897586 3813726 3697796 3624932 3532099 3462874 3390339 3333665 3276887 3200391
4465 3200391 3128472 3019222 2914756 2799707 2696861 2593845 2505698 2437720 2375349 2304133
4455 2304133 2250230 2205433 2166906 2100538 2045153 1976498 1900836 1837461 1811830 1780291 1778981 1756023
4443 1756023 1704530 1588449 1485203 1383865 1330314 1257792 1197365 1155476 1117706 1079642 1041469
4432 1041469 1015006 992420 983575 965976 964503 943722 935716 924049 939090 924841 945984 969369
4420 969369 1042611 1138792 1243095 1368732 1457404 1397507 1247616 1083537 941342 844395 762380
4409 762380 694598 647471 593397 567750 536808 518330 500664 487862 483879 457452 470993 452744
$$ packed form
4487D769476j0995J9483K337J2587n983l3265p5149j07503j26246j53070j34102
4476D157570j19841j40143q3860j15930p2864r2833o9225p2535n6674n6778p6496
4465C200391p1919j09250j04466j15049j02846j03016q8147o7978o2371p1216
4455B304133n3903m4797l8527o6368n5385o8655p5662o3375k5631l1539j310k2958
4443A756023n1493j16081j03246j01338n3551p2522o0427m1889l7770l8064l8173
4432A041469k6463k2586q845j7599j473k0781q006j1667J5041j4249K1143K3385
4420I69369P3242R6181J04303J25637Q8672n9897j49891j64079j42195r6947q2015
4409G62380o7782m7127n4074k5647l0942j8478j7666j2802l983k6427J3541j8249
$$ plain form
4397 452744 475378 478272 504577 524431 573349 625886 705595 763503 807812 829047 778939 719962
4385 719962 639138 580038 505519 482655 450665 406437 400014 371235 359485 352160 350202 352590
4373 352590 341300 354043 350222 351818 351618 363064 372969 360969 386814 406835 432555 434285 424366
4360 424366 436425 429589 418034 442641 446371 435662 470378 483049 493702 497134 539309 556514
4348 556514 565571 573301 568060 543221 508900 478286 437731 362319 339600 321041 292332 258472
4336 258472 247133 241202 233931 228512 215805 211858 187343 202342 206398 189650 191683 203086 196011
4323 196011 199024 213171 186393 196989 188841 184424 176655 169179 171778 154142 163269 154397 157032
4310 157032 147060 158620 153734 158022 155762 163610 182626 200978 202564 212815 230711 249655 255288
$$ packed form
4397D52744K2634K894K6305J9854M8918N2537P9709N7908M4309K1235n0108n8977
4385G19962q0824n9100p4519k2864l1990m4228o423k8779j1750p325j958K388
4373C52590j1290J2743l821J596k00J1446R905j2000K5845K0021K5720J730r919
4360D24366J2059o836j1555K4607L730j0709L4716J2671J0653L432M2175J7205
4348E56514R057P730n241k4839l4321l0614m0555p5412k2719j8559k8709l3860
4336B58472j1339n931p271n419j2707l947k4515J4999M056j6748K033J1403p075
4323A96011L013J4147k6778J0596q148m417p769p476K599j7636R127q872K635
4310A57032r972J1560m886M288k260P848J9016J8352J586J0251J7896J8944N633
$$ plain form
4297 255288 284873 293735 349920 428360 559897 708898 807578 780086 640791 506518 396805
4286 396805 319128 269940 248695 217753 197640 186660 169073 172342 174723 175110 194711 212823
4274 212823 223779 222231 250734 286585 309268 342687 427667 525829 691977 980955 1261787
4263 1261787 1440308 1354252 1073559 798205 592697 472652 387571 305755 257029 221305
4253 221305 182914 161752 161471 141320 137267 144344 161954 129579 146068 153652 158128 179380 203782
4240 203782 232259 275474 387500 515478 636699 704834 656471 522638 397503 305474 240888
4229 240888 195961 164363 126189 106131 88924 68995 54344 51717 39192 41311 48997 47632
4217 47632 50208 45061 17818 30991 30165 16444 24689 40450 20521 21129 25201 27375 32751 18967
$$ packed form
4297B55288K9585Q862N6185P8440J31537J49001R8680k7492j39295j34273j09713
4286C96805p7677m9188k1245l0942k0113j0980j7587L269K381L87J9601J8112
4274B12823J0956j548K8503L5851K2683L3419Q4980R8162J66148K88978K80832
4263A261787J78521q6056k80693k75354k05508j20045q5081q1816m8726l5724
4253B21305l8391k1162k81k0151m053P077J7610l2375J6489P584M476K1252K4402
4240B03782K8477M3215J12026J27978J21221O8135m8363j33833j25135r2029o4586
4229B40888m4927l1598l8174k0058j7207j9929j4651k627j2525K119P686j365
4217D7632K576n147k7243J3173q26j3721Q245J5761j9929O08M072K174N376j3784
$$ plain form
4203 18967 33257 22398 15907 11301 10678 4111 4787 10985 -178 7323 -6245 -14569 -6680 11961
4189 11961 -6550 1152 -18827 -12763 -13336 -34552 -6674 -14633 -14997 -24661 -7043 -21548 -37820
4176 -37820 -10078 -10768 -12510 -14888 -22541 -13582 -25878 -28461 -25064 -12030 -10123 -20057 -21505 -25624
4162 -25624 -26001 -8239 -18784 -2881 -34562 -25192 -15341 -32900 -9357 -28949 -31471 -26042 -28737
4149 -28737 -33323 -20234 -21635 -18285 -29056 -13242 -20711 -15123 -23889 -17658 -6385 -28859 -20601
4136 -20601 -25822 -18269 -6969 -28314 2892 -12779 -20132 -10450 -11176 -11059 -21178 -4698 -24654
4123 -24654 -11743 -33441 -17395 -12524 -11238 -9822 -18339 -9722 -8625 -8184 -23691 11126 -19946
4110 -19946 -11871 -10445 -15794 -18541 -11698 914 -10384 2189 -1305 -521 -1772 8794 5313 8386
$$ packed form
4203A8967J4290j0859o491m606o23o567O76O198j1163P501j3568q324P889J8641
4189A1961j8511P702j9979O064n73k1216K7878p959l64r664J7618j4505j6272
4176c7820K7742o90j742k378p653Q959j2296k583L397J3034J907r934j448m119
4162b5624l77J7762j0545J5903l1681R370R851j7559K3543j9592k522N429k695
4149b8737m586J3089j401L350j0771J5814p469N588q766O231J1273k2474Q258
4136b0601n221P553J1300k1345L1206j5671p353R682p26J17j0119J6480j9956
4123b4654J2911k1698J6046M871J286J416q517Q617J097M41j5507L4817l1072
4110a9946Q075J426n349k747O843J2612j1298J2573l494P84j251J0566l481L073
$$ plain form
4096 8386 2206 -835 -1880 6622 831 4249 9276 5582 -1846 13646 23887 7303 13712 14229
4082 14229 19571 5743 12771 31166 12952 26228 29191 37021 26868 34970 45403 39770 29847
4069 29847 44855 33183 38189 41637 63387 30879 46631 47604 44693 57526 56456 66826 48884
4056 48884 58603 60128 58709 39984 62361 56098 50360 62965 67757 68460 72508 81529 87354 99069
4042 99069 88042 98470 110909 118849 105209 103135 96368 89251 77601 86975 77557 78632 75731
4029 75731 82860 81300 76483 67206 77236 61361 61806 66063 67998 71556 71703 62942 69775 64853 71766
4014 71766 66944 69328 66933 53441 58231 43338 45880 45529 34518 38722 29324 43284 13454 31289
4000 31289 24761 24114 28435 8436 16497 8641 3510 3251 7795 7976 -16225 -6436 -11648 -8949 -2582
$$ packed form
4096H386o180l041j045Q502n791L418N027l694p428J5492J0241j6584O409N17
4082A4229N342j3828P028J8395j8214J3276K963P830j0153Q102J0433n633r923
4069B9847J5008j1672N006L448K1750l2508J5752R73k911J2833j070J0370j7942
4056D8884R719J525j419j8725K2377o263n738J2605M792P03M048R021N825J1715
4042I9069j1027J0428J2439P940j3640k074o767p117j1650R374r418J075k901
4029G5731P129j560m817r277J0030j5875M45M257J935L558J47q761O833m922O913
4014G1766m822K384k395j3492M790j4893K542l51j1011M204r398J3960k9830J7835
4000C1289o528o47M321j9999Q061p856n131k59M544J81k4201R789n212K699O367
$$ plain form
3985 -2582 9531 -11054 1150 -18463 -14633 -20176 -12764 -22582 -29176 -7096 -29484 -30612 -22617
3972 -22617 -31415 -31985 -40200 -19650 -48711 -43540 -21479 -29104 -32133 -44669 -32765 -40612 -36540 -33767
3958 -33767 -41725 -49416 -35375 -38368 -38423 -42291 -37491 -44554 -44375 -46569 -54884 -44031 -26031 -40739
3944 -40739 -34843 -46772 -48520 -31090 -54453 -45842 -51852 -39151 -56467 -65147 -51871 -50442 -60470
3931 -60470 -50121 -54436 -60616 -55399 -54416 -60053 -43153 -55447 -63723 -49499 -55673 -59934 -64152 -67585
3917 -67585 -66918 -55176 -68623 -48729 -64552 -55794 -55866 -53050 -76388 -61103 -66808 -74457 -57565 -61120
3903 -61120 -55057 -54912 -62478 -47983 -62214 -66780 -61002 -68905 -65876 -79897 -55119 -51667 -64826 -65038
3889 -65038 -61379 -55568 -77491 -52148 -68188 -57726 -65738 -60758 -64481 -60032 -62551 -73254 -63714
$$ packed form
3985b582J2113k0585J2204j9613L830n543P412r818o594K2080k2388j128P995
3972b2617q798n70q215K0550k9061N171K2061p625l029j2536J1904p847M072K773
3958c3767p958p691J4041k993n5l868M800p063J79k194q315J0853J8000j4708
3944d0739N896j1929j748J7430k3363Q611o010J2701j7316q680J3276J429j0028
3931f0470J0349m315o180N217R83n637J6900j2294q276J4224o174m261m218l433
3917f7585O67J1742j3447J9894j5823Q758p2K816k3338J5285n705p649J6892l555
3903f1120O063J45p566J4495j4231m566N778p903L029j4021K4778L452j3159k12
3889f5038L659N811k1923K5343j6040J0462q012M980l723M449k519j0703R540
$$ plain form
3876 -63714 -70507 -69919 -70137 -77772 -67438 -61619 -52020 -57750 -60142 -66968 -62930 -54943 -64175 -59728 -55837
3861 -55837 -59868 -65882 -61067 -59401 -66820 -79378 -64575 -54576 -66707 -64226 -64817 -51046 -85031 -61292
3847 -61292 -56674 -73417 -63416 -66907 -60028 -71665 -62377 -56839 -74282 -62050 -75260 -64386 -71516
3834 -71516 -60582 -65241 -69208 -65053 -64305 -56794 -63636 -65909 -60352 -75185 -61695 -62614 -66748 -72649
3820 -72649 -66011 -73009 -57904 -68032 -71397 -71400 -62777 -82603 -59027 -51495 -64232 -66662 -58915 -61550
3806 -61550 -77488 -90757 -51310 -78118 -68138 -73369 -52913 -60607 -65761 -58217 -77360 -62889 -66221
3793 -66221 -59205 -71789 -64289 -69201 -70511 -56398 -51849 -63885 -73937 -56033 -71100 -67935 -69942
3780 -69942 -75942 -64379 -66974 -55256 -64511 -63073 -67995 -74077 -54560 -72541 -59961 -78078 -58164
$$ packed form
3876f3714o793N88k18p635J0334N819R599n730k392o826M038P987r232M447L891
3861e5837m031o014M815J666p419j2558J4803R999j2131K481n91J3771l3985K3739
3847f1292M618j6743J0001l491O879j1637R288N538j7443J2232j3210J0874p130
3834g1516J0934m659l967M155P48P511o842k273N557j4833J3490r19m134n901
3820g2649O638o998J5105j0128l365lQ623j9826K3576P532j2737k430P747k635
3806f1550j5938j3269L9447k6808R980n231K0456p694n154P544j9143J4471l332
3793f6221P016j2584P500m912j310J4113M549j2036j0052J7904j5067L165k007
3780f9942o000J1563k595J1718r255J438m922o082J9517j7981J2580j8117J9914
$$ plain form
3767 -58164 -73890 -53013 -73444 -62291 -68478 -70209 -86524 -65378 -69935 -62046 -61586 -78175 -73689
$$ packed form
3767e8164j5726K0877k0431J1153o187j731j6315K1146m557P889M60j6589M486
$$ [...]
##END NTUPLES=NMR SPECTRUM
##END=
