##TITLE=abcd
##JCAMPDX= 6.0         $$ Bruker NMR JCAMP-DX V2.0
##DATA TYPE= NMR SPECTRUM
##DATA CLASS= NTUPLES
##ORIGIN= UXNMR, Bruker Analytische Messtechnik GmbH
##OWNER= root
$$ XWIN-NMR		Version 3.5
$$ Thu Jul 16 18:46:53 2026 Russian Standard Time (UT+4h)  servis@DPX200
##.OBSERVE FREQUENCY= 200.131235884673
##.OBSERVE NUCLEUS= ^1H
##.ACQUISITION MODE= SIMULTANEOUS
##.ACQUISITION SCHEME= undefined
##.AVERAGES= 32
##.DIGITISER RES= 18
##SPECTROMETER/DATA SYSTEM= spect
##.PULSE SEQUENCE= zg
##.SOLVENT NAME= CDCl3
##.SHIFT REFERENCE= (INTERNAL, CDCl3, 0, 16.4885)
##AUDIT TRAIL= $$ (NUMBER, WHEN, WHO, WHERE, WHAT)
$$ ##TITLE= Audit trail, XWIN-NMR		Version 3.5
$$ ##JCAMPDX= 5.01
$$ ##ORIGIN= Bruker BioSpin GmbH
$$ ##OWNER= servis
$$ F:\spectra/data/av/nmr/H1/1/pdata/1/auditp.txt
$$ ##AUDIT TRAIL=  $$ (NUMBER, WHEN, WHO, WHERE, WHAT)
(   1,<2026-07-16 18:43:52.23 +0400>,<servis>,<DPX200>,
      <created by zg, POWCHK disabled, PULCHK disabled
       configuration hash MD5:
       00 E9 B6 7A A2 85 ED C7 34 08 36 98 17 FE 4E 26
       data hash MD5: 32K
       51 53 AE 5F 3A 59 B4 BE DB B6 04 2A 67 8F E9 75>)
(   2,<2026-07-16 18:46:11.23 +0400>,<servis>,<DPX200>,
      <Start of raw data processing
       efp BC_mod = 2 LB = 0.05 FT_mod = 6 PKNL = 1 PHC0 = -415.39 PHC1 = 3.101563 SI = 16K 
       data hash MD5: 16K
       6C 05 51 46 02 79 A8 02 24 3B 1D E3 8A 55 2B F8>)
(   3,<2026-07-16 18:46:22.75 +0400>,<servis>,<DPX200>,
      <pk PHC0 = 0.7999999 PHC1 = 0 
       data hash MD5: 16K
       72 D7 ED 25 A1 EA F4 12 19 E9 15 06 AB 4A 1E 69>)
$$ ##END=
$$ 
$$ hash MD5
$$ 63 37 87 E8 D5 96 ED D0 23 8E ED 33 3E F0 48 CB
##$RELAX= 
##$RELAX= 
##$RELAX= 
##$RELAX= 
##$RELAX= 
##$RELAX= 
##$RELAX= 
##$RELAX= 
$$ Bruker specific parameters
$$ --------------------------
##$DU= <F:\spectra>
##$EXPNO= 1
##$NAME= <H1>
##$PROCNO= 1
##$TYPE= <nmr>
##$USER= <av>
##$AMP= (0..31)
100 100 100 100 100 100 100 100 100 100 100 100 100 100 100 100 100 100 
100 100 100 100 100 100 100 100 100 100 100 100 100 100 
##$AQSEQ= 0
##$AQ_mod= 1
##$AUNM= <au_zg>
##$AUTOPOS= <>
##$BF1= 200.13
##$BF2= 200.13
##$BF3= 200.13
##$BF4= 200.13
##$BF5= 500.13
##$BF6= 500.13
##$BF7= 500.13
##$BF8= 500.13
##$BYTORDA= 1
##$CFDGTYP= 0
##$CFRGTYP= 5
##$CHEMSTR= <none>
##$CNST= (0..31)
1 1 145 1 1 1 1 1 1 1 1 1 1 1 1 1 1 1 1 1 1 1 1 1 1 1 1 1 1 1 1 1 
##$CPDPRG= <>
##$CPDPRG1= <>
##$CPDPRG2= <>
##$CPDPRG3= <>
##$CPDPRG4= <mlev>
##$CPDPRG5= <mlev>
##$CPDPRG6= <mlev>
##$CPDPRG7= <mlev>
##$CPDPRG8= <mlev>
##$CPDPRGB= <>
##$CPDPRGT= <>
##$D= (0..31)
0 2 0 0 0 0 0 0 0 0.06 0 0 0 0 0 0 0.0002 0 0 0 0 0 0 0 0 0 0 0 0 0 0 
0 
##$DATE= 1784213031
##$DBL= (0..7)
120 120 120 120 120 120 120 120 
##$DBP= (0..7)
150 150 150 150 150 150 150 150 
##$DBP07= 0
##$DBPNAM0= <>
##$DBPNAM1= <>
##$DBPNAM2= <>
##$DBPNAM3= <>
##$DBPNAM4= <>
##$DBPNAM5= <>
##$DBPNAM6= <>
##$DBPNAM7= <>
##$DBPOAL= (0..7)
0.5 0.5 0.5 0.5 0.5 0.5 0.5 0.5 
##$DBPOFFS= (0..7)
0 0 0 0 0 0 0 0 
##$DE= 6
##$DECBNUC= <off>
##$DECIM= 32
$$ [...]
##$SUBNAM4= <"">
##$SUBNAM5= <"">
##$SUBNAM6= <"">
##$SUBNAM7= <"">
##$SUBNAM8= <"">
##$SUBNAM9= <"">
##$SW= 20.6817932712277
##$SWIBOX= (0..15)
0 0 3 0 0 0 0 0 0 0 0 0 0 0 0 0 
##$SW_h= 4139.07284768212
##$TD= 32768
##$TD0= 1
##$TE= 0
##$TE2= 300
##$TE3= 300
##$TEG= 300
##$TL= (0..7)
0 120 120 120 120 120 120 120 
##$TP= (0..7)
150 150 150 150 150 150 150 150 
##$TP07= 0
##$TPNAME0= <>
##$TPNAME1= <>
##$TPNAME2= <>
##$TPNAME3= <>
##$TPNAME4= <>
##$TPNAME5= <>
##$TPNAME6= <>
##$TPNAME7= <>
##$TPOAL= (0..7)
0.5 0.5 0.5 0.5 0.5 0.5 0.5 0.5 
##$TPOFFS= (0..7)
0 0 0 0 0 0 0 0 
##$TUNHIN= 0
##$TUNHOUT= 0
##$TUNXOUT= 0
##$USERA1= <user>
##$USERA2= <user>
##$USERA3= <user>
##$USERA4= <user>
##$USERA5= <user>
##$V9= 5
##$VALIST= <valist>
##$VCLIST= <CCCCCCCCCCCCCCC>
##$VD= 0
##$VDLIST= <DDDDDDDDDDDDDDD>
##$VPLIST= <PPPPPPPPPPPPPPP>
##$VTLIST= <TTTTTTTTTTTTTTT>
##$WBST= 1024
##$WBSW= 30
##$XGAIN= (0..3)
0 0 0 0 
##$XL= 0
##$YL= 0
##$YMAX_a= 1564741
##$YMIN_a= -1888752
##$ZGOPTNS= <>
##$ZL1= 120
##$ZL2= 120
##$ZL3= 120
##$ZL4= 120
##$ABSF1= 0
##$ABSF2= 0
##$ABSG= 0
##$ABSL= 0
##$ALPHA= 0
##$AQORDER= 0
##$ASSFAC= 0
##$ASSFACI= 0
##$ASSFACX= 0
##$ASSWID= 0
##$AUNMP= <proc_1d>
##$AZFE= 0.1
##$AZFW= 0.1
##$BCFW= 0
##$BC_mod= 2
##$BYTORDP= 0
##$COROFFS= 0
##$CY= 18.4799938201904
##$DATMOD= 1
##$DC= 0
##$DFILT= <>
##$DTYPP= 0
##$F1P= 9.9274215381318
##$F2P= -0.165520771350173
##$FCOR= 1
##$FTSIZE= 16384
##$FT_mod= 6
##$GAMMA= 0
##$GB= 0
##$INTBC= 1
##$INTSCL= 4.127829e-11
##$ISEN= 128
##$LB= 0.05
##$LEV0= 0
##$LPBIN= 0
##$MAXI= 10000
##$MC2= 0
##$MEAN= 0
##$ME_mod= 0
##$MI= 50
##$NCOEF= 0
##$NC_proc= -5
##$NLEV= 6
##$NOISF1= 3.799351
##$NOISF2= 2.8
##$NSP= 0
##$NTH_PI= 0
##$NZP= 0
##$OFFSET= 16.48848
##$PC= 4
##$PHC0= -414.59
##$PHC1= 3.101563
##$PH_mod= 1
##$PKNL= yes
##$PPARMOD= 0
##$PSCAL= 4
##$PSIGN= 0
##$REVERSE= no
##$SF= 200.130005582386
##$SI= 16384
##$SIGF1= 3
##$SIGF2= 2
##$SINO= 400
##$SIOLD= 16384
##$SREGLST= <1H.CDCl3>
##$SSB= 0
##$STSI= 16384
##$STSR= 0
##$SW_p= 4139.07284768211
##$SYMM= 0
##$S_DEV= 0
##$TDeff= 32768
##$TDoff= 0
##$TI= <>
##$TILT= no
##$TM1= 0
##$TM2= 0
##$TOPLEV= 0
##$USERP1= <user>
##$USERP2= <user>
##$USERP3= <user>
##$USERP4= <user>
##$USERP5= <user>
##$WDW= 1
##$XDIM= 16384
##$YMAX_p= 427080023
##$YMIN_p= -1358958
$$ End of Bruker specific parameters
$$ ---------------------------------
##NTUPLES= NMR SPECTRUM
##VAR_NAME=  FREQUENCY,     SPECTRUM/REAL,   SPECTRUM/IMAG
##SYMBOL=    X,             R,               I
##VAR_TYPE=  INDEPENDENT,   DEPENDENT,       DEPENDENT
##VAR_FORM=  AFFN,          ASDF,            ASDF
##VAR_DIM=   16384,         16384,           16384
##UNITS=     HZ,            ARBITRARY UNITS, ARBITRARY UNITS
##FACTOR=    0.252644378177508, 1,           1
##FIRST=     3299.83951724647, 0,            0
##LAST=      -839.233330435636, 0,           0
##MIN=       -839.233330435636, -1358958,    0
##MAX=       3299.83951724647, 427080023,    0
$$ Real data points
##PAGE= N=1
##DATA TABLE= (X++(R..R)), XYDATA
$$ [...]
$$ plain form
7299 -200842 -131039 -135016 -178679 -197911 -170702 -111026 -219141 -225676 -162527 -129253 -229239 -219146
7287 -219146 -176185 -185885 -170747 -89474 -219431 -243993 -160536 -91238 -140096 -213574 -264620 -155433
7275 -155433 -93203 -99196 -91346 -143429 -124728 -123538 -83626 -176724 -72709 -177064 -218320 -124915
7263 -124915 -232313 -192473 -151762 -152778 -144647 -114818 -186149 -220446 -221613 -208134 -157534 -179471
7251 -179471 -191277 -240955 -138962 -104159 -74692 -120112 -212560 -236339 -191690 -106531 -170964
7240 -170964 -283387 -254626 -264678 -147901 -76029 -139665 -82510 -67575 -72125 -147647 -160004
7229 -160004 -170694 -68935 -183972 -150269 -68512 -115099 -145342 -76543 -104922 -131722 -56860
7218 -56860 -145535 -71454 -227653 -105970 -150410 -109717 -82965 -147990 -93470 -157324 -142081
$$ packed form
7299b00842O9803l977m3663j9232K7209N9676j08115o535O3149L3274r9986J0093
7287b19146M2961r700J5138Q1273j29957k4562Q3457O9298m8858p3478n1046J09187
7275a55433O2230n993P850n2083J8701J190L9912r3098J04015j04355m1256R3405
7263a24915j07398L9840M0711j016Q131K9829p1331l4297j167J3479N0600k1937
7251a79471j1806m9678J01993L4803K9467m5420r2448k3779M4649Q5159o4433
7240a70964j12423K8761j0052J16777P1872o3636N7155J4935m550p5522j2357
7229a60004j0690J01759j15037L3703Q1757m6587l0243O8799k8379k6800P4862
7218e6860q8675P4081j56199J21683m4440M0693K6752o5025N4520o3854J5243
$$ plain form
7207 -142081 -249005 -194995 -141110 -182724 -188048 -271747 -284169 -198954 -220985 -150127 -223385 -196148
7195 -196148 -243592 -219135 -199015 -199608 -241966 -206299 -175367 -241498 -164781 -202383 -238097 -194177
7183 -194177 -316690 -252964 -224780 -153359 -204148 -185867 -170151 -182992 -240128 -189687 -93088
7172 -93088 -80620 -122192 -79207 -86287 -200379 -232202 -86895 -161051 -181041 -99345 -161681 -158576
7160 -158576 -81479 -167400 -193032 -123798 -199096 -152872 -124551 -179154 -203859 -57871 -128759
7149 -128759 -172573 -152545 -178871 -158653 -240589 -201320 -251765 -179085 -73212 -156591 -172931
7138 -172931 -235135 -124625 -232352 -90878 -217468 -46615 -203086 -165159 -146567 -173310
7128 -173310 -128730 -184287 -142695 -187913 -139530 -225827 -103562 -186857 -157798 -203980 -199725 -239897
$$ packed form
7207a42081j06924N4010N3885m1614n324q3699j2422Q5215k2031P0858p3258K7237
7195a96148m7444K4457K0120n93m2358L5667L0932o6131P6717l7602l5714M3920
7183a94177j22513O3726K8184P1421n0789J8281J5716j2841n7136N0441R6599
7172i3088J2468m1572M2985p080j14092l1823J45307p4156j9990Q1696o2336L105
7160a58576P7097q5921k5632O9234p5298M6224K8321n4603k4705J45988p0888
7149a28759m3814K0028k6326K0218q1936L9269n0445P2680J05873q3379j6340
7138a72931o2204J10510j07727J41474j26590J70853j56471L7927J8592k6743
7128a73310M4580n5557M1592m5218M8383q6297J22265q3295K9059m6182M255m0172
$$ plain form
7116 -239897 -118510 -226047 -190438 -248982 -135716 -180037 -156270 -146607 -227689 -184960 -219157
7105 -219157 -266814 -209826 -95694 -128571 -193096 -122845 -260393 -128417 -212907 -165024 16359
7094 16359 -99485 -189372 -64379 -253541 -200514 -25496 -89362 -218630 -106429 -130450 -117941
7083 -117941 -164448 -238892 -152505 -109060 -151445 -110473 -100618 -94319 -156891 -143088 -119862 -56265
7071 -56265 -268050 -131789 -86299 -118953 -130042 -126246 -110774 -112726 -88767 -114946 -111852 -38398
7059 -38398 -8736 -176341 -102735 -48382 -110210 -95298 -127295 -18972 -66906 -152110 -38242
7048 -38242 -123910 -72968 -175770 -64049 -111367 -97960 34990 -14867 -126397 -119702 -79999
7037 -79999 -2101 -85040 -66134 -72914 -68836 28228 -36559 19247 -26254 -18797 -46827 -97444
$$ packed form
7116b39897J21387j07537L5609n8544J13266m4321K3767R663q1082M2729l4197
7105b19157m7657N6988J14132l2877o4525P0251j37548J31976q4490M7883J81383
7094A6359j15844q9887J24993j89162N3027J75018o3866j29268J12201k4021J2509
7083a17941m6507p4444Q6387M3445m2385M0972R855O299o2572J3803K3226O3597
7071e6265k11785J36261M5490l2654j1089L796J5472j952K3959k6179L094P3454
7059c8398K9662j67605P3606N4353o1828J4912l1997J08323m7934q5204J13868
7048c8242q5668N0942j02802J11721m7318J3407J32950m9857j11530O695L9703
7037g9999P7898q2939J8906o780M078R7064o4787N5806m5501P457k8030n0617
$$ plain form
7025 -97444 -81206 52269 -30293 17586 -43073 -14565 -9467 -7038 -111302 -13629 -10041 -48594
7013 -48594 -93379 -37273 27697 -26697 -104082 -86033 -49769 -44638 95952 -32945 -62004 -2532
7001 -2532 -69623 -102440 -9461 -8855 -44639 -110909 70396 14533 -34110 3317 -9389 -23899
6989 -23899 33302 34942 -35392 -24395 -9947 -100815 -3675 -76527 -8644 37726 14577 -88361
6977 -88361 -19340 66086 19195 -65327 16157 59905 -55536 -69647 -29072 -54890 81579
6966 81579 49846 -68606 8130 -58265 50074 6391 -39393 87785 61975 -32327 20090
6955 20090 87192 -68051 52855 -19604 15807 27697 50455 -45710 49830 4765 89462
6944 89462 37091 -33904 -31227 46151 61743 67730 47150 -32479 79426 22402 86350 24983
$$ packed form
7025i7444J6238J33475q2562M7879o0659K8508N098K429j04264R7673L588l8553
7013d8594m4785N6106O4970n4394p7385J8049L6264N131J40590j28897k9059N9472
7001b532o7091l2817R2979O06l5784o6270J81305n5863m8643L7427j2706j4510
6989b3899N7201J640p0334J0997J4448r0868R7140p2852O7883M6370k3149j02938
6977h8361O9021Q5426m6891q4522Q1484M3748j15441j4111M0575k5818J36469
6966H1579l1733j18452P6736o6395J08339m3683m5784J27178k5810r4302N2417
6955B0090O7102j55243J20906p2459L5411J1890K2758r6165R5540m5065Q4697
6944H9462n2371p0995K677P7378J5592N987k0580p9629J11905n7024O3948o1367
$$ plain form
6932 24983 72743 130285 139113 62197 50067 28165 167236 196273 117272 101281 220258 154027
6920 154027 149838 140000 212331 179038 128880 186435 102904 177838 203957 165223 13526 154292
6908 154292 186261 88566 208298 115781 236775 124221 248503 203044 340944 251893 170301
6897 170301 161722 248025 175784 150905 258612 154376 162642 195468 174625 158226 261828
6886 261828 249676 337248 194210 280707 230736 254185 309523 216350 280419 219004 286619
6875 286619 249427 286480 380017 287655 366351 262660 288164 330487 361030 522825 279799
6864 279799 266017 346392 349430 369592 417785 455427 399422 461670 411284 546592 482626 455158
6852 455158 599054 595352 604188 633111 692968 585749 567272 593028 626173 542072 574468 667083
$$ packed form
6932B4983M7760N7542Q828p6916j2130k1902J39071K9037p9001j5991J18977o6231
6920A54027m189r838P2331l3293n0158N7555q3531P4934K6119l8734j51697J40766
6908A54292L1969r7695J19732r2517J20994j12554J24282m5459J37900q9051q1592
6897A70301q579Q6303p2241k4879J07707j04236Q266L2826k0843j6399J03602
6886B61828j2152Q7572j43038Q6497m9971K3449N5338r3173O4069o1415O7615
6875B86619l7192L7053R3537r2362P8696j03691K5504M2323L0543J61795k43026
6864B79799j3782Q0375L038K0162M8193L7642n6005O2248n0386J35308o3966k7468
6852D55158J43896l702Q836K8923N9857j07219j8477K5756L3145q4101L2396R2615
$$ plain form
6840 667083 569528 654189 751895 647980 697426 640522 665149 565967 530788 581119 491197
6829 491197 471564 549585 553210 543246 510520 541922 482621 589709 497539 584067 567896 481476
6817 481476 485204 535134 523750 495051 517159 506465 474740 498595 490232 515931 529471 686395
6805 686395 731077 705551 837199 766986 763062 747081 904069 803073 834768 881248 797144
6794 797144 767871 760203 956087 968059 889289 950859 856442 829921 876644 878445 794306 785198
6782 785198 757295 696994 707211 573936 635528 711812 665893 640080 637381 617529 605926 541962
6770 541962 598570 626822 593731 574542 577173 605622 612403 631972 662715 691076 595513 583240
6758 583240 625031 649586 565728 732677 666940 745479 725093 657705 746899 693842 785691
$$ packed form
6840F67083r7555Q4661R7706j03915M9446n6904K4627r9182l5179N0331q9922
6829D91197j9633P8021L625r964l2726L1402n9301J07088r2170Q6528j6171q6420
6817D81476L728M9930j1384k8699K2108j0694l1725K3855q363K5699J3540J56924
6805F86395M4682k5526J31648p0213l924j5981J56988j00996L1695M6480q4104
6794G97144k9273p668J95884J1972p8770O1570r4417k6521M6723J801q4139r108
6782G85198k7903o0301J0217j33275O1592P6284m5919k5813k699j9852j1603o3964
6770E41962N6608K8252l3091j9189K631K8449O781J9569L0743K8361r5563j2273
6758E83240M1791K4555q3858J66949o5737P8539k0386o7388Q9194n3057R1849
$$ plain form
6747 785691 714144 838555 790205 789543 859489 894574 898426 964592 925988 901938 919640 915602
6735 915602 923395 987134 916446 1009378 998748 1050979 1045885 1103223 1097835 1220989 1137745 1139457
6723 1139457 1178013 1221381 1118144 1089522 1233184 1285082 1109158 1245404 1077059 1081910 1111703
6712 1111703 1113031 1131502 1226867 1187519 1128445 1167343 1215684 1244331 1147697 1155704 1299673 1227046
6700 1227046 1313774 1305092 1359818 1452202 1326886 1335982 1371701 1407176 1454494 1527342 1547208 1479257
6688 1479257 1494384 1537814 1592240 1522752 1642826 1427894 1531932 1615172 1551232 1627743 1624191
6677 1624191 1582796 1675034 1562499 1648690 1620419 1611365 1534793 1623852 1539518 1607579 1517480
6666 1517480 1568155 1633787 1642295 1648360 1771387 1750776 1828147 1873439 1900792 1870924 2009730
$$ packed form
6747G85691p1547J24411m8350o62O9946L5085L852O6166l8604k4050J7702m038
6735I15602P793O3739p0688R2932j0630N2231n094N7338n388J23154q3244J712
6723A139457L8556M3368j03237k8622J43662N1898j75924J36246j68345M851K9793
6712A111703J328J8471R5365l9348n9074L8898M8341K8647r6634Q007J43969p2627
6700A227046Q6728q682N4726R2384j25316R096L5719L5475M7318P2848J9866o7951
6688A479257J5127M3430N4426o9488J20074k14932J04038Q3240o3940P6511l552
6677A624191m1395R2238j12535Q6191k8271r054p6572Q9059q4334O8061r0099
6666A517480N0675O5632Q508O065J23027k0611P7371M5292K7353k9868J38806
$$ plain form
6655 2009730 2028085 2052867 2093782 2192788 2231952 2252273 2371454 2530848 2667421 2774593 3093655
6644 3093655 3449136 3877983 4389882 4873250 5615525 6282602 6914289 7577068 8310225 9077580
6634 9077580 9874944 10337723 10551287 10410445 10272989 10263430 10154500 9742187 8816117 7951222
6624 7951222 7153658 6683684 5949962 5372523 4929429 4363102 4004965 3793272 3451826 3433738
6614 3433738 3245820 3184618 3168146 3112197 3215787 3098482 3071956 3174320 3224088 3234088 3310042
6603 3310042 3334238 3361945 3422390 3395169 3328705 3384793 3333068 3285471 3177340 3112409 3152171
6592 3152171 2980924 3157851 3060567 3021300 3002776 2994276 3052055 3016782 3045229 3068565 3076985
6581 3076985 3032397 3048850 3067268 3002329 3074848 2993394 2997223 3048749 3078371 2998861 3053722 3038105
$$ packed form
6655B009730J8355K4782M0915R9006L9164K0321J19181J59394J36573J07172L19062
6644C093655L55481M28847N11899M83368P42275O67077O31687O62779P33157P67355
6634I077580P97364M62779K13564j40842j37456r559j08930m12313r26070q64895
6624G951222p97564m69974p33722n77439m43094n66327l58137k11693l41446j8088
6614C433738j87918o1202j6472n5949J03590j17305k6526J02364M9768J0000P5954
6603C310042K4196K7707O0445k7221o6464N6088n1725m7597j08131o4931L9762
6592C152171j71247J76927r7284l9267j8524q500N7779l5273K8447K3336Q420
6581C076985m4588J6453J8418o4939P2519q1454L829N1526K9622p9510N4861j5617
$$ plain form
6569 3038105 3131413 3094325 3095624 3083162 3218180 3072786 3255340 3309330 3324994 3330132 3265985
6558 3265985 3332770 3390347 3389424 3304457 3420289 3435955 3378021 3422099 3438164 3469554 3512721 3607903
6546 3607903 3451275 3611664 3490464 3665078 3604525 3606866 3605815 3726383 3776485 3761370 3588041
6535 3588041 3731927 3746118 3703234 3788478 3797537 3853264 3902557 4000445 4051774 4068386 4142849
6524 4142849 4191446 4255652 4347190 4351309 4401772 4459263 4602596 4650054 4763693 4711896 4708025
6513 4708025 4681370 4745756 4658099 4733933 4665935 4792862 4854340 4915032 4874187 4947692 5077759
6502 5077759 4975126 5064241 5167090 5165518 5232088 5299562 5409400 5490764 5505231 5717074 5631563
6491 5631563 5783989 5809142 5861990 6032753 6027029 6099129 6212983 6261591 6332891 6547940 6528966
$$ packed form
6569C038105R3308l7088J299j2462J35018j45394J82554N3990J5664N138o4147
6558C265985O6785N7577r23q4967J15832J5666n7934M4078J6065L1390M3167R5182
6546C607903j56628J60389j21200J74614o0553K341j051J20568N0102j5115j73329
6535C588041J43886J4191m2884Q5244R059N5727M9293R7888N1329J6612P4463
6524D142849M8597O4206R1538M119N0463N7491J43333M7458J13639n1797l871
6513D708025k6655O4386q7657P5834o7998J26927O1478O0692m0845P3505J30067
6502E077759j02633Q9115J02849j572O6570O7474J09838Q1364J4467K11843q5511
6491E631563J52426K5153N2848J70763n724P2100J13854M8608P1300K15049j8974
$$ plain form
6480 6528966 6722734 6776470 6997612 6996032 7102157 7221345 7340442 7466398 7611386 7638912
6470 7638912 7768085 7898652 8143305 8231989 8334529 8473182 8571941 8705661 8893195 8979974
6460 8979974 9146592 9355684 9560083 9729213 9819442 10024958 10095125 10241530 10339109 10548726
6450 10548726 10709472 10891141 11126100 11405755 11779423 12082219 12420979 12865500 13190172
6441 13190172 13386012 13732243 13951572 14249363 14610290 14791619 15048431 15271883 15370784 15617126
6431 15617126 15848652 16047655 16485236 16707899 16984544 17329124 17601898 18016038 18432409
6422 18432409 18777618 19322495 19767517 20308249 21009064 21942941 23038852 24215544 25573932
6413 25573932 27011984 28033450 28489020 28653346 28656580 28569619 28135831 27617298 26969871 26648986
$$ packed form
6480F528966J93768N3736K21142j580J06125J19188J19097J25956J44988K7526
6470G638912J29173J30567K44653Q8684J02540J38653R8759J33720J87534Q6779
6460H979974J66618K09092K04399J69130R0229K05516P0167J46405R7579K09617
6450A0548726J60746J81669K34959K79655L73668L02796L38760M44521L24672
6441A3190172J95840L46231K19329K97791L60927J81329K56812K23452R8901K46342
6431A5617126K31526J99003M37581K22663K76645L44580K72774M14140M16371
6422A8432409L45209N44877M45022N40732P00815R33877J095911J176692J358388
6413B5573932J438052J021466M55570J64326L234q6961m33788n18533o47427l20885
$$ plain form
6403 26648986 26295087 26277406 26631229 27111087 27755729 28492491 29603382 31115899 33160105
6394 33160105 35328295 37753715 40047633 41879645 42838658 44071432 45387297 46634651
6386 46634651 47739208 48716138 48878868 47927237 46381357 44994117 43550615 41888530 40032605
6377 40032605 38071320 36661247 35676247 35403032 35771128 36490773 37471796 38772843 40362814
6368 40362814 42594305 45521464 48934901 52914463 56567787 58509839 58601885 57968556 57108339
6359 57108339 55753120 53741015 51285807 48456301 45104666 42101113 39821047 38001861
6351 38001861 36276767 34965694 33765940 33251984 33381715 34276776 35694989 37622226 39290675
6342 39290675 40643557 41288150 42053561 42861549 43723502 44628376 45063915 44446203 42604981
$$ packed form
6403B6648986l53899j7681L53823M79858O44642P36762J110891J512517K044206
6394C3160105K168190K425420K293918J832012R59013J232774J315865J247354
6386D6634651J104557R76930J62730r51631j545880j387240j443502j662085j855925
6377D0032605j961285j410073r85000k73215L68096P19645R81023J301047J589971
6368D0362814K231491K927159L413437L979562L653324J942052R2046o33329q60217
6359E7108339j355219k012105k455208k829506l351635l003553k280066j819186
6351C8001861j725094j311073j199754n13956J29731Q95061J418213J927237J668449
6342C9290675J352882O44593P65411Q07988Q61953R04874M35539o17712j841222
$$ plain form
6333 42604981 40536673 38520643 36568323 34261870 31704362 29364112 27173248 25350452
6325 25350452 23996883 23024259 22198810 21567643 21204478 21055087 21236942 21961564 22819448
6316 22819448 24023691 25294599 25995060 26021125 26007101 25532697 24829097 23713130 22449548
6307 22449548 21089199 19732307 18620183 17743207 17042377 16456707 15962180 15417854 15086631
6298 15086631 14625057 14469718 14207166 13967423 14017706 13810924 13615150 13418565 13326053 13253652
6288 13253652 13043144 12915724 12874677 12859870 12865295 12699538 12713381 12757802 12719867 12724883 12516143
6277 12516143 12401616 12121515 11862646 11739207 11510848 11330436 11161141 11039319 10959205 10714125
6267 10714125 10646126 10514848 10293902 10240159 10105819 10083065 9902169 9836826 9769132 9741082
$$ packed form
6333D2604981k068308k016030j952320k306453k557508k340250k190864j822796
6325B5350452j353569r72624q25449o31167l63165j49391J81855P24622Q57884
6316B2819448J204243J270908P00461K6065j4024m74404p03600j115967j263582
6307B2449548j360349j356892j112124q76976p00830n85670m94527n44326l31223
6298A5086631m61574j55339k62552k39743N0283k06782j95774j96585r2512p2401
6288A3253652k10508j27420m1047j4807N425j65757J3843M4421l7935N016k08740
6277A2516143j14527k80101k58869j23439k28359j80412j69295j21822q0114k45080
6267A0714125o7999j31278k20946n3743j34340k2754j80896o5343o7694k8050
$$ plain form
6257 9741082 9711780 9687530 9625994 9575776 9539486 9461999 9580193 9621068 9632722 9569509 9626004
6246 9626004 9533503 9380053 9252473 9043419 8903852 8716687 8563510 8461031 8394230 8326503
6236 8326503 8408175 8403240 8395213 8533845 8599877 8664240 8736748 8823195 8930629 9075041 9172317
6225 9172317 9406585 9392970 9468647 9475840 9665069 9745488 9745016 9792587 9788393 9790940 9767722 9901618
6213 9901618 10239550 10701410 11212225 11767138 12375588 13053704 13479597 13808940 13857763 13927074
6203 13927074 13712768 13257638 12905343 12437667 12023945 11668638 11442150 11121628 11031746 10969183
6193 10969183 10845466 10730097 10554411 10486292 10306634 10205499 10013384 10019271 10033050 10091184
6183 10091184 10595407 10971222 11552055 12129131 12627467 12998228 13096644 13054938 12759813 12289397
$$ packed form
6257I741082k9302k4250o1536n0218l6290p7487J18194M0875J1654o3213N6495
6246I626004r2501j53450j27580k09054j39567j87165j53177j02479o6801o7727
6236H326503Q1672m935q027J38632O6032O4363P2508Q6447J07434J44412R7276
6225I172317K34268j3615P5677P193J89229Q0419m72M7571m194K547k3218J33896
6213I901618L37932M61860N10815N54913O08450O78116M25893L29343M8823O9311
6203A3927074k14306m55130l52295m67676m13722l55307k26488l20522q9882o2563
6193A0969183j23717j15369j75686o8119j79658j01135j92115N887J3779N8134
6183A0091184N04223L75815N80833N77076M98336L70761R8416m1706k95125m70416
$$ plain form
6173 12289397 11689134 11091681 10278779 9562551 8939569 8454440 8061887 7746244 7429720
6164 7429720 7171521 7044746 6843794 6804435 6797894 6772583 6822770 6912326 6867735 6944109 7060882
6153 7060882 7334866 7439513 7775570 8103484 8351306 8623370 8922893 9128716 9394874 9587895
6143 9587895 9708907 9608712 9627775 9840049 9718358 9804678 9833109 10052514 10224571 10482207
6133 10482207 10754263 11164937 11496227 11888027 12101597 12235967 12495375 12474061 12471009 12398195
6123 12398195 12237060 12143591 12016241 11884898 11820881 11775831 11565010 11641988 11598746 11567376
6113 11567376 11673662 11747544 11737519 11903428 12003493 12347211 12509458 12703038 12853191 13067713
6103 13067713 13139511 13233953 13301636 13345914 13278429 13178338 12934017 12788903 12681535 12312450
$$ packed form
6173A2289397o00263n97453q12902p16228o22982m85129l92553l15643l16524
6164G429720k58199j26775k00952l9359o541k5311N0187Q9556m4591P6374J16773
6153G060882K73984J04647L36057L27914K47822K72064K99523K05823K66158J93021
6143I587895J21012j00195J9063K12274j21691Q6320K8431K19405J72057K57636
6133A0482207K72056M10674L31290L91800K13570J34370K59408k1314l052p2814
6123A2398195j61135r3469j27350j31343o4017m5050k10821P6978m3242l1370
6113A1567376J06286P3882j0025J65909J00065L43718J62247J93580J50153K14522
6103A3067713P1798R4442O7683M4278o7485j00091k44321j45114j07368l69085
$$ plain form
6093 12312450 12184213 11982945 11871879 11837097 11525393 11526495 11438902 11372857 11429732 11425695 11405878
6082 11405878 11334071 11167625 11015963 10761901 10522988 10090192 9819102 9478431 9205938 8884279
6072 8884279 8593683 8491376 8444231 8194356 8255451 8295468 8270577 8381437 8446582 8558587
6062 8558587 8615749 8846847 8892856 9091727 9252517 9421120 9619101 9694081 9863685 9777864
6052 9777864 9672839 9424034 9334440 9181664 9051526 8776725 8788110 8713823 8725414 8786750
6042 8786750 8865172 9028240 9238234 9495580 9626527 9782854 9975315 10059029 10179040 10245273
6032 10245273 10160190 10124026 9804127 9663132 9579611 9467903 9269523 9246267 9308874 9271196
6022 9271196 9464232 9668278 9817893 10129208 10340966 10537130 10761342 11038402 11303601 11383087
$$ packed form
6093A2312450j28237k01268j11066l4782l11704J102q7593o6045N6875m037j9817
6082A1405878p1807j66446j51662k54062k38913m32796k71090l40671k72493l21659
6072H884279k90596j02307m7145k49875O1095M0017k4891J10860O5145J12005
6062H558587N7162K31098M6009J98871J60790J68603J97981P4980J69604q5821
6052I777864j05025k48805q9594j52776j30138k74801J1385p4287J1591O1336
6042H786750P8422J63068K09994K57346J30947J56327J92461Q3714J20011O6233
6032A0245273q5083l6164l19899j40995q3521j11708j98380k3256O2607l7678
6022I271196J93036K04046J49615L11315K11758J96164K24212K77060K65199P9486
$$ plain form
6012 11383087 11474226 11573336 11599405 11629824 11425103 11274963 11005769 10857919 10838750 10721559
6002 10721559 10602916 10489104 10741218 10938875 11026452 11093512 11128822 11236795 11297466 11290018
5992 11290018 11179813 11142118 10937580 10712429 10591949 10376573 10070203 9743714 9424020 9286640
5982 9286640 8985727 8625170 8443649 8228279 8286319 8158883 8168147 8116909 8262915 8433914
5972 8433914 8418991 8370845 8432711 8428729 8379536 8417838 8240368 8257800 8096194 8049127 8070164
5961 8070164 8197036 8301564 8548644 8819245 9141296 9276140 9445180 9738637 9849850 9945195
5951 9945195 9955433 9648750 9518574 9227534 8953054 8730112 8496941 8294561 8006520 7871010
5941 7871010 7631303 7484117 7507536 7217171 6911163 6814453 6658313 6473655 6509551 6382331
$$ packed form
6012A1383087R1139R9110K6069L0419k04721j50140k69194j47850j9169j17191
6002A0721559j18643j13812K52114J97657Q7577O7060L5310J07973O0671p448
5992A1290018j10205l7695k04538k25151j20480k15376l06370l26489l19694j37380
5982I286640l00913l60557j81521k15370N8040j27436R264n1238J46006J70999
5972H433914j4923m8146O1866l982m9193L8302j77470J7432j61606m7067K1037
5961H070164J26872J04528K47080K70601L22051J34844J69040K93457J11213R5345
5951I945195J0238l06683j30176k91040k74480k22942k33171k02380k88041j35510
5941G871010k39707j47186K3419k90365l06008r6710j56140j84658L5896j27220
$$ plain form
5931 6382331 6433125 6395737 6403634 6420163 6536037 6636392 6753083 6893554 6964937 7212576 7398141
5920 7398141 7689935 7972885 8274883 8550638 8834835 8973709 9221967 9250046 9223456 9111458
5910 9111458 8877851 8499534 8063485 7684396 7313236 6948170 6631282 6517342 6321990 6273588
5900 6273588 6272013 6088050 5954899 5790630 5746807 5534590 5494852 5257858 5195212 5052342
5890 5052342 4956499 4951794 4995323 4892964 4801458 4764949 4822643 4803462 4885446 4911269 4959150
5879 4959150 4994317 5070175 5086576 5433923 5489069 5599852 5682489 5687972 5727675 5835593 5707693
5868 5707693 5727365 5764420 5601784 5604775 5414625 5348940 5364275 5351559 5197477 5307547 5382666
5857 5382666 5307112 5334977 5275598 5383806 5349703 5457955 5365957 5475034 5539259 5607674 5548415
$$ packed form
5931F382331N0794l7388P897J6529J15874J00355J16691J40471P1383K47639J85565
5920G398141K91794K82950L01998K75755K84197J38874K48258K8079k6590j11998
5910I111458k33607l78317m36049l79089l71160l65066l16888j13940j95352m8402
5900F273588j575j83963j33151j64269m3823k12217l9738k36994o2646j42870
5890E052342r5843m705M3529j02359r1506l6509N7694j9181Q1984K5823M7881
5879D959150L5167P5858J6401L47347N5146J10783Q2637N483L9703J07918j27900
5868E707693J9672L7055j62636K991j90150o5685J5335j2716j54082J10070P5119
5857E382666p5554K7865n9379J08208l4103J08252r1998J09077O4225O8415n9259
$$ plain form
5846 5548415 5607859 5681390 5682224 5740417 5831453 5820646 5747740 5911121 5991927 6096412 6050929
5835 6050929 6229123 6460472 6706832 6854099 7127913 7374661 7691592 7999060 8309884 8346829
5825 8346829 8519382 8449574 8516579 8534464 8585978 8735198 8751550 9194115 9457676 9706423
5815 9706423 10048905 10283089 10293235 10365947 10331935 10298596 10207669 10220953 10501498 10624305 11149982
5804 11149982 12069757 13083602 14209675 15697016 16762923 17042497 17285638 17533294 17867730
5795 17867730 18131660 18443093 18826523 19607731 20870665 22997456 24932560 26587566 28643747
5786 28643747 31146622 32900572 33648884 33146863 32550303 31911710 31741946 31778396 32713416
5777 32713416 34248456 36607652 39984302 43295577 45019252 45682387 46824956 48044719
$$ packed form
5846E548415N9444P3531Q34N8193R1036j0807p2906J63381Q0806J04485m5483
5835F050929J78194K31349K46360J47267K73814K46748L16931L07468L10824L6945
5825H346829J72553o9808O7005J7885N1514J49220J6352M42565K63561K48747
5815I706423L42482K34184J0146P2712l4012l3339r0927J3284K80545J22807N25677
5804A1149982R19775J013845J126073J487341J065907K79574K43141K47656L34436
5795A7867730K63930L11433L83430P81208J262934K126791J935104J655006K056181
5786B8643747K502875J753950P48312n02021n96560o38593j69764L6450R35020
5777C2713416J535040K359196L376650L311275J723675O63135J142569J219763
$$ plain form
5769 48044719 47502960 45501421 43582019 41910947 40934695 41214765 42074452 42692838 44060681
5760 44060681 46630805 49127863 49730944 48161563 46095208 44244303 42341394 40472271
5752 40472271 38406784 37035755 36728293 37522232 38496938 39522012 39641908 39625894 39884183
5743 39884183 39161394 36712228 34016168 31386282 29216296 27208759 25887051 25059195
5735 25059195 24583753 24802750 25497806 25229442 24215376 23351397 22599668 21408243 20015568
5726 20015568 18293470 16518945 15106494 14038954 13122193 12387546 11896390 11415352 11075603
5717 11075603 10691566 10370250 10032277 9751106 9558631 9440698 9009284 8878343 8542741
5708 8542741 8219470 8085206 7812927 7512056 7367438 7062409 6954901 6848788 6668197 6721822
$$ packed form
5769D8044719n41759k001539j919402j671072r76252K80070Q59687O18386J367843
5760D4060681K570124K497058O03081j569381k066355j850905j902909j869123
5752D0472271k065487j371029l07462P93939R74706J025074J19896j6014K58289
5743C9884183p22789k449166k696060k629886k169986k007537j321708q27856
5735B5059195m75442K18997O95056k68364j014066q63979p51729j191425j392675
5726B0015568j722098j774525j412451j067540r16761p34647m91156m81038l39749
5717A1075603l84037l21316l37973k81171j92475j17933m31414j30941l35602
5708H542741l23271j34264k72279l00871j44618l05029j07508j06113j80591N3625
$$ plain form
5698 6721822 6450874 6494441 6261781 6235389 5904792 5931836 5858349 5791719 5651920 5649887 5593883
5687 5593883 5604127 5532431 5571664 5510189 5675743 5578666 5701348 5600692 5730553 5684564 5810346
5676 5810346 5869954 5957028 5985687 6039796 6059052 6216248 6193407 6268466 6362320 6367749 6306966
5665 6306966 6436601 6585148 6703825 6765664 6981377 6985596 7058122 7145076 7199665 7338705 7327656
5654 7327656 7360769 7381277 7218186 7064633 7000307 7032786 6954981 6793586 6885852 6738230 6677351
5643 6677351 6699399 6706346 6700525 6772768 6856420 6917730 6975941 6792697 7075891 7055721 7085855
5632 7085855 6952238 7046768 6957915 6879814 6907950 6876483 6965027 6955822 7178881 7320863 7519717
5621 7519717 7574786 7722324 7908719 7937090 7982185 7902141 8118448 8002500 8083814 8071468 8087758
$$ packed form
5698F721822k70948M3567k32660k6392l30597K7044p3487o6630j39799k033n6004
5687E593883J0244p1696L9233o1475J65554r7077J22682j00656J29861m5989J25782
5676E810346N9608Q7074K8659N4109J9256J57196k2841P5059R3854N429o0783
5665F306966J29635J48547J18677O1839K15713M219P2526Q6954N4589J39040j1049
5654G327656L3113K0508j63091j53553o4326L2479p7805j61395R2266j47622o0879
5643F677351K2048O947n821P2243Q3652O1310N8211j83244K83194k0170L0134
5632G085855j33617R4530q8853p8101K8136l1467Q8544r205K23059J41982J98854
5621G519717N5069J47538J86395K8371M5095q0044K16307j15948Q1314j2346J6290
$$ plain form
5610 8087758 8042342 8153249 8100537 8072085 8048634 8112995 8040494 8101462 8225902 8303676 8433631
5599 8433631 8562625 8678304 8887193 8869302 8896993 8870453 8788072 8648767 8538346 8271343
5589 8271343 8096100 7870884 7754090 7647836 7530125 7467956 7423563 7389428 7440872 7609171
5579 7609171 7716803 7984044 8307891 8634954 8886116 9093172 9342604 9473849 9516441 9522076
5569 9522076 9468294 9450749 9356197 9331492 9273500 9299094 9171278 9238721 9446731 9580981 9800750
5558 9800750 9964287 10370091 10600226 10870149 11102532 11376957 11770175 12034677 12109385 12515814
5548 12515814 12864426 13165728 13604321 13955989 14398905 14748864 15320386 15727312 15942767
5539 15942767 16238588 16618459 17035867 17407093 17590613 17760548 17940330 18199785 18645121
$$ packed form
5610H087758m5416J10907n2712k8452k3451O4361p2501O0968J24440P7774J29955
5599H433631J28994J15679K08889j7891K7691k6540q2381j39305j10421k67003
5589H271343j75243k25216j16794j06254j17711o2169m4393l4135N1444J68299
5579G609171J07632K67241L23847L27063K51162K07056K49432J31245M2592N635
5569I522076n3782j7545r4552k4705n7992K5594j27816O7443K08010J34250K19769
5558I800750J63537M05804K30135K69923K32383K74425L93218K64502P4708M06429
5548A2515814L48612L01302M38593L51668M42916L49959N71522M06926K15455
5539A5942767K95821L79871M17408L71226J83520J69935J79782K59455M45336
$$ plain form
5530 18645121 18927180 19518347 20090881 20738902 21734865 23346020 25884955 29905198 35042241
5521 35042241 41168766 48191158 53906480 56762870 56581768 55963521 55082843 53140179 49728705
5512 49728705 45510070 41418009 38450555 36747476 36836546 38982997 42739560 47954004
5504 47954004 55464182 64123990 71371911 76972486 83264845 87816895 87905719 83386969
5496 83386969 78270599 72571270 66281967 59068510 51984099 45830779 41144808 38136512
5488 38136512 37448278 38972996 41630284 45644651 51198828 55918912 57228792 55770674
5480 55770674 54012233 52351709 49906377 45831045 40784451 35772364 31561401 28143371
5472 28143371 26172358 24657619 23466427 22583991 21955048 21484885 21212214 20991222 21009504
$$ packed form
5530A8645121K82059N91167N72534O48021R95963J611155K538935M020243N137043
5521C5042241O126525P022392N715322K856390j81102o18247q80678j942664l411474
5512D9728705m218635m092061k967454j703079Q9070K146451L756563N214444
5504D7954004P510178Q659808P247921N600575O292359M552050Q8824m518750
5496H3386969n116370n699329o289303p213457p084411o153320m685971l008296
5488C8136512o88234J524718K657288M014367N554177M720084J309880j458118
5480E5770674j758441j660524k445332m075332n046594n012087m210963l418030
5472B8143371j971013j514739j191192q82436o28943m70163k72671k20992J8282
$$ plain form
5463 21009504 21132738 21704991 22552506 24264263 27221049 31265564 36022746 42240680 47741314
5454 47741314 50047988 49463053 48701152 47673591 45746846 42530980 38591801 35203430
5446 35203430 32831851 32475059 34019413 36739238 40873117 45681101 48717154 48403423
5438 48403423 46833824 45651498 43672175 40800416 36820178 32665892 29013870 26241104
5430 26241104 24413894 23163665 22426090 21842558 21348379 21141358 20922563 20909605 21117958
5421 21117958 21619166 22161884 22955140 23906209 24437173 24966844 25489479 26069187 26518067
5412 26518067 27131189 27645381 28412664 29577601 31441896 34846103 39949255 45982672 53593552
5403 53593552 62240238 68493401 69980693 69055879 68347183 66938412 63778428 59164179
$$ packed form
5463B1009504J23234N72253Q47515J711757K956786M044515M757182O217934N500634
5454D7741314K306674n84935p61901j027561j926745l215866l939179l388371
5446C5203430k371579l56792J544354K719825M133879M807984L036053l13731
5438D8403423j569599j182326j979323k871759l980238m154286l652022k772766
5430B6241104j827210j250229p37575n83532m94179k07021k18795j2958K08353
5421B1117958N01208N42718P93256R51069N30964N29671N22635N79708M48880
5412B6518067O13122N14192P67283J164937J864295L404207N103152O033417P610880
5403E3593552Q646686O253163J487292r24814p08696j408771l159984m614249
$$ plain form
5395 59164179 54116714 50208486 48347007 49266430 52569047 57120486 63679470 69645058
5387 69645058 71563194 69978962 68223130 66296046 63260010 58787943 53485601 48303829
5379 48303829 43970525 41050959 39127409 37882580 37233925 36872857 36692997 36760987 36935414
5370 36935414 37156148 37527495 38054766 38441208 38889583 39376632 39982700 40475669 40925664
5361 40925664 41454224 42086287 42756175 43443614 44267076 45188983 46132709 47152480 48286168
5352 48286168 49561222 50951086 52361310 53867611 55470984 57209635 58880538 60754843
5344 60754843 62663885 64523516 66508874 68640274 70791190 73059444 75321746 77577078
5336 77577078 79876627 81828008 83860528 85919992 87539400 89115916 90744777 91900249
$$ packed form
5395E9164179n047465l908228j861479R19423L302617M551439O558984N965588
5387F9645058J918136j584232j755832j927084l036036m472067n302342n181772
5379D8303829m333304k919566j923550j244829o48655l61068j79860O7990J74427
5370C6935414K20734L71347N27271L86442M48375M87049O06068M92969M49995
5361D0925664N28560O32063O69888O87439Q23462R21907R43726J019771J133688
5352D8286168J275054J389864J410224J506301J603373J738651J670903J874305
5344F0754843J909042J859631J985358K131400K150916K268254K262302K255332
5336G7577078K299549J951381K032520K059464J619408J576516J628861J155472
$$ plain form
5328 91900249 92980240 94003809 95106773 96444896 98052139 100242441 102959206 106212220
5320 106212220 110005526 114350872 118992264 123774056 128317873 132540887 136173768 138970429
5312 138970429 140906616 142119466 142684834 142278682 141790637 141104330 140311446 140159108 140309369
5303 140309369 141314655 143074073 145651159 149411892 153987384 159514121 165679342 172569943
5295 172569943 179794459 186920090 193990692 200078783 204959549 208302049 210138064 210734155
5287 210734155 210368218 209168908 207661716 206772954 207469631 210364417 214976753 221805129
5279 221805129 230529070 238432322 243808170 248366003 254032900 260459897 266820026 272940831
5271 272940831 279000700 284923542 291405858 297395352 299589314 296699286 291274709 285251918
$$ packed form
5328I1900249J079991J023569J102964J338123J607243K190302K716765L253014
5320A06212220L793306M345346M641392M781792M543817M223014L632881K796661
5312A38970429J936187J212850N65368m06152m88045o86307p92884j52338J50261
5303A40309369J005286J759418K577086L760733M575492N526737O165221O890601
5295A72569943P224516P125631P070602O088091M880766L342500J836015N96091
5287B10734155l65937j199310j507192q88762O96677K894786M612336O828376
5279B21805129Q723941P903252N375848M557833N666897O426997O360129O120805
5271B72940831O059869N922842O482316N989494K193962k890028n424577o022791
$$ plain form
5263 285251918 278910233 271938113 264740042 258735377 254739795 250995825 246136794 242064449
5255 242064449 240024100 239005762 238501720 239083471 240844299 243891044 248717789 253845379
5247 253845379 256414749 255091883 252197470 248226989 242691751 235127078 226401601 217685348
5239 217685348 209582868 202915244 197963964 194343520 191770559 190038243 189087103 188476723
5231 188476723 188212695 188143560 187940274 187923759 187759081 187398428 187044534 186601147 186146565 185931022
5221 185931022 186218783 186844845 188245619 190217390 192460033 194935608 197261901 199464705
5213 199464705 200966933 201850117 201994006 201229608 199409722 197213218 194225372 190788373
5205 190788373 187013142 183317842 179516939 175743174 172379048 169473071 166880743 164976573
$$ packed form
5263B85251918o341685o972120p198071o004665l995582l743970m859031m072345
5255B42064449k040349j018338n04042N81751J760828L046745M826745N127590
5247B53845379K569370j322866k894413l970481n535238p564673q725477q716253
5239B17685348q102480o667624m951280l620444k572961j732316r51140o10380
5231A88476723k64028o9135k03286j6515j64678l60653l53894m43387m54582k15543
5221A85931022K87761O26062J400774J971771K242643K475575K326293K202804
5213A99464705J502228Q83184J43889p64398j819886k196504k987846l436999
5205A90788373l775231l695300l800903l773765l364126k905977k592328j904170
$$ plain form
5197 164976573 163775362 163096740 163081103 163342916 163845861 164321642 164535174 164276675 163690266
5188 163690266 162361173 160408203 157771179 154529608 151121820 147155055 143111394 139167963
5180 139167963 135289042 131800894 128421540 125407911 122858325 120628700 118795020 117184955
5172 117184955 115824988 114785202 113759183 112963609 112170259 111355693 110425162 109046249 107618931
5163 107618931 105912965 104003373 101842932 99681312 97568534 95772064 93904033 92488098
5155 92488098 91147992 90053085 89342923 88812423 88387872 88020925 88007518 88342505 89208788
5146 89208788 91261355 94581017 99452342 105646968 112763805 118896307 121985710 121735702
5138 121735702 119194267 115659725 111096160 105279443 98176037 90914825 84528334 79591722
$$ packed form
5197A64976573j201211o78622j5637K61813N02945M75781K13532k58499n86409
5188A63690266j329093j952970k637024l241571l407788l966765m043661l943431
5180A39167963l878921l488148l379354l013629k549586k229625j833680j610065
5172A17184955j359967j039786j026019p95574p93350q14566r30531j378913j427318
5163A07618931j705966j909592k160441k161620k112778j796470j868031j415935
5155I2488098j340106j094907p10162n30500m24551l66947j3407L34987Q66283
5146H9208788K052567L319662M871325O194626P116837O132502L089403k50008
5138A21735702k541435l534542m563565n816717p103406p261212o386491m936612
$$ plain form
5130 79591722 76527914 75153109 74933390 75856466 77726051 80219279 83851058 88216219
5122 88216219 93707663 100334435 109114851 122176861 142786885 174773546 215035415 260437428
5114 260437428 313146795 357792282 371147476 363879651 353823879 339702579 314297745
5107 314297745 279007557 238530789 200975559 169527491 147746617 133842347 125190657
5100 125190657 120216158 118322749 119318038 124054103 133725743 147382263 165041076 186658685
5092 186658685 206473724 218679270 227696269 239419489 251335350 259198788 263223560
5085 263223560 261042298 249448617 231529104 213067120 194277937 173727590 151507015
5078 151507015 129402597 109245744 92479828 79739516 70229273 63166784 57757955
$$ packed form
5130G9591722l063808j374805k19719R23076J869585K493228L631779M365161
5122H8216219N491444O626772Q780416J3062010K0610024L1986661M0261869M5402013
5114B60437428N2709367M4645487J3355194p267825j0055772j4121300k5404834
5107C14297745l5290188m0476768l7555230l1448068k1780874j3904270q651690
5100A25190657m974499j893409R95289M736065R671640J3656520J7658813K1617609
5092A86658685J9815039J2205546R016999J1723220J1915861P863438M024772
5085B63223560k181262j1593681j7919513j8461984j8789183k0550347k2220575
5078A51507015k2104418k0156853j6765916j2740312r510243p062489n408829
$$ plain form
5071 57757955 53635692 50467587 48049252 46327579 45854993 46807763 49026301 52210636
5063 52210636 56189299 59743754 61488276 61068726 59499893 57652140 55255307 51991265
5055 51991265 47995137 43842811 39815662 36796108 34469370 32656368 31341607 30242103
5047 30242103 29229260 28460767 27865103 27436618 27391726 27456196 27611339 27949615 28510776 29157878
5037 29157878 29928823 30915507 31558417 31401403 30587421 29689795 28811175 27724598 26437233
5028 26437233 24910333 23499191 22241002 21356346 20648308 19851844 19255280 18473818 17934186
5019 17934186 17476176 16987654 16502920 16263018 16031607 15888650 15875169 15829978 15886012 15785484
5009 15785484 15882753 15900206 15882624 16061169 16238850 16387703 16454981 16393098 16249102 15911165
$$ packed form
5071E7757955m122263l168105k418335j721673m72586R52770K218538L184335
5063E2210636L978663L554455J744522m19550j568833j847753k396833l264042
5055E1991265l996128m152326m027149l019554k326738j813002j314761j099504
5047C0242103j012843p68493n95664m28485m4892O4470J55143L38276N61161O47102
5037B9157878P70945R86684O42910j57014q13982q97626q78620j086577j287365
5028B6437233j526900j411142j258189q84656p08038p96464n96564p81462n39632
5019A7934186m58010m88522m84734k39902k31411j42957j3481m5191N6034j00528
5009A5785484R7269J7453j7582J78545J77681J48853O7278o1883j43996l37937
$$ plain form
4999 15911165 15500419 15048955 14589853 14100402 13786584 13447126 13245204 13137066 13039057 13085370
4989 13085370 13134932 13215861 13323209 13352437 13461242 13514040 13449929 13339904 13181938 12847876
4979 12847876 12742087 12391261 11897005 11471837 11014024 10759067 10536497 10432887 10318764
4970 10318764 9962670 9697273 9573612 9410853 9371099 9272850 9252072 9101836 8850847 8840295
4960 8840295 8670451 8635446 8623595 8532041 8442364 8403090 8452445 8562405 8652223 8550299 8496590
4949 8496590 8371151 8250260 8056105 7751381 7516446 7296390 7059195 6930667 6675659 6548585
4939 6548585 6436148 6342591 6286581 6167997 6117715 5963646 5972572 5759523 5695802 5558546 5459918
4928 5459918 5426345 5349116 5234275 5170121 5297687 5243605 5299495 5352288 5196381 5223351 5105202
$$ packed form
4999A5911165m10746m51464m59102m89451l13818l39458k01922j08138r8009M6313
4989A3085370M9562Q0929J07348K9228J08805N2798o4111j10025j57966l34062
4979A2847876j05789l50826m94256m25168m57813k54957k22570j03610j14123
4970A0318764l56094k65397j23661j62759l9754r8249k0778j50236k50989j0552
4960H840295j69844l5005j1851r1554q9677l9274M9355J09960Q9818j01924n3709
4949H496590j25439j20891j94155l04724k34935k20056k37195j28528k55008j27074
4939F548585j12437r3557n6010j18584n0282j54069Q926k13049o3721j37256r8628
4928E459918l3573p7229j14841o4154J27566n4082N5890N2793j55907K6970j18149
$$ plain form
4917 5105202 5037456 5092085 4947961 4940180 4816987 4719990 4728058 4665223 4589740 4671709 4618032
4906 4618032 4548920 4614531 4622854 4575802 4617886 4622955 4450408 4493914 4370879 4508361 4501416
4895 4501416 4418685 4346233 4363446 4475969 4584308 4552196 4578396 4623827 4688299 4716709 4703112
4884 4703112 4837894 4835453 4945207 4801468 4849304 4930574 5048990 4948442 4908938 5090441
4874 5090441 5002017 5061164 5270169 5072835 5166984 5221304 5338845 5606003 5729195 5993989
4864 5993989 6346438 6572045 6767698 6829941 6950258 7028135 6973129 7007713 6982919 7067293 7007788
4853 7007788 7270831 7324368 7418043 7491339 7489274 7343699 7303867 7124112 7079446 6678476 6669419
4842 6669419 6542937 6491689 6492464 6505009 6544633 6714197 6855735 7207040 7369119 7700526 7798556
$$ packed form
4917E105202o7746N4629j44124p781j23193r6997Q068o2835p5483Q1969n3677
4906D618032o9112O5611Q323m7052M2084N069j72547M3506j23035J37482o945
4895D501416q2731p2452J7213J12523J08339l2112K6200M5431O4472K8410j3597
4884D703112J34782k441J09754j43739M7836Q1270J18416j00548l9504J81503
4874E090441q8424N9147K09005j97334R4149N4320J17541K67158J23192K64794
4864E993989L52449K25607J95653O2243J20317P7877n5006L4584k4794Q4374n9505
4853G007788K63043N3537R3675P3296k065j45575l9832j79755m4666m00970r057
4842F669419j26482n1248P75J2545L9624J69564J41538L51305J62079L31407R8030
$$ plain form
4831 7798556 7997698 8187334 8217123 8221304 8249772 8175033 8110736 8099018 8123311 8051698 8071596
4820 8071596 7977703 8022617 7887665 7913748 7838255 7772042 7663317 7579737 7672065 7609302 7587335
4809 7587335 7604345 7725679 7704423 7935742 8091491 8151794 8223225 8267595 8188827 8334215 8376078
4798 8376078 8467364 8490863 8514432 8510087 8651854 8718269 8616508 8758568 8702144 8706935 8691432
4787 8691432 8648452 8611681 8647386 8632771 8567547 8607521 8554331 8704430 8721553 8704581 8758301
4776 8758301 8851544 8829958 8944014 8976618 8991714 9106492 9046252 9087371 9084739 9138780 9152507
4765 9152507 9122364 9042909 9012033 9014051 9006941 9083534 9029784 9053382 9099772 9103090 9185522 9233148
4753 9233148 9247700 9301360 9398930 9462984 9457189 9501371 9474398 9507740 9427044 9396767 9324673 9331997
$$ packed form
4831G798556J99142J89636K9789M181K8468p4739o4297j1718K4293p1613J9898
4820H071596r3893M4914j34952K6083p5493o6213j08725q3580R2328o2763k1967
4809G587335J7010J21334k1256K31319J55749O0303P1431M4370p8768J45388M1863
4798H376078R1286K3499K3569m345J41767O6415j01761J42060n6424M791j5503
4787H691432m2980l6771L5705j4615o5224L9974n3190J50099J7123j6972N3720
4776H758301R3243k1586J14056L2604J5096J14778o0240M1119k632N4041J3727
4765I152507l0143p9455l0876K018p110P6593n3750K3598M6390L318Q2432M7626
4753I233148J4552N3660R7570O4054n795M4182k6973L3342q0696l0277p2094P324
$$ plain form
4741 9331997 9293277 9442514 9446959 9554471 9563532 9725668 9808318 9964049 9995133 10082049 10236530
4730 10236530 10358868 10421645 10429459 10576246 10674897 10766331 10909581 10901121 10994973 11098830 11134639
4719 11134639 11288580 11297024 11361474 11416640 11415917 11527431 11659427 11747686 11855521 12025095 12091389
4708 12091389 12231815 12423597 12459938 12622453 12899012 13005496 13086663 13174781 13301480 13496010
4698 13496010 13578539 13702478 13881928 14037625 14163179 14276676 14421641 14538575 14662602 14903212
4688 14903212 15088617 15152103 15403508 15571207 15810463 16098696 16326400 16521311 16707459 16846150
4678 16846150 17142787 17380294 17579534 17701642 18005145 18287819 18653335 18896547 19170019
4669 19170019 19620833 19863503 20180767 20464555 20893771 21311090 21767510 22226571 22549756
$$ packed form
4741I331997l8720J49237M445J07512R061J62136Q2650J55731L1084Q6916J54481
4730A0236530J22338O2777P814J46787R8651R1434J43250q460R3852J03857L5809
4719A1134639J53941Q444O4450N5166p23J11514J31996Q8259J07835J69574O6294
4708A2091389J40426J91782L6341J62515K76559J06484Q1167Q8118J26699J94530
4698A3496010Q2529J23939J79450J55697J25554J13497J44965J16934J24027K40610
4688A4903212J85405O3486K51405J67699K39256K88233K27704J94911J86148J38691
4678A6846150K96637K37507J99240J22108L03503K82674L65516K43212K73472
4669A9170019M50814K42670L17264K83788M29216M17319M56420M59061L23185
$$ plain form
4660 22549756 22972252 23369298 23835504 24355124 24832482 25269201 25685964 26237290 26682934
4651 26682934 27370377 27787657 28336971 28934405 29533838 30207025 30896641 31607441 32337279
4642 32337279 33164729 34123815 35037179 35991056 37009126 38250049 39359871 40738892 42241266
4633 42241266 44288393 46484621 48902966 51817920 55168478 58507805 62086799 65487112
4625 65487112 68473850 70742695 72422538 73364295 73778508 73767646 73706607 73535385 73686414
4616 73686414 74433631 75749904 78102200 81304182 85492031 90704498 96875224 103972720
4608 103972720 111806246 119837412 127908509 135968338 143388837 150239130 156563310 161769204
4600 161769204 165817128 168537255 170838605 172726863 174584860 176537924 178952294 182135278
$$ packed form
4660B2549756M22496L97046M66206N19620M77358M36719M16763N51326M45644
4651B6682934O87443M17280N49314N97434N99433O73187O89616P10800P29838
4642C2337279Q27450R59086R13364R53877J018070J240923J109822J379021J502374
4633D2241266K047127K196228K418345K914954L350558L339327L578994L400313
4625F5487112K986738K268845J679843R41757M14213j0862o1039j71222J51029
4616G3686414P47217J316273K352296L201982M187849N212467O170726P097496
4608A03972720P833526Q031166Q071097Q059829P420499O850293O324180N205894
4600A61769204M047924K720127K301350J888258J857997J953064K414370L182984
$$ plain form
4592 182135278 185855484 190302958 195306590 201138395 207111835 213816056 221130684 229214996
4584 229214996 238203829 247615824 257448399 267576997 277400961 286181656 293906813 300395262
4576 300395262 306061993 311033729 315604964 319662665 323390469 327139761 330871272 334777762
4568 334777762 338837464 342643224 345737335 348465836 351310002 354638999 358451540 362698690
4560 362698690 366972141 370462770 373449041 375981719 378238301 380684805 383541187 387323210
4552 387323210 391936009 397580898 403906724 410572010 417255265 422747687 426267894 427080023
4544 427080023 424589091 418859649 411062920 401542699 391004713 380221792 369397171 359321716
4536 359321716 350593045 343326427 338185033 335241223 334630556 335923238 339046201 343582870
$$ packed form
4592A82135278L720206M447474N003632N831805N973440O704221P314628Q084312
4584B29214996Q988833R411995R832575J0128598R823964Q780695P725157O488449
4576C00395262N666731M971736M571235M057701L727804L749292L731511L906490
4568C34777762M059702L805760L094111K728501K844166L328997L812541M247150
4560C62698690M273451L490629K986271K532678K256582K446504K856382L782023
4552C87323210M612799N644889O325826O665286O683255N492422L520207Q12129
4544D27080023k490932n729442p796729r520221j0537986j0782921j0824621j0075455
4536C59321716q728671p266618n141394k943810o10667J292682L122963M536669
$$ plain form
4528 343582870 349220595 354762709 359496103 361894667 361139834 357032076 349417039 338764404
4520 338764404 325970157 311322483 295724174 279789475 264528504 250521867 238247213
4513 238247213 227794389 219267973 212513526 207572432 204178629 201930658 200419187 199473572
4505 199473572 198470827 197199572 195168556 191864969 187237462 181543659 175090790 167904095
4497 167904095 160783156 153492073 146766513 140862034 135685887 131412425 127982350 125178239
4489 125178239 123070110 121662847 120728234 120463928 120702200 121239634 122237624 123257645 124549142
4480 124549142 126214246 128046934 130197694 132611439 135376543 138143988 141213520 144352433
4472 144352433 147934059 151682191 155612465 159637286 163820127 168020241 172070391 175880163
$$ packed form
4528C43582870N637725N542114M733394K398564p54833m107758p615037j0652635
4520C38764404j2794247j4647674j5598309j5934699j5260971j4006637j2274654
4513B38247213j0452824q526416o754447m941094l393803k247971j511471r45615
4505A99473572j002745j271255k031016l303587m627507n693803o452869p186695
4497A67904095p120939p291083o725560n904479n176147m273462l430075k804111
4489A25178239k108129j407263r34613k64306K38272N37434R97990J020021J291497
4480A24549142J665104J832688K150760K413745K765104K767445L069532L138913
4472A44352433L581626L748132L930274M024821M182841M200114M050150L809772
$$ plain form
4464 175880163 179548329 182942032 185942469 188539939 190512784 191973165 192604590 192663751
4456 192663751 192529823 192033799 191332006 190782331 190511426 190959119 192294499 194688955 197746058
4447 197746058 201373779 205353895 209167538 213022469 216052886 218154324 218921170 218492192
4439 218492192 216618027 213497955 209256595 204449460 199545294 194779251 190596433 187305596
4431 187305596 185133209 184326436 184352567 185002686 185805453 186257613 186333174 185773658 184347552
4422 184347552 182330938 179590700 176219827 172240306 168166577 163873974 159537196 155378589
4414 155378589 151430788 147345255 143157775 138841910 134530590 130278447 126065093 121892983
4406 121892983 117843686 114153516 110404442 107059172 104049680 101308257 98933381 96683486
$$ packed form
4464A75880163L668166L393703L000437K597470J972845J460381O31425N9161
4456A92663751j33928m96024p01793n49675k70905M47693J335380K394456L057103
4447A97746058L627721L980116L813643L854931L030417K101438P66846m28978
4439B18492192j874165l120072m241360m807135m904166m766043m182818l290837
4431A87305596k172387q06773K6131O50119Q02767M52160P5561n59516j426106
4422A84347552k016614k740238l370873l979521m073729m292603m336778m158607
4414A55378589l947801m085533m187480m315865m311320m252143m213354m172110
4406A21892983m049297l690170l749074l345270l009492k741423k374876k249895
$$ plain form
4398 96683486 94631295 92436163 90039308 87612681 84802557 81709445 78396902 74994797
4390 74994797 71449479 67885261 64594829 61557602 58992461 56543181 54491071 52589008
4382 52589008 50925856 49396157 47965346 46608502 45456919 44089816 42930316 41738505
4374 41738505 40374642 39161422 37789579 36555981 35200152 33995904 32562641 31377653
4366 31377653 30229026 29098118 28221997 27230203 26314204 25620137 24886411 24449494 23883138
4357 23883138 23434668 23159810 22772587 22626649 22399189 22310611 22344664 22308777 22392069 22286129
4347 22286129 22254981 22284389 22165833 22153403 22103069 21821414 21757541 21721865 21448162 21247850
4337 21247850 21058803 20826998 20622842 20358550 20166017 19924237 19725343 19492404 19245721
$$ packed form
4398I6683486k052191k195132k396855k426627k810124l093112l312543l402105
4390G4994797l545318l564218l290432l037227k565141k449280k052110j902063
4382E2589008j663152j529699j430811j356844j151583j367103j159500j191811
4374D1738505j363863j213220j371843j233598j355829j204248j433263j184988
4366C1377653j148627j130908q76121r91794r15999o94067p33726m36917n66356
4357B3883138m48470k74858l87223j45938k27460q8578L4053l5887Q3292j05940
4347B2286129l1148K9408j18556j2430n0334k81655o3873l5676k73703k00312
4337B1247850j89047k31805k04156k64292j92533k41780j98894k32939k46683
$$ plain form
4328 19245721 19070260 18852981 18664504 18384904 18177178 17905141 17636255 17455029 17287345
4319 17287345 17073054 16895008 16633570 16584449 16314804 16098738 15873178 15729955 15449532 15255828
4309 15255828 15077656 14769214 14502773 14396568 14263563 14125457 13967023 13977157 13935045 14066241
4299 14066241 14139358 14220145 14212315 14268088 14437920 14627395 14731422 14746576 14675482 14416426 14146341
4288 14146341 13667156 13220161 12624804 12071236 11338806 10898908 10397615 9859002 9460324
4279 9460324 9011662 8689067 8413775 8048060 7835781 7624212 7421800 7203938 6871207 6835065
4269 6835065 6624267 6479831 6391998 6232795 6033433 6043342 5690377 5647813 5465658 5339525
4259 5339525 5211509 5068805 5014690 4891419 4859770 4636848 4637621 4547174 4441662 4324738 4287384
$$ packed form
4328A9245721j75461k17279j88477k79600k07726k72037k68886j81226j67684
4319A7287345k14291j78046k61438m9121k69645k16066k25560j43223k80423j93704
4309A5255828j78172l08442k66441j06205j33005j38106j58434J0134m2112J31196
4299A4066241P3117Q0787p830N5773J69832J89475J04027J5154p1094k59056k70085
4288A4146341m79185m46995n95357n53568p32430m39898n01293n38613l98678
4279I460324m48662l22595k75292l65715k12279k11569k02412k17862l32731l6142
4269F835065k10798j44436q7833j59203j99362R909l52965m2564j82155j26133
4259E339525j28016j42704n4115j23271l1649k22922P73r0447j05512j16924l7354
$$ plain form
4248 4287384 4297966 4170451 4117106 4057141 3975622 3955844 3946339 3787345 3815634 3705258 3771984
4237 3771984 3619223 3519748 3375116 3325696 3348750 3286948 3226827 3212745 3116727 3218292 3301928
4226 3301928 3217237 3282077 3246192 3293269 3361614 3288311 3274012 3260425 3327065 3357506 3391338
4215 3391338 3493850 3437628 3550986 3524783 3503917 3518191 3717004 3655729 3695407 3795742 3836568
4204 3836568 3782042 3744799 3819577 3936608 3964717 4077960 4217432 4342134 4542969 4589489
4194 4589489 4960880 5144072 5353636 5666618 5980214 6487942 6921537 7509301 8278666 9723852
4184 9723852 11790461 14686228 17936664 21909786 25384452 27041580 26988452 26132137 25186966
4175 25186966 23634503 21098959 18311735 15366697 13085198 11204530 10109683 9407205
$$ packed form
4248D287384J0582j27515n3345n9965q1519j9778r505j58994K8289j10376O6726
4237C771984j52761r9475j44632m9420K3054o1802o0121j4082r6018J01565Q3636
4226C301928q4691O4840l5885M7077O8345p3303j4299j3587O6640L0441L3832
4215C391338J02512n6222J13358k6203k0866J4274J98813o1275L9678J00335M0826
4204C836568n4526l7243P4778J17031K8109J13243J39472J24702K00835M6520
4194D589489L71391J83192K09564L12982L13596N07728M33595N87764P69365J445186
4184I723852K066609K895767L250436L973122L474666J657128n3128q56315r45171
4175B5186966j552463k535544k787224k945038k281499j880668j094847p02478
$$ plain form
4167 9407205 8947689 8781146 8601508 8640486 8837425 9150051 9972353 11452028 13606829
4158 13606829 16507871 19786781 23661051 26664211 27429317 26856838 26420105 25413443 23816429
4149 23816429 21579402 19057876 17302634 15992152 15639541 16006369 16554524 16549379 16174889
4140 16174889 15920155 15839251 15938778 15806260 16095231 16288065 16203698 15568806 14933828 14310525
4130 14310525 13590098 12559839 11573125 10489007 9486480 8823391 8522662 8468346 8870614
4121 8870614 9540017 10425702 11596449 12798782 13470828 13459565 13571769 13913229 14268663
4112 14268663 14322184 14581045 14654782 14055331 13044592 12181700 11398189 10416239 9178408
4103 9178408 7996269 6739698 5785899 5002187 4414824 4069961 3756077 3502688 3312398
$$ packed form
4167I407205m59516j66543j79638L8978J96939L12626Q22302J479675K154801
4158A3606829K901042L278910L874270L003160P65106n72479m36733j006662j597014
4149B3816429k237027k521526j755242j310482l52611L66828N48155n145l74490
4140A6174889k54734q0904R9527j32518K88971J92834q4367o34892o34978o23303
4130A4310525p20427j030259r86714j084118j002527o63089l00729n4316M02268
4121H870614O69403Q85685J170747J202333O72046j1263J12204L41460L55434
4112A4268663N3521K58861P3737n99451j010739q62892p83511r81950j237831
4103I178408j182139j256571r53799p83712n87363l44863l13884k53389j90290
$$ plain form
4094 3312398 3079939 2976608 2692038 2554272 2525960 2318207 2215049 2044294 1909899 1884355
4084 1884355 1765080 1704185 1658772 1608948 1506597 1391302 1499149 1389369 1315918 1246166
4074 1246166 1360793 1359433 1273882 1287412 1138952 1147512 1120964 1040889 1003230 1016478 957860
4063 957860 1039975 1099368 1038908 1006121 973911 1053435 1008002 941108 982979 872815 817118
4052 817118 756107 794536 892613 799215 911130 739690 883538 828589 848778 801371 719919
4041 719919 789430 740359 753646 765585 900139 809774 900520 899362 860179 924594 943990 1078369
4029 1078369 945383 975477 938144 961518 910579 961673 960304 944916 991219 956386 960379 921891
4017 921891 1073089 957139 954346 923206 923053 849050 925141 985462 948735 967940 995740 1067914
$$ packed form
4094C312398k32459j03331k84570j37766k8312k07753j03158j70755j34395k5544
4084A884355j19275o0895m5413m9824j02351j15295J07847j09780p3451o9752
4074A246166J14627j360q5551J3530j48460Q560k6548q0075l7659J3248n8618
4063I57860Q2115N9393o0460l2787l2210P9524m5433o6894M1871j10164n5697
4052H17118o1011L8429R8077r3398J11915j71440J43848n4949K0189m7407q1452
4041G19919O9511m9071J3287J1939J34554r0365R0746j158l9183O4415J9396J34379
4029A078369j32986L0094l7333K3374n0939N1094j369j5388M6303l4833L993l8488
4017I21891J51198j15950k793l1140j53p4003P6091O0321l6727J9205K7800P2174
$$ plain form
4005 1067914 1047799 1035211 997658 964991 988662 982722 1136368 1158625 1202415 1211207 1090385
3994 1090385 1175792 1089681 1092571 1004393 1046523 881999 790374 845435 715015 743729 809240
3983 809240 671957 726772 624358 633092 663667 605072 610266 509625 523923 535647 607716
3972 607716 603274 629842 538319 586059 597724 470145 515353 456561 443671 441530 494863 429976
3960 429976 413981 269781 262051 207188 334883 231995 271538 310191 226819 163881 196372
3949 196372 171458 171886 215118 166032 118162 19005 53055 51550 59131 -56328 -5104 -19924
3937 -19924 -78743 -8964 19319 -62201 8106 168204 60236 10327 34110 15939 3121
3926 3121 24257 5229 -140447 -44484 -122410 -79963 -121700 -230934 -210719 -142543 -204720 -340587
$$ packed form
4005A067914k0115j2588l7553l2667K3671n940J53646K2257M3790Q792j20822
3994A090385Q5407q6111K890q8178M2130j64524r1625N5061j30420K8714O5511
3983H09240j37283N4815j02414Q734L0575n8595N194j00641J4298J1724P2069
3972F07716m442K6568r1523M7740J1665j27579M5208n8792j2890k141N3333o4887
3960D29976j5995j44200p730n4863J27695j02888L9543L8653q3372o2938L2491
3949A96372k4914M28M3232m9086m7870r9157L4050j505P581j15459N1224j4820
3937a9924n8819O9779K8283q1520P0307J60098j07968m9909K3783j8171j2818
3926C121K1136j9028j45676R5963p7926M2447m1737j09234K0215O8176o2177j35867
$$ plain form
3914 -340587 -328467 -207616 -226001 -151579 -270110 -243552 -167649 -153528 -100208 -117050 -170132
3903 -170132 -197191 -187604 -139420 -159930 -255884 -35697 -248774 -225821 -96169 -230994 -201411
3892 -201411 -233767 -167348 -149120 -198420 -241748 -229652 -128547 -179012 -167394 -164273 -189475 -201246
3880 -201246 -154678 -255679 -291380 -240332 -400640 -303445 -252670 -295110 -333003 -213080 -275984
3869 -275984 -239374 -318760 -228698 -218150 -296301 -250665 -217374 -320270 -312156 -301813 -241111 -327614
3857 -327614 -256852 -346721 -276265 -317909 -395959 -281502 -313228 -364643 -400490 -327924 -340117
3846 -340117 -379408 -429023 -390239 -439991 -421312 -458779 -386299 -357044 -385418 -418305 -458191 -351010
3834 -351010 -285914 -324815 -384233 -440837 -359091 -401336 -315699 -377904 -350401 -358600 -381603 -401638
$$ packed form
3914c40587J2120J20851j8385P4422j18531K6558P5903J4121N3320j6842n3082
3903a70132k7059R587M8184k0510r5954K20187k13077K2953J29652j34825K9583
3892b01411l2356O6419J8228m9300m3328J2096J01105n0465J1618L121k5202j1771
3880b01246M6568j01001l5701N1048j60308R7195N0775m2440l7893J19923o2904
3869b75984L6610p9386R0062J0548p8151M5636L3291j02896Q114J0343O0702q6503
3857c27614P0762q9869P0456m1644p8050J14457l1726n1415l5847P2566j2193
3846c40117l9291m9615L8784m9752J8679l7467P2480K9255k8374l2887l9886J07181
3834c51010O5096l8901n9418n6604Q1746m2245Q5637o2205K7503q199k3003k0035
$$ plain form
3822 -401638 -497495 -384801 -441441 -448115 -387130 -473914 -475636 -400642 -412183 -385454 -452262 -376510
3810 -376510 -326345 -383488 -389117 -411570 -369998 -498534 -429748 -422079 -391161 -396966 -444676 -418884
3798 -418884 -420812 -429779 -495288 -409542 -442222 -389799 -519883 -417164 -480588 -391271 -338850 -437016
3786 -437016 -460605 -482851 -449450 -367010 -443667 -433643 -400988 -457752 -552718 -500758 -543317 -518268
3774 -518268 -460479 -490537 -410899 -472108 -404032 -431662 -480141 -396411 -379156 -430235 -472373 -482386
3762 -482386 -435915 -395903 -568933 -449994 -377701 -492932 -475700 -494072 -405939 -413835 -450741
3751 -450741 -453800 -481211 -392390 -475610 -491728 -484758 -448417 -401166 -370457 -350358 -522794 -478638
3739 -478638 -397763 -490795 -434038 -369898 -507706 -505157 -483161 -498582 -527641 -565275 -446853
$$ packed form
3822d01638r5857J12694n6640o674O0985q6784j722P4994j1541K6729o6808P5752
3810c76510N0165n7143n629k2453M1572j28536O8786P669L0918n805m7710K5792
3798d18884j928q967o5509Q5746l2680N2423j30084J02719o3424Q9317N2421r8166
3786d37016k3589k2246L3401Q2440p6657J0024L2655n6764r4966N1960m2559K5049
3774e18268N7789l0058P9638o1209O8076k7630m8479Q3730J7255n1079m2138j0013
3762d82386M6471M0012j73030J18939P2293j15231J7232j8372Q8133p896l6906
3751d50741l059k7411Q8821q3220j6118O970L6341M7251L0709K0099j72436M4156
3739d78638Q0875r3032N6757O4140j37808K549K1996j5421k9059l7634J18422
$$ plain form
3728 -446853 -402407 -418788 -417913 -536050 -541588 -452878 -421631 -375599 -504956 -508946 -475457 -523236
3716 -523236 -424881 -466795 -472058 -532109 -453010 -471821 -450640 -493078 -379924 -503165 -592896
3705 -592896 -469087 -472950 -464887 -401427 -509667 -557536 -455057 -471607 -415632 -406736 -463701 -431097
3693 -431097 -499165 -529200 -526566 -384999 -515074 -488821 -445678 -377332 -518308 -510350 -510421 -530026
3681 -530026 -530230 -509596 -522204 -548702 -541643 -430121 -489613 -500215 -441567 -496476 -405965 -519231
3669 -519231 -525279 -547105 -508846 -466868 -555939 -495175 -417046 -567689 -471009 -430063 -429384 -525026
3657 -525026 -591696 -525862 -584001 -487614 -528599 -499728 -502013 -531079 -508277 -610675 -545675 -511264
3645 -511264 -461013 -446673 -574827 -506547 -541395 -503822 -498559 -533605 -560625 -626138 -459148
$$ packed form
3728d46853M4446j6381Q75j18137n538Q8710L1247M6032j29357l990L3489m7779
3716e23236R8355m1914n263o0051P9099j8811K1181m2438J13154j23241q9731
3705e92896J23809l863Q063O3460j08240m7869J02479j6550N5975Q896n6965L2604
3693d31097o8068l0035K634J41567j30075K6253M3143O8346j40976P958p1j9605
3681e30026k04K0634j2608k6498P059J11522n9492j0602N8648n4909R0511j13266
3669e19231o048k1826L8259M1978q9071O0764P8129j50643R6680M0946O79r5642
3657e25026o6670O5834n8139R6387m0985K8871k285k9066K2802j02398O5000L4411
3645e11264N0251J4340j28154O8280l4848L7573N263l5046k7020o5513J66990
$$ plain form
3634 -459148 -466560 -477780 -514539 -582284 -515253 -469217 -401387 -429042 -481365 -509630 -505254 -499224
3622 -499224 -478071 -389346 -546483 -595395 -446674 -569590 -461279 -519391 -508544 -521494 -538849
3611 -538849 -507713 -449468 -451662 -436685 -490291 -545235 -415174 -417846 -505610 -388463 -459789 -485984
3599 -485984 -542210 -496209 -488178 -572951 -473143 -465708 -465501 -476144 -482463 -413633 -508318 -504049 -439791
3586 -439791 -546140 -475709 -563017 -597643 -575398 -471030 -465939 -494609 -533839 -440377 -502082
3575 -502082 -553386 -497890 -409730 -479228 -489537 -503532 -439044 -523483 -430920 -518568 -504024 -484385
3563 -484385 -508036 -469092 -575971 -528120 -418581 -462725 -501289 -501706 -462633 -502328 -490263 -383279
3551 -383279 -467444 -404167 -431161 -552193 -501064 -490160 -511187 -489019 -470287 -549170 -520569
$$ packed form
3634d59148p412j1220l6759o7745O7031M6036O7830k7655n2323k8265M376O030
3622d99224K1153Q8725j57137m8912J48721j22916J08311n8112J0847j2950j7355
3611e38849L1136N8245k194J4977n3606n4944J30061k672q7764J17147p1326k6195
3599d85984n6226M6001Q031q4773R9808P435K07j0643o319O8830r4685M269O4258
3586d39791j06349P0431q7308l4626K2245J04368N091k8670l9230R3462o1705
3575e02082n1304N5496Q8160o9498j0309j3995O4488q4439R2563q7648J4544J9639
3563d84385k3651L8944j06879M7851J09539m4144l8564m17L9073l9695J2065J06984
3551c83279q4165O3277k6994j21032N1129J0904k1027K2168J8732p8883K8601
$$ plain form
3540 -520569 -534342 -522190 -548039 -465991 -523096 -500702 -537518 -449946 -411390 -529119 -404155
3529 -404155 -517633 -500502 -535893 -473500 -403704 -463661 -459018 -517464 -462670 -494770 -453194 -521734
3517 -521734 -565600 -533797 -485793 -530472 -472124 -469494 -477092 -407113 -475345 -535522 -414241 -537092
3505 -537092 -508622 -547314 -516706 -453834 -476203 -437377 -508653 -452493 -580828 -510716 -494505
3494 -494505 -581951 -450286 -441519 -598464 -498744 -565459 -490589 -592452 -550868 -435168 -453517
3483 -453517 -472819 -522157 -454983 -474436 -571909 -522137 -464412 -445312 -528306 -534000 -561055 -460400
3471 -460400 -403019 -565404 -465801 -605842 -550284 -434088 -479479 -439405 -624174 -487769 -501772
3460 -501772 -501589 -523914 -506488 -489892 -448920 -427986 -544744 -519257 -491631 -562341 -532142 -505755
$$ packed form
3540e20569j3773J2152k5849Q2048n7105K2394l6816Q7572L8556j17729J24964
3529d04155j13478J7131l5391O2393O9796n9957M643n8446N4794l2100M1576o8540
3517e21734m3866L1803M8004m4679N8348K630p598O9979o8232o0177J21281j22851
3505e37092K8470l8692L0608O2872k2369L8826p1276N6160j28335P0112J6211
3494d94505q7446J31665Q767j56945R9720o6715P4870j01863M1584J15700j8349
3483d53517j9302m9338O7174j9453r7473M9772N7725J9100q2994n694k7055J00655
3471d60400N7381j62385R9603j40041N5558J16196m5391M0074j84769J36405j4003
3460e01772J83k2325J7426J6596M0972K0934j16758K5487K7626p0710L0199K6387
$$ plain form
3448 -505755 -537703 -505603 -544657 -458987 -525585 -485368 -489144 -424738 -532421 -503125 -540186 -570745
3436 -570745 -507270 -458931 -462969 -517537 -465948 -509538 -457279 -422476 -440452 -573484 -554352 -443764
3424 -443764 -527426 -445043 -434857 -533677 -391470 -505140 -484061 -436775 -383250 -480247 -452508
3413 -452508 -529349 -388953 -420603 -458697 -501021 -481943 -376633 -491840 -495217 -539027 -499287
3402 -499287 -461761 -424317 -416442 -402471 -470622 -585855 -452765 -372887 -510340 -410503 -541755
3391 -541755 -505749 -421587 -451549 -413001 -468473 -501613 -465403 -454981 -470519 -552394 -505933 -444369
3379 -444369 -447716 -359874 -444893 -477260 -470592 -392902 -445236 -422057 -482708 -460581 -389899 -427146
3367 -427146 -419008 -430369 -447663 -466381 -424736 -400077 -534678 -333191 -333108 -341009 -350994 -296977
$$ packed form
3448e05755l1948L2100l9054Q5670o6598M0217l776O4406j07683K9296l7061l0559
3436e70745O3475M8339m038n4568N1589m3590N2259L4803j7976j33032J9132J10588
3424d43764q3662Q2383J0186r8820J42207j13670K1079M7286N3525r6997K7739
3413d52508p6841J40396l1650l8094m2324J9078J05310j15207l377m3810L9740
3402d99287L7526L7444P875J3971o8151j15233J33090P9878j37453R9837j31252
3391e41755L6006Q4162k9962L8548n5472l3140L6210J0422j5538q1875M6461O1564
3379d44369l347Q7842q5019l2367O668P7690n2334K3179o0651K2127P0682l7247
3367d27146Q138j1361j7294j8718M1645K4659j34601K01487Q3p901r985N4017
$$ plain form
3355 -296977 -314541 -329403 -365967 -310719 -305858 -269535 -217360 -357009 -384108 -372957 -274858 -400846
3343 -400846 -255218 -413263 -461509 -363542 -434289 -354401 -418517 -377791 -371897 -377492 -364294 -310670
3331 -310670 -302846 -343093 -374099 -227791 -282805 -373038 -274095 -263523 -272665 -238443 -172041 -186736
3319 -186736 -222104 -171513 -186823 -52729 14017 93125 232713 365733 294446 489882 437143
3308 437143 688714 829449 928095 1067425 1430300 2035994 3310598 4566760 6072592
3299 6072592 8461672 10287900 9551075 8891960 8621354 8282066 7286237 5815944 4381791
3290 4381791 3126767 2288102 1682723 1261077 976432 1025450 736750 624721 548022 400672
3280 400672 347383 322637 131493 35682 9893 -58291 -149426 -43069 -142241 -37823 -174592
$$ packed form
3355b96977j7564j4862l6564N5248M861L6323N2175j39649k7099J1151R8099j25988
3343d00846J45628j58045m8246R7967p0747P9888o4116M0726N894n595J3198N3624
3331c10670P824m0247l1006J46308n5014r0233R8943J0572r142L4222O6402j4695
3319a86736l5368N0591j5310J34094O6746P9108J39588J33020p1287J95436n2739
3308D37143K51571J40735R8646J39330L62875O05694J274604J256162J505832
3299F072592K389080J826228p36825o59115k70606l39288r95829j470293j434153
3290D381791j255024q38665o05379m21646k84645M9018k88700j12029p6699j47350
3280D00672n3289k4746j91144r5811k5789o8184r1135J06357r9172J04418j36769
$$ plain form
3269 -174592 -188520 -89653 -256795 -223948 -233001 -87102 -261236 -190719 -260905 -209360 -314068
3258 -314068 -292534 -319664 -319097 -379089 -333275 -299813 -303855 -395184 -300688 -278373 -288065 -331407
3246 -331407 -270813 -258612 -335946 -356612 -305293 -322763 -326600 -401469 -364122 -426508 -420716 -325030
3234 -325030 -355110 -385451 -407850 -378669 -398786 -407821 -418397 -577701 -383397 -352448 -405933
3223 -405933 -433757 -459509 -391874 -441731 -504970 -490769 -469652 -404461 -372634 -489800 -434884
3212 -434884 -527832 -431793 -462126 -407269 -466018 -456671 -474791 -537166 -467444 -431452 -452003 -407481
3200 -407481 -324595 -451704 -473157 -385462 -528887 -415453 -425154 -428259 -538194 -486352 -482174
3189 -482174 -370459 -507729 -498530 -412366 -500287 -474690 -517358 -519252 -518111 -507299 -466434 -514630
$$ packed form
3269a74592j3928R8867j67142L2847r053J45899j74134P0517p0186N1545j04708
3258c14068K1534k7130N67n9992M5814L3462m042r1329R4496K2315r692m3342
3246c31407O0594J2201p7334k0666N1319j7470l837p4869L7347o2386N792R5686
3234c25030l0080l0341k2399K9181k0117r035j0576j59304J94304L0949n3485
3223d05933k7824k5752O7635m9857o3239J4201K1117O5191L1827j17166N4916
3212d34884r2948R6039l0333N4857n8749R347j8120o2375O9722L5992k0551M4522
3200d07481Q2886j27109k1453Q7695j43425J13434r701l105j09935N1842M178
3189d82174J11715j37270R199Q6164q7921K5597m2668j894J141J0812M0865m8196
$$ plain form
3177 -514630 -449890 -468696 -565040 -497547 -498322 -457512 -515510 -472643 -507822 -517906 -499408 -485461
3165 -485461 -420649 -569718 -496254 -560046 -518078 -467693 -426449 -554704 -570361 -580172 -595887
3154 -595887 -540422 -506993 -473654 -534078 -620052 -492676 -508327 -598596 -482774 -566896 -514435
3143 -514435 -609124 -417064 -581036 -525674 -480054 -546017 -502698 -554702 -430822 -484930 -544937
3132 -544937 -496946 -530228 -495545 -477805 -518641 -392710 -459537 -589319 -542324 -495696 -429780
3121 -429780 -549477 -541299 -482326 -513461 -552024 -505019 -538340 -523041 -499456 -558411 -546598 -608578
3109 -608578 -482645 -596615 -549471 -601208 -534815 -538158 -516662 -478982 -565636 -583165 -481680
3098 -481680 -547016 -663052 -525918 -442893 -451470 -496074 -510087 -414548 -578538 -630377 -469303
$$ packed form
3177e14630O4740j8806r6344O7493p75M0810n7998M2867l5179j0084J8498J3947
3165d85461O4812j49069P3464o3792M1968N0385M1244j28255j5657r811j5715
3154e95887N5465L3429L3339o0424q5974J27376j5651r0269J15822q4122N2461
3143e14435r4689J92060j63972N5362M5620o5963M3319n2004J23880n4108o0007
3132e44937M7991l3282L4683J7740m0836J25931o6827j29782M6995M6628O5916
3121d29780j19697Q178N8973l1135l8563M7005l3321J5299K3585n8955J1813o1980
3109f08578J25933j13970M7144n1737O6393l343K1496L7680q6654j7529J01485
3098d81680o5336j16036J37134Q3025q577m4604j4013R5539j63990n1839J61074
$$ plain form
3087 -469303 -559098 -501673 -439733 -502714 -545561 -576683 -577988 -537237 -442335 -458318 -569819 -457808
3075 -457808 -548807 -463368 -502841 -462187 -497629 -483673 -395494 -459659 -497834 -512768 -490621 -524775
3063 -524775 -509908 -420207 -523839 -443676 -400254 -394036 -490432 -498436 -515106 -473840 -439703 -447393
3051 -447393 -514874 -503634 -555798 -519293 -475154 -589930 -578373 -527838 -563781 -483536 -578075
3040 -578075 -561433 -619617 -582117 -565727 -490216 -609349 -520094 -536568 -475193 -487271 -510374
3029 -510374 -570129 -456069 -489683 -546066 -486177 -551345 -524076 -587467 -504638 -521198 -461252
3018 -461252 -523527 -507607 -454158 -559430 -603884 -540701 -547336 -631686 -540816 -578243 -657501 -556131
3006 -556131 -525949 -602317 -451567 -561411 -559039 -481491 -502194 -570450 -433970 -585425 -543061
$$ packed form
3087d69303q9795N7425O1940o2981m2847l1122j305M0751R4902j5983j11501J12011
3075d57808r0999Q5439l9473M0654l5442J3956Q8179o4165l8175j4934K2147l4154
3063e24775J4867Q9701j03632Q0163M3422O218r6396q004j6670M1266L4137p690
3051d47393o7481J1240n2164L6505M4139j14776J1557N0535l5943Q0245r4539
3040e78075J6642n8184L7500J6390P5511j19133Q9255j6474O1375j2078k3103
3029e10374n9755J14060l3614n6383N9889o5168K7269o3391Q2829j6560N9946
3018d61252o2275J5920N3449j05272m4454O3183o635q4350R0870l7427p9258J01370
3006e56131L0182p6368J50750j09844K372P7548k0703o8256J36480j51455M2364
$$ plain form
2995 -543061 -489211 -542977 -580623 -486093 -510439 -551882 -508852 -542363 -528366 -513275 -500520 -549489
2983 -549489 -571732 -529868 -563752 -526198 -473793 -511322 -444410 -498730 -635010 -512921 -574750
2972 -574750 -533007 -450519 -488375 -450558 -500902 -579272 -448370 -554127 -494982 -522591 -569612
2961 -569612 -502784 -483706 -595363 -530441 -620863 -566729 -683304 -556549 -593558 -542430 -524239
2950 -524239 -506580 -449521 -549897 -521396 -487413 -622888 -596366 -624392 -581384 -503027 -554311
2939 -554311 -533997 -483008 -550359 -574143 -548975 -488690 -625845 -499188 -546733 -614521 -585383
2928 -585383 -605692 -546076 -546399 -391662 -500478 -560154 -594179 -550304 -501117 -490312 -496870 -477736
2916 -477736 -505412 -525514 -556060 -569533 -588391 -586852 -564701 -567870 -588099 -516780 -598522 -587635
$$ packed form
2995e43061N3850n3766l7646R4530k4346m1443M3030l3511J3997J5091J2755m8969
2983e49489k2243M1864l3884L7554N2405l7529O6912n4320j36280J22089o1829
2972e74750M1743Q2488l7856L7817n0344p8370J30902j05757N9145k7609m7021
2961e69612O6828J9078j11657O4922r0422N4134j16575J26755l7009N1128J8191
2950e24239J7659N7059j00376K8501L3983j35475K6522k8026M3008P8357n1284
2939e54311K0314N0989o7351k3784K5168O0285j37155J26657m7545o7788K9138
2928e85383k0309N9616l23J54737j08816n9676l4025M3875M9187J0805o558J9134
2916d77736k7676k0102l0546j3473j8858J539K2151l169k0229P1319q1742J0887
$$ plain form
2904 -587635 -502291 -511313 -505732 -604611 -584829 -470685 -530374 -514006 -550523 -613586 -562742 -504040
2892 -504040 -577555 -486346 -619672 -567411 -516499 -566738 -526238 -516944 -535618 -488089 -537166 -486868
2880 -486868 -507336 -500447 -525729 -580308 -556572 -528100 -559681 -499329 -496991 -500940 -582047 -537864
2868 -537864 -547111 -602924 -530273 -612363 -470143 -481664 -603478 -550673 -621613 -635680 -542549
2857 -542549 -480273 -540082 -600957 -503590 -412474 -528188 -641145 -559451 -542334 -518173 -549195
2846 -549195 -531516 -533706 -513097 -561756 -489783 -589554 -584918 -531385 -488075 -583067 -561525 -559482
2834 -559482 -623697 -519178 -562416 -578304 -479043 -592059 -506039 -455505 -641625 -558097 -533676
2823 -533676 -557670 -463270 -483740 -536801 -569731 -508927 -555281 -520564 -622060 -521557 -527666
$$ packed form
2904e87635Q5344r022N581r8879J9782J14144n9689J6368l6517o3063N0844N8702
2892e04040p3515R1209j33326N2261N0912n0239M0500R294j8674M7529m9077N0298
2880d86868k0468O889k5282n4579K3736K8472l1581O0352K338l949q1107M4183
2868e37864r247n5813P2651q2090J42220j1521j21814N2805p0940j4067R3131
2857e42549O2276n9809o0875R7367R1116j15714j12957Q1694J7117K4161l1022
2846e49195J7679k190K0609m8659P1973r9771M636N3533M3310r4992K1542K043
2834e59482o4215J04519m3238j5888R9261j13016Q6020N0534j86120Q3528K4421
2823e33676k3994R4400k0470n3061l2930O0804m6354L4717j01496J00503o109
$$ plain form
2812 -527666 -423571 -640960 -511149 -565993 -561828 -560611 -500494 -520812 -441123 -560184 -535790
2801 -535790 -555326 -533907 -595476 -610371 -575358 -581460 -557608 -452804 -545396 -521990 -595368 -585147
2789 -585147 -527686 -558141 -538558 -468021 -633338 -558796 -569529 -595688 -537964 -571156 -543375
2778 -543375 -513161 -527226 -516636 -637693 -513653 -502276 -559179 -504521 -603837 -568802 -578426
2767 -578426 -625585 -535822 -544168 -603133 -521708 -576744 -598021 -508045 -605697 -554513 -584505 -524106
2755 -524106 -584559 -519762 -586122 -615168 -570873 -477114 -599124 -549378 -538194 -461108 -554388
2744 -554388 -497196 -504507 -445543 -616324 -509459 -527094 -592479 -522969 -473503 -507816 -479063
2733 -479063 -555857 -579761 -488395 -522800 -424711 -545384 -549549 -509163 -515376 -502608 -518703 -546236
$$ packed form
2812e27666J04095k17389J29811n4844M165J217O0117k0318P9689j19061K4394
2801e35790j9536K1419o1569j4895L5013o102K3852J04804r2592K3406p3378J0221
2789e85147N7461l0455J9583P0537j65317P4542j0733k6159N7724l3192K7781
2778e43375L0214j4065J0590j21057J24040J1377n6903N4658r9316L5035r624
2767e78426m7159Q9763q346n8965Q1425n5036k1277Q9976r7652N1184k9992O0399
2755e24106o0453O4797o6360k9046M4295R3759j22010M9746J1184P7086r3280
2744e54388N7192p311N8964j70781J06865j7635o5385O9510M9466l4313K8753
2733d79063p6794k3904R1366l4405R8089j20673m165M0386o213J2768j6095k7533
$$ plain form
2721 -546236 -608997 -544962 -570389 -526786 -552485 -536129 -546349 -552443 -480258 -559286 -540154 -604840
2709 -604840 -549255 -468645 -502491 -553080 -553745 -523979 -502073 -538517 -477310 -574233 -594268 -618565
2697 -618565 -617799 -594387 -556833 -506337 -503217 -541421 -607484 -479702 -499138 -474394 -515818 -501797
2685 -501797 -544486 -531298 -483975 -484955 -501025 -648195 -608982 -582984 -580655 -538007 -549208 -553577
2673 -553577 -496428 -541827 -605723 -512967 -529491 -555856 -530849 -552159 -495005 -629635 -542890
2662 -542890 -540012 -554240 -597927 -472027 -490790 -486032 -514054 -514888 -531867 -561053 -612305 -640145
2650 -640145 -490631 -529532 -574146 -598829 -585223 -654960 -549725 -462731 -546455 -588548 -632120
2639 -632120 -541116 -527228 -531594 -559810 -519921 -620780 -525102 -472026 -587962 -547209 -466295
$$ packed form
2721e46236o2761O4035k5427M3603k5699J6356j0220o094P2185p9028J9132o4686
2709f04840N5585Q0610l3846n0589o65K9766K1906l6444O1207r6923k0035k4297
2697f18565P66K3412L7554N0496L120l8204o6063J27782j9436K4744m1424J4021
2685e01797m2689J3188M7323r80j6070j47170L9213K5998K329M2648j1201m369
2673e53577N7149m5399o3896R2756j6524k6365K5007k1310N7154j34630Q6745
2662e42890K878j4228m3687J25900j8763M758k8022q34j6979k9186n1252k7840
2650f40145J49514l8901m4614k4683J3606o9737J05235Q6994q3724m2093m3572
2639f32120R1004J3888m366k8216L9889j00859R5678N3076j15936M0753Q0914
$$ plain form
2628 -466295 -615513 -495738 -587169 -503573 -521058 -491418 -482690 -409734 -498963 -602809 -476734
2617 -476734 -517116 -634312 -579977 -545811 -509883 -544139 -477161 -469273 -509182 -554248 -569257 -431828
2605 -431828 -556456 -504152 -453633 -590673 -573307 -459762 -538215 -509407 -504698 -482044 -530951
2594 -530951 -486526 -553890 -551015 -490474 -575548 -604866 -480269 -516064 -551496 -544650 -546662 -536207
2582 -536207 -512246 -400204 -539177 -536359 -524368 -471124 -515630 -628994 -650325 -529632 -644353
2571 -644353 -619889 -535340 -525653 -549647 -492486 -621723 -617772 -533851 -506798 -488977 -543822 -685575
2559 -685575 -596056 -479356 -530227 -504281 -489801 -516676 -497739 -506636 -569448 -587350 -558249 -555634
2547 -555634 -531628 -527229 -578578 -548380 -500506 -537538 -611739 -571671 -557564 -484621 -592960 -583727
$$ packed form
2628d66295j49218J19775r1431Q3596j7485K9640Q728P2956q9229j03846J26075
2617d76734m0382j17196N4335L4166L5928l4256O6978P888l9909m5066j5009J37429
2605d31828j24628N2304N0519j37040J7366J13545p8453K8808M709K2654m8907
2594e30951M4425o7364K875O0541q5074k9318J24597l5795l5432O846k012J0455
2582e36207K3961J12042j38973K818J1991N3244m4506j13364k1331J20693j14721
2571f44353K4464Q4549R687k3994N7161j29237L951Q3921K7053J7821n4845j41753
2559f85575Q9519J16700n0871K5946J4480k6875J8937q897o2812j7902K9101K615
2547e55634K4006M399n1349L0198M7874l7032p4201M0068J4107P2943j08339R233
$$ plain form
2535 -583727 -479628 -567085 -640054 -553934 -542739 -545530 -544243 -556422 -493185 -430255 -558383 -543809
2523 -543809 -459257 -549034 -488089 -560690 -604756 -523916 -498926 -551404 -527852 -537506 -532210 -546413
2511 -546413 -547451 -478211 -546023 -542818 -485844 -556814 -612190 -487572 -567337 -476401 -451491 -531843
2499 -531843 -572460 -488114 -531217 -511929 -551060 -669728 -573486 -527652 -569662 -526970 -596694
2488 -596694 -472617 -585961 -619701 -590717 -582839 -576974 -537760 -575064 -558957 -474413 -492113 -563427
2476 -563427 -475110 -559884 -482196 -541014 -472169 -574317 -607900 -544353 -496433 -588861 -552516
2465 -552516 -538248 -631213 -506026 -502803 -492669 -592564 -569378 -499909 -533171 -633347 -511210
2454 -511210 -543951 -365116 -463970 -674853 -503088 -593574 -570161 -506222 -514254 -558655 -482802
$$ packed form
2535e83727J04099q7457p2969Q6120J1195k791J287j2179O3237O2930j28128J4574
2523e43809Q4552q9777O0945p2601m4066Q0840K4990n2478K3552r654N296j4203
2511e46413j038O9240o7812L205N6974p0970n5376J24618p9765R0936K4910q0352
2499e31843m0617Q4346m3103J9288l9131j18668R6242M5834m2010M2692o9724
2488e96694J24077j13344l3740K8984P878N865L9214l7304J6107Q4544j7700p1314
2476e63427Q8317q4774P7688n8818O8845j02148l3583O3547M7920r2428L6345
2465e52516J4268r2965J25187L223J0134r9895K3186O9469l3262j00176J22137
2454e11210l2741J78835r8854k10883J71765r0486K3413O3939q032m4401P5853
$$ plain form
2443 -482802 -579908 -539839 -501334 -442339 -540221 -557224 -508321 -503631 -556198 -597278 -587467 -494788
2431 -494788 -547868 -512502 -604325 -564324 -515763 -479460 -527255 -497241 -515115 -554837 -559386 -546738
2419 -546738 -525625 -528010 -557044 -536318 -584927 -494197 -485054 -459609 -440012 -604790 -672848 -393347
2407 -393347 -540185 -562498 -534123 -531501 -531732 -541458 -520093 -505008 -465866 -530896 -512896 -570129
2395 -570129 -580714 -563956 -454694 -439848 -459153 -588634 -545843 -546928 -595986 -556435 -611601
2384 -611601 -600353 -477629 -566055 -520727 -559341 -654345 -664884 -545534 -576351 -466107 -533382
2373 -533382 -532669 -459904 -447958 -463433 -586588 -582822 -487139 -642731 -590304 -525672 -455684 -637995
2361 -637995 -532874 -534884 -573626 -555708 -575566 -595491 -500282 -551950 -524526 -436145 -576258
$$ packed form
2443d82802r7106M0069L8505N8995r7882j7003M8903M690n2567m1080R811R2679
2431d94788n3080L5366r1823M0001M8561L6303m7795L0014j7874l9722m549J2648
2419e46738K1113k385k9034K0726m8609R0730R143K5445J9597j64778o8058K79501
2407c93347j46838k2313K8375K622k31r726K1365J5085L9142o5030J8000n7233
2395e70129j0585J6758J09262J4846j9305j29481M2791j085m9058L9551n5166
2384f11601J1248J22724q8426M5328l8614r5004j0539J19350l0817J10244o7275
2373e33382P13P2765J1946j5475j23155L766R5683j55592N2427O4632O9988j82311
2361f37995J05121k010l8742J7918j9858j9925R5209n1668K7424Q8381j40113
$$ plain form
2350 -576258 -534163 -515437 -528548 -487864 -519674 -584499 -500446 -472027 -616027 -520772 -579186
2339 -579186 -544039 -480831 -551836 -461005 -546545 -484481 -458410 -668287 -570033 -607643 -511017
2328 -511017 -551158 -595556 -553019 -492519 -532777 -660529 -528197 -528222 -578716 -592815 -457265 -520410
2316 -520410 -524084 -517598 -505115 -534630 -590691 -499871 -493734 -633244 -595572 -588859 -504913 -539167
2304 -539167 -523625 -546524 -586517 -535930 -593784 -612667 -516290 -604035 -538230 -529880 -452794 -562055
2292 -562055 -594183 -540424 -592777 -517390 -597174 -537678 -532730 -660007 -519786 -596966 -487020
2281 -487020 -645668 -540153 -464220 -578829 -564827 -584281 -557882 -563281 -546697 -523854 -601816
2270 -601816 -623537 -531128 -515758 -462489 -613588 -517141 -492211 -511010 -460502 -571347 -507612
$$ packed form
2350e76258M2095J8726j3111M0684l1810o4825Q4053K8419j44000R5255n8414
2339e79186L5147O3208p1005R0831q5540O2064K6071k09877R8254l7610R6626
2328e11017m0141m4398M2537O0500m0258j27752J32332k5n0494j4099J35550o3145
2316e20410l674O486J2483k9515n6061R0820O137j39510L7672O713Q3946l4254
2304e39167J5542k2899l9993N0587n7854j8883R6377q7745O5805Q350P7086j09261
2292e62055l2128N3759n2353P5387p9784N9496M948j27277J40221p7180J09946
2281d87020j58648J05515P5933j14609J4002j9454K6399n399J6584K2843p7962
2270f01816k1721R2409J5370N3269j51099R6447K4930j8799N0508j10845O3735
$$ plain form
2259 -507612 -630924 -529741 -569464 -646592 -579424 -567159 -578507 -522734 -520582 -594681 -453288
2248 -453288 -521924 -560417 -610787 -552809 -556629 -525079 -626048 -609596 -584590 -630800 -610945 -553368
2236 -553368 -568641 -480356 -561393 -616075 -577618 -539456 -571499 -580181 -565077 -469402 -561906 -527177
2224 -527177 -622968 -568206 -583981 -462105 -479529 -456867 -578616 -512510 -546219 -599215 -571744
2213 -571744 -498018 -535298 -531079 -459521 -651268 -527615 -601300 -531605 -532565 -582433 -534537 -466336
2201 -466336 -494483 -640152 -396211 -595038 -595905 -613764 -454776 -514285 -604302 -500719 -571237
2190 -571237 -561979 -494982 -494074 -476112 -571148 -562674 -557079 -465541 -627758 -562230 -626736 -437623
2178 -437623 -607241 -558159 -553592 -586913 -596833 -537886 -576836 -563087 -575677 -554460 -543998 -471266
$$ packed form
2259e07612j23312J01183l9723p7128O7168J2265j1348N5773K152p4099J41393
2248d53288o8636l8493n0370N7978l820L1550j00969J6452K5006m6210J9855N7577
2236e53368j5273Q8285q1037n4682L8457L8162l2043q682J5104R5675r2504L4729
2224e27177r5791N4762j5775J21876j7424K2662j21749O6106l3709n2996K7471
2213e71744P3726l7280M219P1558j91747J23653p3685O9695r60m9868M7896O8201
2201d66336k8147j45669K43941j98827q67j7859J58988n9509r0017J03583p0518
2190e71237R258O6997R08J7962r5036Q474N595R1538j62217O5528o4506J89113
2178d37623j69618M9082M567l3321r920N8947l8950J3749j2590K1217J0462P2732
$$ plain form
2166 -471266 -558008 -502333 -517148 -530535 -562795 -573257 -612039 -527379 -546191 -512579 -606956 -580434
2154 -580434 -644248 -419416 -620820 -545304 -545909 -508324 -536676 -619654 -566105 -443632 -495025
2143 -495025 -516402 -624183 -479950 -542590 -567475 -546802 -477727 -528832 -524097 -631794 -551555
2132 -551555 -621182 -515819 -550960 -548394 -549007 -541184 -519058 -520484 -475992 -530636 -668029 -557073
2120 -557073 -453930 -607990 -485221 -635766 -506883 -533795 -539307 -587991 -554812 -563346 -555243
2109 -555243 -509123 -546367 -598833 -555780 -495714 -568430 -522054 -594836 -569143 -580117 -618041 -563986
2097 -563986 -516601 -512748 -538989 -529582 -560108 -515807 -609613 -553586 -621906 -634157 -473694 -564968
2085 -564968 -527358 -568871 -689800 -590930 -523250 -595352 -588733 -472515 -456866 -567338 -536400
$$ packed form
2166d71266q6742N5675j4815j3387l2260j0462l8782Q4660j8812L3612r4377K6522
2154e80434o3814K24832k01404P5516o05L7585k8352q2978N3549J22473n1393
2143d95025k1377j07781J44233o2640k4885K0673O9075n1105M735j07697Q0239
2132e51555o9627J05363l5141K566o13P823K2126j426M4492n4644j37393J10956
2120e57073J03143j54060J22769j50545J28883k6912n512m8684L3179q534Q103
2109e55243M6120l7244n2466M3053O0066p2716M6376p2782K5693j0974l7924N4055
2097e63986M7385L853k6241R407l0526M4301r3806N6027o8320j2251J60463r1274
2085e64968L7610m1513j20929R8870O7680p2102O619J16218J5649j10472L0938
$$ plain form
2074 -536400 -422155 -485091 -483573 -513997 -557133 -638962 -530939 -462625 -566666 -620564 -509058
2063 -509058 -516493 -496751 -613822 -558209 -573494 -621095 -560256 -500599 -643530 -556780 -540730
2052 -540730 -553844 -524292 -533226 -528506 -546068 -541051 -536531 -533525 -501925 -562098 -482530 -492804 -605357
2039 -605357 -582260 -612308 -498645 -476500 -519830 -508476 -582047 -379543 -509798 -488240 -541855
2028 -541855 -536583 -563853 -512298 -552167 -562883 -579937 -595901 -560816 -511741 -545057 -567870 -551687
2016 -551687 -579708 -488429 -596227 -540395 -542521 -566159 -499285 -484689 -607038 -557333 -621458
2005 -621458 -591556 -620890 -614624 -461339 -623119 -556030 -499723 -581006 -583214 -507776 -631440
1994 -631440 -513580 -647870 -629663 -532173 -669662 -460974 -547846 -581572 -494285 -533747 -609689
$$ packed form
2074e36400J14245o2936J518l0424m3136q1829J08023O8314j04041n3898J11506
2063e09058p435J9742j17071N5613j5285m7601O0839N9657j42931Q6750J6050
2052e40730j3114K9552q934M720j7562N017M520L006L1600o0173P9568j0274j12553
2039f05357K3097l0048J13663K2145m3330J1354p3571K02504j30255K1558n3615
2028e41855N272k7270N1555l9869j0716j7054j5964L5085M9075l3316k2813J6183
2016e51687k8021R1279j07798N5832k126k3638O6874J4596j22349M9705o4125
2005f21458K9902k9334O266J53285j61780O7089N6307q1283k208P5438j23664
1994f31440J17860j34290J8207R7490j37489K08688q6872l3726Q7287l9462p5942
$$ plain form
1983 -609689 -516149 -546175 -707934 -614399 -604622 -467105 -532746 -548638 -545676 -569035 -576275 -528141
1971 -528141 -506199 -590659 -590744 -623303 -499054 -611897 -525535 -563612 -547962 -584775 -580266 -629064
1959 -629064 -477147 -517269 -624219 -584206 -508946 -478804 -603373 -555450 -591027 -518374 -542840
1948 -542840 -544619 -532735 -462514 -519082 -523966 -597909 -597851 -485771 -507160 -519099 -548752 -581237
1936 -581237 -591755 -470996 -525073 -581065 -594414 -626517 -562171 -639468 -531269 -617978 -556468
1925 -556468 -629332 -605876 -534938 -586275 -485572 -564577 -435868 -587939 -561588 -593119 -513642
1914 -513642 -576548 -459476 -593890 -528793 -544290 -560941 -453414 -526468 -621257 -597691 -552719
1903 -552719 -478564 -519902 -625706 -530053 -581334 -572299 -626166 -644577 -501865 -579040 -499940
$$ packed form
1983f09689R3540l0026j61759R3535R777J37517o5641j5892K962k3359p240M8134
1971e28141K1942q4460q5l2559J24249j12843Q6362l8077J5650l6813M509m8798
1959f29064J51917m0122j06950M0013P5260L0142j24569M7923l5577P2653k4466
1948e42840j779J1884P0221n6568m884p3943N8J12080k1389j1939k9653l2485
1936e81237j0518J20759n4077n5992j3349l2103O4346p7297J08199q6709O1510
1925e56468p2864K3456P0938n1337J00703p9005J28709j52071K6351l1531P9477
1914e13642o2906J17072j34414O5097j5497j6651J07527p3054r4789K3566M4972
1903e52719P4155m1338j05804R5653n1281R035n3867j8411J42712p7175P9100
$$ plain form
1892 -499940 -599899 -542478 -548188 -618691 -570078 -594663 -570301 -650675 -678635 -573740 -634662 -530508
1880 -530508 -589196 -617713 -462318 -529740 -490518 -603178 -617465 -592989 -569198 -624837 -470272
1869 -470272 -598819 -598313 -522358 -577713 -507845 -617686 -570665 -587930 -525906 -536252 -514493 -539715
1857 -539715 -524840 -615973 -491248 -601583 -607973 -573487 -515508 -508091 -538549 -540843 -505317 -511677
1845 -511677 -549287 -484810 -587982 -616515 -582616 -478448 -451815 -549387 -611017 -572757 -586464
1834 -586464 -523498 -584670 -482232 -554938 -614829 -538154 -468362 -493123 -570710 -661955 -624596
1823 -624596 -547531 -486022 -444507 -554628 -581094 -560410 -527406 -556182 -602286 -589382 -685996
1812 -685996 -499419 -502869 -574694 -482009 -531456 -471278 -506050 -494698 -627152 -526810 -614892
$$ packed form
1892d99940r9959N7421n710p0503M8613k4585K4362q0374k7960J04895o0922J04154
1880e30508n8688k8517J55395o7422L9222j12660j4287K4476K3791n5639J54565
1869d70272j28547N06P5955n5355O9868j09841M7021j7265O2024j0346K1759k5222
1857e39715J4875r1133J24725j10335o390L4486N7979P417l0458k294L5526o360
1845e11677l7610O4477j03172k8533L3899J04168K6633r7572o1630L8260j3707
1834e86464O2966o1172J02438p2706n9891P6675O9792k4761p7587r1245L7359
1823f24596P7065O1509M1515j10121k6466K0684L3004k8776m6104J2904r6614
1812f85996J86577l450p1825R2685m9447O0178l4772J1352j32454J00342q8082
$$ plain form
1801 -614892 -545694 -625206 -568159 -616645 -569393 -595522 -559443 -587961 -552462 -520413 -568280 -601143
1789 -601143 -522647 -508753 -579177 -575539 -520781 -671233 -524251 -595100 -524856 -657346 -537208
1778 -537208 -494297 -547978 -628385 -470142 -538991 -540523 -554408 -584566 -597355 -528789 -591620 -576834
1766 -576834 -578314 -627382 -536609 -585290 -511760 -542712 -631627 -589411 -592692 -550232 -436400 -577328
1754 -577328 -623206 -596294 -580556 -522907 -534068 -570370 -555796 -535401 -659312 -550839 -640093
1743 -640093 -507048 -587623 -545900 -550637 -641906 -584188 -553738 -615002 -601726 -571806 -569933 -503326
1731 -503326 -544314 -522807 -491398 -490403 -566372 -692515 -510879 -537258 -665649 -514127 -507384
1720 -507384 -589757 -585162 -508977 -481303 -515180 -527414 -626646 -625131 -607326 -590149 -528931 -630932
$$ packed form
1801f14892O9198p9512N7047m8486M7252k6129L6079k8518L5499L2049m7867l2863
1789f01143P8496J3894p0424L638N4758j50452J46982p0849P0244j32490J20138
1778e37208M2911n3681q0407J58243o8849j532j3885l0158j2789O8566o2831J4786
1766e76834j480m9068R0773m8681P3530l0952q8915M2216l281M2460J13832j40928
1754e77328m5878K6912J5738N7649j1161l6302J4574K0395j23911J08473q9254
1743f40093J33045q0575M1723m737r1269N7718L0450o1264J3276K9920J873O6607
1731e03326m0988K1507L1409R95p5969j26143J81636k6379j28391J51522O743
1720e07384q2373M595P6185K7674l3877j2234r9232J515J7805J7177O1218j02001
$$ plain form
1708 -630932 -486650 -528813 -566383 -656003 -557672 -528409 -664689 -661394 -597438 -678964 -522273
1697 -522273 -586168 -485300 -603985 -540502 -520102 -555159 -583035 -623830 -570190 -512451 -499818
1686 -499818 -687320 -511071 -617991 -615940 -555492 -506939 -564270 -554733 -604522 -506984 -609772
1675 -609772 -600435 -595700 -400345 -617174 -548085 -545026 -490612 -621896 -534249 -440803 -639872
1664 -639872 -616209 -517542 -540747 -625008 -550065 -557473 -607694 -566642 -609904 -532789 -655860 -585559
1652 -585559 -527581 -544498 -423046 -627456 -550890 -565990 -569078 -592172 -554299 -545284 -658712
1641 -658712 -546766 -546341 -514950 -642716 -647816 -579976 -608360 -630542 -554347 -601390 -554172 -612694
1629 -612694 -572755 -608384 -618291 -573616 -497453 -538481 -585189 -610235 -497963 -510246 -575588 -531946
$$ packed form
1708f30932J44282m2163l7570q9620R8331K9263j36280L295O3956q1526J56691
1697e22273o3895J00868j18685O3483K0400l5057k7876m0795N3640N7739J2633
1686d99818j87502J76249j06920K051O0448M8553n7331R537m9789R7538j02788
1675f09772R337M735J95355k16829O9089L059N4414j31284Q7647R3446j99069
1664f39872K3663R8667k3205q4261P4943p408n0221M1052m3262P7115j23071P0301
1652e85559N7978j6917J21452k04410P6566j5100l088k3094L7873R015j13428
1641f58712J11946M25L1391j27766n100O7840k8384k2182P6195m7043M7218n8522
1629f12694L9939l5629r907M4675P6163m1028m6708k5046J12272j2283o5342M3642
$$ plain form
1617 -531946 -575040 -569378 -637477 -561095 -573870 -633376 -536556 -559122 -539393 -527121 -563708 -616182
1605 -616182 -522281 -584304 -491110 -416095 -558765 -514478 -531356 -565725 -571376 -573411 -555416 -539275
1593 -539275 -612394 -552072 -532784 -527879 -510818 -520803 -590727 -613067 -495687 -587654 -548458 -539411
1581 -539411 -540701 -498728 -552406 -568729 -586214 -568139 -559075 -647600 -533205 -636488 -608421 -488453
1569 -488453 -616074 -614489 -595331 -559008 -507997 -570204 -604630 -634430 -511513 -663220 -646262
1558 -646262 -599845 -579173 -600600 -607792 -615994 -597617 -465876 -547591 -605555 -516473 -584195 -552528
1546 -552528 -458902 -568763 -543135 -537272 -653150 -577078 -527882 -548642 -536497 -558811 -529923
1535 -529923 -595834 -562658 -569888 -597445 -570786 -618931 -543854 -584583 -522735 -556402 -586942 -659915
$$ packed form
1617e31946m3094N662o8099P6382j2775n9506R6820k2566J9729J2272l6587n2474
1605f16182R3901o2023R3194P5015j42670M4287j6878l4369n651k035J7995J6141
1593e39275p3119O0322J9288M905J7061r985o9924k2340J17380r1967L9196R047
1581e39411j290M1973n3678j6323j7485J8075R064q8525J14395j03283K8067J19968
1569d88453j27621J585J9158L6323N1011o2207l4426k9800J22917j51707J6958
1558f46262M6417K0672k1427p192q202J8377J31741q1715n7964Q9082o7722L1667
1546e52528R3626j09861K5628N863j15878P6072M9196k0760J2145k2314K8888
1535e29923o5911L3176p230k7557K6659m8145P5077m0729O1848l3667l0540p2973
$$ plain form
1523 -659915 -530334 -559903 -503832 -539859 -431843 -560802 -600786 -597917 -598653 -577005 -631554 -506270
1511 -506270 -577119 -519079 -562770 -686816 -569862 -450674 -508590 -615397 -629148 -557157 -515352
1500 -515352 -631312 -485554 -560936 -617290 -543676 -593124 -613866 -542295 -611037 -541930 -573736
1489 -573736 -625076 -598005 -547593 -547938 -641633 -643659 -584785 -484514 -553832 -536357 -591724 -560567
1477 -560567 -564976 -517941 -561217 -564946 -558737 -481361 -494006 -598740 -500544 -570034 -568895 -610558
$$ packed form
1523f59915J29581k9569N6071l6027J08016j28959l9984K869p36K1648n4549J25284
1511e06270p0849N8040m3691j24046J16954J19188n7916j06807j3751P1991M1805
1500e15352j15960J45758p5382n6354P3614m9448k0742P1571o8742O9107l1806
1489e73736n1340K7071N0412l45r3695k026N8874J00271o9318J7475n5367L1157
1477e60567m409M7035m3276l729O209P7376j2645j04734R8196o9490J139m1663
$$ [...]
##END NTUPLES=NMR SPECTRUM
##END=
