##TITLE=abcd
##JCAMPDX= 6.0         $$ Bruker NMR JCAMP-DX V2.0
##DATA TYPE= NMR SPECTRUM
##DATA CLASS= NTUPLES
##ORIGIN= UXNMR, Bruker Analytische Messtechnik GmbH
##OWNER= root
$$ XWIN-NMR		Version 3.5
$$ Fri Jul 17 16:27:19 2026 Russian Standard Time (UT+4h)  servis@DPX200
##.OBSERVE FREQUENCY= 200.131235884673
##.OBSERVE NUCLEUS= ^1H
##.ACQUISITION MODE= SIMULTANEOUS
##.ACQUISITION SCHEME= undefined
##.AVERAGES= 32
##.DIGITISER RES= 18
##SPECTROMETER/DATA SYSTEM= spect
##.PULSE SEQUENCE= zg
##.SOLVENT NAME= DMSO
##.SHIFT REFERENCE= (INTERNAL, DMSO, 0, 16.4885)
##AUDIT TRAIL= $$ (NUMBER, WHEN, WHO, WHERE, WHAT)
$$ ##TITLE= Audit trail, XWIN-NMR		Version 3.5
$$ ##JCAMPDX= 5.01
$$ ##ORIGIN= Bruker BioSpin GmbH
$$ ##OWNER= servis
$$ F:\spectra/data/av/nmr/H1/1/pdata/1/auditp.txt
$$ ##AUDIT TRAIL=  $$ (NUMBER, WHEN, WHO, WHERE, WHAT)
(   1,<2026-07-17 16:25:22.53 +0400>,<servis>,<DPX200>,
      <created by zg, POWCHK disabled, PULCHK disabled
       configuration hash MD5:
       00 E9 B6 7A A2 85 ED C7 34 08 36 98 17 FE 4E 26
       data hash MD5: 32K
       94 14 12 9D 91 35 44 98 1D 78 FA 52 74 EF D0 62>)
(   2,<2026-07-17 16:26:39.82 +0400>,<servis>,<DPX200>,
      <Start of raw data processing
       efp BC_mod = 2 LB = 0.05 FT_mod = 6 PKNL = 1 PHC0 = -414.59 PHC1 = 3.101563 SI = 16K 
       data hash MD5: 16K
       DE 4E 0E 04 12 18 94 28 67 85 80 F3 C9 AB 16 DE>)
(   3,<2026-07-17 16:26:56.59 +0400>,<servis>,<DPX200>,
      <pk PHC0 = -1.999999 PHC1 = 0 
       data hash MD5: 16K
       1D 78 D2 3E 13 85 F9 39 FC 67 86 97 53 D7 3D 6A>)
$$ ##END=
$$ 
$$ hash MD5
$$ A5 0B F7 F5 04 F9 27 46 74 46 2D 46 0D 95 04 6A
##$RELAX= 
##$RELAX= 
##$RELAX= 
##$RELAX= 
##$RELAX= 
##$RELAX= 
##$RELAX= 
##$RELAX= 
$$ Bruker specific parameters
$$ --------------------------
##$DU= <F:\spectra>
##$EXPNO= 1
##$NAME= <H1>
##$PROCNO= 1
##$TYPE= <nmr>
##$USER= <av>
##$AMP= (0..31)
100 100 100 100 100 100 100 100 100 100 100 100 100 100 100 100 100 100 
100 100 100 100 100 100 100 100 100 100 100 100 100 100 
##$AQSEQ= 0
##$AQ_mod= 1
##$AUNM= <au_zg>
##$AUTOPOS= <>
##$BF1= 200.13
##$BF2= 200.13
##$BF3= 200.13
##$BF4= 200.13
##$BF5= 500.13
##$BF6= 500.13
##$BF7= 500.13
##$BF8= 500.13
##$BYTORDA= 1
##$CFDGTYP= 0
##$CFRGTYP= 5
##$CHEMSTR= <none>
##$CNST= (0..31)
1 1 145 1 1 1 1 1 1 1 1 1 1 1 1 1 1 1 1 1 1 1 1 1 1 1 1 1 1 1 1 1 
##$CPDPRG= <>
##$CPDPRG1= <>
##$CPDPRG2= <>
##$CPDPRG3= <>
##$CPDPRG4= <mlev>
##$CPDPRG5= <mlev>
##$CPDPRG6= <mlev>
##$CPDPRG7= <mlev>
##$CPDPRG8= <mlev>
##$CPDPRGB= <>
##$CPDPRGT= <>
##$D= (0..31)
0 2 0 0 0 0 0 0 0 0.06 0 0 0 0 0 0 0.0002 0 0 0 0 0 0 0 0 0 0 0 0 0 0 
0 
##$DATE= 1784291122
##$DBL= (0..7)
120 120 120 120 120 120 120 120 
##$DBP= (0..7)
150 150 150 150 150 150 150 150 
##$DBP07= 0
##$DBPNAM0= <>
##$DBPNAM1= <>
##$DBPNAM2= <>
##$DBPNAM3= <>
##$DBPNAM4= <>
##$DBPNAM5= <>
##$DBPNAM6= <>
##$DBPNAM7= <>
##$DBPOAL= (0..7)
0.5 0.5 0.5 0.5 0.5 0.5 0.5 0.5 
##$DBPOFFS= (0..7)
0 0 0 0 0 0 0 0 
##$DE= 6
##$DECBNUC= <off>
##$DECIM= 32
$$ [...]
##$SUBNAM4= <"">
##$SUBNAM5= <"">
##$SUBNAM6= <"">
##$SUBNAM7= <"">
##$SUBNAM8= <"">
##$SUBNAM9= <"">
##$SW= 20.6817932712277
##$SWIBOX= (0..15)
0 0 3 0 0 0 0 0 0 0 0 0 0 0 0 0 
##$SW_h= 4139.07284768212
##$TD= 32768
##$TD0= 1
##$TE= 0
##$TE2= 300
##$TE3= 300
##$TEG= 300
##$TL= (0..7)
0 120 120 120 120 120 120 120 
##$TP= (0..7)
150 150 150 150 150 150 150 150 
##$TP07= 0
##$TPNAME0= <>
##$TPNAME1= <>
##$TPNAME2= <>
##$TPNAME3= <>
##$TPNAME4= <>
##$TPNAME5= <>
##$TPNAME6= <>
##$TPNAME7= <>
##$TPOAL= (0..7)
0.5 0.5 0.5 0.5 0.5 0.5 0.5 0.5 
##$TPOFFS= (0..7)
0 0 0 0 0 0 0 0 
##$TUNHIN= 0
##$TUNHOUT= 0
##$TUNXOUT= 0
##$USERA1= <user>
##$USERA2= <user>
##$USERA3= <user>
##$USERA4= <user>
##$USERA5= <user>
##$V9= 5
##$VALIST= <valist>
##$VCLIST= <CCCCCCCCCCCCCCC>
##$VD= 0
##$VDLIST= <DDDDDDDDDDDDDDD>
##$VPLIST= <PPPPPPPPPPPPPPP>
##$VTLIST= <TTTTTTTTTTTTTTT>
##$WBST= 1024
##$WBSW= 30
##$XGAIN= (0..3)
0 0 0 0 
##$XL= 0
##$YL= 0
##$YMAX_a= 763508
##$YMIN_a= -1308549
##$ZGOPTNS= <>
##$ZL1= 120
##$ZL2= 120
##$ZL3= 120
##$ZL4= 120
##$ABSF1= 0
##$ABSF2= 0
##$ABSG= 0
##$ABSL= 0
##$ALPHA= 0
##$AQORDER= 0
##$ASSFAC= 0
##$ASSFACI= 0
##$ASSFACX= 0
##$ASSWID= 0
##$AUNMP= <proc_1d>
##$AZFE= 0.1
##$AZFW= 0.1
##$BCFW= 0
##$BC_mod= 2
##$BYTORDP= 0
##$COROFFS= 0
##$CY= 18.4799938201904
##$DATMOD= 1
##$DC= 0
##$DFILT= <>
##$DTYPP= 0
##$F1P= 9.9274215381318
##$F2P= -0.165520771350173
##$FCOR= 1
##$FTSIZE= 16384
##$FT_mod= 6
##$GAMMA= 0
##$GB= 0
##$INTBC= 1
##$INTSCL= 4.127829e-11
##$ISEN= 128
##$LB= 0.05
##$LEV0= 0
##$LPBIN= 0
##$MAXI= 10000
##$MC2= 0
##$MEAN= 0
##$ME_mod= 0
##$MI= 50
##$NCOEF= 0
##$NC_proc= -4
##$NLEV= 6
##$NOISF1= 3.799351
##$NOISF2= 2.8
##$NSP= 0
##$NTH_PI= 0
##$NZP= 0
##$OFFSET= 16.48848
##$PC= 4
##$PHC0= -416.59
##$PHC1= 3.101563
##$PH_mod= 1
##$PKNL= yes
##$PPARMOD= 0
##$PSCAL= 4
##$PSIGN= 0
##$REVERSE= no
##$SF= 200.130005582386
##$SI= 16384
##$SIGF1= 3
##$SIGF2= 2
##$SINO= 400
##$SIOLD= 16384
##$SREGLST= <1H.CDCl3>
##$SSB= 0
##$STSI= 16384
##$STSR= 0
##$SW_p= 4139.07284768211
##$SYMM= 0
##$S_DEV= 0
##$TDeff= 32768
##$TDoff= 0
##$TI= <>
##$TILT= no
##$TM1= 0
##$TM2= 0
##$TOPLEV= 0
##$USERP1= <user>
##$USERP2= <user>
##$USERP3= <user>
##$USERP4= <user>
##$USERP5= <user>
##$WDW= 1
##$XDIM= 16384
##$YMAX_p= 326682668
##$YMIN_p= -398591
$$ End of Bruker specific parameters
$$ ---------------------------------
##NTUPLES= NMR SPECTRUM
##VAR_NAME=  FREQUENCY,     SPECTRUM/REAL,   SPECTRUM/IMAG
##SYMBOL=    X,             R,               I
##VAR_TYPE=  INDEPENDENT,   DEPENDENT,       DEPENDENT
##VAR_FORM=  AFFN,          ASDF,            ASDF
##VAR_DIM=   16384,         16384,           16384
##UNITS=     HZ,            ARBITRARY UNITS, ARBITRARY UNITS
##FACTOR=    0.252644378177508, 1,           1
##FIRST=     3299.83951724647, 0,            0
##LAST=      -839.233330435636, 0,           0
##MIN=       -839.233330435636, -398591,     0
##MAX=       3299.83951724647, 326682668,    0
$$ Real data points
##PAGE= N=1
##DATA TABLE= (X++(R..R)), XYDATA
$$ [...]
12047 -198153 -101288 -152025 -125561 -171248 -191990 -148496 -141280 -130891 -149086 -91413 -104273 -83802
12035 -83802 -107474 -108102 -178150 -105476 -212623 -174582 -173058 -168470 -177855 -118955 -162831 -108389
12023 -108389 -47777 -81377 -93564 -157703 -136923 -127916 -132171 -163557 -179348 -162542 -112064 -181480
12011 -181480 -116337 -102602 -155944 -86973 -117030 -115334 -118164 -125912 -157631 -180845 -79076 -130365
11999 -130365 -81939 -151355 -86989 -105215 -40310 -155633 -92320 -54258 -138284 -47702 -98359
11988 -98359 -103110 -86600 -97212 -142824 -65536 -126538 -164831 -148967 -108756 -71067 726 -103558
11976 -103558 -67246 -166479 -78750 -15719 -72346 -62642 -140443 -82110 -59519 -34546 -84471 -52201
11964 -52201 -117653 -77294 -59931 -51673 -43709 -91824 -85109 -41858 -8063 38197 -92736 -21844
11952 -21844 -65837 -26496 -26495 -39730 -74928 -62554 -60921 -48262 -33643 -81266 -78739 -9595 -19168
11939 -19168 26611 -17327 -84697 -96517 -49980 -23804 -53444 -32774 -17913 -67673 -28246 -40673
11927 -40673 -2759 -11754 -53471 -58162 18897 -13936 -62319 -100467 -58076 -67113 -20805 -51536
11915 -51536 -89518 -23158 -76689 -22862 13337 -37343 -84236 -93162 -29884 -28436 -48300 -48241 -75381
11902 -75381 -82864 -70782 -69312 -17199 -112994 -72041 -56210 -34730 -35576 -113199 -89466 -105993
11890 -105993 -22637 -45905 -95461 -93850 -148471 -121481 -83340 -87365 -161169 -107388 -80726 -96645
11878 -96645 -54419 -106114 -113743 -94594 -104243 -119397 -95364 -130633 -140774 -95891 -53142 -28424
11866 -28424 -91475 -93953 -139142 -118864 -74719 -100167 -154717 -115492 -161650 -154328 -77564 -126976
11854 -126976 -119495 -86792 -111419 -29816 -102628 -104746 -72535 -125682 -93542 -103688 -115776 -113008
11842 -113008 -169047 -107898 -68261 -160723 -97738 -164717 -96598 -63962 -145268 -105391 -130825
11831 -130825 -143214 -129191 -64132 -121263 -136580 -135441 -120958 -121083 -93359 -92217 -111556 -101502
11819 -101502 -90499 -74233 -81068 -39153 -147289 -81242 -101006 -103913 -72498 -120125 -143126 -147470
11807 -147470 -94563 -132004 -125294 -96982 -93388 -101459 -99659 -156603 -107279 -70013 -141921 -111233
11795 -111233 -95900 -127619 -112425 -18880 -117645 -86959 -106474 -74470 -92443 -55265 -95463
11784 -95463 -143498 -63974 -85534 -140061 -91484 -83242 -129674 -121288 -105174 -81062 -35677 -70726
11772 -70726 -89783 -21163 -103136 -47826 -93928 -64769 -109058 -105618 -114200 -94496 -37879 -80676
11760 -80676 -84699 -82845 -30523 -78332 -81454 -41176 -91006 -75667 -107549 -110577 -68047 -53376
11748 -53376 -64687 -43289 -87360 -61055 -60864 -25747 -66976 -97661 -90142 -130926 -29286 -76593
11736 -76593 -59083 -53364 -73986 -79710 -20873 43306 -17203 -89648 -69301 -32438 -48893 -24425
11724 -24425 -63502 -101777 -90957 -31147 35736 -52115 -68945 -84457 -76711 -91031 -59816 -39733
11712 -39733 -75860 -113918 -83847 -71465 -16232 -67648 -98891 -43265 -17608 -16426 -6349 -29231
11700 -29231 -51021 -84170 -88143 -50200 -92475 -81201 -63334 -67634 -23803 -70075 -62390 -30873
11688 -30873 -26935 -31943 -25949 -82841 -89813 -37975 -97462 -79488 -56352 -75063 -48926 -50052 -28582
11675 -28582 -44754 -18081 -33406 -71540 -56900 -100128 -84304 -65577 -38648 -20868 -23896 -70097
11663 -70097 -22353 -16896 -49491 -35042 -42523 -83454 -84110 -62388 -53989 -84801 -47981 -69487 -97698
11650 -97698 -88176 -31985 -27950 11786 -79624 -85490 -17096 -13393 -42458 -21152 -135977 -113248
11638 -113248 -22960 -6157 -81481 -60880 -82276 -74758 -42900 -45422 -85440 -102108 -79582 -33927
11626 -33927 -86223 -65224 -108075 -92340 -11869 -54649 -30391 -12079 -55724 -71280 -43096 -72362
11614 -72362 -42910 -52639 -84895 -53673 29920 -63880 -65383 -34519 -17838 -11926 7871 -45406
11602 -45406 -60875 -83987 -47378 -5680 -55701 -25000 -58030 -542 30319 19595 34302 -51584
11590 -51584 -51794 -72180 3369 -12927 -66578 -26964 -61229 14562 -5445 -6369 -29198 30674
11578 30674 3469 34181 4130 -31896 17677 -42635 -76846 13447 -43055 67551 2782
11567 2782 26187 20609 21899 -1036 33215 66815 66775 29407 -47695 -25900 14539 26537 60588
11554 60588 38295 3539 108330 66090 88129 182314 59505 95035 82944 74242 116047
11543 116047 122279 111093 76867 104491 98515 80705 153630 130492 150841 111192 142648 163375
11531 163375 108861 134714 144919 217250 167441 128263 201117 261279 225170 229993 221116 280509
11519 280509 266032 253387 246918 259204 245516 299191 275651 299636 247204 304179 309269 315697
11507 315697 309841 306050 348642 336602 326882 374504 367280 401173 433303 430394 393937 444724
11495 444724 449567 439742 458875 453012 513413 510022 490096 514002 551566 558887 564941 613304 613563
11482 613563 585775 595259 594797 664131 643835 669963 636488 657877 722787 761216 736114 759072
11470 759072 749508 820347 832528 852750 839844 837838 910590 895588 931820 977661 923494 930972
11458 930972 983394 987320 1053102 1046642 1038652 1017051 1030544 1063871 1073063 1124738 1156435 1125125
11446 1125125 1129098 1134991 1148289 1210417 1151813 1200022 1247624 1255017 1186577 1263904 1244117 1289051
11434 1289051 1276015 1301722 1355898 1273012 1323842 1368245 1357120 1340125 1375364 1323489 1411885
11423 1411885 1392514 1349937 1345186 1391488 1395877 1415502 1437299 1368844 1343470 1343249 1378657 1377246
11411 1377246 1379474 1366405 1326315 1389781 1341516 1350882 1376241 1352808 1333639 1296873 1356044 1265768
11399 1265768 1321882 1312618 1314040 1337595 1264600 1248105 1223879 1239961 1222554 1245558 1150724 1139472
11387 1139472 1168405 1124704 1106217 1091687 1168421 1105188 1102363 1093623 1099325 1108827 1069548 1023811
11375 1023811 1060973 999118 929032 968800 929764 934097 966178 936937 928124 933852 904310 878114
11363 878114 978114 918131 844835 864201 846755 833622 823502 778282 770846 799047 793346 798676
11351 798676 806836 770596 762605 784466 705030 751028 785264 756437 761086 711256 720525 714178
11339 714178 694094 724899 746808 761108 747282 747691 749400 720354 776314 706275 745142 673933
11327 673933 743297 733382 702814 725561 773196 728838 811563 795442 784101 857020 824995 849792
11315 849792 854138 889301 892214 891218 901206 847130 880151 970306 963136 965880 990022 963420 1064472
11302 1064472 1138088 1067327 1095220 1123334 1098889 1152420 1187991 1146052 1199822 1188278 1314826
11291 1314826 1254468 1307498 1320202 1346289 1407378 1362502 1443277 1493106 1436215 1468502 1621491
11280 1621491 1562937 1546497 1563251 1577417 1592358 1680772 1654301 1721410 1719742 1746409 1769635
11269 1769635 1789636 1844408 1802966 1849681 1873734 1846543 1918399 1877543 1942943 1928068 1916516
11258 1916516 1940269 2049012 2028052 2031327 2061744 2040355 2096288 2083832 2028924 2037829 2079195
11247 2079195 2116716 2055116 2122784 2133904 2129103 2113325 2122509 2083079 2092786 2107404 2117371 2161922
11235 2161922 2027813 2021301 2017708 2023830 2057008 2086360 1991587 1961406 1968333 2015878 1984518 1948844
11223 1948844 1955687 1903927 1927953 1938773 1853985 1834746 1846490 1766969 1786616 1786655 1688303 1773222
11211 1773222 1706280 1681859 1664437 1580247 1559993 1548006 1534638 1499172 1493246 1482877 1402175
11200 1402175 1378848 1390523 1359730 1360131 1341054 1258397 1216803 1235175 1236126 1235289 1142332 1120919
11188 1120919 1114259 1053083 1054764 1056790 1028653 946975 980766 970818 924417 914321 869495 792716
11176 792716 797236 816843 720012 705156 713368 717972 713957 657024 715181 624275 656416 620586
11164 620586 550942 516237 532649 581289 512418 482423 540699 472234 504519 422998 426391 449976
11152 449976 410020 354764 327148 363855 348867 372848 307904 333022 361914 335840 325656
11141 325656 330037 298186 227624 239539 286122 220357 223390 221773 234801 230699 257609 183214
11129 183214 243200 204942 207521 235405 191834 187513 222980 177759 125781 144632 159083 134266
11117 134266 153278 168121 91070 169822 164116 98793 106473 137583 93508 103935 101651 93854
11105 93854 102163 76444 128145 95027 87436 63318 67292 85217 32530 78271 64393 30861
11093 30861 68061 88991 55645 26627 51421 17435 -8270 765 -8326 -119823 -3461 18537
11081 18537 -35306 10495 -1700 -4610 -57167 -10821 -26682 23420 -4531 -37747 -13102 -103587
11069 -103587 -73508 8410 -59874 -17504 -40316 -24739 -11926 8274 2913 -44699 56268
11058 56268 -12688 -30642 -64938 -34158 -105591 -49297 -12145 -31961 -37660 -19658 -54550 -8795
11046 -8795 -2885 -67499 -21917 -68825 -100448 -57397 -47435 -102561 -62351 -48365 -132043 -69861
11034 -69861 -64329 -87855 -71941 -69518 -139240 -85930 -87650 -157077 -114767 -83180 -121074 -11562
11022 -11562 -86173 -135880 -14408 -94138 -101603 -70319 -84377 -114604 -75428 -30924 -85836 -133941
11010 -133941 -75169 -98012 -113445 -74208 -98803 -120649 -58135 -127676 -107853 -87030 -125326
10999 -125326 -100210 -80162 -132748 -72049 -94708 -118981 -117234 -92272 -142552 -108194 -108921 -128854
10987 -128854 -132057 -104812 -137621 -137328 -119067 -104778 -113786 -56065 -163414 -154920 -107114 -153875
10975 -153875 -99672 -92423 -140328 -102891 -164972 -88272 -110518 -101218 -163762 -102168 -152649 -91551
10963 -91551 -92349 -146255 -125428 -141333 -76256 -116155 -101967 -134865 -124444 -109845 -80416 -82092
10951 -82092 -93311 -106907 -92017 -115082 -93362 -136304 -145284 -229215 -115680 -109622 -112643 -101402
10939 -101402 -141974 -108190 -164266 -145179 -119857 -115691 -155731 -153894 -132352 -106630 -83480 -160970
10927 -160970 -165716 -106107 -124427 -138274 -168529 -184119 -176074 -120582 -142749 -96639 -137225 -117876
10915 -117876 -99706 -121987 -155804 -127193 -173412 -176110 -162478 -134365 -153678 -208484 -137624 -177161
10903 -177161 -112335 -136309 -175290 -138820 -155796 -137170 -122701 -136604 -150503 -143248 -98299 -124254
10891 -124254 -113493 -133947 -172355 -141307 -84880 -143795 -128975 -190559 -92039 -125206 -97976
10880 -97976 -104274 -169529 -125699 -130746 -139842 -88760 -130613 -165830 -188205 -165058 -160731 -133276
10868 -133276 -136374 -160564 -161957 -159695 -90382 -85979 -125766 -132272 -132426 -76485 -177940 -122987 -148035
10855 -148035 -210668 -169342 -148477 -122852 -127809 -145953 -109593 -120953 -149658 -92854 -100462 -176478
10843 -176478 -118657 -136519 -192262 -152817 -141293 -217163 -139100 -103396 -76248 -180009 -109457
10832 -109457 -121363 -118445 -116027 -106266 -151411 -153933 -160523 -119596 -141041 -181294 -207332 -141629
10820 -141629 -151138 -101838 -112740 -141928 -120585 -131813 -142102 -105268 -148202 -102813 -234688
10809 -234688 -128165 -114501 -146234 -124387 -112066 -141622 -86241 -126676 -147401 -68191 -114707
10798 -114707 -121627 -99516 -87016 -116464 -139233 -141947 -102729 -133950 -124986 -145321 -125205 -97239
10786 -97239 -104419 -113885 -71759 -185810 -167294 -150358 -128270 -121820 -150000 -143028 -130471 -180313
10774 -180313 -121403 -137265 -105879 -105374 -112129 -117600 -107248 -82947 -120578 -108612 -138999 -152726
10762 -152726 -173665 -156619 -119487 -81196 -130381 -120094 -126449 -127950 -64575 -80415 -98939 -155865
10750 -155865 -140168 -86860 -145034 -93367 -180059 -160795 -137140 -133892 -137024 -75620 -104307 -107536
10738 -107536 -81356 -83161 -105307 -119002 -115044 -78006 -87369 -119131 -133026 -116621 -101373 -101256
10726 -101256 -98839 -140912 -165969 -93232 -88937 -94973 -111157 -66994 -135745 -97288 -112578 -84366
10714 -84366 -111878 -129280 -47374 -34282 -103524 -114240 -113911 -108880 -87300 -71289 -85531 -103385
10702 -103385 -65413 -64387 -74499 -103954 -80245 -92940 -101469 -73911 -134088 -82122 -68139 -88892
10690 -88892 -148453 -91898 -61366 -77347 -50218 -50909 -60018 -63153 -32242 -46350 -87120 -41990
10678 -41990 -1853 -60472 -114030 -62088 -78209 -5747 -18486 1642 -64722 -70076 -3605 -9017
10666 -9017 -42217 -36344 -37023 3153 -27901 -32375 -85389 -51589 -69542 -39817 -13302 -37714 -81146
10653 -81146 12946 -20256 55267 82639 32986 32923 69250 53844 7845 -13297 18622 -12250
10641 -12250 184 59591 15905 29673 74813 27865 77061 95202 94285 106128 73889 52408
10629 52408 78289 66637 95097 125076 64638 103978 191368 127942 137849 177315 150551 126667
10617 126667 133528 209279 136494 172946 131012 112006 140838 128280 93407 173710 163039 161369
10605 161369 163238 149210 179133 189353 132471 185224 164467 145853 196512 236011 130837
10594 130837 115880 215739 183249 202704 215112 182099 167112 187641 133525 139136 178874 165892
10582 165892 179472 156556 113581 118133 148300 140295 179476 168924 106774 102453 155385 175692
10570 175692 168533 136087 152099 124510 116806 98144 130708 26467 87759 110300 127709 88920
10558 88920 119387 83953 91012 96428 112247 63086 68631 101604 41592 20495 54676 28087
10546 28087 13298 41728 48202 -6244 47715 48940 39066 8017 62122 5893 10024 30022
10534 30022 -1811 29015 -36225 4661 308 -37999 20227 -1274 10458 -8812 -38657 -50511
10522 -50511 34477 -37612 -41066 -32734 -52273 5242 -43434 -48628 -92143 -41409 -95919 -61786
10510 -61786 -46260 -108235 -57778 -25447 -64251 -49610 -41019 -66330 -103622 -63878 -105489 -63259
10498 -63259 -82419 -66808 -96617 -102830 -45477 -121010 -71033 -68746 -68834 -60518 -164619 -95306 -81816
10485 -81816 -80713 -89702 -67027 -94431 -171739 -78374 -75014 -99789 -143861 -99139 -78414 -65330
10473 -65330 -132196 -99716 -173699 -125713 -85524 -98450 -139770 -125980 -107946 -88997 -71571 -93659
10461 -93659 -71685 -95036 -92984 -87676 -96019 -106451 -72592 -116894 -132848 -91320 -85959 -144379
10449 -144379 -124696 -138050 -67523 -56888 -109851 -106912 -129761 -93797 -87305 -141582 -113395 -110396
10437 -110396 -69008 -133617 -102954 -56051 -130033 -121762 -129558 -61860 -86127 -163963 -175052 -183147
10425 -183147 -114174 -130845 -157032 -172075 -147382 -106986 -69673 -115964 -120826 -168755 -142341 -99466
10413 -99466 -109485 -153273 -130825 -116981 -114141 -73608 -113361 -165650 -156576 -92265 -81692 -121126
10401 -121126 -176823 -146354 -167808 -130258 -130772 -157946 -129631 -138698 -132739 -138991 -98164 -122759
10389 -122759 -186919 -189912 -134463 -136799 -192065 -149263 -160094 -135585 -120126 -114408 -161042 -104341
10377 -104341 -112384 -112796 -165464 -106405 -169735 -147458 -98477 -153946 -148256 -158826 -194648 -158186
10365 -158186 -85556 -130392 -149281 -143103 -163796 -130122 -134323 -147239 -180854 -151282 -151616 -166424
10353 -166424 -125654 -182097 -200871 -111349 -170559 -106160 -66919 -167503 -167066 -118956 -159080 -159065
10341 -159065 -109554 -197840 -158677 -81021 -182176 -135607 -136364 -132012 -165792 -87038 -143013 -197571
10329 -197571 -110884 -130307 -170238 -142417 -151438 -191995 -87041 -108096 -144906 -154765 -202216 -207967
10317 -207967 -121132 -117482 -133360 -126681 -134672 -176077 -94366 -175865 -209261 -131237 -194017 -227830
10305 -227830 -216750 -116079 -233298 -141239 -191002 -93787 -105094 -96383 -133921 -150608 -144994
10294 -144994 -156097 -175100 -201359 -199293 -167481 -153298 -154586 -144595 -145575 -116692 -151181 -117510
10282 -117510 -129566 -125972 -137137 -167365 -193225 -159941 -118618 -153554 -128605 -131536 -92531 -68473
10270 -68473 -112112 -148066 -134055 -178172 -181591 -131156 -228579 -134011 -167396 -221126 -131828 -181653
10258 -181653 -156971 -129702 -84705 -120916 -86932 -137944 -163328 -260197 -151391 -133409 -202854
10247 -202854 -173242 -150436 -118530 -142650 -154829 -106312 -136971 -117582 -66531 -144234 -175156
10236 -175156 -181360 -161584 -158816 -160512 -172057 -115184 -168402 -63261 -125123 -193468 -103326 -87139
10224 -87139 -181793 -125724 -116423 -175034 -175505 -186999 -154443 -155826 -132662 -157276 -142382 -180776
10212 -180776 -166651 -163498 -122384 -114439 -215591 -175042 -190617 -149390 -145155 -190169 -138944 -114635
10200 -114635 -168475 -90795 -125155 -143896 -104850 -156307 -115479 -148885 -203089 -100793 -126795
10189 -126795 -173715 -155642 -136923 -149990 -199091 -127996 -155266 -142685 -169922 -156987 -181542
10178 -181542 -111551 -126440 -120030 -165114 -183621 -148515 -140383 -178885 -147608 -168564 -140184 -132906
10166 -132906 -136500 -145979 -100219 -154875 -178903 -153603 -79943 -142402 -146588 -142715 -184291 -154704
10154 -154704 -169740 -141990 -120121 -119002 -91829 -178515 -96421 -156761 -141770 -124092 -179256 -115673
10142 -115673 -114115 -210689 -138610 -139254 -162959 -176407 -72302 -127666 -102503 -135257 -126611 -192615
10130 -192615 -179953 -117996 -109659 -97457 -122694 -139862 -205272 -105221 -137018 -180459 -160323
10119 -160323 -142557 -140868 -129866 -123306 -168235 -127143 -191001 -141552 -193505 -193407 -147231 -192990
10107 -192990 -124569 -127108 -126794 -171753 -158770 -157773 -124149 -193164 -155736 -182850 -200676 -191102 -151535
10094 -151535 -138831 -129912 -231621 -178151 -102845 -167329 -96534 -149334 -165372 -121134 -114159 -151445
10082 -151445 -168223 -134285 -211136 -119507 -136684 -158164 -192831 -133341 -137242 -125892 -189148 -110350
10070 -110350 -167935 -162725 -134476 -178340 -180076 -162511 -173650 -154865 -143945 -145235 -159057 -168081
10058 -168081 -125903 -93518 -108774 -159667 -159352 -165997 -113795 -100961 -113874 -194309 -154249 -139390
10046 -139390 -129133 -88585 -99953 -153529 -119623 -163312 -174931 -137365 -112373 -135467 -119421
10035 -119421 -120884 -110046 -142268 -90481 -167496 -154716 -135377 -174482 -170400 -150973 -153625 -145380
10023 -145380 -122953 -120942 -134351 -102969 -102479 -116327 -154810 -130439 -194760 -148064 -121800 -97341
10011 -97341 -136888 -156329 -170926 -85066 -132944 -125414 -137208 -159628 -102184 -116637 -142296 -151513
9999 -151513 -168061 -169619 -126479 -108636 -143777 -121268 -127358 -96210 -107029 -140114 -83899 -150567
9987 -150567 -140578 -156255 -162359 -177518 -153224 -157181 -141657 -119707 -93888 -95983 -124340 -158269
9975 -158269 -74280 -88640 -127813 -89731 -138472 -121986 -142638 -77524 -127199 -109543 -116909 -137689
9963 -137689 -102603 -75484 -85553 -139431 -113413 -76306 -62797 -119046 -100683 -119068 -100624 -123231
9951 -123231 -77132 -99363 -120180 -81730 -24572 -87122 -96969 -71055 -45719 -139814 -100760 -151597
9939 -151597 -112167 -77978 -19683 -68273 -86311 -41421 -66440 -38007 -62189 -71155 -66631 -66330
9927 -66330 -39818 7510 -107805 -69302 -53154 -40513 -53747 -19847 -33638 -43934 -67045 -16966
9915 -16966 -39762 -44109 -23246 -84222 -38261 -44840 -13929 -45538 -36417 7254 -28988 -25245 3775
9902 3775 -23605 -26333 -63801 3292 -6802 -14229 -15894 -19752 -8785 -16840 -29913 -52107 -36943
9889 -36943 -73450 -24601 -32439 -30446 -44975 -41360 20787 -3590 -80517 -46304 -9692 -53225
9877 -53225 12157 -9599 -46016 -57557 -63194 -22115 -45724 -120774 -68146 -79739 -104354 -88789
9865 -88789 -91001 -61745 -62103 -48020 -48270 -17974 -102456 -33370 -72647 -57030 -63591 -87229 -100484
9852 -100484 -82424 -51186 -77847 -12148 -61358 -60703 -130345 -55592 14405 -105556 -90925 -115585
9840 -115585 -73600 -119097 -91138 -59620 -80894 -55038 -71867 -10867 -31337 -67145 -48270 -68253
9828 -68253 -75218 -80953 -58921 -57866 -46921 -77077 -39393 49520 -15966 9754 35559 52973
9816 52973 -14427 -2814 8709 -31757 9240 -84029 -58091 -42179 -109901 -30822 -22590 -47637
9804 -47637 2263 -51953 -75879 -5743 -44415 -52451 -16245 -9728 -52373 -111136 -48346 -36982
9792 -36982 -89242 -78024 -19139 -58821 -17792 -74128 -62214 -19375 -23931 -59394 -96360 -79645
9780 -79645 -53683 -42006 -63666 -56162 -64910 -66373 -35562 -52047 -36469 -26994 -83986 -20867 -84570
9767 -84570 -43267 -82626 -140607 -40683 -86301 -51642 -64139 -58423 -58239 -79917 -87172 -74028 -11258
9754 -11258 -31486 -75548 -10040 -75369 -55117 -81291 -2915 -73772 -107753 -80291 -115022 -75281
9742 -75281 -104544 -169980 -106324 -50753 -102235 -59442 -105367 -81621 -86209 -102289 -100892 -116282
9730 -116282 -211735 -95413 -53785 -60335 -99461 -112245 -108999 -134975 -108235 -60504 -120281 -178078
9718 -178078 -74789 -114751 -125850 -58811 -131859 -146627 -105518 -84072 -14466 -3543 56331
9707 56331 12733 11942 -13853 445 -43094 -105128 -85032 -95901 -121561 -127811 -97391 -93469 -150673
9694 -150673 -51780 -60830 -120762 -64996 -135727 -85994 -136598 -108695 -149622 -150379 -158278 -160508 -164271
9681 -164271 -101352 -125939 -152575 -66507 -131226 -97085 -137039 -88478 -113092 -103164 -187404 -118065
9669 -118065 -113206 -196684 -123302 -140419 -122843 -125810 -134416 -128370 -120852 -107578 -151015 -78005 -127875
9656 -127875 -101964 -139555 -69162 -120071 -114548 -156136 -138082 -147120 -138680 -134733 -113724 -80463
9644 -80463 -134762 -79337 -82872 -104135 -149880 -119525 -138116 -116558 -169599 -107571 -134135 -100455
9632 -100455 -134274 -125880 -120682 -131807 -95186 -62853 -109155 -107406 -110669 -133472 -141728 -126651 -135071
9619 -135071 -137028 -151566 -185158 -162430 -121675 -148332 -93529 -109524 -117513 -126967 -132221 -61184
9607 -61184 -149636 -124423 -189377 -127669 -143546 -130844 -132174 -117880 -174643 -67048 -88979 -122386
9595 -122386 -108681 -143225 -66524 -132190 -88744 -136935 -137777 -159933 -132683 -144127 -139347 -89447
9583 -89447 -117558 -148122 -75010 -86980 -106636 -160400 -155735 -143640 -123372 -138300 -154873 -181221
9571 -181221 -116455 -131328 -117909 -91381 -124020 -107466 -115426 -143615 -146427 -140611 -131261 -167075
9559 -167075 -148606 -186472 -108185 -124966 -171247 -124830 -101509 -106375 -133802 -92683 -174340 -114432
9547 -114432 -138342 -115797 -159821 -141777 -195233 -145756 -110424 -156156 -106652 -149335 -97966 -106543
9535 -106543 -132640 -133202 -105336 -153690 -159820 -164598 -126037 -89447 -108643 -139821 -119866 -102620
9523 -102620 -147172 -144649 -135767 -169227 -188713 -85630 -106573 -96061 -113468 -165506 -95153 -104310
9511 -104310 -117187 -124907 -116650 -93307 -215062 -125231 -147659 -153970 -168363 -180587 -103527 -187086
9499 -187086 -130687 -127391 -88803 -111458 -103256 -136727 -194037 -124150 -162371 -177981 -109225 -137305
9487 -137305 -176406 -159905 -72150 -103032 -118805 -91894 -178783 -136260 -147795 -131372 -171143 -110420
9475 -110420 -162826 -83727 -117615 -101896 -126244 -110870 -71791 -122031 -132019 -133663 -129455 -142835
9463 -142835 -104016 -202160 -169091 -157252 -106307 -115553 -67241 -113207 -107687 -115008 -79428 -99755
9451 -99755 -126449 -151855 -123657 -130508 -137513 -156272 -133127 -133176 -132084 -84684 -129464 -117694 -88081
9438 -88081 -135718 -150335 -125780 -79209 -79663 -102677 -140419 -129231 -158979 -104828 -107984 -96411
9426 -96411 -70486 -96703 -51579 -76660 -112679 -96655 -127667 -54456 -86563 -114577 -83449 -34972
9414 -34972 -36588 -54537 -26471 -26543 -45778 -25391 33520 8097 -19467 -18023 27383 44366 12684
9401 12684 -6643 -39710 -22226 -20720 6869 -33803 -88833 6152 -42833 -67318 -45268 -79404
9389 -79404 -83377 -70952 -106767 -107033 -52713 -102011 -136591 -69567 -94537 -82926 -61577 -94729
9377 -94729 -73657 -58093 -70465 -67243 -72821 -141328 -172328 -79581 -96779 -116783 -157839 -93793
9365 -93793 -95511 -67126 -71228 -128222 -65575 -101436 -103776 -90885 -98147 -165897 -122182 -92824 -147972
9352 -147972 -111724 -143589 -107478 -80289 -86639 -64540 -81462 -103769 -146079 -69094 -107280 -135959
9340 -135959 -99404 -56104 -53234 -95492 -99900 -115541 -112251 -113461 -45431 -89650 -112476 -126461
9328 -126461 -38187 -106825 -110077 -133631 -132806 -80293 -91774 -153210 -82804 -119193 -62303 -73488
9316 -73488 -75776 -55538 -96831 -149803 -62628 -96037 -128468 -112670 -82312 -121201 -143553 -112782
9304 -112782 -96196 -73363 -108220 -107186 -55296 -107434 -138730 -127231 -112737 -130613 -92599 -152850
9292 -152850 -161196 -114465 -97392 -122275 -127606 -120587 -136747 -155235 -120182 -89301 -116773 -137057
9280 -137057 -128682 -89238 -109250 -68638 -122953 -96181 -142201 -133319 -99234 -184520 -85863 -83900
9268 -83900 -151613 -154844 -144287 -121998 -81335 -156972 -171880 -92359 -110143 -129637 -149931 -104984
9256 -104984 -80845 -73942 -110660 -102314 -106204 -101963 -82239 -83359 -59220 -131611 -99484 -51453 -140103
9243 -140103 -27769 -35875 -127214 -92962 -111679 -110479 -92062 -121590 -84387 -73739 -87065 -106607
9231 -106607 -55582 -57118 -109627 -130011 -74735 -90926 -75278 -72381 -90454 -100252 -115643 -84207
9219 -84207 -84297 -49106 -107508 -68573 -75531 -15918 -17381 6335 -39125 20654 6476 -23220 55707
9206 55707 29400 9218 63065 82988 84479 55897 36075 4513 22697 11757 24900 -6672
9194 -6672 -32961 -9325 -34259 -45441 -46189 -62523 -45370 -103465 -107047 -75517 -72783 -90524 -113251
9181 -113251 -43058 -67903 -33647 -87352 -73286 -65525 -76728 -115855 -117699 -110652 -78729 -58220
9169 -58220 -81092 -58199 -99145 -81557 -104524 -80029 -76166 -84388 -149831 -120411 -152282 -89560
9157 -89560 -90765 -168910 -108034 -64346 -114678 -110857 -59847 -115455 -56085 -104419 -114794 -133548
9145 -133548 -115339 -124505 -140718 -136346 -98247 -89796 -40309 -134301 -86249 -88518 -90881 -114441 -128530
9132 -128530 -61178 -181709 -85067 -80777 -148316 -126575 -105512 -91982 -104705 -71133 -108132 -99312
9120 -99312 -97543 -76228 -83810 -93804 -93050 -97155 -134903 -124383 -94176 -107248 -94280 -81257 -80395
9107 -80395 -146424 -121091 -64696 -90100 -112791 -115884 -80226 -118641 -109983 -137039 -104362 -144284
9095 -144284 -151505 -88291 -95137 -148501 -111495 -67344 -122927 -110449 -94951 -90912 -87077 -63087
9083 -63087 -82692 -86702 -139744 -142695 -136960 -119723 -124557 -92003 -38499 -77467 -60383 -23901 -65582
9070 -65582 -88702 -129620 -117065 -110392 -94645 -109200 -96234 -125260 -112199 -124728 -86760 -80167
9058 -80167 -92701 -45814 -77925 -87996 -81732 -111933 -126055 -101161 -131532 -102950 -138043 -135251
9046 -135251 -91647 -89109 -86658 -77141 -65048 -62737 -69833 -29483 -54161 -124360 -55989 -92154 -73984
9033 -73984 -88101 -47359 -109782 -68581 -56100 -77085 -42658 -46325 -61371 -50716 -85171 -96377
9021 -96377 -51620 -73680 -109240 -98297 -79644 -146530 -31002 -57052 -42840 -31549 -6304 -41853
9009 -41853 -29654 372 7331 50139 68975 -11460 -17409 15125 34437 -2463 33057 18437
8997 18437 56936 -53560 -28770 709 -23691 -33801 -24559 -75581 -55723 -37466 -6552 -8235
8985 -8235 -95933 -34042 -82851 -100062 -78107 -37201 -83807 -53643 -58464 -55098 -56035 -137675 -105323
8972 -105323 -71824 -117460 -64864 -98592 -86072 -44732 -90899 -113544 -115144 -143704 -80159 -107491
8960 -107491 -59534 -84770 -117677 -92568 -147789 -96012 -78953 -83798 -108779 -78755 -113450 -131755
8948 -131755 -95394 -103917 -130461 -101236 -107430 -99457 -103436 -113082 -154695 -61296 -48897 -86492 -118195
8935 -118195 -75302 -112405 -80976 -38115 -104571 -58509 -155387 -132275 -104620 -96261 -151082 -113428
8923 -113428 -134700 -96981 -105100 -108156 -135928 -113892 -123923 -56993 -74805 -120519 -144603 -108953
8911 -108953 -72553 -39276 -189521 -126418 -134971 -71102 -116371 -154418 -54259 -71445 -93598
8900 -93598 -69463 -96268 -166675 -69956 -80320 -83330 -94331 -112398 -112258 -80582 -130011 -125202 -52797
8887 -52797 -36242 -75619 -122787 -101425 -100889 -129639 -114503 -132613 -162334 -100074 -97700 -87407
8875 -87407 -60738 -138952 -74512 -30264 -79823 -94528 -108986 -137608 -85482 -121395 -149011 -96010
8863 -96010 -76003 -75708 -91643 -104746 -57875 -116244 -71805 -59208 -106794 -128615 -124686 -150846
8851 -150846 -118141 -113748 -111020 -80233 -125132 -77156 -88316 -132613 -76876 -70200 -128702 -102477
8839 -102477 -110859 -88438 -118409 -88322 -124920 -188804 -98355 -87650 -56894 -88047 -107591 -110725
8827 -110725 -44340 -104630 -101468 -101742 -128384 -101451 -53020 -102812 -91047 -55085 -132249 -93361
8815 -93361 -83704 -75148 -61456 -61028 -48823 -100427 -37637 -72594 -60140 -107866 -46714 -117634 -94618
8802 -94618 -110111 -125403 -74182 -80487 -107359 -85190 -107739 -95682 -62214 -84943 -147400 -97747
8790 -97747 -114762 -154269 -59583 -121756 -113771 -90088 -112173 -75933 -74692 -54121 -46372 -119258
8778 -119258 -93297 -96601 -101685 -106996 -104195 -94228 -110445 -88032 -65582 -136162 -117598 -58885 -114558
8765 -114558 -104792 -41382 -77559 -42901 -101626 -139863 -159579 -75618 -83533 -96086 -122179 -95494
8753 -95494 -108442 -102657 -78780 -87892 -67698 -59395 -107722 -71184 -58727 -126512 -89937 -74398
8741 -74398 -108790 -127284 -154282 -132932 -44322 -64002 -90675 -41850 -83079 -94351 -66201 -75729
8729 -75729 -103855 -87443 -35593 -78280 -92487 -74467 -146653 -71935 -26756 -107937 -108279 -37078
8717 -37078 -80999 -58819 -113481 -92809 -50595 -87942 -148694 -135174 -134949 -111970 -72305 -73130 -133571
8704 -133571 -110577 -67926 -80344 -49832 -44781 -122511 -79663 -46349 -112126 -135200 -94257 -149818
8692 -149818 -113737 -51457 -127044 -111479 -49977 -63712 -22503 -66064 -90207 -118896 -77065 -104293
8680 -104293 -112389 -116526 -158387 -136673 -68877 -113345 -133908 -80167 -109215 -81700 -50924 -102792
8668 -102792 -111301 -48386 -107669 -98734 -55670 -56745 -57655 -71175 -107106 -104534 -97248 -81564 -90909
8655 -90909 -109518 -98413 -117658 -73619 -91148 -142877 -121478 -88021 -98753 -48051 -76650 -67807
8643 -67807 -107631 -56915 -116291 -38957 -66810 -118607 -66183 -71702 -130233 -96114 -107093 -86947
8631 -86947 -7050 -106627 -133142 -130855 -63238 -100378 -108047 -107601 -88581 -148591 -47397 -98462
8619 -98462 -126270 -77542 -74474 -62496 -103215 -100832 -98678 -60592 -75695 -89889 -138548 -77275
8607 -77275 -97414 -46993 -120030 -70959 -88495 -59654 -51812 -23965 -103473 -88144 -78815 -102341
8595 -102341 -86524 -105545 -140319 -96150 -65424 -120111 -88689 -138758 -85943 -64418 -87088 -81477
8583 -81477 -104169 -39344 -103405 -101881 -52972 -62281 -103370 -131267 -95408 -85862 -63112 -94135
8571 -94135 -106066 -44921 -34563 -47411 -91590 -64326 -72733 -62791 -93784 -54607 -70717 -124427
8559 -124427 -126412 -98530 -84172 -79757 -79815 -96268 -87043 -33075 -18401 -41704 -105614 -87126 -108618
8546 -108618 -66052 -123998 -85117 -67830 -17624 -15421 -63316 -86232 -88979 -92923 -78772 -33977
8534 -33977 -88878 -79648 -112150 -112770 46881 146017 -50061 -45787 -99200 -85970 -102404 -76993
8522 -76993 -75195 -43965 -85345 -51308 -54501 -42900 -87525 -136233 -47496 8732 -45629 -39179
8510 -39179 -88127 -97657 -84126 -93633 -23842 -57126 -122421 -44015 -17834 -79289 -35929 -54102
8498 -54102 -107317 -51906 -75877 -45215 -98155 -59303 -84879 -20482 -93727 -123735 -96118 -52469
8486 -52469 -58136 -97077 -62974 -101928 -101892 -61284 -79746 -91902 -68430 -69195 -74937 -7651 -48039
8473 -48039 -86096 -81171 -50125 -12666 -26920 -68266 -82564 -32311 -39395 -34062 -54088 -65718
8461 -65718 -94905 -61888 -50257 -77493 -40209 -71326 -85109 -68056 -70909 -44246 -105352 -139324
8449 -139324 -8827 -49570 -61212 -86849 -111638 -105646 -44100 -81395 -146836 -77329 -82771 -10342
8437 -10342 -42030 -14533 -42547 -56689 -25065 20717 -68120 -19527 -61187 -115870 -38104 -16524
8425 -16524 -23043 -18739 -107864 -68116 47189 21273 -41369 -53970 -27068 -35640 -9982 -14384
8413 -14384 -81894 -51512 -48010 -92762 15983 -17332 -108790 -76998 -29936 -73024 1663 -49614
8401 -49614 -33400 -45277 -100004 -58709 -36319 -43556 -108061 -18507 -35410 -20537 -63725 -52669
8389 -52669 -84796 -35073 -75669 -104903 -105150 -63382 -9833 -11952 6744 -123044 -89401 -70732
8377 -70732 -58354 -51012 -63770 -46855 6176 -2146 -17913 -50691 -68282 -56147 -79863 -55612
8365 -55612 -107438 -47267 -21032 -48817 -39191 -13691 -52637 -96315 -63585 -40027 -1353 -50369
8353 -50369 -102215 -63786 -62646 -58943 -71094 -104816 -36499 -80254 -35627 -62328 -33581 -64005
8341 -64005 -72074 -82273 -32117 -71028 -57211 -75543 -85302 -54031 -65999 -30300 -52334 -105185
8329 -105185 -55783 -39948 -67290 -50966 -56533 -105388 -58505 -47674 -71715 -111176 -84575 -4611
8317 -4611 -47169 -85939 -62591 -60244 -43687 -38022 -78973 -89085 -78949 -104996 -42933 -30069
8305 -30069 -30757 -98797 -51602 -1974 35469 -28402 -19424 -80168 -42472 -29228 -60267 -77400
8293 -77400 -66032 -79650 -44073 -7275 -10548 -58074 -56620 -39519 943 -48311 -67085 -69666
8281 -69666 -47064 -71487 -68575 -59955 -43775 -32677 -73946 -80289 -38893 -81110 -37882 -10817
8269 -10817 -68997 -17996 -50111 -97478 -49900 -52257 -21608 -12976 -55782 -47392 -60557 -42144
8257 -42144 -68292 -25774 -75982 -88636 -28923 -24057 -20967 -63327 -17470 -22627 -20023 14243 -77520
8244 -77520 -95960 -67130 -73438 -27995 -28682 -78085 -50978 -11046 -33860 -20262 -40066 -47340 -78814
8231 -78814 -34775 -10084 -70621 -82020 -88560 -82086 -37596 -96357 -46949 27794 41865 -38129
8219 -38129 35895 -29928 -46735 -24090 -51419 -104229 -61503 -49202 -13488 22964 -5184 -10301
8207 -10301 6597 59802 13410 11964 -87889 -66695 -32963 -63332 -132056 -26668 -39698 -43450
8195 -43450 29985 -56533 -43911 86808 -9676 57605 58510 -41887 -84713 1259 -35350 -60695
8183 -60695 16623 -15432 773 -6089 -22931 -13367 7121 -11444 -28058 -35179 11440 -44212
8171 -44212 6227 54169 -73915 -21984 -12420 -40887 23454 -3928 -61599 -31333 9298 16296
8159 16296 -3577 -4510 -50889 27837 -855 16809 590 34346 -34461 12943 24903 -36367
8147 -36367 -65711 -15223 -90673 -45489 25519 -23068 -41105 17676 -95074 -14766 55612 2270
8135 2270 7331 -11715 -24812 -31533 2400 1489 17943 777 -47611 4481 75603 50241 -54002
8122 -54002 15363 -324 -79050 11280 -54051 -35007 45181 -12732 5510 -4935 -2282 28496
8110 28496 14091 -47761 -47745 -13269 -20315 -21037 -59867 -6511 -32670 -22464 14323 -38411 -13268
8097 -13268 13026 -37249 51533 -7867 -138117 -17613 -11698 4071 -52050 -44064 1123 255
8085 255 25187 -57208 -15303 -63584 -14767 -48234 -38694 -10550 -61160 -1563 -41876 -74003
8073 -74003 -48928 -77764 9403 -3739 -27858 13241 -20339 -33428 -16052 9131 -33058 -71277
8061 -71277 -38439 -17393 -25864 -23636 -34705 -7633 -26876 -13316 12472 -60820 -31029 -31125 -84329
8048 -84329 -51016 -45127 -19047 -32533 -36003 10164 8121 29930 -6367 -56026 -18889 32584
8036 32584 28272 -50532 -39104 -9887 2417 21013 13061 -60852 -49410 49526 41400 24355
8024 24355 -46126 -14622 -8331 -5892 -8329 -3697 -28955 -5771 2681 3064 -41076 -24884 -39456
8011 -39456 7800 -15383 -4490 -41230 -13563 -49643 -42695 -31934 -865 -7976 -4595 -30500
7999 -30500 -72377 21715 35385 -20766 -20318 3602 -10703 -12969 -27297 -26786 -19643 -37690 -50955
7986 -50955 34881 -33920 -34986 -9294 -2749 2609 -30055 -415 26728 38894 47931 -32676 13161
7973 13161 2282 -12073 -361 4145 -21066 -63210 4452 -3950 -10192 64787 -14536 28109
7961 28109 51605 8335 -22843 1433 -51609 3340 -8459 -29240 -25744 6191 -3421 -21421
7949 -21421 -21997 -36186 16717 13254 -28610 -7636 25090 24216 11350 -4593 -43400 -65881 41048
7936 41048 30363 18050 -19688 44450 -8579 59480 47350 -2940 -13663 3105 -40917 -7054
7924 -7054 -50943 -19513 -21770 65781 8355 15726 18749 12298 35114 10697 13974 23857 48549
7911 48549 -35393 -42609 8604 -50791 17105 728 -53762 3946 56461 37682 24423 -17657
7899 -17657 25974 -96267 -4523 20347 -6757 37206 -47633 -1143 78147 5001 -9908 101106
7887 101106 35598 26319 85330 -8945 -23009 64957 33829 1364 -7615 -3458 -17495 37769
7875 37769 40478 23510 12247 43378 50438 62642 -1762 -28881 76653 315 -49130 10172
7863 10172 -7513 -26313 21844 -35221 -2543 -14939 -28993 -18476 -84556 -72221 139418 97948
7851 97948 126949 43092 -36435 23731 -8820 15239 58422 20726 35589 53990 71412 18584
7839 18584 96586 5070 48569 12052 6395 -13321 -27701 -17276 23113 34696 31889 13420
7827 13420 59794 6782 23318 16909 24516 60000 85863 27790 6845 3248 15438 67664
7815 67664 9369 23648 59112 39987 78207 108649 54997 42866 21113 53234 30141 51642
7803 51642 35796 46152 26925 -22594 17012 13782 78874 8531 72607 16876 30649 58705
7791 58705 29333 34488 48239 47923 27370 25774 73931 97030 27419 106712 100019 43470 95459
7778 95459 77363 40541 109963 68178 68474 -10342 38321 29841 26793 35541 5236 39544 37612
7765 37612 73039 4384 27465 100443 62547 49369 34201 46277 12827 41170 -1755 22874
7753 22874 9587 44160 64917 54011 51956 76747 53432 32448 96743 64518 83588 10514
7741 10514 27532 24732 61657 63839 100763 79929 73779 88269 54926 49225 124987 93948 76888
7728 76888 71332 70232 78371 81266 61067 52789 48776 94592 99613 65946 93619 58597 70803
7715 70803 66904 81783 83792 35341 97133 56373 1616 74413 50192 71159 68278 -18007
7703 -18007 99586 75512 83365 163508 56820 49280 68395 87948 118993 88070 53723 18826
7691 18826 -5183 115802 113770 64471 144027 28881 106396 139083 96657 72125 80891 82171
7679 82171 57956 113174 86762 82774 41866 77565 72365 65431 46072 125909 71783 98583
7667 98583 156002 122664 115289 86268 155121 68434 90396 71493 73535 30652 77783 49136
7655 49136 121757 57433 83169 145711 90022 150281 3499 65143 26647 31686 145059 87901
7643 87901 55635 98686 116947 114688 153050 87870 83823 166023 105922 134214 106740 83982
7631 83982 91291 58615 69348 126935 92490 102185 113573 99597 148111 99093 68868 97384
7619 97384 87852 116147 98606 83092 121902 81787 109247 85308 105336 82117 106282 128357
7607 128357 102632 153886 158505 162477 120798 133463 193683 123560 55005 111258 161093 149124
7595 149124 191061 111519 91002 151132 183874 158687 94015 128099 134451 138645 163959 152744
7583 152744 165002 56474 138055 128877 140034 102469 181279 142061 162238 154312 136768 129112
7571 129112 124150 162766 153180 168621 160521 87484 134187 142853 97726 176302 179711 117251 156732
7558 156732 217243 120065 186598 174941 119927 157664 119168 218499 233580 154827 142049 114255
7546 114255 229148 158154 160011 156157 170646 173759 188221 162817 119275 111982 181045 222506
7534 222506 203256 98846 108259 195611 183390 179417 209145 124404 222197 173606 155340 176330
7522 176330 168772 213137 175484 212040 243091 240884 233541 213176 194650 248067 213805 161219
7510 161219 174693 222678 181872 204154 184298 220221 207897 258612 257150 311389 283864 211912
7498 211912 253308 218511 264774 202125 225147 183821 237286 230567 277514 253505 212434 254557
7486 254557 251640 243819 213132 225271 256227 256682 256407 316761 269042 284265 293502 285882 225895
7473 225895 307805 223590 262527 273944 234039 272009 285999 153422 301297 289072 266786
7462 266786 293645 272916 251836 270262 300359 265204 241895 276584 240176 276575 304924 288304
7450 288304 288614 258825 260840 292210 362664 257791 222927 236429 245148 218273 232588 285166
7438 285166 202071 297209 267969 289027 353967 293939 306796 275031 315400 287542 292103 286703
7426 286703 279657 318870 314049 315019 334465 297453 297573 286464 267615 289534 311491 328527 300285
7413 300285 254236 312554 295500 295337 271826 289471 303430 302270 281147 342405 273410 305595
7401 305595 269382 338708 285968 307006 301402 354162 363969 341361 348362 303444 282941 291989
7389 291989 339064 340878 313194 329429 377639 350925 412518 320592 302852 400083 376482 323530
7377 323530 326209 342626 408071 308623 392460 303392 373225 333004 334470 361633 403933 347180
7365 347180 341478 396223 384444 459041 378265 371916 348390 417964 447500 454032 392977 413488
7353 413488 430143 433613 467163 451427 406971 445221 406452 389164 417278 406351 462929 443183
7341 443183 461525 450627 473296 329047 464016 381202 404522 459181 469888 484412 489321
7330 489321 472398 477028 555892 482410 479376 443913 483501 470599 508217 446195 507874 510036
7318 510036 517760 498424 557221 522309 521186 591428 611365 585982 555382 556199 573435 580567 531997
7305 531997 550332 512409 570617 547739 560830 578612 517741 524960 561559 525172 498916 488669
7293 488669 475069 544431 550141 513683 536824 519742 527835 562649 550439 539916 477121 579320
7281 579320 577446 536856 529645 556434 491345 532954 550918 544037 594613 552576 590708 607642
7269 607642 544483 579421 528795 582867 557767 626973 575718 536026 594089 544117 583521 654311
7257 654311 610929 556300 636593 671717 639438 637853 628853 595065 579221 629869 597607 601516
7245 601516 554709 568206 638408 620406 637755 627492 638532 640354 590394 662349 612733 605144
7233 605144 582446 607012 638151 597290 576771 581031 625547 603101 652898 662708 667258 655502
7221 655502 674868 623418 694432 678062 651152 661036 739202 699789 655929 706686 622436 697725
7209 697725 815863 802984 763508 776651 737780 855331 831426 702486 715641 713771 803092
7198 803092 777754 791935 790284 808502 814384 898547 893608 911029 862999 843434 937862 883120
7186 883120 895788 954513 848161 864046 947806 933261 981519 894623 906968 962960 982549
7175 982549 1033163 1066712 971907 1018762 1022324 1051196 1036357 960961 1043208 1045116 1059357 1112619
7163 1112619 1108476 1062909 1137589 1095955 1164889 1138823 1143418 1166982 1183292 1178618 1214684 1221176
7151 1221176 1208760 1239282 1253320 1253056 1294894 1304221 1308739 1322556 1371850 1388327 1387776 1333564 1458838
7138 1458838 1417452 1410543 1406653 1416056 1417934 1471958 1474761 1476764 1491311 1457436 1489056 1510852 1515871
7125 1515871 1563110 1483363 1480404 1522059 1527750 1561974 1569858 1547624 1559404 1615853 1677058 1620268
7113 1620268 1546633 1556667 1574166 1616715 1641919 1624660 1594970 1519885 1619104 1667812 1595673
7102 1595673 1595616 1623223 1588661 1580071 1574930 1556629 1557761 1582879 1579804 1479508 1560497 1601742 1571176
7089 1571176 1563837 1572371 1592731 1567367 1612828 1587114 1641853 1548510 1543868 1542413 1561879 1567175
7077 1567175 1586181 1542784 1553884 1593599 1554879 1594159 1575202 1551032 1575488 1588168 1568033
7066 1568033 1609711 1567280 1556233 1585585 1553305 1585066 1615945 1667079 1575285 1619573 1648214
7055 1648214 1700924 1713585 1755458 1704854 1722171 1769631 1770297 1785525 1847376 1793433 1885815 1888594
7043 1888594 1886821 1986163 2034062 2087804 2139902 2230976 2256638 2311855 2515583 2700180 2808116
7032 2808116 2919755 3055335 3099665 3153514 3132336 3156549 3089456 3095302 3006162 3046664 3052850
7021 3052850 3079541 3090534 3191724 3239594 3397581 3504955 3677572 3931076 4292091 4599490
7011 4599490 5042707 5381515 5577384 5795925 5920052 5991295 6070887 6120566 6116965 6099100 6047891
7000 6047891 5916718 5811056 5692717 5575512 5514550 5464273 5508113 5586434 5740449 5962535
6990 5962535 6319369 6584985 6903981 7371479 7948656 8474078 9031754 9445589 9650838 9714517
6980 9714517 9589369 9439210 9213643 8869427 8567689 8210267 7786072 7443720 7116004 6859557
6970 6859557 6655178 6580705 6537099 6578014 6671254 6810087 6773871 6982195 7138208 7391184
6960 7391184 7726804 8081110 8423635 8781638 9030223 9120302 8985760 8665269 8260165 7712422
6950 7712422 7178562 6670494 6208854 5857359 5565887 5380767 5184053 5040025 4968024 4958133
6940 4958133 5028308 5185182 5391031 5579376 5714778 5861835 5870927 5741511 5634279 5380655
6930 5380655 5067015 4766912 4517394 4379844 4216172 3988647 3854376 3752659 3742413 3638849
6920 3638849 3605034 3543490 3466116 3526508 3514401 3465677 3453763 3441231 3470814 3462103 3521845 3447342
6908 3447342 3501313 3489257 3551194 3622465 3677936 3692525 3729059 3719505 3845115 3883533 3946052
6897 3946052 4031182 4136723 4260778 4383837 4536008 4611609 4851585 5077048 5374568 5742164
6887 5742164 6138099 6621584 7160391 7827763 8637765 9527345 10540585 11678771 12731034
6878 12731034 13468970 13853632 13920745 13874813 13510337 13060905 12553477 11974226 11374288 10744434
6868 10744434 10224274 9584975 9059285 8652276 8126767 7900187 7755980 7601441 7604949 7776246
6858 7776246 8003845 8347317 8814195 9297882 9744909 10222880 10699526 11081648 11405433 11576831
6848 11576831 11724628 11873324 12040456 12262523 12539175 12845162 13160325 13486947 13765390
6839 13765390 14059587 14479178 14984013 15591202 16501237 17393929 18242565 18548282 18452637 17957808
6829 17957808 17181161 16063947 14892446 13817984 12823370 11954065 11163998 10559357 10091244
6820 10091244 9746072 9573124 9541802 9550762 9689066 9928915 10231761 10523101 10790698 11251965
6810 11251965 11699220 12070096 12775789 13368430 14002145 14498796 14748197 14757022 14427483 13893219
6800 13893219 13090215 12299436 11393268 10550700 9832911 9132275 8551903 8122402 7808721
6791 7808721 7482259 7305388 7144744 6945316 6826061 6758253 6649788 6620476 6555143 6489181
6781 6489181 6532850 6542413 6539070 6474339 6571176 6567200 6637397 6610383 6684441 6707783 6756197 6792013
6769 6792013 6808227 6889897 6850607 6940363 6953509 6979181 6978138 7057149 7107051 7110832 7183459 7160486
6757 7160486 7212320 7245988 7286394 7338732 7412221 7442162 7531683 7528577 7583230 7644226 7740088 7772918
6745 7772918 7854117 7920932 8021869 8091693 8169343 8216617 8318281 8379589 8483303 8618286 8717782
6734 8717782 8761484 8841983 8894656 9059000 9125346 9201876 9290920 9309361 9482208 9625673 9712230
6723 9712230 9828782 9880765 10067686 10173475 10291514 10395588 10467720 10628243 10785966 10908358
6713 10908358 11028415 11183793 11316086 11485423 11700323 11809749 11976237 12108688 12328782
6704 12328782 12496862 12672004 12856727 12991960 13203910 13408976 13522520 13747643 13970508
6695 13970508 14161403 14309342 14610352 14779838 15070381 15265168 15521954 15659763 15985499
6686 15985499 16167486 16483479 16712408 16967971 17247008 17513965 17881059 18120887 18450274
6677 18450274 18786781 19102261 19440385 19786430 20144287 20474818 20800835 21205008 21561104
6668 21561104 21937479 22361352 22700169 23130244 23520880 24020134 24458058 25011720 25460400
6659 25460400 26031574 26528521 27007433 27598024 28259970 28731507 29374609 30075593 30686022
6650 30686022 31410651 32099218 32835720 33598433 34408868 35259434 35995257 36832807 37710647
6641 37710647 38600900 39510419 40480004 41457571 42484223 43600788 44813408 45991308 47200171
6632 47200171 48562671 49953025 51411741 52946528 54479770 56152793 57926614 59753778
6624 59753778 61661514 63618939 65812817 68050346 70440731 72905230 75565440 78312773
6616 78312773 81229610 84328654 87560306 90989523 94610498 98551119 102677469 107109772
6608 107109772 111760584 116827657 122134975 127915444 134048359 140611784 147594361 155024842
6600 155024842 162941519 171352911 180480975 190195812 200445267 210928808 221463808 231943378
6592 231943378 242275662 252447600 262534418 272111675 281526590 290500457 298942821 306566241
6584 306566241 313211297 318610415 322734262 325480870 326682668 326461482 324958146 322012074
6576 322012074 318041816 312782342 306376469 298775508 290403246 281021813 271017070 260511838
6568 260511838 249711411 238962967 228417187 218038128 207914255 198375954 189213620
6561 189213620 180673730 172735494 165176948 158242278 151845198 145792648 140109034 134772047
6553 134772047 129716390 125076562 120786780 116912923 113324150 109893312 106382814 102713011
6545 102713011 99126463 95354886 91696110 88314878 85019122 81955334 79197280 76692475
6537 76692475 74440100 72435164 70474290 68732755 67194017 65821748 64572980 63605952
6529 63605952 62655065 61762914 60736403 59547418 58020366 56215610 54316568 52281795
6521 52281795 50345797 48440630 46632709 45016704 43561466 42204095 40953196 39780926
6513 39780926 38718092 37757131 36821428 35965556 35123943 34443572 33750619 33137480 32502232
6504 32502232 31940953 31427198 30928901 30402244 29919136 29435447 28955541 28541500 28031522
6495 28031522 27521278 27102783 26685405 26317405 25889835 25497401 25081371 24702731 24298312
6486 24298312 24004588 23628785 23176670 22852082 22569364 22218483 21850748 21545922 21217502
6477 21217502 20917087 20606690 20279954 20019830 19775567 19600889 19327937 19024900 18799672
6468 18799672 18549747 18288517 18058836 17787482 17536526 17331331 17159155 16950624 16738932
6459 16738932 16441862 16137922 15955090 15649875 15425222 15123302 14911048 14598309 14385529
6450 14385529 14178965 13968469 13746578 13528651 13425268 13289339 13151384 13040564 12881438
6441 12881438 12667611 12566428 12428061 12343848 12129132 11979227 11912627 11759341 11629589 11503595
6431 11503595 11390117 11244348 11003579 10915995 10772849 10632434 10495015 10300057 10170165 9990417
6421 9990417 9934814 9704368 9603904 9486915 9327393 9264515 9234153 9101718 8990141 8926019
6411 8926019 8856054 8849512 8744075 8657471 8568540 8485456 8424122 8357476 8240114 8112238 8041600
6400 8041600 7920576 7748347 7660474 7574089 7468101 7337001 7224473 7191902 7114321 7093819
6390 7093819 6993702 6941952 6889726 6835907 6791436 6760528 6638218 6665913 6544482 6403840 6369811
6379 6369811 6240057 6223494 6253510 6202227 6137734 6105905 6115274 6091171 6096747 6051280 6088256 6071424
6367 6071424 6111737 6029552 5969573 5912317 5856493 5787670 5777134 5657776 5691889 5720515 5613577
6356 5613577 5627442 5511477 5550718 5518748 5574433 5531979 5506793 5486340 5472493 5531171 5555894
6345 5555894 5490932 5491752 5532840 5537932 5514578 5590178 5533902 5477337 5515124 5568819 5547086 5525950
6333 5525950 5524390 5509886 5530246 5520874 5522085 5574531 5620828 5607962 5618756 5684707 5687416 5673279
6321 5673279 5687333 5583492 5587080 5634421 5647036 5656191 5643121 5630162 5648149 5638595 5634066 5656054
6309 5656054 5632328 5597560 5658327 5696863 5620429 5639550 5614696 5671824 5641648 5634954 5680833 5635439
6297 5635439 5708125 5726344 5683509 5697901 5775134 5860123 5858785 5855914 5893392 5901225 5900580 5902854 6024320
6284 6024320 6013956 6013312 6074017 5993262 6107185 6068627 6123624 6151884 6178743 6241859 6291849 6334454
6272 6334454 6387140 6390816 6424428 6463589 6497517 6560202 6523829 6568536 6573680 6586352 6643002 6737017
6260 6737017 6725505 6708740 6820817 6780162 6932106 6924622 7001048 7008232 7051348 7175711 7150169
6249 7150169 7160279 7228982 7344063 7324709 7425394 7427889 7491450 7564634 7628418 7664025 7734052
6238 7734052 7758394 7750610 7774962 7709570 7791866 7801914 7844825 7841776 7868734 7974539 7983765 7961612
6226 7961612 7987374 7970052 8046234 8140605 8149739 8293973 8270874 8352748 8373108 8474201 8559995
6215 8559995 8558641 8671095 8806434 8894107 8911949 9009434 8980081 9158492 9184685 9204096 9249372
6204 9249372 9358004 9338309 9417747 9495486 9409589 9523513 9532502 9651686 9737868 9849980 9924803
6193 9924803 10081013 10310500 10474086 10759172 11044665 11167870 11265156 11344474 11290686 11164321
6183 11164321 11119680 10990907 10887845 10817304 10827783 10872222 10955462 11103816 11338968 11774102
6173 11774102 12243135 12857792 13382570 13733504 14163839 14468766 14741820 15110627 15494230
6164 15494230 15963320 16565013 17262151 17946269 18606086 19119648 19537737 19665557 19685829 19657513
6154 19657513 19503102 19453925 19438465 19351911 19397538 19389327 19418398 19518824 19703582 20037551 20439366
6143 20439366 21028884 21717428 22492337 23261001 23992101 24612650 25021041 25164486 25274093
6134 25274093 25006370 24595152 24072380 23494622 22818535 22149963 21543449 20879667 20404553
6125 20404553 20002988 19808873 19642013 19599560 19808112 20124530 20520862 21006913 21569510 22062655
6115 22062655 22376061 22486205 22374867 21908821 21264424 20424114 19512207 18573701 17732472
6106 17732472 16951675 16213299 15653490 15137013 14680176 14299049 14008226 13749518 13538816
6097 13538816 13379621 13273457 13156544 13072118 13021259 12997903 12958387 13001156 13046062 12993875 13114740
6086 13114740 13165314 13296533 13418057 13597103 13751184 13915038 14132873 14232174 14426519 14594810
6076 14594810 14799061 15075050 15346094 15666190 16110769 16528606 17060611 17659543 18420562
6067 18420562 19294623 20183163 21364850 22533089 23641393 24626920 25391892 25753030 25863276
6058 25863276 25686734 25332532 24879519 24328987 23820456 23442701 23103709 22866940 22801748 22804593
6048 22804593 23095294 23541030 24132853 24973458 25872114 26849856 27636620 28301078 28665228
6039 28665228 28666449 28368301 27870416 27120006 26265007 25284868 24300059 23348304 22446952 21659364
6029 21659364 21016076 20525768 20102337 19886644 19918707 20082697 20425639 21036017 21873701 22853557
6019 22853557 23981595 24805278 25331353 25465597 25149484 24328124 23223999 21899936 20523781
6010 20523781 19206823 17968145 16888627 15937106 15179255 14561343 14069242 13686874 13511567
6001 13511567 13418572 13510682 13560459 13456878 13186896 12702188 12193496 11614041 10928713 10285377
5991 10285377 9741854 9212254 8877074 8549316 8249082 7996505 7706456 7495187 7299661
5982 7299661 7120113 6987675 6820481 6671986 6528145 6440566 6311980 6183280 6116368 6035804
5972 6035804 6012547 5964956 5927972 5936186 5965049 6032478 6032021 6134846 6172099 6176491 6250227 6266216
5960 6266216 6319520 6364961 6439836 6477020 6485663 6682793 6816627 6992790 7200209 7469037 7944945
5949 7944945 8446549 8906337 9152854 9410511 9377829 9212241 8964834 8546112 8160730 7810349
5939 7810349 7450066 7216289 6930619 6745514 6600458 6506224 6376408 6396087 6377884 6334410
5929 6334410 6384224 6564419 6667920 6950728 7250073 7724157 8174229 8583211 8767587 8836888
5919 8836888 8710408 8484452 8274603 7993958 7648151 7282445 7089082 6901624 6748661 6808269
5909 6808269 6793073 6700095 6830830 7062680 7263487 7471673 7624508 7708623 7667407 7547200
5899 7547200 7355778 7155579 6953454 6719184 6547909 6434971 6304141 6154524 6170915 6112590
5889 6112590 6056530 6080395 6061363 6113132 6108696 6159025 6222136 6306821 6492387 6761655 6989373
5878 6989373 7175687 7287027 7286448 7277285 7233234 7058905 6904379 6759288 6595106 6363541 6226868
5867 6226868 6175109 6007629 5883488 5824201 5715527 5676392 5564991 5507985 5437891 5286619
5857 5286619 5271795 5169094 5215970 5121943 5111028 5113634 5165998 5225191 5288778 5325208 5351945
5846 5351945 5365203 5384580 5400547 5394859 5406497 5408846 5480571 5486670 5457067 5424786 5467455 5373920
5834 5373920 5364128 5305821 5236737 5129737 5128397 5179055 5126040 5113088 5201251 5342636 5351133 5497972
5822 5497972 5685339 5812902 6028197 6201043 6279255 6312432 6438563 6434211 6411287 6474698 6507392
5811 6507392 6547596 6624500 6562635 6550176 6533396 6516064 6377426 6281548 6218578 6222382 6219084 6336406
5799 6336406 6383740 6542327 6799791 6919524 7131794 7254960 7274506 7310071 7439643 7447234
5789 7447234 7459271 7463946 7463819 7507092 7532199 7476417 7354141 7261357 7181440 7080000 7044073 6930008
5777 6930008 6795257 6778009 6742487 6715943 6656372 6622681 6667951 6595491 6541065 6531412 6567141
5766 6567141 6501266 6483173 6496711 6496544 6475885 6567824 6612811 6637333 6774277 6778030 6901449 7004261
5754 7004261 7055252 7150115 7243499 7325603 7417213 7444547 7495222 7583511 7697525 7782091 7832537
5743 7832537 7930592 7985102 8118530 8194785 8220075 8252718 8266336 8330537 8377570 8390125 8412270
5732 8412270 8384770 8478802 8445983 8450204 8411161 8376130 8324093 8404685 8379052 8383230 8380519 8426535
5720 8426535 8427621 8457389 8494050 8532066 8657583 8712186 8791580 8819232 8919993 8943835 9031501
5709 9031501 9088041 9121519 9270548 9368276 9443632 9584992 9693434 9855877 9983193 10217393
5699 10217393 10349756 10522153 10649265 10750408 10862506 10912249 10914233 10988701 11008848 11040858
5689 11040858 11065912 11190803 11342493 11463618 11575110 11652958 11729948 11770967 11705085 11600110
5679 11600110 11427477 11291249 11147067 10996985 10941572 10866743 10841678 10878126 10950560 11006263
5669 11006263 11065241 11170040 11251327 11291643 11214317 11238368 11107943 10974701 10843641 10683095
5659 10683095 10570407 10415653 10352509 10243543 10162235 10159606 10076290 10069272 10077349 10130841 10077487
5648 10077487 10179104 10099720 10067798 9901631 9766131 9623636 9362519 9138500 8922422 8765183
5638 8765183 8558462 8491246 8447070 8419004 8490148 8543825 8625506 8703657 8668086 8535155 8391792
5627 8391792 8235467 8032623 7736834 7480682 7257797 7037317 6880562 6777760 6635252 6589965
5617 6589965 6514773 6473483 6392969 6279444 6129169 6032931 5853189 5600846 5456649 5246713
5607 5246713 5029473 4841178 4663770 4554069 4413510 4291608 4169735 4119332 4120584 4040958
5597 4040958 4007849 4032700 3983978 3972131 4007539 3945286 3828734 3738077 3606487 3524766 3479504
5586 3479504 3406266 3273717 3220260 3123320 3125101 3096516 3045353 3039627 3054034 3011219 3047700 3021637
5574 3021637 3024363 2869851 2821594 2734496 2609196 2531490 2337177 2268240 2181997 2051515 1907754
5563 1907754 1888926 1748125 1687986 1632397 1542926 1480333 1442188 1352783 1377011 1348352 1278535
5552 1278535 1212768 1197544 1159093 1145481 1149213 1117773 1111680 1041121 1045905 984811 955966 982892
5540 982892 952046 971243 926213 888512 872498 897758 882949 913724 871995 872571 858467 846068
5528 846068 818443 822387 833471 713941 746154 796433 802853 727700 741815 713724 753857 694104
5516 694104 724613 692051 686537 687814 649706 723775 701969 655523 628053 628057 704248 669963 636902
5503 636902 598218 640537 610034 592495 596935 603906 585711 593059 650666 638132 583292 539788
5491 539788 537150 523887 555699 495646 477222 473955 535907 518796 569191 521995 585316 546314
5479 546314 491208 508933 466466 468535 474512 507470 447638 487984 395742 428206 432912 423539
5467 423539 475063 450430 422698 422842 403376 474756 425432 402395 383983 346210 407828 446279
5455 446279 412288 396415 381227 384099 445483 431082 363223 401546 396300 423760 396576 411921
5443 411921 336439 283923 397337 414442 410888 411304 400439 369829 407291 406820 392496 389893 366796
5430 366796 364161 404972 415852 368101 413391 390269 375099 383973 380018 426844 391874 408636
5418 408636 439418 437439 434426 414437 427584 418723 362841 456640 411136 427516 371322 435666
5406 435666 463091 501433 441803 410576 451125 480948 466425 420963 460143 515561 488512 479996
5394 479996 485611 491918 526716 476618 569649 539811 491729 482191 508194 565566 544261 512555
5382 512555 501661 559026 548349 552384 525984 538354 498797 583405 570159 550418 568790 578368
5370 578368 578605 548973 605270 616927 638319 606824 636541 600757 655431 667225 661296 682877
5358 682877 713611 682696 712110 726228 716823 740658 797689 787034 760825 783546 755939 836132
5346 836132 862494 891916 905125 995747 952325 985779 1037861 1053357 1059699 1080149 1117778 1181226
5334 1181226 1247855 1250625 1323799 1357961 1451222 1508696 1636343 1685783 1768948 1996820 2136634
5323 2136634 2334053 2600289 2873766 3345042 3962995 4676689 5402966 6076330 6615784 7226854
5313 7226854 7889363 8693725 9723474 10844433 11776551 12385104 12923365 13358852 13869942
5304 13869942 14670680 15595513 16274682 16658365 16524372 16260381 15901461 15461853 15194061
5295 15194061 14946064 14480050 13757921 13012206 12099273 11208016 10440254 9736929 9008589
5286 9008589 8284318 7469764 6740957 5986234 5318988 4655984 4037620 3531401 3180807 2875385
5276 2875385 2602480 2368999 2213949 2103902 1903055 1848217 1796415 1640153 1638234 1578716
5266 1578716 1526653 1400689 1409511 1366289 1335905 1341609 1264792 1287804 1212388 1148364 1128973 1110385
5254 1110385 1136194 1069454 1126226 1032921 990849 1016339 964128 937602 956219 889454 909479
5243 909479 947537 842866 796288 839778 744396 801827 815598 746650 745825 764216 751320 782038
5231 782038 735898 694752 753478 751934 720036 705196 683297 654837 753417 758056 742296 749546
5219 749546 783165 872145 912949 991366 960502 949641 908063 850736 799812 806126 735845 755769
5207 755769 730594 718427 710344 696296 589824 664585 630582 574524 631353 586777 575029 582074
5195 582074 584337 596606 589208 647672 642056 619633 665545 574288 628774 583390 578997 569573 570983
5182 570983 540540 560449 561438 554653 567086 532152 531021 543027 568372 519629 534155 569104
5170 569104 522665 546557 605039 591512 527278 558192 576401 536707 565907 566796 573255 574881
5158 574881 585065 554261 558999 515455 555932 513448 501361 551551 576736 557994 537632 551961
5146 551961 577745 650331 666684 684942 691891 697048 721494 722743 686612 706482 627786 640367
5134 640367 574762 535723 528089 588333 554997 546482 524031 548280 540236 553029 556655 606410
5122 606410 610415 597675 564066 600037 614262 639463 595788 648153 672367 656795 682468 652891
5110 652891 724011 678286 686923 692443 694215 688125 653930 686968 789394 755442 722033 742626
5098 742626 733610 764641 742566 747656 752107 717148 765820 743158 788723 813212 771532 770549 812758
5085 812758 922060 930673 828753 818799 828977 921499 908684 897740 831119 923421 924266 968158
5073 968158 1044061 986340 982362 959200 1011988 990423 986264 897976 940961 918509 893581 864234
5061 864234 819503 808034 822283 795583 829205 866054 825524 797431 808919 790103 808401 865473
5049 865473 764470 855259 881724 950656 958774 927172 937963 956652 990221 1027913 993251 990265
5037 990265 977788 1019980 978976 979441 1011072 988203 965152 1007569 1062282 971471 994489 992190
5025 992190 980793 970202 1075822 1024610 1036876 1035890 1020029 1092191 1083200 1050005 1050761 1025801
5013 1025801 1051212 1078445 1041626 1066963 1078341 1077655 1064347 1131648 1182284 1190735 1105957 1123819
5001 1123819 1149962 1152264 1127723 1140588 1144851 1107094 1115358 1184926 1169112 1169759 1211453 1167614
4989 1167614 1230626 1183227 1198160 1235400 1260740 1266588 1281898 1250942 1320902 1322244 1322226 1360940
4977 1360940 1387510 1378369 1402295 1466478 1471946 1433855 1409005 1488742 1508891 1504119 1614555 1619992
4965 1619992 1651630 1617102 1665039 1666960 1699767 1779735 1783474 1776747 1825479 1891384 1834806 1891461
4953 1891461 1905788 1943367 2062059 2068223 2073306 2034713 2112713 2140658 2202668 2208667 2289727 2302977
4941 2302977 2346820 2435546 2452957 2526760 2554298 2624062 2710881 2738115 2810877 2939617 2962215
4930 2962215 3026656 3073690 3116768 3209303 3234904 3231505 3211460 3343290 3426931 3406354 3456596
4919 3456596 3526424 3612003 3666430 3694827 3717280 3806239 3826916 3911274 3981164 4002848 3986102
4908 3986102 4117831 4121070 4119331 4229099 4238697 4326835 4390634 4430664 4505249 4606518 4720568
4897 4720568 4800902 4825351 4862453 4981794 5060845 5177620 5241536 5362438 5434707 5551010 5646329
4886 5646329 5763325 5889174 6010737 6135678 6257774 6311937 6406727 6442770 6629953 6753171
4876 6753171 6794849 6940612 7104223 7216166 7364464 7456400 7523832 7615438 7739337 7795300
4866 7795300 7966094 8031114 8015064 8187068 8259345 8383952 8439046 8486202 8512744 8621714 8687285
4855 8687285 8786675 8773121 8950614 8978475 9043600 9186974 9302331 9389318 9522744 9584153 9713224
4844 9713224 9866762 10008114 10079027 10234787 10292774 10438455 10579885 10718608 10842432 10918431
4834 10918431 11156505 11194190 11350964 11528336 11628399 11811653 11975604 12141516 12263239 12434315
4824 12434315 12440653 12658289 12801949 12894735 13173796 13535373 13975203 14255465 14340486 14355146
4814 14355146 14392044 14314276 14166724 14060611 14010401 13930975 13870038 13854268 13875488 13894882 13970697
4803 13970697 13957377 13972812 14163287 14162283 14353805 14387543 14533733 14635383 14769685 14969438
4793 14969438 15056397 15227167 15401646 15503121 15651020 15794652 15987703 16170321 16361327 16689656
4783 16689656 16929530 17166992 17360911 17603474 17779095 17959747 18172541 18333335 18518360
4774 18518360 18676787 18899798 19127242 19413930 19599244 19910860 20303738 20546588 20927643
4765 20927643 21188622 21412686 21757755 21960686 22176618 22385802 22564860 22709783 22877567
4756 22877567 23141832 23290957 23453403 23671792 23855447 24027496 24204431 24312208 24378330 24379070
4746 24379070 24477774 24463260 24550662 24506145 24491479 24528094 24536445 24438944 24448854 24319147 24208206
4735 24208206 24099202 23953603 23703418 23530945 23343270 23092102 22955803 22766102 22667626 22605969
4725 22605969 22581555 22569510 22638903 22637676 22610168 22607872 22607989 22459456 22439084 22333501 22153918
4714 22153918 22150019 22164222 22103544 22205657 22371968 22578252 22935276 23189644 23556095 23972859
4704 23972859 24392076 24781833 25225142 25553904 25855358 26244327 26487107 26672019 26944102
4695 26944102 27120989 27240184 27473656 27646386 27858204 28055456 28314016 28563008 28808337
4686 28808337 29253637 29568303 30008866 30384952 30756370 31201923 31659515 32031010 32415071
4677 32415071 32782940 33046315 33357016 33538939 33660696 33694830 33679957 33592234 33661070 33617991
4667 33617991 33600713 33675125 33790801 33978311 34090609 34296933 34392896 34539814 34663043 34729441
4657 34729441 34602910 34512984 34300610 34159351 33915966 33539121 33111737 32676896 32098316 31603455
4647 31603455 31012730 30378275 29824504 29293273 28825512 28425946 27973506 27553156 27110841
4638 27110841 26726807 26326904 25875653 25413091 24919574 24336561 23779278 23172368 22510502
4629 22510502 21842196 21169114 20495364 19772208 19088418 18427095 17897174 17326902 16845359
4620 16845359 16499276 16083783 15781120 15438776 15126522 14769807 14491470 14129833 13734590
4611 13734590 13333640 12913311 12531230 12191653 11825201 11440771 11087445 10827970 10533421
4602 10533421 10287659 10090237 9814155 9682214 9498077 9313399 9181073 9050980 8923140
4593 8923140 8800715 8754751 8596190 8448070 8373633 8232654 8198185 8094322 8002616 7937088
4583 7937088 7841182 7725501 7691517 7620997 7571191 7564530 7507749 7485266 7468597 7539933 7560370
4572 7560370 7520095 7542331 7600285 7614439 7597815 7654959 7587414 7662040 7722013 7790479 7945433
4561 7945433 7951978 8115530 8253307 8423955 8571677 8790483 8980555 9223069 9424848 9690307
4551 9690307 10002126 10336641 10718080 11002151 11285431 11478373 11623436 11764025 11817396 11821735
4541 11821735 11783912 11924334 11947239 12036538 12167253 12329663 12601984 12803623 13188448 13525896
4531 13525896 13877997 14401610 14887972 15474417 16068656 16559428 16968608 17267183 17391921
4522 17391921 17417933 17266650 16966105 16594194 16149161 15766877 15412246 15089845 14907444 14763543
4512 14763543 14772352 14869171 15178328 15528148 15935963 16450123 16951086 17428686 17696184 17868725
4502 17868725 17803197 17670195 17421973 17097286 16683078 16247657 15832380 15445648 15071139 14732742
4492 14732742 14382104 14116413 13874761 13699086 13548625 13446463 13404336 13387416 13355797 13427997
4482 13427997 13333563 13334750 13287859 13150850 12998505 12787965 12548954 12223894 11925586 11594853
4472 11594853 11266899 10946698 10574304 10258889 9926539 9645685 9349700 9117673 8942748
4463 8942748 8767146 8674831 8624364 8438030 8369964 8137706 8011095 7852108 7700276 7577003
4453 7577003 7431276 7203148 7060393 6898110 6785849 6617766 6441324 6366337 6317522 6250138
4443 6250138 6179222 6104053 6018767 5952569 5895360 5825336 5708296 5614994 5592773 5523966 5396779
4432 5396779 5446296 5331406 5292290 5309864 5247348 5221455 5252821 5280908 5329104 5290199 5217277
4421 5217277 5185676 5091480 5093193 4959770 4839130 4779364 4655498 4624916 4516964 4455685 4430717
4410 4430717 4343346 4281346 4273292 4156758 4094997 3979368 3868730 3797544 3704428 3655079 3550818
4399 3550818 3572679 3566327 3476211 3501371 3521206 3520160 3492218 3515391 3527167 3555491 3607017 3591991
4387 3591991 3660218 3688340 3747760 3743744 3712145 3634914 3559667 3451670 3462366 3380725 3381407 3289191
4375 3289191 3251301 3206902 3099028 3063460 3022247 2868842 2792607 2763129 2684426 2643586 2652006
4364 2652006 2629160 2676071 2611761 2647930 2604113 2663201 2633626 2622011 2525123 2510008 2392913
4353 2392913 2329068 2238054 2190658 2156713 2167558 2151140 2088449 2087108 2049897 1985902 1894242 1854963
4341 1854963 1908027 1828774 1807503 1735073 1778642 1720921 1699299 1713754 1620672 1553654 1535464
4330 1535464 1465511 1456186 1442391 1319804 1342966 1331194 1310079 1248635 1239921 1175822 1221650 1226520
4318 1226520 1263467 1227618 1270999 1220384 1271497 1275383 1268622 1283609 1272632 1295580 1292361 1215512
4306 1215512 1176961 1219797 1198363 1130457 1106056 1066667 1066524 978648 976006 1022420 1034164 1029212
4294 1029212 991358 953494 998835 976936 1011172 960994 919549 972766 999266 1041411 1078379
4283 1078379 1062523 1081523 1061791 1140008 1150915 1145953 1227099 1260757 1350740 1382398 1426269 1465923
4271 1465923 1373045 1373503 1366742 1287684 1172529 1178779 1065855 917292 980552 964991 816980
4260 816980 826877 801241 748062 723074 692392 690172 688697 651165 665168 658499 566439 634141
4248 634141 581411 625375 643422 609340 603756 544422 526434 580896 498928 555541 508802 472384
4236 472384 469364 550870 480624 498331 488624 497027 521497 436064 517665 472807 465068 409151
4224 409151 408089 392817 399178 433013 388247 353505 371883 439912 436252 368302 402146 389660
4212 389660 350014 385139 358698 379142 329978 380510 407520 368620 381657 330399 381920 390686
4200 390686 441494 420375 346836 380192 343793 381904 323256 290702 314894 334140 339914 332230
4188 332230 354462 319872 360616 305592 376293 345316 311183 322814 324625 309019 302515 356541
4176 356541 305207 380232 333323 290637 302601 293965 263980 250999 244412 231258 205096 225829
4164 225829 187696 176331 245599 239250 191186 180504 150284 209067 190154 183151 162108 217565
4152 217565 181603 234874 160003 136252 208008 179207 136092 128887 140810 130444 160013 141512
4140 141512 182342 166048 128435 143984 160417 200681 122585 129124 123084 121725 169611 167922
4128 167922 162291 154496 171990 108362 173453 171035 183043 189488 230981 192987 205918 255152
4116 255152 265337 228122 242310 210228 261761 317155 357166 453131 587491 690659 743847
4105 743847 771816 777596 754832 747026 700380 625625 543738 568899 485148 450560 413663 393490
4093 393490 366935 422939 506246 488476 475817 569638 693505 636785 718519 769299 873457
4082 873457 824877 821732 812292 736909 602692 518148 410022 383498 366093 307079 306707 327431
4070 327431 257041 299573 294039 283054 270471 248911 227018 239808 186923 154029 131443 128473
4058 128473 121605 134375 142237 77317 62547 160496 72032 76883 143523 24288 42167 104502
4046 104502 55160 86524 51046 38827 25524 -1093 -12387 27990 8462 80697 59549 63170
4034 63170 168 7999 41446 31195 -29877 49189 40982 25781 51594 41889 -67188 97309
4022 97309 85525 41514 78362 26315 69006 51810 37701 53479 29616 66711 86686 83868
4010 83868 105237 23867 69910 45233 73887 104553 22654 25663 140390 76564 44099 51038
3998 51038 18503 49887 96664 99365 52453 75767 125239 171387 109475 52827 117765 67038
3986 67038 111747 84345 86693 70206 65290 106725 89731 52886 25845 95000 16361 77377
3974 77377 52426 55606 30202 35637 34891 -4334 -27529 84122 22609 46969 86244 112625
3962 112625 73781 85507 52713 46367 117103 89108 34737 14164 21443 17813 47383 23283
3950 23283 -35530 17848 -15947 21526 21960 -3799 -44571 -15657 6365 -46338 28979 -949
3938 -949 -66453 28358 14423 -57908 -34815 -29093 -26967 -23582 -44363 -21919 -48207 -55390 -45844
3925 -45844 -89775 -53783 -100027 -34557 -13604 -106300 -89111 -36202 -79496 -96424 -43836 -96459
3913 -96459 -67071 -98858 -81175 -88103 -69744 -78209 -67840 -110508 -127751 -105025 -71861 -107045
3901 -107045 -68920 -109364 -81424 -116585 -112795 -134553 -85058 -135067 -114209 -71008 -68219 -132760
3889 -132760 -104139 -132647 -171029 -82433 -152424 -111712 -56022 -128842 -101612 -54276 -117983 -136584
3877 -136584 -110238 -136431 -100869 -152949 -128010 -105292 -147955 -156174 -163122 -118273 -137813 -147410
3865 -147410 -153442 -117457 -152956 -144094 -102046 -197010 -164625 -177530 -130929 -109136 -119106 -135996
3853 -135996 -121248 -151040 -111625 -166458 -150032 -95079 -131851 -137900 -148453 -198209 -168531 -130853
3841 -130853 -153377 -164928 -119267 -160090 -145416 -121131 -182698 -130329 -164184 -168881 -158933 -169955
3829 -169955 -186586 -185382 -123102 -138962 -155961 -79006 -186804 -142491 -162508 -156159 -122136 -167875
3817 -167875 -160325 -134052 -157317 -140545 -124808 -163358 -174056 -161130 -181464 -141784 -142504 -80697
3805 -80697 -128674 -226267 -167193 -213264 -173311 -165234 -134565 -198291 -162097 -217569 -101671 -160093
3793 -160093 -132867 -142470 -147530 -194128 -148445 -124783 -191592 -133918 -201731 -191928 -175628 -187325
3781 -187325 -196190 -194985 -176992 -148975 -172477 -191102 -161615 -172108 -154384 -187621 -156143 -199974
3769 -199974 -142869 -121388 -179725 -192552 -179447 -178631 -128358 -168130 -186275 -177997 -182192 -155195
3757 -155195 -125088 -192870 -153786 -191472 -207627 -168708 -155450 -187300 -162849 -163567 -176554 -193310
3745 -193310 -114994 -200590 -207636 -159565 -149732 -158561 -158742 -170311 -188712 -173533 -174790 -152323 -231758
3732 -231758 -148091 -175987 -135163 -175725 -178801 -190035 -188096 -225692 -138764 -204940 -174317 -200929
3720 -200929 -186663 -205133 -142820 -176625 -140292 -152726 -165412 -162160 -207968 -206014 -233562 -212268
3708 -212268 -196984 -248942 -197012 -209963 -95824 -204294 -135126 -214806 -164097 -173715 -200392
3697 -200392 -167230 -194256 -205120 -186264 -183872 -194226 -141052 -205957 -158611 -194661 -180280 -195432
3685 -195432 -174570 -172741 -223451 -147383 -241410 -227051 -168323 -154351 -312340 -236615 -188742 -144213
3673 -144213 -177686 -222561 -196624 -219930 -174542 -183420 -200052 -159047 -151908 -186192 -161374 -164419
3661 -164419 -129782 -166201 -191924 -174961 -201922 -184786 -181974 -157878 -216043 -156557 -180935 -145122
3649 -145122 -175214 -131492 -180577 -200640 -228984 -160710 -189521 -190867 -143166 -198462 -208279 -224564
3637 -224564 -163536 -181544 -219815 -211255 -139280 -187922 -195970 -112505 -182406 -179004 -217368 -199506
3625 -199506 -221702 -202264 -147832 -213529 -194311 -161493 -120307 -194861 -229126 -172958 -131424 -188991
3613 -188991 -164584 -208512 -236279 -193452 -195869 -160140 -190947 -221009 -182779 -156104 -202496 -197547
3601 -197547 -177077 -135727 -159675 -153213 -196242 -168249 -166108 -124561 -181009 -188725 -180106 -235857
3589 -235857 -219032 -175375 -198141 -211412 -106408 -154239 -139622 -143269 -152071 -209440 -180671 -190702
3577 -190702 -220043 -166166 -251236 -260721 -237688 -198891 -169527 -80251 -131701 -182641 -139796 -162252
3565 -162252 -138440 -181590 -218586 -224693 -176922 -247249 -231019 -234105 -199376 -189850 -129957 -100950
3553 -100950 -153965 -167111 -180635 -125174 -168425 -192801 -197484 -244419 -255516 -199259 -220239 -213471
3541 -213471 -194467 -147041 -161654 -160509 -155942 -196138 -166059 -157084 -174054 -132710 -161213 -116505
3529 -116505 -152992 -149087 -172179 -165444 -177642 -173936 -174021 -176685 -175331 -166445 -216981 -187147 -163399
3516 -163399 -167820 -142657 -153014 -113998 -180253 -150345 -137472 -203620 -195775 -220261 -228957 -243561
3504 -243561 -162269 -192694 -231312 -193754 -192362 -127309 -236183 -193692 -168210 -182281 -174470 -211590
3492 -211590 -234128 -252296 -207447 -192355 -204037 -173699 -185261 -158870 -167166 -152535 -181786 -194329
3480 -194329 -177314 -196061 -212421 -178930 -162862 -209613 -237441 -215703 -160273 -111731 -155722 -162157
3468 -162157 -178268 -194144 -151452 -200489 -157641 -198471 -210797 -180031 -180058 -181652 -163975 -202831
3456 -202831 -165019 -118647 -140527 -204790 -147618 -227082 -137494 -185385 -194894 -237356 -213670 -153201
3444 -153201 -108635 -129396 -170635 -169947 -146708 -125875 -183611 -165420 -216615 -175548 -185679 -211865
3432 -211865 -182707 -184903 -172866 -145435 -116574 -169207 -142110 -102263 -127856 -145401 -175357 -158392
3420 -158392 -204576 -199613 -186260 -147958 -178918 -140718 -113461 -174611 -129322 -147465 -197768 -176558
3408 -176558 -159296 -144253 -156019 -173357 -185220 -144030 -156100 -157820 -121194 -130665 -152683 -135531
3396 -135531 -150531 -130923 -177466 -125271 -179114 -144080 -103560 -157914 -167225 -139256 -142667 -160020
3384 -160020 -100318 -139618 -150804 -130267 -196867 -117423 -138607 -142229 -161170 -84749 -101954 -122070
3372 -122070 -101957 -154287 -126733 -120946 -82642 -147779 -100779 -143572 -124713 -111150 -119730 -154949
3360 -154949 -99487 -133958 -113556 -72704 -189628 -136653 -95714 -155884 -102745 -96150 -104850 -74034
3348 -74034 -39882 -109742 -78601 -115691 -138524 -108075 -35812 -106612 -82732 -82715 -122380 -74226
3336 -74226 -4499 -121484 -115691 -16197 -26479 -48312 4333 -55956 -52857 -84542 -27647 2386
3324 2386 22539 -46043 37782 20770 95316 85909 47030 56625 39554 132760 97431 157879
3312 157879 259891 333177 332108 455736 468337 516237 650894 764041 824018 1045018 1256858
3301 1256858 1738739 2739330 4296168 5224378 5550486 5444329 5162165 4751650 3850398
3292 3850398 2986921 2370238 1903056 1388961 1139117 929798 796054 734798 595802 531035
3282 531035 496853 382051 352182 238240 247368 163661 142171 182035 126782 97503 72001
3271 72001 74305 23675 63531 43058 51668 31779 -9449 30106 11499 6685 -12379 42826
3259 42826 -18798 3517 36704 27302 -60828 -1617 -3690 -41950 -1940 -15997 -39108 -76705
3247 -76705 -40143 -60074 -97825 -57399 -65385 -73655 -125779 -70986 -43759 -112219 -76331 -100011
3235 -100011 -155848 -200122 -121207 -92246 -125692 -169364 -90799 -171820 -66341 -65090 -111346 -139633
3223 -139633 -94227 -129563 -100374 -176708 -158861 -127525 -172997 -132637 -154038 -143420 -118130 -110843
3211 -110843 -107558 -146150 -107459 -134616 -142850 -170582 -154855 -134826 -145603 -148927 -173670 -150722
3199 -150722 -139343 -144507 -178178 -129210 -151500 -171165 -227779 -136536 -202699 -140339 -163207 -149947
3187 -149947 -184558 -166688 -190017 -143342 -131022 -81112 -177065 -170173 -199752 -123455 -141178 -156874
3175 -156874 -200491 -186707 -128792 -188442 -182764 -174886 -182617 -179132 -111250 -141379 -234595 -204935
3163 -204935 -207620 -155208 -172692 -167927 -203717 -168473 -129933 -149362 -173964 -148588 -133332 -186685
3151 -186685 -197563 -165309 -182531 -199245 -146203 -152300 -151135 -196349 -124645 -191367 -215004 -161470
3139 -161470 -175832 -167758 -180016 -184760 -180081 -194012 -207121 -204879 -183537 -172017 -185521 -126251
3127 -126251 -204276 -182297 -196373 -173939 -171197 -152100 -211156 -219109 -153484 -151094 -168895 -200753
3115 -200753 -146312 -225260 -124363 -165883 -165450 -194876 -211437 -183415 -232079 -175994 -223694 -211064
3103 -211064 -208441 -242501 -188447 -181799 -179480 -215846 -197949 -211465 -190762 -161377 -187858 -207201
3091 -207201 -240685 -153660 -186318 -196127 -188662 -191860 -162418 -205549 -203502 -158172 -218105 -222293 -216697
3078 -216697 -188097 -215548 -205023 -222365 -168490 -229235 -155553 -165080 -201330 -183288 -234807 -145725
3066 -145725 -167242 -114640 -193986 -144888 -183199 -145559 -157426 -178546 -175191 -181570 -185133 -187135
3054 -187135 -193978 -201962 -166362 -157586 -189818 -217750 -211750 -147649 -126689 -187486 -165722 -193562
3042 -193562 -243825 -193124 -196381 -159285 -191897 -276530 -187088 -187469 -151054 -173353 -191035 -225510
3030 -225510 -238872 -172462 -159092 -190808 -190134 -195716 -199160 -188907 -245779 -232620 -211913 -222087
3018 -222087 -168349 -129949 -212384 -190208 -181057 -197301 -215637 -174507 -223022 -236865 -214264 -192324
3006 -192324 -163809 -201404 -161881 -241316 -144276 -170610 -203696 -252073 -206562 -208944 -169689 -167762
2994 -167762 -195390 -177426 -208486 -230234 -173026 -157205 -193141 -215372 -192815 -202488 -193419 -165666
2982 -165666 -207612 -192396 -155716 -153180 -217664 -216595 -233707 -173499 -206378 -234157 -246075 -228858
2970 -228858 -259247 -211825 -247789 -199500 -159649 -207877 -254346 -168171 -192050 -242513 -207749 -125067
2958 -125067 -152664 -217660 -184440 -214423 -221393 -224409 -177695 -193525 -209242 -233496 -187819 -175404
2946 -175404 -180475 -194464 -187498 -224925 -229675 -224195 -214839 -133806 -184867 -201536 -244847 -127379
2934 -127379 -122861 -158957 -128562 -174192 -209317 -171115 -223797 -251663 -246169 -224440 -227954 -138364
2922 -138364 -179493 -181967 -183130 -188052 -196898 -172455 -202949 -226749 -222083 -199039 -223118 -196546 -206627
2909 -206627 -241320 -163435 -115069 -191922 -193388 -168757 -186822 -188337 -173590 -254815 -199258 -214505
2897 -214505 -254341 -219272 -215419 -244787 -187190 -127299 -211143 -176777 -176503 -220883 -176133 -167796
2885 -167796 -275393 -236796 -187247 -197569 -251443 -199528 -203639 -239101 -129478 -175091 -189546
2874 -189546 -140700 -169896 -197850 -207223 -182990 -214835 -159841 -189812 -202261 -191428 -203621 -229971
2862 -229971 -203096 -206800 -220509 -156353 -150608 -183751 -179585 -127844 -246789 -179682 -208721 -236379
2850 -236379 -214826 -177032 -241605 -204674 -202391 -250437 -186064 -209344 -164598 -166368 -195731 -196520
2838 -196520 -164306 -186667 -198296 -196869 -212041 -257115 -245809 -164908 -255744 -211565 -221880 -145042
2826 -145042 -165247 -175293 -213194 -210346 -184320 -206762 -211658 -184310 -198205 -224814 -179223 -230645
2814 -230645 -193214 -184334 -208625 -161169 -195304 -144835 -164656 -174589 -216197 -217146 -177347 -189822
2802 -189822 -234360 -221834 -250397 -241119 -175856 -171812 -151776 -199841 -186057 -128440 -146666 -169976
2790 -169976 -194722 -229154 -152244 -196083 -205783 -237502 -256611 -183077 -190615 -183307 -213510 -180365
2778 -180365 -190296 -161642 -172274 -229692 -180264 -236531 -207497 -235506 -226681 -228481 -197146 -169443
2766 -169443 -224668 -196162 -189270 -172127 -200258 -235558 -207311 -202510 -167656 -160452 -189672 -218657
2754 -218657 -202193 -169620 -221364 -188979 -176557 -171134 -267801 -190407 -196949 -222521 -218637 -204221
2742 -204221 -188163 -190346 -202387 -177527 -170331 -141351 -229178 -193346 -230451 -231482 -207072 -185852
2730 -185852 -227888 -192572 -160794 -119666 -218278 -218103 -177031 -174718 -163675 -218894 -212090 -172196
2718 -172196 -219953 -202278 -154461 -203122 -162939 -103744 -198226 -192197 -230257 -262764 -184333 -176054
2706 -176054 -220732 -199828 -194074 -228325 -243209 -220398 -217334 -160275 -173328 -176715 -250695 -171022
2694 -171022 -163277 -209036 -166500 -258556 -250826 -225328 -159345 -153062 -214334 -195239 -162144 -195772
2682 -195772 -204086 -196944 -203890 -210957 -173460 -206192 -255951 -225489 -149046 -184187 -203079 -219127
2670 -219127 -162091 -200511 -146319 -208318 -239615 -279502 -207586 -186576 -222994 -197646 -235457 -172987
2658 -172987 -189576 -188051 -170454 -213441 -218021 -185042 -198070 -185758 -197432 -248566 -243503 -212991
2646 -212991 -165863 -173667 -166939 -99778 -194353 -175837 -145691 -192919 -180677 -190118 -256874 -244524
2634 -244524 -169068 -207597 -217999 -197452 -186434 -192332 -115410 -193061 -204611 -224774 -234358 -268409
2622 -268409 -197286 -261622 -269034 -173481 -188898 -186697 -166448 -189858 -242502 -190720 -157847 -245087
2610 -245087 -252987 -221641 -238182 -189301 -193635 -228675 -161589 -187534 -196008 -122804 -203678 -224517
2598 -224517 -189319 -215316 -213226 -246050 -172106 -199251 -189824 -213321 -193209 -216803 -158674 -240186
2586 -240186 -177454 -164131 -169753 -214299 -208916 -212504 -220828 -222878 -173468 -171173 -139812 -179488 -163172
2573 -163172 -211949 -178423 -252847 -160690 -242168 -157352 -194759 -263273 -271666 -190756 -177575 -167913
2561 -167913 -171849 -223682 -179982 -154173 -219724 -226923 -190491 -227404 -195971 -206169 -219339 -203206
2549 -203206 -189356 -154988 -137877 -199113 -139948 -252409 -188158 -185819 -177208 -209842 -201296 -281727
2537 -281727 -202387 -211376 -205408 -188483 -180536 -234466 -200037 -179350 -197709 -197538 -212115 -184969 -194272
2524 -194272 -167185 -196150 -238151 -167201 -184681 -153179 -146750 -198798 -239805 -204612 -182006 -138921
2512 -138921 -179355 -194269 -225357 -225660 -198614 -195160 -201995 -206399 -180924 -120158 -143974 -222646 -206374
2499 -206374 -198688 -246799 -157785 -192347 -220596 -212502 -167183 -160616 -164557 -218099 -197396 -176167
2487 -176167 -171424 -193490 -181866 -208494 -215419 -202984 -167965 -217157 -172988 -197293 -202671 -216523
2475 -216523 -173412 -203598 -225576 -193408 -238342 -149445 -218374 -222287 -217100 -271310 -193115 -186433
2463 -186433 -153382 -150054 -197683 -176150 -240878 -185034 -167512 -215023 -198194 -210631 -216165 -234601
2451 -234601 -239733 -247215 -240106 -142429 -138165 -245361 -231625 -206666 -228310 -230409 -166340 -210490
2439 -210490 -221339 -175087 -187640 -245181 -255223 -198831 -156106 -204739 -218846 -199810 -191978 -237686
2427 -237686 -180985 -224380 -168131 -187402 -167474 -214338 -257996 -235443 -218893 -170861 -143607 -160823
2415 -160823 -285986 -135938 -198445 -223429 -185678 -209388 -236624 -230820 -175136 -222844 -178568
2404 -178568 -211502 -227483 -168759 -204649 -209024 -173844 -217892 -211959 -196127 -208666 -202776 -257231
2392 -257231 -211577 -219259 -186580 -195725 -193353 -213685 -230255 -196486 -147339 -156956 -177280 -175483 -145823
2379 -145823 -141114 -167307 -184656 -220772 -231803 -166568 -123087 -158770 -177739 -253496 -224534 -222610
2367 -222610 -175863 -253673 -241887 -221966 -201493 -196771 -240651 -209355 -233362 -280657 -187527 -160494
2355 -160494 -222569 -188655 -221744 -209228 -145179 -187188 -207126 -206716 -208295 -242864 -148776 -182724
2343 -182724 -184310 -170524 -233411 -203895 -160993 -152022 -174482 -152444 -203563 -168127 -145901 -164309
2331 -164309 -201777 -228127 -198986 -179352 -267559 -244154 -239875 -181221 -145074 -180052 -228220 -281374
2319 -281374 -188121 -190283 -191282 -171700 -259677 -226197 -200812 -180408 -232695 -210763 -213652 -159995
2307 -159995 -224020 -192731 -180280 -233237 -223174 -199917 -161255 -189935 -177567 -196731 -203318 -198307
2295 -198307 -146887 -202125 -194906 -206264 -215639 -224215 -190945 -169498 -171182 -173671 -244320 -202154 -215514
2282 -215514 -223912 -215073 -187056 -236524 -128435 -213134 -234331 -224152 -169134 -194143 -169717 -197970
2270 -197970 -247257 -226784 -172343 -246319 -167821 -187375 -233587 -189859 -208458 -208955 -184113 -159711
2258 -159711 -187378 -152073 -151261 -218824 -140549 -143713 -215481 -170657 -200812 -206763 -190182 -190344 -217980
2245 -217980 -170511 -196332 -198216 -146767 -193845 -197877 -194999 -161811 -212977 -185022 -222325 -254677
2233 -254677 -207049 -157847 -198056 -190997 -185024 -230377 -186527 -145944 -166740 -226737 -226754 -170441 -194425
2220 -194425 -177614 -200422 -195474 -184640 -221554 -248705 -165709 -198558 -140750 -90700 -149151 -179276
2208 -179276 -178848 -191603 -188884 -199909 -185904 -172638 -224589 -163022 -281413 -192004 -147398 -175257
2196 -175257 -213908 -232601 -198564 -138329 -216061 -238862 -166744 -203472 -218270 -144210 -201768 -211147
2184 -211147 -168142 -174309 -223977 -215647 -194814 -270117 -212362 -251522 -243620 -236335 -183384 -225808
2172 -225808 -205634 -169589 -229029 -182549 -205782 -188143 -251043 -212043 -260140 -167693 -172414 -183343
2160 -183343 -204249 -200398 -189803 -200668 -231980 -211018 -196791 -184990 -220823 -203463 -186509 -190259
2148 -190259 -268564 -177903 -279535 -231576 -187792 -219012 -201446 -206913 -186280 -210357 -126803 -171275
2136 -171275 -221739 -149513 -143674 -186702 -183215 -220879 -212996 -194052 -210035 -179381 -185502 -225134
2124 -225134 -227139 -178748 -204815 -137160 -244966 -202737 -167034 -135514 -240985 -226182 -172423
2113 -172423 -164419 -226755 -198877 -187436 -244285 -191688 -200766 -193503 -159187 -198059 -184629 -127150
2101 -127150 -166511 -221720 -223562 -202137 -184244 -186311 -198608 -179190 -191105 -92393 -185330 -169470
2089 -169470 -172980 -116935 -200506 -156854 -210375 -229097 -203417 -165199 -180520 -204874 -170446 -173811
2077 -173811 -143558 -127577 -160878 -254783 -171378 -200074 -169727 -224441 -239399 -192851 -189298 -243242
2065 -243242 -176621 -142686 -171604 -195757 -155373 -178516 -211075 -207149 -205731 -241141 -202428 -177023
2053 -177023 -199832 -250794 -238800 -239818 -185096 -203737 -254571 -224571 -200716 -216599 -147240 -237154
2041 -237154 -223488 -152262 -232066 -169709 -190510 -201367 -217821 -206748 -177291 -236480 -203334 -205813
2029 -205813 -182886 -174102 -186775 -194407 -252390 -169475 -196082 -172700 -232492 -237133 -234827 -205912
2017 -205912 -228098 -202912 -204487 -219595 -222874 -167867 -174824 -193280 -160844 -170792 -198552 -185101
2005 -185101 -221571 -214608 -255642 -180163 -222050 -244504 -188655 -179755 -240147 -170793 -188633 -153328
1993 -153328 -132157 -261820 -186791 -199266 -175208 -187487 -220286 -219515 -210223 -169231 -169687 -172209 -217424
1980 -217424 -192053 -180498 -121924 -182997 -206803 -229680 -164257 -198399 -218618 -169770 -248061 -143879
1968 -143879 -166543 -171113 -199785 -191700 -216833 -209235 -229244 -182960 -169895 -220797 -165274 -239600
1956 -239600 -217782 -165232 -177162 -177733 -153419 -169306 -164161 -162529 -195736 -220143 -197984 -221344
1944 -221344 -187831 -203374 -238259 -255289 -186872 -143901 -237974 -179811 -223118 -191001 -214817 -221719
1932 -221719 -156128 -193157 -265006 -235997 -166901 -224160 -220432 -178312 -241309 -174516 -209569 -201975
1920 -201975 -229599 -209820 -238797 -200323 -175853 -169679 -186212 -228110 -215613 -188287 -202094 -211456
1908 -211456 -176698 -198291 -206036 -206780 -200813 -200313 -209040 -210166 -199361 -181447 -172283 -223119 -173527
1895 -173527 -231642 -233672 -182224 -253906 -178486 -202143 -213218 -228233 -206278 -197526 -212331 -188079
1883 -188079 -162857 -147283 -198875 -198497 -217750 -221177 -157900 -251072 -186823 -251889 -188190 -144003
1871 -144003 -187245 -150985 -200159 -219828 -194932 -168718 -176469 -185337 -180592 -189544 -156320 -171602
1859 -171602 -137224 -227800 -301228 -211744 -166172 -147509 -189433 -176879 -186318 -245712 -171158 -216595
1847 -216595 -215800 -198555 -227623 -199485 -135188 -190910 -216388 -207379 -167726 -179501 -230684 -173446
1835 -173446 -224269 -216805 -181809 -187056 -198582 -202705 -202714 -210973 -163495 -224066 -173793 -164427 -174137 -139882
1821 -139882 -154431 -218901 -178581 -173629 -189975 -197491 -160364 -210519 -274415 -184517 -175281 -181691
1809 -181691 -139395 -195447 -244856 -181531 -211846 -149713 -215835 -212111 -211882 -238875 -216800 -189325
1797 -189325 -237554 -211234 -181697 -195148 -122188 -178422 -162585 -183313 -192420 -186496 -166436 -240128
1785 -240128 -205504 -199578 -253500 -190054 -204477 -142635 -193350 -168142 -161446 -158629 -179497 -135138
1773 -135138 -157043 -214176 -202823 -190259 -193593 -219662 -214416 -214419 -224484 -226472 -165115 -176119 -164605
1760 -164605 -166675 -164231 -159966 -219058 -227111 -217230 -245930 -205128 -241210 -208856 -204481 -176210 -180175
1747 -180175 -191216 -191338 -209923 -241413 -204827 -203511 -220035 -268718 -228788 -239186 -201778 -151263
1735 -151263 -213151 -188087 -182537 -157098 -141218 -177528 -176732 -179137 -209307 -199684 -247910 -208035 -226868
1722 -226868 -244038 -129275 -225850 -242619 -181781 -288530 -205621 -182529 -228885 -186716 -199111
1711 -199111 -225037 -215188 -186230 -189223 -183812 -216659 -220297 -180282 -163090 -164502 -215781 -206927 -209881
1698 -209881 -175264 -173898 -186983 -223303 -175733 -141007 -160103 -165088 -149050 -196174 -248028 -162128
1686 -162128 -171798 -215454 -184452 -183201 -203094 -179120 -123640 -212632 -218966 -187728 -196674 -171436
1674 -171436 -210919 -195160 -237589 -262186 -160988 -208699 -213292 -168511 -148166 -180956 -196291 -159950
1662 -159950 -186954 -222849 -250843 -186124 -205846 -220977 -248005 -236394 -167435 -131956 -122331 -155923
1650 -155923 -192473 -171770 -168291 -201385 -182532 -217858 -211151 -174350 -178445 -177913 -226775 -230287 -174973
1637 -174973 -183784 -150862 -194472 -223849 -191607 -165276 -191627 -195693 -228482 -218706 -247767 -243260
1625 -243260 -270964 -188657 -220375 -173297 -169381 -226216 -205668 -149680 -159825 -259617 -185933 -224020
1613 -224020 -181781 -192656 -195612 -201293 -160971 -207835 -131871 -156203 -204249 -187291 -162434 -190884
1601 -190884 -212360 -217908 -225079 -179661 -218198 -223511 -223131 -211287 -186950 -167506 -226116 -203764 -230605
1588 -230605 -190399 -224326 -205142 -207887 -189919 -203424 -217353 -199623 -167888 -239990 -225732 -211198
1576 -211198 -173146 -184925 -199900 -221038 -218377 -196214 -228773 -205736 -257583 -231581 -209859 -198463
1564 -198463 -187017 -160460 -188189 -180228 -218245 -168722 -169628 -150485 -180946 -189322 -195984 -167677 -160176
1551 -160176 -218121 -146866 -196841 -156930 -164802 -226660 -221825 -207126 -164536 -157466 -190511 -240556
1539 -240556 -183864 -198531 -161459 -159199 -274479 -160951 -192525 -230519 -159178 -176861 -168584 -189506
1527 -189506 -225962 -135250 -237885 -228129 -190489 -196224 -147214 -145336 -196997 -151170 -217669 -168788
1515 -168788 -205614 -200284 -182372 -215541 -199761 -209620 -242760 -223268 -144630 -196288 -207801 -194130
1503 -194130 -232454 -187047 -211031 -195761 -147630 -174889 -184146 -169650 -267725 -183927 -196574 -214355
1491 -214355 -168488 -196189 -228239 -118498 -240999 -183281 -182887 -197487 -178534 -188941 -176237 -210228
1479 -210228 -221451 -182142 -150832 -226884 -179958 -165821 -144786 -139048 -213326 -205258 -213683 -264062
1467 -264062 -193888 -202199 -231160 -229098 -220784 -161013 -179123 -177292 -171126 -186072 -210580 -163624 -227119
1454 -227119 -202064 -198999 -228119 -218849 -209889 -164243 -147252 -156987 -241344 -157631 -210551 -159341
1442 -159341 -162901 -224206 -179059 -195471 -177327 -131297 -168719 -200850 -158233 -168126 -194236 -158818
1430 -158818 -208699 -185163 -192828 -194016 -201907 -231738 -230283 -184081 -188851 -188524 -245194 -221876 -161714
1417 -161714 -180057 -212671 -239797 -219375 -205065 -177811 -176758 -147857 -184568 -171850 -198251 -132153
1405 -132153 -178709 -200124 -190757 -183250 -224613 -153460 -165851 -215750 -191775 -235859 -227652 -119989
1393 -119989 -211186 -218522 -192808 -187996 -180814 -162956 -194576 -262283 -175146 -199080 -153468 -176182
1381 -176182 -204754 -168976 -141280 -164473 -220460 -240184 -188502 -208092 -143091 -177138 -202003 -245839
1369 -245839 -208004 -196656 -154693 -149047 -243175 -160881 -218770 -165207 -206556 -188883 -211730 -180212
1357 -180212 -216940 -185011 -188125 -192570 -267471 -156635 -210259 -154967 -139541 -167116 -219414 -152792
1345 -152792 -199770 -194054 -226679 -198736 -183871 -136369 -178604 -226879 -180982 -218214 -180209 -158474
1333 -158474 -216705 -243267 -222012 -252446 -201662 -168776 -161401 -214172 -195769 -181220 -158494 -231739
1321 -231739 -180820 -268386 -220503 -162982 -143854 -144269 -198607 -210805 -203411 -204890 -172647 -179838 -231597
1308 -231597 -226131 -194906 -199699 -135799 -185433 -209313 -175391 -188315 -188224 -187725 -242566 -181702 -199143
$$ [...]
##END NTUPLES=NMR SPECTRUM
##END=
