##TITLE=abcd
##JCAMPDX= 6.0         $$ Bruker NMR JCAMP-DX V2.0
##DATA TYPE= NMR SPECTRUM
##DATA CLASS= NTUPLES
##ORIGIN= UXNMR, Bruker Analytische Messtechnik GmbH
##OWNER= root
$$ XWIN-NMR		Version 3.5
$$ Mon Mar 16 17:39:47 2026 Russian Standard Time (UT+4h)  servis@DPX200
##.OBSERVE FREQUENCY= 200.131235884673
##.OBSERVE NUCLEUS= ^1H
##.ACQUISITION MODE= SIMULTANEOUS
##.ACQUISITION SCHEME= undefined
##.AVERAGES= 32
##.DIGITISER RES= 18
##SPECTROMETER/DATA SYSTEM= spect
##.PULSE SEQUENCE= zg
##.SOLVENT NAME= CDCl3
##.SHIFT REFERENCE= (INTERNAL, CDCl3, 0, 16.4885)
##AUDIT TRAIL= $$ (NUMBER, WHEN, WHO, WHERE, WHAT)
$$ ##TITLE= Audit trail, XWIN-NMR		Version 3.5
$$ ##JCAMPDX= 5.01
$$ ##ORIGIN= Bruker BioSpin GmbH
$$ ##OWNER= servis
$$ F:\spectra/data/av/nmr/H1/1/pdata/1/auditp.txt
$$ ##AUDIT TRAIL=  $$ (NUMBER, WHEN, WHO, WHERE, WHAT)
(   1,<2026-03-16 17:32:42.59 +0400>,<servis>,<DPX200>,
      <created by zg, POWCHK disabled, PULCHK disabled
       configuration hash MD5:
       00 E9 B6 7A A2 85 ED C7 34 08 36 98 17 FE 4E 26
       data hash MD5: 32K
       3C 59 F2 6B 81 F6 19 61 63 BE BF 4E C1 DD 48 A2>)
(   2,<2026-03-16 17:39:10.87 +0400>,<servis>,<DPX200>,
      <Start of raw data processing
       efp BC_mod = 2 LB = 0.05 FT_mod = 6 PKNL = 1 PHC0 = -259.1951 PHC1 = -0.898437 SI = 16K 
       data hash MD5: 16K
       22 9A E7 FE FD 20 CD CA 6A 74 FB B3 DB 8F 0A D3>)
$$ ##END=
$$ 
$$ hash MD5
$$ 4A 7C 62 14 3D D1 C6 87 9B E1 2E AD F9 0F F3 B2
##$RELAX= 
##$RELAX= 
##$RELAX= 
##$RELAX= 
##$RELAX= 
##$RELAX= 
##$RELAX= 
##$RELAX= 
$$ Bruker specific parameters
$$ --------------------------
##$DU= <F:\spectra>
##$EXPNO= 1
##$NAME= <H1>
##$PROCNO= 1
##$TYPE= <nmr>
##$USER= <av>
##$AMP= (0..31)
100 100 100 100 100 100 100 100 100 100 100 100 100 100 100 100 100 100 
100 100 100 100 100 100 100 100 100 100 100 100 100 100 
##$AQSEQ= 0
##$AQ_mod= 1
##$AUNM= <au_zg>
##$AUTOPOS= <>
##$BF1= 200.13
##$BF2= 200.13
##$BF3= 200.13
##$BF4= 200.13
##$BF5= 500.13
##$BF6= 500.13
##$BF7= 500.13
##$BF8= 500.13
##$BYTORDA= 1
##$CFDGTYP= 0
##$CFRGTYP= 5
##$CHEMSTR= <none>
##$CNST= (0..31)
1 1 145 1 1 1 1 1 1 1 1 1 1 1 1 1 1 1 1 1 1 1 1 1 1 1 1 1 1 1 1 1 
##$CPDPRG= <>
##$CPDPRG1= <>
##$CPDPRG2= <>
##$CPDPRG3= <>
##$CPDPRG4= <mlev>
##$CPDPRG5= <mlev>
##$CPDPRG6= <mlev>
##$CPDPRG7= <mlev>
##$CPDPRG8= <mlev>
##$CPDPRGB= <>
##$CPDPRGT= <>
##$D= (0..31)
0 2 0 0 0 0 0 0 0 0.06 0 0 0 0 0 0 0.0002 0 0 0 0 0 0 0 0 0 0 0 0 0 0 
0 
##$DATE= 1773667962
##$DBL= (0..7)
120 120 120 120 120 120 120 120 
##$DBP= (0..7)
150 150 150 150 150 150 150 150 
##$DBP07= 0
##$DBPNAM0= <>
##$DBPNAM1= <>
##$DBPNAM2= <>
##$DBPNAM3= <>
##$DBPNAM4= <>
##$DBPNAM5= <>
##$DBPNAM6= <>
##$DBPNAM7= <>
##$DBPOAL= (0..7)
0.5 0.5 0.5 0.5 0.5 0.5 0.5 0.5 
##$DBPOFFS= (0..7)
0 0 0 0 0 0 0 0 
##$DE= 6
##$DECBNUC= <off>
##$DECIM= 32
##$DECNUC= <off>
##$DECSTAT= 4
##$DIGMOD= 1
##$DIGTYP= 9
##$DL= (0..7)
0 120 120 120 120 120 120 120 
##$DP= (0..7)
150 150 150 150 150 150 150 150 
##$DP07= 0
$$ [...]
##$SUBNAM4= <"">
##$SUBNAM5= <"">
##$SUBNAM6= <"">
##$SUBNAM7= <"">
##$SUBNAM8= <"">
##$SUBNAM9= <"">
##$SW= 20.6817932712277
##$SWIBOX= (0..15)
0 0 3 0 0 0 0 0 0 0 0 0 0 0 0 0 
##$SW_h= 4139.07284768212
##$TD= 32768
##$TD0= 1
##$TE= 0
##$TE2= 300
##$TE3= 300
##$TEG= 300
##$TL= (0..7)
0 120 120 120 120 120 120 120 
##$TP= (0..7)
150 150 150 150 150 150 150 150 
##$TP07= 0
##$TPNAME0= <>
##$TPNAME1= <>
##$TPNAME2= <>
##$TPNAME3= <>
##$TPNAME4= <>
##$TPNAME5= <>
##$TPNAME6= <>
##$TPNAME7= <>
##$TPOAL= (0..7)
0.5 0.5 0.5 0.5 0.5 0.5 0.5 0.5 
##$TPOFFS= (0..7)
0 0 0 0 0 0 0 0 
##$TUNHIN= 0
##$TUNHOUT= 0
##$TUNXOUT= 0
##$USERA1= <user>
##$USERA2= <user>
##$USERA3= <user>
##$USERA4= <user>
##$USERA5= <user>
##$V9= 5
##$VALIST= <valist>
##$VCLIST= <CCCCCCCCCCCCCCC>
##$VD= 0
##$VDLIST= <DDDDDDDDDDDDDDD>
##$VPLIST= <PPPPPPPPPPPPPPP>
##$VTLIST= <TTTTTTTTTTTTTTT>
##$WBST= 1024
##$WBSW= 30
##$XGAIN= (0..3)
0 0 0 0 
##$XL= 0
##$YL= 0
##$YMAX_a= 181114
##$YMIN_a= -135411
##$ZGOPTNS= <>
##$ZL1= 120
##$ZL2= 120
##$ZL3= 120
##$ZL4= 120
##$ABSF1= 0
##$ABSF2= 0
##$ABSG= 0
##$ABSL= 0
##$ALPHA= 0
##$AQORDER= 0
##$ASSFAC= 0
##$ASSFACI= 0
##$ASSFACX= 0
##$ASSWID= 0
##$AUNMP= <proc_1d>
##$AZFE= 0.1
##$AZFW= 0.1
##$BCFW= 0
##$BC_mod= 2
##$BYTORDP= 0
##$COROFFS= 0
##$CY= 18.4799938201904
##$DATMOD= 1
##$DC= 0
##$DFILT= <>
##$DTYPP= 0
##$F1P= 9.9274215381318
##$F2P= -0.165520771350173
##$FCOR= 1
##$FTSIZE= 16384
##$FT_mod= 6
##$GAMMA= 0
##$GB= 0
##$INTBC= 1
##$INTSCL= 4.127829e-11
##$ISEN= 128
##$LB= 0.05
##$LEV0= 0
##$LPBIN= 0
##$MAXI= 10000
##$MC2= 0
##$MEAN= 0
##$ME_mod= 0
##$MI= 50
##$NCOEF= 0
##$NC_proc= -8
##$NLEV= 6
##$NOISF1= 3.799351
##$NOISF2= 2.8
##$NSP= 0
##$NTH_PI= 0
##$NZP= 0
##$OFFSET= 16.48848
##$PC= 4
##$PHC0= -259.1951
##$PHC1= -0.898437
##$PH_mod= 1
##$PKNL= yes
##$PPARMOD= 0
##$PSCAL= 4
##$PSIGN= 0
##$REVERSE= no
##$SF= 200.130005582386
##$SI= 16384
##$SIGF1= 3
##$SIGF2= 2
##$SINO= 400
##$SIOLD= 16384
##$SREGLST= <1H.CDCl3>
##$SSB= 0
##$STSI= 16384
##$STSR= 0
##$SW_p= 4139.07284768211
##$SYMM= 0
##$S_DEV= 0
##$TDeff= 32768
##$TDoff= 0
##$TI= <>
##$TILT= no
##$TM1= 0
##$TM2= 0
##$TOPLEV= 0
##$USERP1= <user>
##$USERP2= <user>
##$USERP3= <user>
##$USERP4= <user>
##$USERP5= <user>
##$WDW= 1
##$XDIM= 16384
##$YMAX_p= 313999934
##$YMIN_p= -2961149
$$ End of Bruker specific parameters
$$ ---------------------------------
##NTUPLES= NMR SPECTRUM
##VAR_NAME=  FREQUENCY,     SPECTRUM/REAL,   SPECTRUM/IMAG
##SYMBOL=    X,             R,               I
##VAR_TYPE=  INDEPENDENT,   DEPENDENT,       DEPENDENT
##VAR_FORM=  AFFN,          ASDF,            ASDF
##VAR_DIM=   16384,         16384,           16384
##UNITS=     HZ,            ARBITRARY UNITS, ARBITRARY UNITS
##FACTOR=    0.252644378177508, 1,           1
##FIRST=     3299.83951724647, 0,            0
##LAST=      -839.233330435636, 0,           0
##MIN=       -839.233330435636, -2961149,    0
##MAX=       3299.83951724647, 313999934,    0
$$ Real data points
##PAGE= N=1
##DATA TABLE= (X++(R..R)), XYDATA
$$ [...]
8880B32973n31084L07768m92181J054257q62010l13512P34584o8255J70657J99254
$$ 232973 -298111 9657 -482524 571733 -290277 -603789 130795 62540 233197 432451
8870D32451M33776q73736N85930l19867o33248O29710l00166J78195l81733O27411
$$ 432451 866227 -7509 578421 258554 -374694 255016 -45150 133045 -248688 378723
8860C78723r07691O54857K55769m74378L81215j56102k44733O21972o00653J183
$$ 378723 -528968 125889 381658 -92720 288495 132393 -112340 509632 -91021 -89838
8850h9838k37145L22997n26096R66624j38875J6396N45020l04837P21829m81716
$$ -89838 -326983 -3986 -530082 436542 297667 314063 859083 554246 1276075 794359
8840G94359j420949J442446o39624k15684l17722O87044q56829K98599k77730
$$ 794359 -626590 815856 176232 -39452 -357174 329870 -526959 -228360 -506090
8831e06090P94176n88953P50253Q2982O6886K60238j7444j194959K90899M98074
$$ -506090 288086 -300867 449386 532368 599254 859492 842048 -352911 -62012 436062
8821D36062n17524k27567L79771O34889l67204q2271k70361J7379Q73172q18283
$$ 436062 -81462 -309029 70742 705631 338427 256156 -14205 3174 876346 58063
8811E8063k9832o22324J064081o37159p31636P07953J32199j9719k78422O96792
$$ 58063 28231 -594093 469988 -167171 -898807 -190854 -58655 -78374 -356796 339996
8801C39996J4522j18425n5427k1182n10632N6087J05835n08973Q23756k70786
$$ 339996 354518 236093 180666 159484 -351148 -295061 -189226 -698199 125557 -145229
8791a45229K65184l85520K18957K84431P81012j033768m10628K8180n3045Q80339
$$ -145229 119955 -265565 -46608 237823 1018835 -14933 -425561 -397381 -450426 429913
8781D29913o64260K84217J96987j91553k78986J97248M72777n06919l8889p46725
$$ 429913 -234347 49870 246857 55304 -223682 -26434 446343 -60576 -99465 -846190
8771h46190Q01784n58865J261542l60147m97798M91278J4778m99587L19769K61646
$$ -846190 -44406 -603271 658271 298124 -199674 291604 306382 -193205 126564 388210
8761C88210q63679P99234q63041J94173J97345r88822P22475K60324j63568O69771
$$ 388210 -475469 323765 -539276 -345103 -147758 -1136580 -414105 -153781 -317349 352422
8751C52422k88423L33684R5464n35361p81215M40100J367900q76900L23927O76965
$$ 352422 63999 397683 493147 -42214 -823429 -383329 984571 107671 431598 1108563
8741A108563r35556M65068n4006n92112L8755k40198O63067q11537N97119p36345
$$ 1108563 173007 638075 584069 -8043 30712 -209486 453581 -357956 239163 -497182
8731d97182P59621l71687M65965k24951Q5164K57194R289n06334K55866N07284
$$ -497182 262439 -109248 356717 131766 216930 474124 483413 -22921 232945 740229
8721G40229n12283j46940J33034m12652j22142J50978P54577l341j63340r8923
$$ 740229 227946 81006 214040 -198612 -320754 -169776 584801 581460 418120 319197
8711C19197m49076N52013o61795L54688j54156K31690J1498k64603J298431j083899
$$ 319197 -129879 422134 -239661 115027 -39129 192561 204059 -60544 1237887 153988
8701A53988j44439M62962n35882k08523R52065l34840j40098k61499k94952M90534
$$ 153988 9549 472511 -63371 -271894 680171 345331 205233 -56266 -351218 139316
8691A39316Q892n34795R23035o13958K18415P6373n66480Q71894L43776p89021
$$ 139316 148208 -386587 536448 -77510 140905 217278 -349202 522692 866468 77447
8681G7447N58702m39978k26543L55391p7915R3276m31389N37868m05585J372407
$$ 77447 636149 196171 -30372 325019 247104 340380 -91009 446859 41274 1413681
8671A413681o62655k338K59834J1581n8938J06607L60314o7797j118593J79415
$$ 1413681 751026 748688 1008522 1020103 961165 1067772 1428086 1360289 241696 421111
8661D21111r0641K22557K60663o2734k36641K9118P5413J69639l96701K54874
$$ 421111 330470 553027 813690 750956 514315 543433 618846 788485 391784 646658
8651F46658j98515o0503Q00004m48223j52601k93028l46083o32219J255048k31393
$$ 646658 448143 387640 1187644 739421 586820 293792 -52291 -684510 570538 339145
8641C39145l96775J78053j91148m81594M22370J85349K75087M5738r1051o20380
$$ 339145 -57630 120423 -70725 -552319 -129949 55400 330487 376225 285174 -335206
8631c35206K63892K41371j002228J318484l56279J20848J45565k95010J66209
$$ -335206 -71314 170057 -832171 486313 130034 250882 396447 101437 267646
8622B67646j40218R0800m46510L41280J35452m83450K35026r0390k73400K49993
$$ 267646 127428 218228 -228282 112998 248450 -235000 26 -90364 -363764 -113771
8612a13771P53295m19235K24689m19044M42867j23554k90337n45068L52741L61067
$$ -113771 639524 220289 444978 25934 468801 345247 54910 -490158 -137417 223650
8602B23650r6388j99619k91916L73046N16546n82236M53088J73218j66125k87168
$$ 223650 127262 -72357 -364273 8773 525319 -56917 396171 569389 403264 116096
8592A16096q0713J85037M3708N50984l18607o00542l92319N69833K93326Q2964
$$ 116096 35383 220420 264128 815112 496505 -104037 -496356 73477 366803 449767
8582D49767l32196K25712m41787l67490J127914k12409m85222J27960o29861J300425
$$ 449767 117571 343283 -98504 -465994 661920 449511 -35711 92249 -537612 762813
8572G62813m53725j55126J16723P91j05463L53318k43623l32310O94230m80720
$$ 762813 309088 153962 270685 271476 166013 519331 275708 -56602 637628 156908
8562A56908o82055M92875J30121Q20416m38044r19705J136260q16963Q2033j89847
$$ 156908 -525147 -32272 97849 918265 480221 -439484 696776 -120187 -38154 -228001
8552b28001K7032M22289K57374n97457l6622L21815n45473J01793M29707M4675
$$ -228001 -200969 221320 478694 -118763 -155385 166430 -379043 -277250 152457 197132
8542A97132L40796O77345r33366o52104L9854N78642r68862P01169L88146L57734
$$ 197132 537928 1215273 281907 -370197 -330343 248299 -720563 -19394 368752 726486
8532G26486r67129L08517N10342l539365L381282j88688O28824k79677J72767
$$ 726486 -240643 67874 578216 -2961149 420133 231445 860269 580592 753359
8523G53359k43690l04356L48327J51007j89067L96398j186004l46380N27404N19546
$$ 753359 509669 205313 553640 704647 515580 911978 -274026 -620406 -93002 426544
8513D26544k17222J10895J36651L55838q75968Q74658j130375J21036K62940Q53
$$ 426544 209322 320217 456868 812706 -63262 811396 -318979 -197943 64997 65850
8503F5850L50820k39851l30727m9912p6118M89895M6946J89001j08892J119343
$$ 65850 416670 176819 -153908 -203820 -279938 209957 256903 445904 337012 1456355
8493A456355j229036J87538M63761q47883k60064J78881L87100j79944O72097
$$ 1456355 227319 414857 878618 30735 -229329 -50448 336652 156708 828805
8484H28805j412814Q9703O92383L174N30757o27906M65366n98226M81357J604
$$ 828805 -584009 -494306 198077 201251 732008 104102 569468 -28758 452599 454203
8474D54203q8701j23836p7413L83722K80859n50185M85699m70030L68198n42933
$$ 454203 365502 241666 164253 547975 828834 278649 764348 294318 662516 119583
8464A19583N90127n3033K41220j69933Q2731K49397m3909q89800O83922q35640
$$ 119583 709710 656677 897897 727964 810695 1060092 1016183 126383 810305 -25335
8454b5335J43318P26703j047142R61380j51240q4519K97125m12450L91928j78363
$$ -25335 117983 844686 -202456 758924 607684 523165 820290 407840 799768 621405
8444F21405o2547L92510K11201m7576n76112K56489n25063R24707m01871n325
$$ 621405 558858 951368 1162569 1114993 538881 795370 270307 1195014 793143 787818
8434G87818j65498j66600k39865L25687q9098K20864O25944j027304R13453p33154
$$ 787818 622320 455720 215855 541542 452444 673308 1299252 271948 1185401 452247
8424D52247J30610n27780L59932O33356K88308j014705N89779O9858l47882k98641
$$ 452247 582857 55077 415009 1048365 1336673 321968 911747 981605 633723 335082
8414C35082k5777R58266K10369p32444n48824P03286p06123N85395k75234J58009
$$ 335082 309305 1267571 1477940 745496 196672 899958 193835 779230 503996 662005
8404F62005n0007n6185M59641p49959J642261m06563j079370R65234o31604N19717
$$ 662005 611998 555813 1015454 265495 1907756 1501193 421823 1387057 755453 1275170
8394A275170k60221K8821n07976l89559K83867Q38258n39116J50722l85612Q89862
$$ 1275170 1014949 1043770 535794 146235 430102 1268360 729244 879966 494354 1384216
8384A384216p6020K21312o3659j080212K103631j613157J016398J65610n15570
$$ 1384216 1308196 1529508 1465849 385637 2489268 876111 1892509 2058119 1542549
8375A542549L15223j074848M32750N36382J8664l44177M3579R88508k09910l03886
$$ 1542549 1857772 782924 1215674 1752056 1770720 1426543 1470122 2458630 2248720 1944834
8365A944834J34382p17687N52930k32763L11901o97658L46676M78552L5499M73232
$$ 1944834 2079216 1361529 1914459 1681696 1993597 1295939 1642615 2121167 2156666 2629898
8355B629898k52537l63034J182580j085039M93638j75677r00627P94486m68438
$$ 2629898 2377361 2014327 3196907 2111868 2605506 2429829 1529202 2323688 1855250
8346A855250P91249o16303R30269n81446Q2230M58019K3060O41575j93013J02289
$$ 1855250 2646499 2030196 2960465 2379019 2461249 2919268 2942328 3583903 3390890 3493179
8336C493179m29384Q0106N78418Q8510j66797m20192K44452J109159j859453J329628
$$ 3493179 3063795 3143901 3722319 3810829 3644032 3223840 3468292 4577451 2717998 4047626
8326D047626R1297L09344n26913Q95331m75311p18001J135964l02965J015467
$$ 4047626 4138923 4448267 3921354 4816685 4341374 3623373 4759337 4456372 5471839
8317E471839m66010J39448L02686k2419N84876q23129J297472R040k95422J06191
$$ 5471839 5005829 5145277 5447963 5425544 6010420 5187291 6484763 6493803 6198381 6304572
8307F304572J078549k54903K08116J72969L80366N72040o42693P23704L19100
$$ 6304572 7383121 7128218 7336334 7509303 7889669 8461709 7819016 8542720 8861820
8298H861820m71110J494047q75828O46053N44685P793O75M83566j39386O74574
$$ 8861820 8390710 9884757 9008929 9654982 10199667 10207460 10208135 10691701 10552315 11226889
8288A1226889m37043P79270k56418J007034J35803J40764o3787Q22682o53859
$$ 11226889 10789846 11569116 11312698 12319732 12455535 12596299 12532512 13355194 12701335
8279A2701335N78055l24311N46231K65087j06000K37737M36304j24095M58855
$$ 12701335 13279390 12955079 13501310 13766397 13660397 13898134 14334438 14210343 14669198
8270A4669198L44118j16322j152668O5518N76255m32865l68530M36189J00419
$$ 14669198 15013316 14896994 13744326 13809844 14386099 13953234 13584704 14020893 14121312
8261A4121312R2937o26007J54921p55219M81342p34301o12724K54493N14303l16680
$$ 14121312 14214249 13588242 13743163 12987944 13469286 12734985 12122261 12376754 12891057 12574377
8251A2574377j78692l12063k55397k70127q226M85194j472684N7512m09427l63606
$$ 12574377 12395685 12083622 11828225 11558098 11549872 12035066 10562382 10619894 10210467 9846861
8241I846861K81342p90272j06182n45099m56777j14685P64288p85957r92334O38479
$$ 9846861 10128203 9337931 9231749 8686650 8229873 8115188 8879476 8093519 7101185 7739664
8231G739664l12448r54477N04009r21510P10849j28065o03136o86727J98482L47715
$$ 7739664 7427216 6472739 6976748 6055238 6766087 6638022 6034886 5348159 5546641 5894356
8221E894356r63591J141599j105535J90226M6885M51285o77739j088686L99497
$$ 5894356 4930765 6072364 4966829 5157055 5203940 5655225 4977486 3888800 4288297
8212D288297N50486n72885o16707k49495L71162R4038M49945q78334O53969K14033
$$ 4288297 4838783 4265898 3649191 3399696 3770858 3864896 4314841 3436507 4090476 4304509
8202D304509n60280N6860m09920k96098j56553K32763J30434M25173r14884J281856
$$ 4304509 3744229 3801089 3391169 3095071 2938518 3171281 3301715 3726888 2812004 4093860
8192D093860J629631l199800j559368J145749m30038J049741l80219Q19480j383278
$$ 4093860 5723491 2523691 964323 2110072 1680034 2729775 2349556 3169036 1785758
8183A785758Q63744j229289M20159J46993n59454j98713P45105N17048n31852
$$ 1785758 2649502 1420213 1840372 1987365 1427911 1229198 1974303 2491351 1959499
8174A959499L61521n22927P22373j376393Q11548k46426J71366l74943O92825
$$ 1959499 2321020 1798093 2520466 1144073 1955621 1709195 1880561 1505618 2198443
8165B198443m6572j189722k45401J150205j56614L79387J01460r05258O29555
$$ 2198443 2151871 962149 716748 1866953 1710339 2089726 2191186 1285928 1915483
8156A915483l81241M77538j8711l52836n39806l6371P01199j47155p30492J06284
$$ 1915483 1534242 2011780 1993069 1640233 1100427 1064056 1765255 1618100 887608 993892
8146I93892N22310l08228N11243j135716J215318j60534k64048l62168J31417
$$ 993892 1516202 1207974 1719217 583501 1798819 1638285 1374237 1012069 1143486
8137A143486k57972L10099N28089j231242P80759k56457L76057o46388k22912
$$ 1143486 885514 1195613 1723702 492460 1273219 1016762 1392819 746431 523519
8128E23519O98149n22283K00468L8309m39263O39343k23081K32975l28373N22924
$$ 523519 1221668 699385 899853 938162 498899 1138242 915161 1148136 819763 1342687
8118A342687l74888N0485k2407j048065M43831K86484L0271L32148p58584J366528
$$ 1342687 967799 1018284 995877 -52188 391643 678127 708398 1040546 281962 1648490
8108A648490r13672O59109k44851k23386p50993L66533L6014P37817k22113m74149
$$ 1648490 734818 1393927 1149076 925690 174697 541230 577244 1315061 1092948 618799
8098F18799M0252j15922p1322r1714k44551R82519l05495j39628J57594J04071
$$ 618799 659051 543129 471807 380093 135542 1118061 812566 672938 830532 934603
8088I34603o1549m36934M95269l52859k31139P50977O4662q02371O12977j017936
$$ 934603 873054 436120 931389 578530 347391 1098368 1163030 360659 973636 -44300
8078d4300J214847p26403L85412k06542R38264r16188p22949L49025P77521j72054
$$ -44300 1170547 444144 829556 623014 1561278 645090 -77859 271166 1048687 876633
8068H76633j65487k59970L83734l23648N49831M5504n42889N12639m62237L59044
$$ 876633 711146 451176 834910 511262 1061093 1106597 563708 1076347 614110 973154
8058I73154j51076p43703J79982N90765N70653l12462q44040K45979N78889p36361
$$ 973154 822078 78375 258357 849122 1419775 1107313 263273 509252 1088141 351780
8048C51780l06436J015121p30061N7367O20587p82010R62547j544476J86685K96544
$$ 351780 45344 1060465 330404 387771 1008358 226348 1188895 -355581 -168896 127648
8038A27648J70394P98028K6505K25991q65576J96320n52121M42679j37101j70198
$$ 127648 298042 1096070 1122575 1348566 482990 679310 127189 569868 432767 262569
8028B62569K88627Q7373j01386o26804Q58669p70326N68851j62665L90195m8969
$$ 262569 551196 638569 537183 -89621 769048 -1278 567573 404908 795103 746134
8018G46134l15861l48516L16762K90172n1542L00058Q2785q44432Q28712m31106
$$ 746134 430273 81757 398519 688691 637149 937207 1019992 175560 1004272 573166
8008E73166j32735J57845p13500L2429K81815K64199Q0910L85366l89942j46979
$$ 573166 440431 598276 -115224 -82795 199020 463219 544129 929495 539553 392574
7998C92574K40898j435L30755o05926P43641m78929K7369k36769p5594J136608
$$ 392574 633472 632037 962792 356866 1100507 621578 648947 412178 336584 1473192
7988A473192m75683j30029j98304J29995K99658j020850J425210J75466j278604
$$ 1473192 997509 867480 669176 799171 1098829 77979 1503189 1678655 400051
7979D00051j19388N10461p55187M83860N05034J35126q81642N11141k62847L35271
$$ 400051 280663 791124 35937 519797 1024831 1159957 278315 789456 526609 861880
7969H61880o09954J115043q22235p0532j77815Q89000j324669L10478k40798R02829
$$ 861880 251926 1366969 544734 474202 296387 1185387 -139282 171196 -69602 833227
7959H33227j11344o28659K48862m5349K9452m78733M58977J44431n1610r00639
$$ 833227 721883 93224 342086 296737 326189 -152544 306433 450864 399254 -501385
7949e01385N21171M98880m23061M05102M71091p87954N48789M35257o31051k47240
$$ -501385 19786 518666 95605 500707 971798 183844 732633 1167890 536839 289599
7939B89599M71608l09433Q5454l07760L93745n13327l28111N30872k35682Q14179
$$ 289599 761207 451774 537228 229468 623213 109886 -218225 312647 76965 891144
7929H91144q60715J52339m12425K28815N98789l5311J31241M04449o74858l34723
$$ 891144 30429 182768 -229657 -842 597947 562636 693877 1098326 423468 88745
7919H8745J72117l078K95921p96720k22893M68178M09126o83688O67666n72762
$$ 88745 260862 257784 553705 -243015 -465908 2270 411396 -272292 395374 -177388
7909a77388M37320P66433p08877N35351J23037m03619n1880K01278K00592q32253
$$ -177388 259932 1026365 317488 852839 975876 572257 520377 721655 922247 89994
7899H9994O32932N4488l69226j03527j20863K48458O25868j152481J164073r44286
$$ 89994 722926 777414 408188 304661 183798 432256 1058124 -94357 1069716 125430
7889A25430J2929R19139o12709J94428o3079J99696l48081M04164j75720l38736
$$ 125430 138359 1057498 444789 639217 576138 775834 427753 831917 656197 317461
7879C17461m6524n32333J539015j013396j23018J13383k17906K20909L1184l86738
$$ 317461 270937 -261396 1277619 264223 141205 254588 36682 257591 288775 -97963
7869i7963O55191J106916m69250q74541M59891l30300J12718J3227l92725P67502
$$ -97963 557228 1664144 1194894 320353 780244 449944 562662 575889 183164 950666
7859I50666o32242K22246J16935K162788j996102j079913K57314N14956K4392
$$ 950666 318424 540670 657605 2820393 824291 -255622 1692 516648 541040
7850E41040o69827J63927P70772l23184l40914L73187J56202k47088J02915P55695
$$ 541040 -128787 35140 805912 482728 141814 515001 671203 424115 527030 1282725
7840A282725j628800O08338J33909J136203j033973K62377o20806J068209n02918
$$ 1282725 -346075 262263 396172 1532375 498402 760779 139973 1208182 705264
7831G05264j087959P64059k0740K24855J85641K50112j37803p54995j12054J95979
$$ 705264 -382695 381364 360624 585479 771120 1021232 883429 128434 16380 212359
7821B12359k05259M81847m79447P76556r38923P92300m08349P47942j38712j20276
$$ 212359 7100 488947 9500 786056 -152867 639433 231084 979026 840314 720038
7811G20038m27104N02688l38627J17236o52045J042785q68228l02273P64657K78319
$$ 720038 292934 795622 456995 574231 -77814 964971 96743 -205530 559127 837446
7801H37446m73244O1509j58612J36382l01183K40009J95074k53603N58811p28922
$$ 837446 364202 425711 267099 403481 102298 342307 537381 283778 842589 113667
7791A13667M08091r87186P25842M05016l96785m90339J07961k70975J191137l00669
$$ 113667 521758 -465428 260414 665430 268645 -221694 -113733 -384708 806429 505760
7781E05760n88635O33189n70140K25544N84082l29256j84592j40372L58663m4255
$$ 505760 -82875 550314 -19826 205718 789800 460544 275952 135580 494243 449988
7771D49988J64316n62844j80107j37122J91327j44679N78998n3791P5948L58746
$$ 449988 614304 51460 -128647 -265769 -74442 -219121 359877 306086 382034 740780
7761G40780k92014J66699J63017j61191l28586J379094k011080Q96036k8698q6722
$$ 740780 448766 615465 778482 617291 288705 1667799 -343281 552755 524057 437335
7751D37335l31689M92916L9258p51587Q86284q5883j5764j059318P09503R32403
$$ 437335 105646 598562 637820 -113767 772517 686634 670870 -388448 321055 1253458
7741A253458q79519o59767K57476R36975n79953R42354o22228k17809N78157j443
$$ 1253458 373939 -285828 -28352 908623 328670 1271024 648796 430987 1009144 1007701
7731A007701q35389M06549l05304O39020k52892n16504L11999J87937J47655o2566
$$ 1007701 172312 578861 273557 912577 659685 143181 455180 643117 790772 728206
7721G28206J87539o98156J12402J20240L84438Q6103m24968K09871k47446L3116
$$ 728206 915745 217589 329991 450231 834669 920772 495804 705675 458229 491345
7711D91345o35641P59885k02939R91670p84770M19079q70678N51687l99927K43168
$$ 491345 -144296 615589 412650 1404320 619550 1038629 167951 719638 319711 562879
7701E62879L79178J096055j110162j79143j59807n03198L79629k33146M0517Q60472
$$ 562879 942057 2038112 927950 748807 589000 85802 465431 232285 272802 1133274
7691A133274m51243O15460j314261N65865l89439J58806L11777k3360J68190M11783
$$ 1133274 682031 1297491 -16770 549095 159656 318462 630239 606879 775069 1186852
7681A186852l81269n55497K46555j23034m30862K54794P2394j22028J93587j6686
$$ 1186852 805583 250086 496641 373607 -57255 197539 269933 147905 341492 324806
7671C24806Q12127j491457R77399n88376p3532N95786k12161m61387O72816j56694
$$ 324806 1136933 -354524 622875 34499 -39033 556753 344592 -116795 556021 399327
7661C99327N10838r10908O84667m55316J47941k48600K9057L68555L11576O8774
$$ 399327 910165 -743 683924 228608 376549 127949 157006 525561 837137 905911
7651I05911n87492r1728j04869M67496J07041o60918r2042L4465O57856J17811
$$ 905911 318419 226691 121822 589318 696359 35441 -56601 -22136 635720 753531
7641G53531j58934j32875m7881l78971r0153j26310N23701o50034M87074N28850
$$ 753531 594597 461722 413841 34870 -55283 -181593 342108 -307926 179148 707998
7631G07998l45n52482L28510n2270J14669p081k08005J49265K02263k43515l7901
$$ 707998 707653 155171 483681 431411 546080 538999 330994 480259 682522 439007 401106
7620D01106l93417M4416M7116Q52727m16928M89054m62145N15296r67082M97392
$$ 401106 7689 52105 99221 951948 535020 1024074 561929 1077225 110143 607535
7610F07535O94394m41015l11578k00566J82632o58579N44748J66107j08149J02447
$$ 607535 1301929 860914 549336 348770 531402 -127177 417571 583678 475529 577976
7600E77976J30157j27495j240596J741501m40832L56278n09889m14527J10632
$$ 577976 708133 580638 -659958 1081543 640711 996989 487100 72573 183205
7591A83205J29678N53199m49845j137252N96299J491791p92889J59414K3562p17368
$$ 183205 312883 866082 416237 -721015 -124716 1367075 574186 733600 757162 39794
7581C9794R65241r57177Q08747k59377K10068k47233j57793n13803p7507M46049
$$ 39794 1005035 47858 856605 597228 807296 560063 402270 -111533 -189040 257009
7571B57009L87515N72222l27244n09810K79948j30729p7792L60262p65542R99384
$$ 257009 644524 1216746 889502 379692 659640 528911 451119 811381 45839 1045223
7561A045223r4587o32792M66503p91953P63448l04877N4188L21218l30873M77953
$$ 1045223 950636 317844 784347 -7606 755842 450965 505153 826371 495498 973451
7551I73451o80329K2781n3577L52703M274Q6021l54979J98421J93678m53533M88077
$$ 973451 293122 315903 262326 615029 619303 705324 350345 548766 742444 288911 776988
7540G76988Q03640j473893M00999K33605k93945J4686O41724n37380R43991k50517
$$ 776988 1580628 106735 507734 741339 447394 462080 1103804 566424 1510415 1259898
7530A259898n74p03280P98765q83806J35855r9398K16411M28465p78830J82589
$$ 1259898 1259324 556044 1354809 471003 606858 507460 723871 1152336 373506 556095
7520E56095Q4905K52629N7012J44747j42549l32227N1254J215305j142068L18507
$$ 556095 641000 893629 950641 1095388 952839 620612 671866 1887171 745103 1063610
7510A063610M14211o0147J48283k99432K21168r28103L24295K39646K56037k58747
$$ 1063610 1477821 1417674 1565957 1266525 1487693 559590 883885 1123531 1379568 1120821
7500A120821m01003L4593m9853K35406N80012p70681j30144k03152N94003N8898
$$ 1120821 719818 754411 704558 939964 1519976 749295 619151 415999 1010002 1068900
7490A068900o42696K5929M2836J46250J02812L04439j83628m81994J041036m21448
$$ 1068900 426204 452133 494969 641219 744031 1048470 864842 382848 1423884 1002436
7480A002436J86232M67953j182950O0348o0729J7227l11582Q52833k19662K20708
$$ 1002436 1188668 1656621 473671 534019 473290 490517 178935 1031768 812106 1032814
7470A032814k55829o7891q0760K36492K64624q94654j66739O55846l42213N50129
$$ 1032814 776985 709094 628334 864826 1129450 234796 68057 723903 381690 931819
7460I31819r9244K97050j013838J544872n38945n14039N35124o71048Q78691r31126
$$ 931819 832575 1129625 115787 1660659 1121714 607675 1142799 471751 1350442 419316
7450D19316M26203o19137R91772k67517l15643N1242p03077J079681J16215r81486
$$ 419316 845519 226382 1218154 950637 634994 686236 -16841 1062840 1179055 197569
7440A97569Q81774P1557K93320n45022K5793N56645k80361j560802R80097M46633
$$ 197569 1079343 1150900 1444220 899198 924991 1481636 1201275 -359527 620570 1067203
7430A067203m46541P06643o58068L49707j42386n63387J12837M74978J3482R7086
$$ 1067203 620662 1327305 669237 1018944 876558 313171 426008 900986 914468 1011554
7420A011554j61082p83493J049536m78578k83137N62677p30228J035634j113969
$$ 1011554 850472 66979 1116515 637937 354800 917477 187249 1222883 108914
7411A08914P48871j03793J81871J02252l11626J55408j052878R97050J44337j89705
$$ 108914 857785 753992 935863 1038115 726489 881897 -170981 826069 970406 780701
7401G80701o04043O72888K63005l00619M47759j276060J348325q77417J8903N92615
$$ 780701 176658 849546 1112551 811932 1259691 -16369 1331956 454539 473442 1066057
7391A066057m72478M80954n38497J94306o5236Q9252l6231n49221N69629l08510
$$ 1066057 593579 1074533 536036 730342 665106 754358 718127 168906 738535 430025
7381D30025j02712R76237j52067m78634k98987N78412K52465j76610o65675j5695
$$ 430025 327313 1303550 1151483 672849 373862 952274 1204739 1028129 362454 346759
7371C46759R86788m46770k13204N98383j228825K92401N25835l83400K14464m23042
$$ 346759 1333547 886777 673573 1271956 43131 335532 861367 477967 692431 269389
7361B69389K98039n75199k57287O21343k85118L47675L58881K51827j298565Q02466
$$ 269389 567428 -7771 -265058 356285 71167 418842 777723 1029550 -269015 533451
7351E33451p0067k33412M95966n6448l11898n03002J211928K2155l59130j103052
$$ 533451 463384 229972 725938 669490 357592 -145410 1066518 1088673 729543 -373509
7341c73509J435244q48865M63736M40690k28614R06465j439648j01871N14604
$$ -373509 1061735 212870 676606 1117296 888682 1795147 355499 253628 768232
7332G68232L28772M6412n78261Q83561m74964m9916l07016N47354o64838N94412
$$ 768232 1097004 1143416 565155 1448716 973752 923836 616820 1164174 499336 1093748
7322A093748o73540N94048j034374J160648q96271L29635N11232j232284P91115
$$ 1093748 420208 1014256 -20118 1140530 244259 573894 1085126 -147158 643957
7313F43957J72949K93222l90241n9903j66932Q23777n96761k27760M10681N86975
$$ 643957 816906 1110128 719887 659984 493052 1316829 720068 492308 902989 1489964
7303A489964l73187m0202J74478N05566j042630k2093P36158l24416J32592l38287
$$ 1489964 1116777 1076575 1251053 1756619 713989 691896 1428054 1103638 1236230 897943
7293H97943K30277L56211J38000q04330M08024P05979j99584p16376k75624J189366
$$ 897943 1128220 1484431 1622431 818101 1226125 1932104 1732520 1016144 740520 1929886
7283A929886j252433J97580O89389m25144M2996J23481j73543j24696O31915n61372
$$ 1929886 677453 875033 1564422 1139278 1182274 1305755 1132212 1007516 1639431 1078059
7273A078059L5679k68285J5750M33541p62061N79758n83506J11843O93213o49607
$$ 1078059 1113738 845453 861203 1294744 532683 1112441 528935 640778 1333991 684384
7263F84384K81015M08948n63801Q87551m20467K93268k66769k00054k1162j00967
$$ 684384 965399 1374347 810546 1698097 1277630 1570898 1304129 1104075 1082913 981946
7253I81946K0244n71957P98782M10847l89137n63974O83565j372134P32587M59062
$$ 981946 1002190 430233 1229015 1639862 1250725 686751 1370316 -1818 730769 1189831
7243A189831K91208J6878n27791k52135N30431j63596J80590l47073K57435j16301
$$ 1189831 1481039 1497917 970126 717991 1248422 1084826 1265416 918343 1175778 1059477
7233A059477R54652p31763J01094l53968J82137J34370k08509N8183l36127J05078
$$ 1059477 2014129 1282366 1383460 1029492 1211629 1345999 1137490 1195673 859546 964624
7223I64624m93031O38673M6433l77407Q51961l48786j27328K80648j64191o3489
$$ 964624 471593 1110266 1156699 779292 1631253 1282467 1155139 1435787 1271596 1208107
7213A208107K16566l88303M51913l28017M48858m20330j24488J50475k86762N01280
$$ 1208107 1424673 1036370 1488283 1160266 1609124 1188794 1064306 1214781 928019 1429299
7203A429299M0762l35327N61107p16511l13765r3367Q21471P49471o72906k31843
$$ 1429299 1470061 1134734 1695841 979330 665565 572198 1393669 2143140 1470234 1238391
7193A238391L01341M13154l30996r9712k28178r4429J11449j19663j49473k15511
$$ 1238391 1539732 1952886 1621890 1522178 1294000 1199571 1311020 1191357 1041884 826373
7183H26373J68979M24620O73502q65623L75960o13660N42938n05699L61281N80160
$$ 826373 995352 1419972 2093474 1227851 1603811 990151 1533089 1027390 1388671 1968831
7173A968831n38250P658L41946k88499P2772q36112N07436N42654J99581j84801
$$ 1968831 1430581 1438239 1780185 1491686 1564458 728346 1235782 1778436 1978017 1793216
7163A793216o68876Q1764L24059l85576O70084q33335J291668o28248n41072K18395
$$ 1793216 1124340 1206104 1530163 1144587 1814671 981336 2273004 1644756 1103684 1322079
7153A322079J258547r41781k98404L41298L34080k94268n63950J414429o35160
$$ 1322079 2580626 1638845 1340441 1681739 2015819 1721551 1157601 2572030 1936870
7144A936870k8419j28335j0104L55888k86620N87567r92158O46360k61252J04701
$$ 1936870 1908451 1780116 1770012 2125900 1839280 2426847 1434689 2081049 1819797 1924498
7134A924498L04095l02684Q99566l42765p9101K33766j87253q8725K24429k81127
$$ 1924498 2228593 1925909 2825475 2482710 2403609 2637375 2450122 2361397 2585826 2304699
7124B304699q068K52645o45642R01070l80039K89899M70176r38129j41458J203629
$$ 2304699 2296631 2549276 1903634 2804704 2424665 2714564 3184740 2246611 2105153 3308782
7114C308782l395J51084L5390r25727R22376M61250q32517r6997L43498J73502
$$ 3308782 3305387 3456471 3491861 2566134 3488510 3949760 3117243 3020246 3363744 3537246
7104C537246O74044k50575M58295l86865j57452K04142K18474k81600l42044O55751
$$ 3537246 4211290 3960715 4419010 4032145 3874693 4078835 4297309 4015709 3673665 4329416
7094D329416L39713O31705o54005J019938J56811j50083m38899M72366L94985
$$ 4329416 4669129 5300834 4646829 5666767 5823578 5673495 5234596 5706962 6101947
7085F101947r32R85904j72040q04417N8118L04754J367472J87962p22881N18519
$$ 6101947 6101015 7086919 6914879 6110462 6168580 6473334 7840806 8028768 7305887 7824406
7075G824406M42429j88520j38967L31815j9884M59746L11271j052233L50861J79741
$$ 7824406 8266835 8078315 7939348 8271163 8251279 8711025 9022296 7970063 8320924 8500665
7065H500665j28831M72916P80709j010957R28439o48259J47457k90995O99326
$$ 8500665 8371834 8844750 9625459 8614502 9542941 8894682 9042139 8751144 9450470
7056I450470k58609L58120n93299K59808L74462N24998j234831O02315j18737
$$ 9450470 9191861 9549981 8956682 9216490 9590952 10115950 8881119 9483434 9364697
7047I364697Q4852j2821R5632J53864L39618n56725k79377k81453L16268O50466
$$ 9364697 9449549 9436728 9532360 9686224 10025842 9469117 9189740 8908287 9224555 9875021
7037I875021k8418n56207k33202O07933L73904j394556N29236j09809L13904L37420
$$ 9875021 9846603 9290396 9057194 9665127 10039031 8644475 9173711 9063902 9377806 9715226
7027I715226l54639j399574N16262l69881R4531l50244L6203O5861O1610j72867
$$ 9715226 9360587 7961013 8477275 8107394 8201925 7851681 7887884 7953745 8015355 7842488
7017G842488l54318j47206P08081j342944P30481j147584R84527m10160o60380
$$ 7842488 7488170 7340964 8049045 6706101 7436582 6288998 7273525 6863365 6202985
7008F202985P74219q42283K30638l59998m84733j90981L01168R2560p88524O25851
$$ 6202985 6977204 6134921 6365559 6005561 5520828 5329847 5631015 5723575 4935051 5560902
6998E560902j428613J197279l42115r68465P02700J97641J8142J01367k25268
$$ 5560902 4132289 5329568 4987453 4018988 4721688 4919329 4937471 5038838 4813570
6989D813570P87836q20912r57742N96888L94488k66104p81785L54677Q8711L31493
$$ 4813570 5601406 4780494 3822752 4419640 4814128 4548024 3766239 4120916 4209627 4541120
6979D541120m74145m60127L58891j68040L07848l43842K27287R8850l35073K69653
$$ 4541120 4066975 3606848 3965739 3797699 4105547 3761705 3988992 4087842 3752769 4022422
6969D022422m17322n8677Q56649j19235j350027R90201l89837l60917j9578J44495
$$ 4022422 3605100 3546423 4403072 4283837 2933810 3924011 3534174 3173257 3153679 3298174
6959C298174k02574J37929j50831R76898q07161J81433J87020l05666m51540M08162
$$ 3298174 3095600 3233529 3082698 4059596 3252435 3433868 3620888 3315222 2863682 3271844
6949C271844M61103j053517M53544o26592J048891p33560L59777j82452Q1458
$$ 3271844 3732947 2679430 3132974 2506382 3555273 2821713 3181490 2999038 3080496
6940C080496N06565p13572K41726K48757o27579L5886J625582j760532M52800
$$ 3080496 3587061 2873489 3115215 3363972 2736393 2772279 4397861 2637329 3090129
6931C090129K1387j09826j48721O08177k50600N455l11970J48662J46977J61635
$$ 3090129 3111516 3001690 2852969 3461146 3210546 3216001 2904031 3052693 3199670 3361305
6921C361305l69826O75689m00898k39869O21938n64334l01390P13243q3898L13365
$$ 3361305 2991479 3667168 3266270 3026401 3648339 3084005 2782615 3495858 3411960 3725325
6911C725325j06522K86319n90836N98570K35317J24765m41139Q37411o18585L7071
$$ 3725325 3618803 3905122 3314286 3912856 4148173 4272938 3831799 4669210 4050625 4087696
6901D087696j20826j62393J87462K52130o11763N70919M80309p65694j36666Q20660
$$ 4087696 3966870 3804477 3991939 4244069 3632306 4203225 4683534 3917840 3781174 4601834
6891D601834L78383m42364R25334K49044p3247n58439J775506o29346R83183m56571
$$ 4601834 4980217 4537853 5463187 5712231 5638984 5080545 6856051 6226705 7209888 6753317
6881F753317J229735J174760Q80968J848964J680801M261115K176421K332761
$$ 6753317 7983052 9157812 10038780 11887744 13568545 17829660 20006081 22338842
6873B2338842K5104q34233k026978k499906j486494j324955j808671j206729q47588
$$ 22338842 22363946 21529713 19502735 17002829 15516335 14191380 12382709 11175980 10328392
6864A0328392j107421n41286O1945N01091j355610O56606J828136k030202J227865
$$ 10328392 9220971 8679685 8741630 9242721 7887111 8543717 10371853 8341651 9569516
6855I569516j70671J050225P68436R54658N19105J911080L738405L352736M995335
$$ 9569516 9398845 10449070 11217506 12172164 12691269 14602349 18340754 21693490 26688825
6846B6688825M761369L582001J771187j012426j583496j166226j257814j233854
$$ 26688825 31450194 35032195 36803382 35790956 34207460 33041234 31783420 30549566
6838C0549566j193245k950839k722233l793162k402512k002207k412442j613663
$$ 30549566 29356321 26405482 23683249 19890087 17487575 15485368 13072926 11459263
6830A1459263m14020j644894R31160j449652L32026q4132P87778q80760J007092
$$ 11459263 11045243 9400349 10331509 8881857 9213883 9129751 9917529 9036769 10043861
6821A0043861k12138O99222O01692J024672N75391L097195K522879K747923L454220
$$ 10043861 9831723 10530945 11132637 12157309 12732700 15829895 18352774 21100697 24554917
6812B4554917K402512q25020r6124l290060k718758k433415k450253l007348m73025
$$ 24554917 26957429 26132409 26036285 22746225 20027467 17594052 15143799 12136451 11663426
6803A1663426j699028o69224p73439j858484K49599k52016L07404m64638n80083
$$ 11663426 9964398 9295174 8521735 6663251 6912850 6660834 6968238 6503600 5923517
6794E923517M72321m65605p11073k7914N40406O33269O18362L53728M62394M5897
$$ 5923517 6395838 5930233 5219160 5191246 5731652 6364921 6983283 7337011 7799405 7845302
6784G845302J32855j488931J93430j70233k9006J20368q59629M36196o23189M30363
$$ 7845302 7978157 6489226 6682656 6512423 6483417 6603785 5744156 6180352 5557163 5987526
6774E987526J15148r8989J38291l73053K20852K94114m44335J225425p28361M93576
$$ 5987526 6102674 6003685 6141976 5768923 5989775 6283889 5839554 7064979 6336618 6830194
6764F830194K36789O33456J248348R78156J152176J862079O17089L4002L48574
$$ 6830194 7066983 7700439 8948787 9926943 11079119 12941198 13558287 13592289 13940863
6755A3940863J15683j13742k322292r5223l77599m11207l58438k17343O48692
$$ 13940863 14056546 13942804 11620512 11525289 11147690 10736483 10378045 10160702 10809394
6746A0809394J0603J48576N87651R29841M29182Q43342K57568K22494J368631
$$ 10809394 10819997 10968573 11556224 12486065 12915247 13758589 14016157 14238651 15607282
6737A5607282k426469Q05590K50569j453441J55179j921613j181547N89792j616522
$$ 15607282 13180813 13986403 14236972 12783531 12938710 11017097 9835550 10425342 8808820
6728H808820j82409J378785q06754Q5121J251841J007360J024933O07083J065643
$$ 8808820 8626411 10005196 9198442 9283563 10535404 11542764 12567697 13174780 14240423
6719A4240423M67343m86976p0954j601806j022343j242241j675099L5591n50588
$$ 14240423 14707766 14220790 14149836 12548030 11525687 10283446 8608347 8643938 8093350
6710H093350q38383J88121o03732L99599k029828J187306j08587o35432K76260
$$ 8093350 7254967 7443088 6839356 7238955 5209127 6396433 6287846 5652414 5928674
6701E928674j17707R0862n89758L54182m29477R04423o25349N00185q97369R31009
$$ 5928674 5810967 5901829 5312071 5666253 5236776 6141199 5515850 6016035 5118666 6049675
6691F049675q98736M37064K559k62702k31156M54918L55762r80833O47060M36821
$$ 6049675 5150939 5588003 5590562 5327860 5096704 5551622 5907384 4926551 5573611 6010432
6681F010432n71413L7828L05263j049925R13782Q1589p78325J174836n85458J97701
$$ 6010432 5439019 5476847 5782110 4732185 5645967 5727556 4949231 6124067 5538609 5736310
6671E736310K19125o7609k71493l32725K04303J62808K60671j85930J12878J65813
$$ 5736310 5955435 5887826 5616333 5283608 5487911 5650719 5911390 5725460 5838338 6004151
6661F004151O8192n32348N47269j24010J72046j025657J286818j90525K86875
$$ 6004151 6072343 5539995 6087264 5963254 6135300 5109643 6396461 6205936 6492811
6652F492811r5076P90472m70843l4086k61236p2163Q67960o46532K84178K91398
$$ 6492811 6397735 7188207 6717364 6683278 6422042 6349879 7217839 6571307 6855485 7146883
6642G146883o98284M61395K97875j03019Q04217q56374N17921K53840J93616j39125
$$ 7146883 6448599 6909994 7207869 7104850 7909067 7052693 7570614 7824454 8018070 7878945
6632G878945o73138J353997n68923M5411n62725J040899L4249p12684L42379k85445
$$ 7878945 7205807 8559804 7990881 8036292 7473567 8514466 8548715 7836031 8178410 7892965
6622G892965N11058L79848P3528o39747L49521K62822l33858J04702J214813n58546
$$ 7892965 8404023 8783871 8857399 8217652 8567173 8829995 8496137 8600839 9815652 9257106
6612I257106K73006q7921l09194N92297J22767J13105R95595j060771J189589
$$ 9257106 9530112 9442191 9132997 9725294 9848061 9961166 10956761 9895990 11085579
6603A1085579P61807m18352j171981R27569k06539N00004L7555l90555P9389P73217
$$ 11085579 11847386 11429034 10257053 11184622 10978083 11478087 11515642 11125087 11204476 11977693
6593A1977693K5537l55270l05207n98146J847709n0026k04814m63170K91034P41101
$$ 11977693 12003230 11647960 11342753 10744607 12592316 12542290 12337476 11874306 12165340 12906441
6583A2906441r57033k2537k54710J421636k63262N72960K49289O72417L68960
$$ 12906441 11949408 11926871 11672161 13093797 12830535 13403495 13652784 14325201 14694161
6574A4694161N4581j11751L43696r42158R4612K48445j25502Q7599L53570k9091
$$ 14694161 14748742 14636991 14980687 14038529 14133141 14381586 14256084 14343683 14697253 14668162
6564A4668162N47903R3893k63338K61818L36304R84464k43870J57411l49160M32760
$$ 14668162 15216065 15309958 15046620 15308438 15644742 16629206 16385336 16542747 16193587 16626347
6554A6626347l41092Q98781k07196O43060M40080M52550K69050N25707p5174k10960
$$ 16626347 16285255 17184036 16976840 17619900 18059980 18512530 18781580 19307287 19232113 19021153
6544A9021153O54395P38836j98909o01029J465541K97748n7304N74538M38293
$$ 19021153 19675548 20414384 20215475 19614446 21079987 21377735 21320431 21894969 22333262
6535B2333262N66423P9809J115879L61797n22737J219938Q98885Q12649J001659
$$ 22333262 22899685 22979494 24095373 24457170 23934433 25154371 26053256 26865905 27867564
6526B7867564J37734Q02082P54453Q15370J642533L70084J818912J443610J018020
$$ 27867564 28005298 28807380 29561833 30377203 32019736 32389820 34208732 35652342 36670362
6517C6670362J246649J266737K440220L98967J639382K030896K390404K251135
$$ 36670362 37917011 39183748 41623968 42022935 43662317 45693213 48083617 50334752
6509E0334752K059467K559125J245978K144435K904317K140126K491582K277272
$$ 50334752 52394219 54953344 56199322 58343757 61248074 63388200 65879782 68157054
6501F8157054J875701J742808J672325K516463K404301Q03149J546484P96953
$$ 68157054 70032755 71775563 73447888 75964351 78368652 79171801 80718285 81515238
6493H1515238J423342L05401N81801R86844n5053l18168j5547k61947q19394n93595
$$ 81515238 82938580 83243981 83825782 84812626 84757573 84439405 84423858 84161911 83342517 82748922
6483H2748922p82795r00311k075999j499947j998262j157103r21566j738439j677579
$$ 82748922 81966127 81065816 78989817 77489870 75491608 74334505 73412939 71674500 69996921
6474F9996921k763809j228203j488759k154640j321747k333133j100439j947186
$$ 69996921 67233112 66004909 64516150 62361510 61039763 58706630 57606191 55659005
6466E5659005r17298k407523p19481j587354k406668j244727j875995p10603k107000
$$ 55659005 54741707 52334184 51614703 50027349 47620681 46375954 44499959 43789356 41682356
6457D1682356j561691j048175j569727q79731j221668j603993L9084j72077k553790
$$ 41682356 40120665 39072490 37502763 36623032 35401364 33797371 33836455 33664378 31110588
6448C1110588N30162j31895n47076q58582q36315O82409j267552J40475o42108
$$ 31110588 31640750 31508855 30961779 30103197 29266882 29949291 28681739 28822214 28180106
6439B8180106L86713n71860o71198j64321n27045J273927j586056J058514j646307
$$ 28180106 28566819 27994959 27323761 27159440 26632395 27906322 26320266 27378780 25732473
6430B5732473J132995q35061n98162M96889J76670j42994m5518M34493j122181
$$ 25732473 26865468 26030407 25432245 25929134 26105804 25962810 25917292 26351785 25229604
6421B5229604L36400j24403l61626O39254O21428m14473K80087J05874N7101J14329
$$ 25229604 25566004 25441601 25079975 25719229 26340657 25926184 26206271 26312145 26369246 26483575
6411B6483575k41494j153333R64685k02707J015101p98086M49999N6913L94880
$$ 26483575 26242081 25088748 26053433 25850726 26865827 26067741 26517740 26574653 26969533
6402B6969533Q3667k95551O20721K13515l68857O65492k57087K84748J141158
$$ 26969533 27053200 26757649 27378370 27591885 27223028 27888520 27631433 27916181 29057339
6393B9057339m25202J218188L4966J11864p57261J335637j74856O04970p1569
$$ 29057339 28632137 29850325 29885291 29997155 29239894 30575531 30400675 31005645 30934076
6384C0934076J613518M3771M83108Q21995q038j338178K456337q6488k78829J083467
$$ 30934076 32547594 32591365 33074473 33896468 33888430 32550252 35006589 34920101 34641272 35724739
6374C5724739O81937N79312M38726J87742J159866P96398O60712K66673P73601
$$ 35724739 36406676 36985988 37424714 37612456 38772322 39568720 40229432 40496105 41269706
6365D1269706K57837m70452J230469O68520Q76022o10386K9209J161625l50602
$$ 41269706 41527543 41057091 42287560 42956080 43832102 43221716 43250925 44412550 44061948
6356D4061948k03345J43834J46051k67582J24317N52200K6612J16651j41250P08114
$$ 44061948 43858603 44002437 44148488 43880906 44005223 44557423 44584035 44700686 44559436 45267550
6346D5267550n61071o72263M60715O15842p89030k7849j52158k58364L90674j33319
$$ 45267550 44706479 44034216 44494931 45110773 44321743 44293894 44141736 43883372 44274046 44140727
6336D4140727j01259J37956k9469p72613j2316j99430q64373L37160j580366q04448
$$ 44140727 44039468 44177424 44147955 43375342 43363026 43163596 42299223 42636383 41056017 40251569
6326D0251569k23966r47877k44978r08129n89502r16756p40002k61082l38916
$$ 40251569 40027603 39079726 38834748 37926619 37337117 36420361 35680359 35419277 35080361
6317C5080361p16116j217754l76776j191812n71858j378177m00623j09713l99063
$$ 35080361 34364245 33146491 32769715 31577903 31006045 29627868 29227245 29117532 28718469
6308B8718469n19627J76021n18833K61310m36052J694399j123808Q60207J53113
$$ 28718469 28198842 28374863 27856030 28117340 27681288 29375687 28251879 29112086 29265199
6299B9265199R68505P62597P82036J103832K810454K618522M280638M196150K962582
$$ 29265199 30233704 30996301 31778337 32882169 35692623 38311145 42591783 46787933 49750515
6290D9750515J596149J73408j364952k931103l552313l061595l370345k580709
$$ 49750515 51346664 51520072 50155120 47224017 43671704 40610109 37239764 34659055
6282C4659055n91239k384668p47709o96536m91523l66946K76577j40996K40267
$$ 34659055 34067816 31683148 30935439 30238903 29747380 29380434 29657011 29516015 29756282
6273B9756282J79800J36646L63635N45865J230067O12285L762330K334100L385547
$$ 29756282 29936082 30072728 30436363 30982228 32212295 32824580 36586910 38921010 42306557
6264D2306557L214576K779672J085258L670740K172985K680957J094325p90187
$$ 42306557 45521133 48300805 49386063 53056803 55229788 57910745 59005070 58214883
6256E8214883l085840m040530m169585m900709l383588l320474j578586j939488
$$ 58214883 55129043 51088513 46918928 42018219 38634631 35314157 33735571 31796083
6248C1796083j414447n56878j722266M66143L4556j032890J71640l4204L1897
$$ 31796083 30381636 29824758 28102492 28568635 28603191 27570301 27741941 27707737 27739634
6239B7739634K82673K48736N88251n02548J832621N09744K189274J320118K739301
$$ 27739634 28022307 28271043 28859294 28356746 30189367 30699111 32888385 34208503 36947804
6230C6947804K737343L028632J653457j559246j707156k322749j215833k974706
$$ 36947804 39685147 42713779 44367236 42807990 41100834 38778085 37562252 34587546
6222C4587546n22234j409407q45583l80680j861101M88865l12680j55316j09833
$$ 34587546 34065312 32655905 31810322 31429642 29568541 30057406 29744726 29589410 29479577
6213B9479577m10573n28306M36534j41098n9264m92621k62235K48877J23310J67258
$$ 29479577 29069004 28540698 28977232 28836134 28776870 28284249 28022014 28270891 28394201 28561459
6203B8561459J049r7248N18195P51855R66139M06300Q12866J716440J094755J154685
$$ 28561459 28562508 28465260 28983455 29735310 30701449 31107749 31920615 33637055 34731810 35886495
6193C5886495K24207P94723j235597r19597j790978q46641k10883j193325M36820
$$ 35886495 36110702 36905425 35669828 34750231 32959253 32112612 31901729 30708404 31145224
6184C1145224r05686J87284l43798j1135N03097J082697J92539R36740M31096
$$ 31145224 30239538 30426822 30083024 30071889 30574986 31657683 31850222 32786962 33218058
6175C3218058R43732J055438o84012N51167l03873n1957k157866K55588j515019
$$ 33218058 34161790 35217228 34533216 35084383 34780510 34728553 32570687 32826275 31311256
6166C1311256P53346q30849q51142l11241n70582j2516Q78144O8362Q20085P73446
$$ 31311256 32064602 31233753 30382611 30071370 29500788 29488272 30366416 30434778 31254863 32028309
6156C2028309n04774p3621L66210l10255j250074j263518j009887j078239j124779
$$ 32028309 31523535 31449914 31816124 31505869 30255795 28992277 27982390 26904151 25779372
6147B5779372m99652j081111n12585n71021L73341r14427n18230k03118R56476
$$ 25779372 25279720 24198609 23686024 23115003 23488344 22573917 22055687 21852569 22809045
6138B2809045n31819j76663l68713r9990J28090J9865R72253o32594Q30399M61944
$$ 22809045 22277226 22100563 21731850 21631860 21759950 21779815 22752068 22119474 22949873 23411817
6128B3411817n27070l58642Q94051j011395j059008j8276m74635j20246J00854
$$ 23411817 22884747 22526105 23420156 22408761 21349753 21331477 20856842 20736596 20837450
6119B0837450m07014m51081P26095J70761j97482j195651J953156o14536m86734
$$ 20837450 20430436 19979355 20705450 20876211 20678729 19483078 21436234 20821698 20334964
6110B0334964L42156N64679k09415l53979J082803p5961J66707j24768J66687
$$ 20334964 20677120 21241799 21032384 20678405 21761208 21685247 21851954 21727186 21893873
6101B1893873O35600J95613m29909M03071n46638O38702L20950P50013k35797
$$ 21893873 22529473 22725086 22295177 22698248 22151610 22790312 23111262 23861275 23625478
6092B3625478Q95285L72065K15593J167303k77470N04685L73188Q73932J432958
$$ 23625478 24520763 24892828 25108421 26275724 25998254 26502939 26876127 27750059 29183017
6083B9183017J402031J112803M61033O64118K188737J394656K180731J913782
$$ 29183017 30585048 31697851 32158884 32823002 35011739 36406395 38587126 40500908
6075D0500908K744913K735297L360680M002255K969559O182054M774873P992826
$$ 40500908 43245821 45981118 49341798 53344053 56313612 62495666 67270539 75263365
6067G5263365P832631J0151139J4121785J8152246K5700993L4171485M2996645
$$ 75263365 83095996 93247135 107368920 125521166 151222159 185393644 228390289
6060B28390289M5589230L2326270P694145j3550457k9417608l6309418l6568225
$$ 228390289 273979519 306305789 313999934 300449477 271031869 234722451 198154226
6053A98154226l1735906k5742590k1439204j7880837j2925794r999423r109615
$$ 198154226 166418320 140675730 119236526 101355689 88429895 78430472 69320857
6046F9320857o252832m658255m281910l017614k681231k139304j793822j845372
$$ 69320857 63068025 58409770 54127860 51110246 48429015 46289711 44495889 42650517
6038D2650517o484k295941j103513j199645K87033q88641n43714o59703M53451
$$ 42650517 42644033 40348092 39244579 38044934 38331967 37443326 36899612 36239909 36693360
6029C6693360j307340L40174p84879L55858P4352n12434J25477L94503L25803
$$ 36693360 35386020 35726194 34941315 35297173 35371525 34859091 34984568 35379071 35704874
6020C5704874l79581L98345P19091N10869M1597J153081L47593k09138L34221
$$ 35704874 35325293 35723638 36442729 36953598 36995195 38148276 38495869 38286731 38620952
6011C8620952P60853k36645J102759M42637l5727R64039L54548J765614K92724
$$ 38620952 39381805 39145160 40247919 40690556 40654829 41618868 41973416 43739030 44031754
6002D4031754J175203L33255O82301J609932J241340M20079J310688O79401L95552
$$ 44031754 45206957 45540212 46222513 47832445 49073785 49493864 50804552 51483953 51879505
5993E1879505K156388J180230J116640K464265J346155K359449J839343K466372
$$ 51879505 54035893 55216123 56332763 58797028 60143183 62502632 64341975 66808347
5985F6808347K085182J399232K528627K764512J596994K658180J741556Q35008
$$ 66808347 68893529 70292761 72821388 75585900 77182894 79841074 81582630 82417638
5977H2417638J406462J874121N20504J431766J773416J338314J815097K563217
$$ 82417638 83824100 85698221 86218725 87650491 89423907 90762221 92577318 95140535
5969I5140535J187178J675280N44970J032305J53782J224365k56940N06122R16332
$$ 95140535 96327713 98002993 98547963 99580268 99734050 100958415 100701475 101207597 102123929
5960A02123929J29052J493874J83737K329260J179998K962740L728784K815665
$$ 102123929 102252981 103746855 103930592 106259852 107439850 110402590 114131374 116947039
5952A16947039L986807K777391R27548O44550P57636j174776M43071j82952K094
$$ 116947039 120933846 123711237 124638785 125283335 126040971 124866195 125309266 125126314 125128408
5943A25128408J055303J057578K619144J450944K409570Q26546K64933j05819
$$ 125128408 126183711 127241289 129860433 131311377 133720947 134547493 134812426 134706607
5935A34706607k315467j414868l128133l111522l895261l399029l128900k811950
$$ 134706607 132391140 130976272 127848139 124736617 120841356 117442327 114313427 111501477
5927A11501477k749867j645111j717953j417705l23281Q87477j07624N91028R21093
$$ 111501477 108751610 107106499 105388546 103970841 103647560 104535037 104427413 105018441 105939534
5918A05939534J88337N66343J183015J405335J060638J728043M283409N259961
$$ 105939534 106127871 106694214 107877229 109282564 110343202 112071245 116354654 121614615
5910A21614615R890928J1767895J0016050R01414m639150p988300r134799r055173
$$ 121614615 131505543 143273438 153289488 154190902 149551752 141563452 132428653 123373480
5902A23373480p026765o120677o585254m739222l439566l870880j558625j345391
$$ 123373480 116346715 110226038 103640784 98901562 95461996 91591116 90032491 88687100
5894H8687100k65984l2171r35197j81705n89252J166953P40648J321952K101100
$$ 88687100 88421116 88388945 87453748 87272043 86682791 87849744 88590392 89912344 92013444
5885I2013444L352330K623534L692380K612490L677717L672926L472604L276081
$$ 92013444 95365774 97989308 101681688 104294178 107971895 111644821 115117425 118393506
5877A18393506J196110o8989j535057j746203k354891k339165j654582j433502
$$ 118393506 119589616 119520627 117985570 116239367 113884476 111545311 109890729 108457227
5869A08457227p21694j191957L83784R12094J017434J463757L299194K294133
$$ 108457227 107735533 106543576 106927360 107839454 108856888 110320645 113619839 115913972
5861A15913972K342051K614859J521969L42983q23919k383553j553434k726502
$$ 115913972 118256023 120870882 122392851 122735834 121911915 119528362 117974928 115248426
5853A15248426l464088k349544j763914k951633k870330j593573r41614m00284
$$ 115248426 111784338 109434794 107670880 104719247 101848917 100255344 99313730 98913446
5845I8913446J89549R62090j132505M92128J83646j004589Q07332r39737L18939
$$ 98913446 99102995 100065085 98932580 99424708 99608354 98603765 99411097 98471360 98790299
5836I8790299j46466o59840J311588R9884n96881L80558J47783O95269K63675
$$ 98790299 98643833 97983993 99295581 99395465 98798584 99179142 99326925 100022194 100285869
5827A00285869j83404N08164m64977R96376l48085R2226J006637L38664M42625
$$ 100285869 100102465 100610629 100145652 101142028 100793943 100886169 101892806 102231470 102674095
5818A02674095Q21017J536974O98964P9337J020770O63390q74727K34192N14308
$$ 102674095 103495112 105032086 105731050 105810387 106831157 107494547 106619820 106854012 107368320
5809A07368320k749244K71447j139466n12238j513778j249884j703594j635364
$$ 107368320 104619076 104890523 103751057 103238819 101725041 100475157 98771563 97136199
5801I7136199j417699j536172j857606K9090j269042j261475j112087p04545o7946
$$ 97136199 95718500 94182328 92324722 92353812 91084770 89823295 88711208 88006663 87938717
5792H7938717j083029o92045j84769m44074q59507o78370j083978l60342l45553
$$ 87938717 86855688 86163643 85978874 85534800 84675293 83996923 82912945 82552603 82207050
5783H2207050j150979q35104j734333j522053p84214j691206k614481o71741j924749
$$ 82207050 81056071 80220967 78486634 76964581 76180367 74489161 71874680 71202939 69278190
5774F9278190j196733p92975j238535r12339J05680O73375K10175Q21161j422780
$$ 69278190 68081457 67288482 66049947 65137608 65243288 65916663 66126838 66947999 65525219
5765F5525219q92203m81140j794440q54213j164950q99293J012667K515085M322612
$$ 65525219 64633016 64151876 62357436 61503223 60338273 59438980 60451647 62966732 67289344
5756F7289344M848983J526758j438098j962628l199646k319216N52913o85893
$$ 67289344 72138327 73665085 72226987 70264359 67064713 64745497 65298410 64612517
5748F4612517J215832J793500L610903O478952J1349376K6931604M0849751L5383843
$$ 64612517 65828349 67621849 71232752 77711704 89061080 115992684 156842435 192226278
5740A92226278P554518j3294148k2742558k7717207k6757345j7778909j4507964
$$ 192226278 199780796 186486648 163744090 136026883 109269538 91490629 76982665
5733G6982665j0600903p147661n501333m760468l072503k249212j448318j716982
$$ 76982665 66381762 59234101 53732768 48972300 45899797 43650585 42202267 40485285
5725D0485285j453832j214842l7776r1948j239057o24438p1358q43220M99616
$$ 40485285 39031453 37816611 37778835 37686887 36447830 35823392 35752034 34908814 35408430
5716C5408430j012947j283213N57202p29469l85064p45800k13860o43248m96575
$$ 35408430 34395483 33112270 33669472 32940003 32554939 31809139 31595279 30952031 30455456
5707C0455456O1624n17828j66438j074812J91935M40412n11701p89415M8406j99617
$$ 30455456 30517080 29999252 29832814 28758002 28949937 29390349 28878648 28089233 28137639 27938022
5697B7938022j006532o66242K35881K81880n88406Q20143m26361q74694l31734
$$ 27938022 26931490 26265248 26501129 26783009 26194603 27014746 26588385 25713691 25381957
5688B5381957N60783q12932k04336j021613K88145L68334P5058p98485L00458
$$ 25381957 25942740 25129808 24925472 23903859 24192004 24560338 24635396 23836911 24137369
5679B4137369m14320K6592o66922R32964j215237K39579J46598l49652k95304
$$ 24137369 23723049 23749641 23082719 24015683 22800446 23040025 23186623 22836971 22541667
5670B2541667p41111R24292r98198k04730j12992M96588q20155J62023J02253
$$ 22541667 21800556 22724848 21726650 21521920 21408928 21905516 21085361 21247384 21349637
5661B1349637k16713O01591j259559m0385P27987k78810p16153j28422p9899R17574
$$ 21349637 21132924 21734515 20474956 20434571 21162558 20883748 20167595 20039173 19959274 20876848
5651B0876848p7061l48700N78385N31698l57264k88026L1728l55594j56442o54250
$$ 20876848 20799787 20451087 21029472 21561170 21203906 20915880 20947608 20592014 20435572 19781322
5641A9781322m758L93247n44610R81712k09970k96404M85124n37639Q72926Q52788
$$ 19781322 19776564 20169811 19625201 20606913 20396943 20100539 20585663 20048024 20920950 21773738
5631B1773738l06377K7969J634589J139214M119265P448253O022689J03183j485424
$$ 21773738 21467361 21495330 23129919 24269133 28388398 35836651 41859340 41962523 40477099
5622D0477099m722793l703146m178876j545868k482556n45508j501104p63000
$$ 40477099 35754306 32051160 27872284 26326416 23843860 23298352 21797248 21034248
5614B1034248L95175o50171k06408l01801J70811j90053Q23090n14190m83345
$$ 21034248 21429423 20779252 20572844 20271043 20441854 20251801 21074891 20560701 20077356
5605B0077356M38231J103650L84915j403260J164777J07266q6603J206535r0792
$$ 20077356 20515587 21619237 22004152 20600892 21765669 21872935 21786332 22992867 22902075
5596B2902075j97986O20158k28261R86841N52467L81736J09525J701875J57277
$$ 22902075 22704089 23324247 23095986 24082827 24635294 25017030 25126555 26828430 26985707
5587B6985707P12793J000134n20375J520294K95884Q40499r13023J064155q71086
$$ 26985707 27698500 28698634 28178259 29698553 29994437 30834936 29921913 30986068 30114982
5578C0114982o8889Q55341R4207n72763P98299o96503R77924M2731L46752K96615
$$ 30114982 30046093 30901434 30995641 30422878 31221177 30524674 31502598 31545329 31892081 32188696
5568C2188696K97759N2082J343835Q3990J359699R35849J453261K80023J480828
$$ 32188696 32486455 32538537 33882372 33966362 35326061 36261910 37715171 37995194 39476022
5559C9476022J262641J158720K105048P31275J339501K72131J307519L3691M85990
$$ 39476022 40738663 41897383 44002431 44733706 46073207 46345338 47652857 47686548 48172538
5550D8172538M19762j119810N90499L39718L32335j282645P92207l35531j16229
$$ 48172538 48592300 47472490 48062989 48402707 48735042 47452397 48244604 47909073 47792844
5541D7792844l40567J020432k82052L36522J316906j63648R71271K92202J577096
$$ 47792844 47452277 48472709 48190657 48527179 49844085 49680437 50651708 50943910 52521006
5532E2521006N21606J121376J269327M37519J783696J085417N67369J082144Q49255
$$ 52521006 53042612 54163988 55433315 55870834 57654530 58739947 59307316 60389460 61238715
5523F1238715P44365K552350O40293K629565P01499J100052M87794l29901J47520
$$ 61238715 61983080 64535430 65175723 67805288 68506787 69606839 70094633 69764732 69912252
5514F9912252J022977j57609o81530p14178j222914n44259j289117j900140J07767
$$ 69912252 70935229 70777620 70096090 69381912 68158998 67614739 66325622 64425482 64533249
5505F4533249k122628L01016q16286K24226m45989J0165r2646O29847l2931N39147
$$ 64533249 62410621 62711637 61895351 62119577 61673588 61683753 61591107 62220954 62188023 62727170
5495F2727170N5621J116648Q47934J422774K394393K009897K122637J926899K560582
$$ 62727170 62782791 63899439 64747373 66170147 68564540 70574437 72697074 74623973 77184555
5486G7184555J946988J740361J240637j84348n48194j92400k670039j905679k382891
$$ 77184555 79131543 80871904 82112541 81928193 81379999 81187599 78517560 76611881 74228990
5477G4228990k272984k804250k577049j543759j374484j103262p41164j807424
$$ 74228990 71956006 69151756 66574707 65030948 63656464 62553202 61812038 60004614
5469F0004614P0121j183080l15061O06752n22597R98971Q78023j72707P67978
$$ 60004614 60074735 58891655 58576594 59183346 58660749 59659720 60537743 60365036 61133014
5460F1133014L29925J332304J087415O55126O36891O91433N7291L21189j615181
$$ 61133014 61462939 62795243 63882658 64537784 65174675 65866108 65923399 66244588 64629407
5451F4629407j264516j825069k007468j138469k624837j804710o51682p99850
$$ 64629407 63364891 61539822 59532354 58393885 55769048 53964338 53312656 52512806
5443E2512806k169712o77465p93307k13492q54842p25532o24901o23676q00345
$$ 52512806 50343094 49665629 48872322 48658830 47803988 47078456 46453555 45829879 45029534
5434D5029534O42149q77505j023315m83329m26152n50561n5624j110595r1008
$$ 45029534 45671683 44794178 43770863 43287534 42861382 42310821 42255197 41144602 41053594
5425D1053594j000624L91299p65273n53605l78216P46245j134576l00776K60633
$$ 41053594 40052970 40444269 39678996 39125391 38747175 39493420 38358844 38058068 38318701
5416C8318701N65634o18708k3817p41986j93418J200277q80428l85612P16612
$$ 38318701 38884335 38265627 38241810 37499824 37306406 38506683 37626255 37240643 37957255
5407C7957255k8209k66802o62539j57711O40970j310310O70817j38267N312K76585
$$ 37957255 37929046 37662244 36999705 36841994 37482964 36172654 36843471 36705204 36710516 36987101
5397C6987101J107558J38399M13944P34789R53589l04607J023997P37558J162820
$$ 36987101 38094659 38233058 38647002 39381791 40335380 40030773 41054770 41792328 42955148
5388D2955148Q4527O72110J175892m18934M89231M5436n63704J04183m13518N36908
$$ 42955148 43039675 43711785 44887677 44468743 44957974 45003410 44439706 44543889 44130371 44667279
5378D4667279n46760P08891M45634J80780N62930O53679J049436J649581J564131
$$ 44667279 44120519 44829410 45275044 45455824 46018754 46672433 47721869 49371450 50935581
5369E0935581J713513J129235J949172Q11774J999365J31753J105584L47862L39245
$$ 50935581 52649094 53778329 55727501 56539275 58538640 58670393 59775977 60123839 60463084
5360F0463084j138344k16540k53124k131371k121795q454j117120j513070j148992
$$ 60463084 59324740 59108200 58855076 56723705 54601910 54593456 53476336 51963266 50814274
5351E0814274o16967l6091J35776k78344K09355j31627n6798j39472j97437M446
$$ 50814274 50197307 50161216 50296992 50018648 50228003 50096376 50039578 49900106 49702669 49707115
5341D9707115P7858o12034j87041r65797o66979j521298j913070o71958k099775
$$ 49707115 49784973 49172939 48985898 48020101 47353122 45831824 43918754 43246796 41147021
5332D1147021m77345j170354j567398l28666j388196n97102j964710m66145n14086
$$ 41147021 40669676 39499322 37931924 37603258 36215062 35617960 33653250 33187105 32673019
5323C2673019J45005q87787j318350n29979O25636j198186Q45563j494942j137746
$$ 32673019 32818024 31930237 30611887 30081908 30707544 29509358 30354921 28859979 27722233
5314B7722233K87515m08132q69092k79337m33738J50171o00374j630832k15813
$$ 27722233 28009748 27601616 26732524 26453187 26019449 26169620 25569246 23938414 23722601
5305B3722601n36308J312o56875K36388j008879M6331k81337j97184o89680j99308
$$ 23722601 23186293 23187605 22530730 22767118 21758239 21804570 21523233 21326049 20636369 20437061
5295B0437061L95990p82897p00028L09648N34206n12347K89950q89017k63841
$$ 20437061 20833051 20050154 19350126 19659774 20193980 19681633 19971583 19082566 18818725
5286A8818725K58676k60688n6124J12896m97166m99394K57640K32718J06723m24140
$$ 18818725 19077401 18816713 18760589 18873485 18376319 17876925 18134565 18367283 18474006 18049866
5276A8049866k19388J09472L75467p31799l36217L51806M69222n2929m01103N90689
$$ 18049866 17830478 17939950 18315417 17583618 17247401 17599207 18068429 18015500 17614397 18205086
5266A8205086q31943J125674j565323O67121k71349N0178l75660n51807J43120
$$ 18205086 17373143 18498817 16933494 17600615 17329266 17379444 17003784 16451977 16595097
5257A6595097n46745k30608j37646M39733o72755L45251n03998P81565o11733
$$ 16595097 16048352 15817744 15680098 16119831 15447076 15792327 15288329 16069894 15458161
5248A5458161r45741L01958L94712n66818n66563j7688N41613o72601L28992j92821
$$ 15458161 14512420 14814378 15209090 14642272 14075709 14058021 14599634 13927033 14256025 14063204
5238A4063204k19550Q60519j157817j84940k69850M42773M57276r43520M76987
$$ 14063204 13843654 14704173 13546356 13361416 13091566 13534339 13991615 13048095 13525082
5229A3525082j96527r3882m54298P08409l95459n45644R55434O74684j478839
$$ 13525082 13328555 13234673 12780375 13488784 13093325 12547681 13503115 14177799 12698960
5220A2698960l41078J402704p40892O40417Q8496r90897R06010K1078N62029j116687
$$ 12698960 12357882 13760586 13019694 13660111 13748607 12757710 13663720 13684798 14246827 13130140
5210A3130140J033256l9543K83431L28443M21978l36798n94038O94750L61086
$$ 13130140 14163396 14123853 14407284 14735727 15157705 14820907 14226869 14921619 15282705
5201A5282705m1605j3432n21303J089629r1340M22395j08135m56879K87215J90358
$$ 15282705 15241100 15227668 14706365 15795994 15704654 16127049 16018914 15562035 15849250 16039608
5191A6039608J49654J69269J00394m6264M3382J48899n16152R54768L94106k59932
$$ 16039608 16189262 16358531 16458925 16412661 16456043 16604942 16088790 17043558 17437664 17177732
5181A7177732K11769J282692m70553j45343J89862j71388j33822O11911k7811
$$ 17177732 17389501 18672193 18201640 18056297 18246159 18074771 17940949 18552860 18525049
5172A8525049n689Q40531l71766O77518l4918O07982M10721k73962j5971K0301
$$ 18525049 18519360 19359891 18988125 19665643 19630725 20238707 20649428 20375466 20359495 20379796
5162B0379796Q23080M10178l17402J09942K95878k35580L80379k95623j38559
$$ 20379796 21202876 21613054 21295652 21405594 21701472 21465892 21846271 21550648 21412089
5153B1412089J033526P96672p89724m16443J359059o45607K128449j237623K45830
$$ 21412089 22445615 23242287 22452563 22036120 23395179 22749572 24878021 23640398 23886228
5144B3886228K92833O69279l08726M58564K52233L97567P74733P61583L11123
$$ 23886228 24179061 24848340 24539614 24998178 25250411 25647978 26422711 27184294 27495417
5135B7495417M73561L3182R08378j52955Q85698k7576J510263k02759N96206J2410
$$ 27495417 27968978 28002160 28910538 28757583 29643281 29615705 31125968 30923209 31519415 31531825
5125C1531825J295626n75921N58168O79434O01585P96049N75296q1179J109130
$$ 31531825 32827451 32251530 32809698 33489132 34090717 34886766 35462062 35380883 36490013
5116C6490013L57800j01066M81800N9313Q14011J179691Q23979J60424R91439
$$ 36490013 36847813 36746747 37228547 37287860 38101871 39281562 40105541 40265965 41257404
5107D1257404R21909O13996J113637O09147Q13356J394950Q23240K130425L55292
$$ 41257404 42179313 42793309 43906946 44516093 45329449 46724399 47547639 49678064 50033356
5098E0033356J896153N72404O33765Q3723J8729J352687J076483j26842m7611
$$ 50033356 51929509 52501913 53135678 53219401 53238130 54590817 55667300 55540458 55492847
5089E5492847J049455k23466j73236Q78591j79642l33590o11094R10757K30539
$$ 55492847 56542302 56318836 56145600 57024191 56844549 56510959 55899865 56810622 57041161
5080E7041161J74897K44650K09011K259099O52884J564977K63960J999730K965024
$$ 57041161 57216058 57460708 57669719 59928818 60581702 62146679 62410639 64410369 67375393
5071F7375393R16384K258351K440601R5121K102949O60P16078n47595k52256l19002
$$ 67375393 68291777 70550128 72990729 73085850 75188799 75189459 75905537 75357942 75105686 74786684
5061G4786684l95552K51015j003280k39302M46174j902326N32980J846748M611926
$$ 74786684 74391132 74642147 73638867 73399565 73845739 71943413 72476393 74323141 78935067
5052G8935067Q822158P975579j173337k320278n251460o186379l391728k079197
$$ 78935067 87757225 95732804 94559467 92239189 86987729 80801350 77409622 75330425
5044G5330425j178362R89060O1950J868421R22679Q64129J319268l42544n33595
$$ 75330425 74152063 75141123 75203073 77071494 77994173 78858302 80177570 79835026 79301431
5035G9301431j761771j245143k809023j656827j517139j163824j561615j941472
$$ 79301431 77539660 76294517 73485494 71828667 70311528 69147704 67586089 65644617
5027F5644617j225057j273473j457578j307922q11062l53980j383194m7064r29967
$$ 65644617 64419560 63146087 61688509 60380587 59569525 59215545 57832351 57785287 56855320
5018E6855320j17374l322r3539n13445J220046K36626J650019o5082J007340N74702
$$ 56855320 56737946 56734624 56641085 56127640 57347686 57584312 59234331 59169249 60176589 60751291
5008F0751291r01151n50161p70989j613410j782717k366564j206213n96272k028514
$$ 60751291 59850140 59299979 58528990 56915580 55132863 52766299 51560086 50963814 48935300
4999D8935300j566859k198658k36669p45180q57615j127981L45003r97102j218530
$$ 48935300 47368441 45169783 44933114 44187934 43330319 42202338 42547341 41550239 40331709
4990D0331709O9934p25508j43419j239898P0251l30821m25010m25504L73212J44005
$$ 40331709 40401643 39676135 39532716 38292818 38363069 38032248 37607238 37181734 37554946 37698951
4980C7698951m46401o0161j20708p47183o50138r40132q90037o09479j061185
$$ 37698951 37252550 37192389 37071681 36324498 35674360 34734228 33844191 33234712 32173527
4971C2173527k20997m30862j088385r59691j73753p88666K50693o8726q12912
$$ 32173527 31952530 31521668 30433283 29473592 29299839 28511173 28761866 28693140 27880228
4962B7880228k52218j152036P29735q17492J53371p9198o54280J26007p02429
$$ 27880228 27628010 26475974 27205709 26388217 26541588 26462390 25808110 25934117 25231688
4953B5231688n8191O75411m6260Q86794j80039K45383l10216j775989j93724l89640
$$ 25231688 25173497 25848908 25802648 26689442 26509403 26754786 26444570 24668581 24474857 24085217
4943B4085217j303006L82305k95916P2532o21834k43545j43264q41600R29553
$$ 24085217 22782211 23164516 22868600 22941132 22319298 22075753 21932489 21090889 22020442
4934B2020442p88062j36656L29176r6964k73795j82026m50648L85812L72703k51690
$$ 22020442 21232380 21095724 21424900 21327936 21054141 20872115 20421467 20807279 21179982 20928292
4924B0928292l49916K78885j15811k77782l40854O07192L49233p89665j70180
$$ 20928292 20578376 20857261 20741450 20463668 20122814 20730006 21079239 20289574 20119394
4915B0119394j19756j347K80883m48666L54851k14110L52732M31251l64006L62136
$$ 20119394 19999638 19998291 20279174 19830508 20185359 19971249 20323981 20755232 20391226 20753362
4905B0753362J87552N32776j027934L48773K59611j73480K51244K3377J99335
$$ 20753362 20940914 21473690 20445756 20794529 21054140 20880660 21131904 21155281 21354616
4896B1354616N43352m85790K39185l66784L74476R53214j13582N4930l93132M22204
$$ 21354616 21897968 21412178 21651363 21284579 21659055 22612269 22498687 22553617 22160485 22582689
4886B2582689L94044O62557j286147Q84855L41003L0875L66351N69029k76261
$$ 22582689 22976733 23639290 22353143 23237998 23579001 23609876 23976227 24545256 24268995
4877B4268995P02846j39000R6706Q80581P249P83939r404l32931j33909Q60546
$$ 24268995 24971841 24832841 24929547 25810128 25817377 26601316 26591912 26258981 26125072 26985618
4867B6985618M07891L28859j25898N47252K50103N57570N847J115586k08164J110111
$$ 26985618 27393509 27722368 27596470 28143722 28393825 28951395 28957242 30072828 29864664 30974775
4857C0974775p24414J897831j038868J475526K33967P57249Q42194P3771L81600
$$ 30974775 30250361 32148192 31109324 32584850 32818817 33576066 34418260 34492031 34873631
4848C4873631Q42697k58266J003008O46308J054665P09465M50473K40113J022759
$$ 34873631 35716328 35458062 36461070 37107378 38162043 38871508 39321981 39562094 40584853
4839D0584853R68869R46583R94622J020967J021068K080716R27J600233J406413
$$ 40584853 41553722 42500305 43494927 44515894 45536962 47617678 47618605 49218838 50625251
4830E0625251N55759J185586J337385J029725J025787J752051K5469J501991O22122
$$ 50625251 51181010 52366596 53703981 54733706 55759493 57511544 57537013 59039004 59661126
4821E9661126J266500J224612J905944P81315K900666K64316J275064J735683
$$ 59661126 60927626 62152238 64058182 64839497 67740163 68004479 69279543 71015226
4813G1015226j34554K585593J85430J621044R67742J371737L036570J699188K808456
$$ 71015226 70880672 73466265 73651695 75272739 76240481 77612218 80648788 82347976 85156432
4804H5156432K294883K062443Q30326K980650J320263J035496K464589K442507
$$ 85156432 87451315 89513758 90344084 93324734 94644997 95680493 98145082 100587589
4796A00587589K198136L680021K128026L714637K046341L076580K824169K164977
$$ 100587589 102785725 106465746 108593772 112308409 114354750 117431330 120255499 122420476
4788A22420476L162594L401776K249578K573351L575133L087251L511032K066564
$$ 122420476 125583070 128984846 131234424 133807775 137382908 140470159 143981191 146047755
4780A46047755M891832L615231M287680M213361M422264N806056M224313M630193
$$ 146047755 150939587 154554818 158842498 163055859 167478123 173284179 177508492 182138685
4772A82138685L614593L703366K254316J224156Q16553J060090Q73750J844449
$$ 182138685 185753278 189456644 191710960 192935116 193751669 194811759 195685509 197529958
4764A97529958j01710J288669L51187O19366K69532l40676j017531m33959j491981
$$ 197529958 197428248 198716917 199068104 199687470 199957002 199616326 198598795 198164836 196672855
4755A96672855j384601j960102k648339j193347k025871k325951j025643j603875
$$ 196672855 195288254 193328152 190679813 189486466 187460595 185134644 184109001 182505126
4747A82505126k622524k782097l911733n136833m032416m909621m538910m944230
$$ 182505126 179882602 177100505 173188772 168051939 164019523 159109902 154570992 149626762
4739A49626762m011788m266458l900328l825681l086653l451534k783045k796424
$$ 149626762 145614974 141348516 137448188 133622507 130535854 127084320 124301275 121504851
4731A21504851l928283l071177k472947j941076l610435k624479j843813k034448
$$ 121504851 117576568 114505391 112032444 110091368 106480933 103856454 102012641 99978193
4723I9978193l873745k689510k398714k663434k356442j864839k918064j394454
$$ 99978193 96104448 93414938 91016224 88352790 85996348 84131509 81213445 79818991
4715G9818991j737474k316110j781411j980551j323930j560229k550704j384473
$$ 79818991 78081517 75765407 73983996 72003445 70679515 69119286 66568582 65184109
4707F5184109r96522p51081k625892j120826q39846j733800j021651k100071n56073
$$ 65184109 64187587 63436506 60810614 59689788 58849942 57116142 56094491 53994420 53438347
4698E3438347p63673k161770j050924n36276m80259j149657j205475j650716n91427
$$ 53438347 52674674 50512904 49461980 48925704 48445445 47295788 46090313 44439597 43848170
4689D3848170m24365q66777r20918j033475o79082o67725m85740j266676j098439
$$ 43848170 43423805 42557028 41636110 40602635 39923553 39255828 38770088 37503412 36404973
4680C6404973q97676o09913j258770m84559P378o32614j042567q35141o16364
$$ 36404973 35507297 34897384 33638614 33154055 33161433 32528819 31486252 30651111 30034747
4671C0034747o44625n11529k34386q81638K9949q83863p94727k47094n05733o77044
$$ 30034747 29390122 28878593 28644207 27762569 27792518 26908655 26113928 25866834 25361101 24684057
4661B4684057l09370o89663p66761J81579q4745k248473R89514q2680j428633
$$ 24684057 24374687 23685024 22918263 23099842 23015097 20766624 21756138 21673458 20244825
4652B0244825K16198k13461q18657K97605j33940j263917r742k57893P90741j741499
$$ 20244825 20461023 20247562 19428905 19726510 19592570 18328653 18318911 18061018 18851759 17110260
4642A7110260Q95071o30048J70342j121780j98402r49442N44213L15228j054587
$$ 17110260 18005331 17375283 17545625 16423845 16225443 15276001 15820214 16135442 15080855
4633A5080855K97549m56980m19789N49309q05530O92392j206088m90866K43818
$$ 15080855 15378404 14921424 14501635 15050944 14245414 14937806 13731718 13240852 13484670
4624A3484670n62507R2802M36430K62825p87171p01232o74231P06071J50084q74272
$$ 13484670 12922163 13014965 13451395 13714220 12927049 12225817 11551586 12257657 12407741 11533469
4614A1533469K53132j77795j10357J08603Q1890N2929r63554k57372P86569O3324
$$ 11533469 11786601 11608806 11498449 11607052 11688942 11741871 10778317 10520945 11307514 11370838
4604A1370838j076184l6061k66569k40613m3138P68061j81088m17104j2927p85862
$$ 11370838 10294654 10258593 9992024 9751411 9708273 10476334 10295246 9878142 9865215 9079353
4594I079353N20232k41008J77984p90171j45235o12433Q53950p08197Q91138q72767
$$ 9079353 9599585 9358577 9536561 8746390 8601155 7988722 8842672 8134475 9025613 8152846
4584H152846K89510l26488K83298m53446n06637O15315o73430N90468l51131l23286
$$ 8152846 8442356 8115868 8399166 7945720 7439083 8054398 7380968 7971436 7620305 7297019
4574G297019R36449r83836N9018J81761N29358p92252j62600q9413O44743p79839
$$ 7297019 8233468 7249632 7308650 7490411 8019769 7227517 7064917 6975504 7620247 6840408
4564F840408l8979j85837L42138J14938j039124M38232l70733J070966k42347
$$ 6840408 6801429 6615592 6957730 7072668 6033544 6471776 6101043 7172009 6929662
4555F929662l18894n22074k99534P92463k21125j87381r77550O06064J74144k93477
$$ 6929662 6610768 6088694 5789160 6581623 6360498 6173117 5195567 5801631 5975775 5682298
4545E682298K61814J88508K22470L02691l87635j53685l91764J56640J47586K3819
$$ 5682298 5944112 6132620 6355090 6657781 6270146 6116461 5724697 5881337 6028923 6052742
4535F052742q31405K35878n65107N29566L93670m30277m97592K52199k32464P49616
$$ 6052742 5221337 5457215 4892108 5421674 5815344 5385067 4887475 5139674 4907210 5656826
4525E656826p44050K77977l17847P40637o85631n54823P34856j0669L0420m03847
$$ 5656826 4912776 5190753 4872906 5613543 4927912 4373089 5107945 5097276 5127696 4723849
4515D723849l8916N7849P80093j223015M54723J79600M03277l30042k502k75976
$$ 4723849 4684933 4742782 5522875 4299860 4754583 4934183 5337460 5007418 5004916 4728940
4505D728940n14351J282185j900561Q40894o3762N36230k39539q52770M94858
$$ 4728940 4214589 5496774 3596213 4437107 4373345 4909575 4670036 3817266 4312124
4496D312124O16548l8880p04552J06066m10360n730j2785L38859k81817n08126
$$ 4312124 4928672 4889792 4185240 4291306 3880946 3875216 3862431 4201290 3919473 3411347
4486C411347N56008K48184j96850r19295J39781P6725l50070J087872r8232O62051
$$ 3411347 3967355 4215539 4018689 3099394 3239175 3315900 2965830 4053702 3955470 4617521
4476D617521q02343N93600l67561l64659L29337l14254k25821O46169j345642
$$ 4617521 3815178 4408778 4041217 3676558 4005895 3691641 3465820 4111989 2766347
4467B766347J49560k5481K81140l92523M26563m71775K96515J87964k18085n05409
$$ 2766347 2915907 2890426 3171566 2779043 3205606 2733831 3030346 3218310 3000225 2494816
4457B494816M05240L81465j34630L33879q56828n50080N63526P9825k511p4898
$$ 2494816 2900056 3281521 3146891 3480770 2623942 2073862 2637388 2717213 2714702 2639804
4447B639804k28016L17023k47390J109190m34912l62788J21536o15950Q04448
$$ 2639804 2411788 2728811 2481421 3590611 3155699 2792911 2914447 2298497 3102945
4438C102945n62982o68813J424904k53416q30178p37587J415593p60855M02768
$$ 3102945 2539963 1871150 3296054 3042638 2212460 1474873 2890466 2129611 2532379
4429B532379L01072j013634Q39521j54192l99352J542095j333708j97572j28971
$$ 2532379 2833451 1819817 2659338 2505146 2105794 3647889 2314181 2116609 1987638
4420A987638M21718K3025R2723m64877m8013k57543R03919l96360J21408l38863
$$ 1987638 2409356 2432381 2525104 2060227 2012214 1754671 2658590 2262230 2383638 2044775
4410B044775O61323N5898o59784k7463p8353J28631M10426r28510K69268j73388
$$ 2044775 2706098 2761996 2102212 2074749 1996396 2125027 2535453 1606943 1876211 1702823
4400A702823L99701L03674o77262Q92606m83002P7933n48371Q88977J38618j073279
$$ 1702823 2102524 2406198 1728936 2621542 2138540 2216473 1668102 2557079 2695697 1622418
4390A622418O2581K62692M86215M98611p90965L18741r01759R07402k77960L96472
$$ 1622418 1684999 1947691 2433906 2932517 2141552 2460293 1558534 2465936 2187976 2584448
4380B584448o24199R0150J142226r10570J52830m33101L61175j83137m90912J362336
$$ 2584448 1960249 2050399 3192625 2282055 2434885 2001784 2362959 2179822 1688910 3051246
4370C051246j542618P36277K41109m40968M56877n24133J84134j18451r5000K55510
$$ 3051246 1508628 2244905 2486014 2045046 2501923 1977790 2161924 2043473 1948473 2203983
4360B203983M4209J25138m70401K23875J79297k27037p6356J367523o17183J17809
$$ 2203983 2248192 2373330 1902929 2126804 2306101 2079064 2002708 3370231 2753048 2870857
4350B870857m11417J69501m5926j076141J172885r18522J80321M03576J94787
$$ 2870857 2459440 2628941 2583015 1506874 2679759 1761237 1941558 2345134 2539921
4341B539921j80590J60311n39466J63585l86098R56019n16073K6471K91494l29584
$$ 2539921 2359331 2519642 1980176 2143761 1757663 2713682 2197609 2224080 2515574 2185990
4331B185990O99901L23173j433505O81228L97913J062816p45345J479110l83945
$$ 2185990 2885891 3209064 1775559 2456787 2854700 3917516 3172171 4651281 4267336
4322D267336O21180p92012O44355o5774l76159m80775Q77632O40144j181746k98938
$$ 4267336 4888516 4096504 4740859 4675085 4298926 3818151 4695783 5335927 4154181 3855243
4312C855243Q46280j273252M81973m09811j186872l38480L07777n66455N16245
$$ 3855243 4701523 3428271 3910244 3500433 2313561 1975081 2282858 1716403 2232648
4303B232648o12906Q53713J52374n73532q10429L82763N42819o9763L6283P87017
$$ 2232648 1619742 2473455 2625829 2052297 1241868 1624631 2167450 2097687 2133970 2920987
4293B920987q26277l41390r7345Q02411m73414o36476J47305j92587M59699p75154
$$ 2920987 2094710 1753320 1655975 2458386 1984972 1348496 1495801 1303214 1762913 987759
4283I87759K05086O05511p25764J170911o29348o05650M88308n26515M63072k63605
$$ 987759 1192845 1798356 1072592 2243503 1614155 1008505 1496813 970298 1433370 1169765
4273A169765L66252n44213O47117l51354m43622J19742J03927j33594l83702N56787
$$ 1169765 1536017 991804 1638921 1287567 843945 963687 1067614 934020 550318 1107105
4263A107105N65108q98872N98693J01291k58536P741L76466j95670q2108m99561
$$ 1107105 1672213 773341 1372034 1473325 1214789 1222530 1598996 1403326 1321218 821657
4253H21657j34440L61798j02900l36932L38496r4283M94344m47524M08347m51883
$$ 821657 687217 1049015 946115 609183 947679 853396 1347740 900216 1308563 856680
4243H56680M2288J39149l2797J44616Q107n06169l27947L72541J67107L054P0331
$$ 856680 898968 1038117 1005320 1149936 1158043 651874 323927 696468 863575 866629 936960
4232I36960p02128m1727O92585o63063L05585n87235L82235J26915J36828j8022
$$ 936960 234832 193105 885690 222627 528212 -59023 323212 450127 586955 568933
4222E68933L42318j33238M6542M16844k87097J43804L14098r82064O07209r97136
$$ 568933 911251 778013 824555 1241399 954302 1098106 1412204 430140 1037349 40213
4212D0213O98318M75499q0085m81874K10253N5394j67463k7070N75584j251401
$$ 40213 738531 1214030 1133945 652071 862324 917718 750255 723185 1298769 47368
4202D7368P82116L99100J20959l68315l31272N58750o64385M76389k69248n09527
$$ 47368 829484 1228584 1349543 981228 649956 1208706 544321 1020710 751462 241935
4192B41935J73120J42409M02335q54211P87783L32978j611899J062435k61014
$$ 241935 415055 557464 959799 105588 893371 1226349 -385550 676885 415871
4183D15871j93819P64703m63416P05377r97768N08069J02208L26540m05275K45958
$$ 415871 222052 986755 523339 1228716 230948 739017 841225 1167765 762490 1008448
4173A008448n29006L88897n75817K37294j0501J59144K57630k39723O92728q78059
$$ 1008448 479442 868339 292522 529816 519315 678459 936089 696366 1389094 511035
4163E11035q22608R36511r76428J556356o70880l67246J42190O14468m87176j41987
$$ 511035 -311573 624938 -351490 1204866 533986 166740 308930 923398 436222 294235
4153B94235O42100q8235n46022P28776j061679J34301P62714m39841L58745r74492
$$ 294235 936335 848100 302078 1030854 -30825 103476 866190 426349 785094 -189398
4143a89398J043926k72809k40243M14507n73030l86301L90483J068395j092856
$$ -189398 854528 581719 341476 755983 182953 -203348 187135 1255530 162674
4134A62674l021N65178K6057k05376L01801l25735m52670N8763K85297K25946
$$ 162674 159653 724831 750888 545512 847313 521578 68908 127671 412968 638914
4124F38914P28884n49649j13806J99229k66773l00806P3983j71851k3596K86931
$$ 638914 1367798 818149 704343 903572 636799 335993 409976 238125 214529 501460
4114E01460o7949K00026m96633K75075N90751J53954o78024J57155K11685J73366
$$ 501460 433511 633537 136904 411979 1002730 1156684 478660 635815 847500 1020866
4104A020866O41694r76026O8863l80096l47353K23385R04526l9389j568461R46629
$$ 1020866 1662560 686534 755397 375301 27948 251333 1155859 1116470 -451991 494638
4094D94638P1077n9546k58509J161042p53092P52742m87601l07790N11403q83402
$$ 494638 565715 506169 247660 1408702 655610 1408352 920751 612961 1124364 240962
4084B40962L50786K01126o43271N96481k63056k71368J50020J138Q1584K0136
$$ 240962 591748 792874 149603 746084 483028 211660 361680 362818 444402 464538
4074D64538L59419m30527k26221L97719o06352O38248J50107p22915j30955P59518
$$ 464538 823957 393430 167209 564928 -41424 596824 746931 24016 -106939 652579
4064F52579m3842l06255m7501K89716j4505j03758K06626O29968q30782j09513
$$ 652579 608737 302482 254981 544697 530192 426434 633060 1263028 432246 322733
4054C22733P10298o97390R8572m77431J76380N54665k77988j50964j13148O00908
$$ 322733 1033031 335641 434213 -43218 133162 687827 409839 258875 145727 746635
4044G46635M63748j013557N07591k74406p531P18864p74026j62087m83204R67134
$$ 746635 1210383 196826 704417 430011 422480 1141344 367318 205231 -277973 689161
4034F89161N42214o17212L23176l49308O30052m72300m29099P82803j431602J045521
$$ 689161 1231375 614163 937339 588031 1218083 745783 316684 1099487 -332115 713406
4024G13406l08887l3671O31396m89257K95544L26501j37362Q6936o26621O29019
$$ 713406 404519 370848 1002244 512987 808531 1135032 997670 1084606 457985 1087004
4014A087004j20781K23693q4769k75073l00181K46999K48250m15110N06585o35393
$$ 1087004 966223 1189916 1105147 830074 529893 776892 1025142 610032 1116617 481224
4004D81224L14333m30353J085793m23460J99780k19013n9299o198j52043J16934
$$ 481224 795557 365204 1450997 1027537 1227317 1008304 949005 942807 790764 907698
3994I07698k05142L04564j44206k9479l16931P55033o23289M7845m409J44904
$$ 907698 702556 1007120 862914 833435 516504 1271537 648248 696093 691684 836588
3984H36588j02299o90606R99222L22946m99714L30362j08814P09005r45195l13902
$$ 836588 734289 43683 1042905 1365851 866137 1196499 1087685 1796690 851495 537593
3974E37593N47958j9882n03285L01404N86917l78729N4993n07841L03210p60936
$$ 537593 1085551 1065669 562384 863788 1450705 1071976 1126969 619128 922338 161402
3964A61402M39355O02572M5078q31261l37006O67421m92102L58032N63842l00662
$$ 161402 600757 1203329 1248407 417146 80140 747561 255459 613491 1177333 876671
3954H76671N03814n24810m35764K53355m78493J43400N72105r66820J133727m81959
$$ 876671 1380485 855675 419911 673266 194773 338173 910278 -56542 1077185 595226
3944E95226J39117o48636J54155K20150k62454L71405l54983N23226m81011m3642
$$ 595226 734343 85707 239862 460012 197558 568963 213980 737206 256195 212553
3934B12553L98344q08626J427236j076124o30160Q58693Q6477m75780K59723p62945
$$ 212553 610897 -197729 1229507 153383 -476777 381916 468393 -7387 252336 -510609
3924e10609N92843L731l4263L49610j77691L7136M2664m09936j01282P56828o50154
$$ -510609 82234 85965 51702 401312 223621 260757 303421 -106515 -207797 549031 -101123
3913a01123k15651J41910p6751O86336J1628L1181m07474K09105m74288R27504
$$ -101123 -316774 -174864 -251615 434721 446349 477530 70056 279161 -195127 732377
3903G32377r64774P20644O9184q28974P37266r56775M88962J7379N54465j1920
$$ 732377 -232397 488247 557431 -271543 465723 -491052 -2090 15289 569754 557834
3893E57834p94053j79173K90630P73638j373417o2665J025261k69515P13839o06280
$$ 557834 -236219 -415392 -124762 648876 -724541 -787206 238055 -31460 682379 76099
3883G6099O42255p46110K57411L81394j062495N23546M4914m36835M53263J75204
$$ 76099 718354 -27756 229655 611049 -451446 72100 117014 -319821 133442 308646
3873C08646n51690j39736L84714Q8913M1994M54598j020653J90458K70214p89392
$$ 308646 -243044 -382780 1934 90847 132841 587439 -433214 -242756 27458 -761934
3863g61934M49576Q72775l75724n00361j66335L05789K76126L55925l33983M17629
$$ -761934 -312358 560417 184693 -315668 -482003 -176214 99912 455837 121854 539483
3853E39483j75313j91839m9471p35797O84251J18742k5946L66220l41013o69650
$$ 539483 364170 172331 122860 -612937 71314 190056 164110 530330 189317 -480333
3843d80333J71405p9270R51057o7278r20207P30406K7073l97421J16128n28493
$$ -480333 -308928 -388198 562859 495581 -424626 305780 332853 -64568 51560 -476933
3833d76933J13062K66063n24933Q76673j107540Q49272O86727p29806P37054j191053
$$ -476933 -363871 -97808 -622741 253932 -853608 -4336 682391 -47415 689639 -501414
3823e01414O41489Q2754K13572m798k66453J25038n34616k22850O68850oM91930
$$ -501414 140075 222829 436401 431603 165150 290188 -244428 -467278 201572 201566 693496
3812F93496j252097O41050r2111K01519l17617L05532m8966L72447j719305Q69378
$$ 693496 -558601 82449 -9662 191857 -125760 179772 130806 503253 -1216052 -346674
3802c46674J52499l45299N38739L0254J3664J19882m80341J66252k44436P86082
$$ -346674 -194175 -539474 -735 29519 43183 163065 -317276 -151024 -395460 390622
3792C90622q27738L38204M48730j64091R4598m31865j39657L03599q3066N74096
$$ 390622 -437116 -98912 349818 185727 280325 -151540 -291197 12402 -70664 503432
3782E03432n02188j45584l27967m52496J009125J08673j43197o50616Q21218o99355
$$ 503432 1244 -144340 -472307 -924803 84322 192995 49798 -600818 220400 -478955
3772d78955K97841j64999m07656Q58096N7198k87942m64764N20229j40440J27373
$$ -478955 -181114 -346113 -753769 104327 161525 -126417 -591181 -70952 -211392 -84019
3762h4019K19805J74316o34296l99599R21971m52058K72814p5259L63245q9956
$$ -84019 135786 310102 -324194 -723793 198178 -253880 18934 -56325 306920 216964
3752B16964l70109q951k69016L08795j13326M53756R0717p26388M63711n68308
$$ 216964 -153145 -162096 -431112 -122317 -235643 218113 308830 -417558 46153 -522155
3742e22155J73036N35350m52404J15756R8625J08469L36372o18340j36201M48190
$$ -522155 -349119 186231 -266173 -150417 -51792 56677 393049 -225291 -361492 86698
3732H6698P73785o91727k44572J77611j54274l31467P41033m09706k94746J85975
$$ 86698 860483 168756 -75816 101795 -52479 -383946 357087 -52619 -347365 -161390
3722a61390L39843k04967O91586j213941m9309j53525N16337K26411k39094N33655
$$ -161390 178453 -26514 665072 -548869 -598178 -751703 -235366 -8955 -248049 285606
3712B85606L26638j082883N00233j48597Q3488l4929L93589j58636L66403K2739
$$ 285606 612244 -470639 29594 -119003 -35515 -70444 323145 164509 530912 553651
3702E53651r74276J236627n60638o01223J19340M99921k3883J74594j18096k40861
$$ 553651 -420625 816002 255364 -345859 -226519 273402 249519 424113 306017 65156
3692F5156L8128K53380k50194J41910p5353J55718J80357k34976p87859J261758
$$ 65156 103284 356664 106470 248380 173027 328745 509102 274126 -513733 748025
3682G48025p63681m385N56152p21977K94057K35343L6376q67808K30238M78442
$$ 748025 -15656 -20041 536111 -185866 108191 343534 379910 -487898 -257660 220782
3672B20782l67127M21322j226126P26681k6782R90084R5864q41030N60315j54224
$$ 220782 -146345 274977 -951149 -224468 -251250 738834 834698 -6332 553983 399759
3662C99759J61184q0193K49757n54266o43591O52630J42609R3678L88923k39847
$$ 399759 560943 480750 730507 176241 -467350 185280 327889 421567 810490 570643
3652E70643P8072m64627J03842k81723l61853R07442j57529p62999M70158Q02856
$$ 570643 648715 184088 287930 6207 -355646 551796 394267 -368732 101426 904282
3642I04282j050136O01573m90332J012020j008256m50762l23080P37168n13646
$$ 904282 -145854 455719 -34613 977407 -30849 -481611 -804691 -67523 -581169
3633e81169R47957L68292j249691J127828K4462k39228m69719o9119O03312m22336
$$ -581169 366788 735080 -514611 613217 637679 398451 -71268 -140387 462925 40589
3623D0589J87379k18634P31863p33715J512456K84783j013734J59767L29009j12480
$$ 40589 227968 9334 741197 7482 1519938 1804721 790987 950754 1279763 1167283
3613A167283k89556j005973J510250q82628L19454n45741k54082p10681O74318
$$ 1167283 877727 -128246 1382004 499376 818830 273089 19007 -691674 -17356
3604a7356P10971o41865q1396O62484p59982M92521l66773j29435K70321l94249
$$ -17356 693615 51750 -29646 632838 -127144 365377 -1396 -130831 139490 -254759
3594b54759L30025n87898J054714k35622n10468l15035O91572M66766r50917R16251
$$ -254759 75266 -512632 542082 306460 -204008 -519043 172529 639295 -311622 604629
3584F04629n38650o95444Q66544l7087K51325j001018J192324n58680n7435Q2174
$$ 604629 65979 -629465 237079 199992 451317 -549701 642623 83943 26508 108682
3574A08682N11148l97929n75125n3195Q75938K97541m1577p96832J246914j51024
$$ 108682 619830 221901 -353224 -406419 469519 767060 725483 -71349 1175565 1024541
3564A024541r09601l07233P64883k45546p3802o73581R23803M89697P03961p62815
$$ 1024541 114940 -192293 572590 327044 253242 -420339 503464 993161 1697122 934307
3554I34307J51519k20667R6878Q7900R6986M03112q33820q511j34312L44651M3873
$$ 934307 1085826 865159 962037 1049937 1146923 1550035 716215 707704 573392 918043 961916
3543I61916N81424Q31576p15302P49123q65613j72222P3450l73322q58129O35682
$$ 961916 1543340 2374916 1659614 2408737 1543124 1370902 1444352 1071030 212901 848583
3533H48583N15936N53493k7413J017841J547919J020302O02460o07191r12868
$$ 848583 1364519 1918012 1890599 2908440 4456359 5476661 6079121 5471930 4559062
3524D559062j164899q56079j40752p30753o26995P82779l43607J11937r56000
$$ 4559062 3394163 2538084 2397332 1666579 1039584 1822363 1478756 1590693 634693
3515F34693L18002Q93152o67213L21041N00690J214930N39644r1080p78962K14152
$$ 634693 952695 1845847 1178634 1499675 2000365 3215295 3754939 3663859 2884897 3099049
3505C099049r46756K21623j161584L05707j081524P86029r8135q07248k74884
$$ 3099049 2152293 2373916 1212332 1518039 436515 1222544 1124409 317161 42277
3496D2277J136776j057476K79870M87953J35668j411401P54098R68932o78943
$$ 42277 1179053 121577 401447 889400 1025068 -386333 367765 1336697 657754
3487F57754J55047L91736r60360N00141J190460j181931k90231J71515k89203
$$ 657754 812801 1204537 244177 744318 1934778 752847 462616 634131 344928
3478C44928J592218q90266q1684K64554J02177n68200o88745J76130O74037n73956
$$ 344928 1937146 1046880 965196 1229750 1331927 763727 74982 251112 925149 351193
3468C51193N36186n24789N49206r4956M87282l77791j55967P5997L33254k95248
$$ 351193 887379 362590 911796 816840 1304122 926331 770364 846361 1179615 884367
3458H84367Q04335p79417O77414r62742J23922N18007J127486N46746J413695
$$ 884367 1688702 909285 1586699 623957 747879 1265886 2393372 2940118 4353813
3449D353813J143361J35752q10671q98612o85427p08903l80510N92517Q21678
$$ 4353813 5497174 5632926 4822255 3923643 3238216 2529313 2148803 2741320 3562998
3440C562998j221232j37647J015488l70252R7281J23010m83298P45502L63781
$$ 3562998 2341766 2204119 3219607 2849355 2946636 3069646 2586348 3331850 3695631
3431C695631Q46186n89907J400851Q64530L519334P123708O063859j13782k173884
$$ 3695631 4541817 3951910 5352761 6217291 9736625 16860333 22924192 22810410 20636526
3422B0636526l742147l638251l092989k317087j951574o19775j440094p17943
$$ 20636526 16894379 13256128 10163139 7846052 5894478 5274703 3834609 3116666
3414C116666J068945q51439q26903R2683l49789M06098k99338n74285P78293l15900
$$ 3116666 4185611 3334172 2507269 2599952 2250163 2656261 2356923 1782638 2560931 2245031
3404B245031k55945O90006o07832M08876p43356p1425P6866l93959M69721M69925
$$ 2245031 1989086 2679092 2071260 2480136 1736780 1665355 1742221 1348262 1817983 2287908
3394B287908q54133O27723J65143J7140j06702M37672k08860p07499j11386L98822
$$ 2287908 1433775 2061498 2226641 2243781 2137079 2574751 2365891 1658392 1547006 1945828
3384A945828P19869o80150r3357N92655J50583R19979M34234k18748O7015K22001
$$ 1945828 2665697 1985547 1892190 2484845 2635428 3555407 3989641 3770893 3837908 4059909
3374D059909k75823k57273j83270l24275J08245o79585K83131J78526m41790n4213
$$ 4059909 3784086 3526813 3343543 3019268 3127513 2447928 2731059 2909585 2467795 2413582
3364B413582K96840n29595J212055p83271O16634p49964M59994n0139Q76044r68502
$$ 2413582 2710422 2180827 3392882 2609611 3226245 2476281 2936275 2886136 3762180 2793678
3354B793678Q6750N58465r4953M61056J106532n84937J119193p32160K29579K64538
$$ 2793678 2880428 3438893 3343940 3804996 4911528 4326591 5445784 4713624 4943203 5207741
3344E207741L09243O78858N29868K02940J351543J429520J951199K075117O49197
$$ 5207741 5516984 6195842 6725710 6928650 8280193 9709713 11660912 13736029 14385226
3335A4385226J431913K96276M28906L18311J875077L109287L458001O234218P712002
$$ 14385226 15817139 16113415 16542321 16860632 18735709 21844996 25302997 31537215 39249217
3326C9249217K4702716N0233338M8938760O809292j6555478k6000551k9691884
$$ 39249217 63951933 114185271 163124031 169933323 153377845 127377294 97685410
3319I7685410k8329146j8760958j2198131q439748p509763m508973k717219j193957
$$ 97685410 69356264 50595306 38397175 29957427 22447664 17938691 15221472 14027515
$$ [...]
##END NTUPLES=NMR SPECTRUM
##END=
