##TITLE=abcd
##JCAMPDX= 6.0         $$ Bruker NMR JCAMP-DX V2.0
##DATA TYPE= NMR SPECTRUM
##DATA CLASS= NTUPLES
##ORIGIN= UXNMR, Bruker Analytische Messtechnik GmbH
##OWNER= root
$$ XWIN-NMR		Version 3.5
$$ Mon Aug  3 18:04:23 2026 Russian Standard Time (UT+4h)  servis@DPX200
##.OBSERVE FREQUENCY= 200.131235884673
##.OBSERVE NUCLEUS= ^1H
##.ACQUISITION MODE= SIMULTANEOUS
##.ACQUISITION SCHEME= undefined
##.AVERAGES= 32
##.DIGITISER RES= 18
##SPECTROMETER/DATA SYSTEM= spect
##.PULSE SEQUENCE= zg
##.SOLVENT NAME= CDCl3
##.SHIFT REFERENCE= (INTERNAL, CDCl3, 0, 16.4885)
##AUDIT TRAIL= $$ (NUMBER, WHEN, WHO, WHERE, WHAT)
$$ ##TITLE= Audit trail, XWIN-NMR		Version 3.5
$$ ##JCAMPDX= 5.01
$$ ##ORIGIN= Bruker BioSpin GmbH
$$ ##OWNER= servis
$$ F:\spectra/data/av/nmr/H1/1/pdata/1/auditp.txt
$$ ##AUDIT TRAIL=  $$ (NUMBER, WHEN, WHO, WHERE, WHAT)
(   1,<2026-08-03 18:03:50.46 +0400>,<servis>,<DPX200>,
      <created by zg, POWCHK disabled, PULCHK disabled
       configuration hash MD5:
       00 E9 B6 7A A2 85 ED C7 34 08 36 98 17 FE 4E 26
       data hash MD5: 32K
       64 0F 81 84 D2 9D E9 12 5E 3B 42 93 A0 C9 F4 36>)
(   2,<2026-08-03 18:03:52.18 +0400>,<servis>,<DPX200>,
      <Start of raw data processing
       efp BC_mod = 2 LB = 0.05 FT_mod = 6 PKNL = 1 PHC0 = -413.3518 PHC1 = 3.101563 SI = 16K 
       data hash MD5: 16K
       CF 39 51 65 4C F5 E4 42 C2 F5 71 85 0C C2 B2 4E>)
$$ ##END=
$$ 
$$ hash MD5
$$ 18 62 65 E9 38 D7 56 F6 F1 86 9C 3C EA 51 FD 32
##$RELAX= 
##$RELAX= 
##$RELAX= 
##$RELAX= 
##$RELAX= 
##$RELAX= 
##$RELAX= 
##$RELAX= 
$$ Bruker specific parameters
$$ --------------------------
##$DU= <F:\spectra>
##$EXPNO= 1
##$NAME= <H1>
##$PROCNO= 1
##$TYPE= <nmr>
##$USER= <av>
##$AMP= (0..31)
100 100 100 100 100 100 100 100 100 100 100 100 100 100 100 100 100 100 
100 100 100 100 100 100 100 100 100 100 100 100 100 100 
##$AQSEQ= 0
##$AQ_mod= 1
##$AUNM= <au_zg>
##$AUTOPOS= <>
##$BF1= 200.13
##$BF2= 200.13
##$BF3= 200.13
##$BF4= 200.13
##$BF5= 500.13
##$BF6= 500.13
##$BF7= 500.13
##$BF8= 500.13
##$BYTORDA= 1
##$CFDGTYP= 0
##$CFRGTYP= 5
##$CHEMSTR= <none>
##$CNST= (0..31)
1 1 145 1 1 1 1 1 1 1 1 1 1 1 1 1 1 1 1 1 1 1 1 1 1 1 1 1 1 1 1 1 
##$CPDPRG= <>
##$CPDPRG1= <>
##$CPDPRG2= <>
##$CPDPRG3= <>
##$CPDPRG4= <mlev>
##$CPDPRG5= <mlev>
##$CPDPRG6= <mlev>
##$CPDPRG7= <mlev>
##$CPDPRG8= <mlev>
##$CPDPRGB= <>
##$CPDPRGT= <>
##$D= (0..31)
0 2 0 0 0 0 0 0 0 0.06 0 0 0 0 0 0 0.0002 0 0 0 0 0 0 0 0 0 0 0 0 0 0 
0 
##$DATE= 1785765830
##$DBL= (0..7)
120 120 120 120 120 120 120 120 
##$DBP= (0..7)
150 150 150 150 150 150 150 150 
##$DBP07= 0
##$DBPNAM0= <>
##$DBPNAM1= <>
##$DBPNAM2= <>
##$DBPNAM3= <>
##$DBPNAM4= <>
##$DBPNAM5= <>
##$DBPNAM6= <>
##$DBPNAM7= <>
##$DBPOAL= (0..7)
0.5 0.5 0.5 0.5 0.5 0.5 0.5 0.5 
##$DBPOFFS= (0..7)
0 0 0 0 0 0 0 0 
##$DE= 6
##$DECBNUC= <off>
##$DECIM= 32
##$DECNUC= <off>
##$DECSTAT= 4
##$DIGMOD= 1
##$DIGTYP= 9
##$DL= (0..7)
0 120 120 120 120 120 120 120 
##$DP= (0..7)
150 150 150 150 150 150 150 150 
##$DP07= 0
##$DPNAME0= <>
$$ [...]
##$SUBNAM4= <"">
##$SUBNAM5= <"">
##$SUBNAM6= <"">
##$SUBNAM7= <"">
##$SUBNAM8= <"">
##$SUBNAM9= <"">
##$SW= 20.6817932712277
##$SWIBOX= (0..15)
0 0 3 0 0 0 0 0 0 0 0 0 0 0 0 0 
##$SW_h= 4139.07284768212
##$TD= 32768
##$TD0= 1
##$TE= 0
##$TE2= 300
##$TE3= 300
##$TEG= 300
##$TL= (0..7)
0 120 120 120 120 120 120 120 
##$TP= (0..7)
150 150 150 150 150 150 150 150 
##$TP07= 0
##$TPNAME0= <>
##$TPNAME1= <>
##$TPNAME2= <>
##$TPNAME3= <>
##$TPNAME4= <>
##$TPNAME5= <>
##$TPNAME6= <>
##$TPNAME7= <>
##$TPOAL= (0..7)
0.5 0.5 0.5 0.5 0.5 0.5 0.5 0.5 
##$TPOFFS= (0..7)
0 0 0 0 0 0 0 0 
##$TUNHIN= 0
##$TUNHOUT= 0
##$TUNXOUT= 0
##$USERA1= <user>
##$USERA2= <user>
##$USERA3= <user>
##$USERA4= <user>
##$USERA5= <user>
##$V9= 5
##$VALIST= <valist>
##$VCLIST= <CCCCCCCCCCCCCCC>
##$VD= 0
##$VDLIST= <DDDDDDDDDDDDDDD>
##$VPLIST= <PPPPPPPPPPPPPPP>
##$VTLIST= <TTTTTTTTTTTTTTT>
##$WBST= 1024
##$WBSW= 30
##$XGAIN= (0..3)
0 0 0 0 
##$XL= 0
##$YL= 0
##$YMAX_a= 641927
##$YMIN_a= -433247
##$ZGOPTNS= <>
##$ZL1= 120
##$ZL2= 120
##$ZL3= 120
##$ZL4= 120
##$ABSF1= 0
##$ABSF2= 0
##$ABSG= 0
##$ABSL= 0
##$ALPHA= 0
##$AQORDER= 0
##$ASSFAC= 0
##$ASSFACI= 0
##$ASSFACX= 0
##$ASSWID= 0
##$AUNMP= <proc_1d>
##$AZFE= 0.1
##$AZFW= 0.1
##$BCFW= 0
##$BC_mod= 2
##$BYTORDP= 0
##$COROFFS= 0
##$CY= 18.4799938201904
##$DATMOD= 1
##$DC= 0
##$DFILT= <>
##$DTYPP= 0
##$F1P= 9.9274215381318
##$F2P= -0.165520771350173
##$FCOR= 1
##$FTSIZE= 16384
##$FT_mod= 6
##$GAMMA= 0
##$GB= 0
##$INTBC= 1
##$INTSCL= 4.127829e-11
##$ISEN= 128
##$LB= 0.05
##$LEV0= 0
##$LPBIN= 0
##$MAXI= 10000
##$MC2= 0
##$MEAN= 0
##$ME_mod= 0
##$MI= 50
##$NCOEF= 0
##$NC_proc= -4
##$NLEV= 6
##$NOISF1= 3.799351
##$NOISF2= 2.8
##$NSP= 0
##$NTH_PI= 0
##$NZP= 0
##$OFFSET= 16.48848
##$PC= 4
##$PHC0= -413.3518
##$PHC1= 3.101563
##$PH_mod= 1
##$PKNL= yes
##$PPARMOD= 0
##$PSCAL= 4
##$PSIGN= 0
##$REVERSE= no
##$SF= 200.130005582386
##$SI= 16384
##$SIGF1= 3
##$SIGF2= 2
##$SINO= 400
##$SIOLD= 16384
##$SREGLST= <1H.CDCl3>
##$SSB= 0
##$STSI= 16384
##$STSR= 0
##$SW_p= 4139.07284768211
##$SYMM= 0
##$S_DEV= 0
##$TDeff= 32768
##$TDoff= 0
##$TI= <>
##$TILT= no
##$TM1= 0
##$TM2= 0
##$TOPLEV= 0
##$USERP1= <user>
##$USERP2= <user>
##$USERP3= <user>
##$USERP4= <user>
##$USERP5= <user>
##$WDW= 1
##$XDIM= 16384
##$YMAX_p= 455900860
##$YMIN_p= -197220
$$ End of Bruker specific parameters
$$ ---------------------------------
##NTUPLES= NMR SPECTRUM
##VAR_NAME=  FREQUENCY,     SPECTRUM/REAL,   SPECTRUM/IMAG
##SYMBOL=    X,             R,               I
##VAR_TYPE=  INDEPENDENT,   DEPENDENT,       DEPENDENT
##VAR_FORM=  AFFN,          ASDF,            ASDF
##VAR_DIM=   16384,         16384,           16384
##UNITS=     HZ,            ARBITRARY UNITS, ARBITRARY UNITS
##FACTOR=    0.252644378177508, 1,           1
##FIRST=     3299.83951724647, 0,            0
##LAST=      -839.233330435636, 0,           0
##MIN=       -839.233330435636, -197220,     0
##MAX=       3299.83951724647, 455900860,    0
$$ Real data points
##PAGE= N=1
##DATA TABLE= (X++(R..R)), XYDATA
$$ [...]
13154h0952M9J2666M9046k9317N0729m1389L600r824k7084M1310j2365j3480Q157
13141d8854Q776l5691M7792k0841p089j0994J7992N121l2842N0378J2779l9253
13129e2726P536j3416K9551M500k2210L5719n5959M84L4682M072k0747n5270K2626
13116h1158k156M9902k1309K682n934K9721k4276L470l277M210K3158j6901m7086
13103h8954O4206m1630M6103k6060K5914r3527O1229M531l5921L5986L926l7972
13091h2169j6573N4027o5846N2870m5945P5944k1308k4507l590j5841L3357k057
13079f1638j3474R211L591M0544k3746M77q501Q361N528n7188K7881K9273k5408
13066f5089j8475Q2593p8861J8473n683K2243k007k0712p117L3217P224m6581
$$ plain form
13154 -80952 -80903 -68237 -19191 -48508 2221 -39168 -35568 -45392 -72476 -31166 -43531 -57011 -48854
13141 -48854 -40078 -75769 -27977 -48818 -55907 -66901 -48909 -43788 -76630 -26252 -13473 -52726
13129 -52726 -45190 -58606 -29055 -24555 -46765 -11046 -67005 -66521 -31839 -27767 -48514 -103784 -81158
13116 -81158 -83314 -33412 -54721 -52039 -57973 -28252 -52528 -49058 -52335 -48125 -24967 -41868 -88954
13103 -88954 -24748 -66378 -20275 -46335 -20421 -113948 -52719 -48188 -84109 -48123 -44197 -82169
13091 -82169 -98742 -44715 -110561 -57691 -103636 -27692 -49000 -73507 -77097 -92938 -59581 -61638
13079 -61638 -75112 -65901 -62310 -21766 -45512 -45035 -53536 -45175 -39647 -96835 -68954 -39681 -65089
13066 -65089 -83564 -971 -79832 -61359 -67042 -44799 -46806 -67518 -74635 -41418 -34194 -80775
13054h0775L732N357K010N0411l0155j1501m094M059R211q289N7184m4991M6956
13041h85k6523m5099j2123j0912N7684j5697j3231l4647L7967P6567p8508M746
13029f0661N962j5283M2985k2538K700N655l8860L1300r849k442J0540r157L8964
13016b0684m3493k2503M3094J1125j1189k9640N4334k3130J0694o3335L8224o858
13004f3361M148p546o1761J02261p1672N6627j6823P541J7592k8314J4485l5051
12992h1874J4590n4049K3255k3468K6782k762K8685L8613m6202k2321J8849o828
12980h6730L8775k0781j2840L8551n7181K662O2860l017k3306K9820r198M7344
12968F959l8557o171j6285O394l5189J0381k5965M7101J4700l2187N0085l7575
$$ plain form
13054 -80775 -77043 -71686 -69676 -19265 -49420 -60921 -65015 -60956 -51745 -60034 -2850 -47841 -885
13041 -885 -27408 -72507 -84630 -95542 -37858 -53555 -66786 -101433 -63466 13101 -65407 -60661
13029 -60661 -54699 -69982 -26997 -49535 -46835 -41180 -80040 -48740 -58589 -61031 -50491 -59648 -20684
13016 -20684 -64177 -86680 -43586 -32461 -43650 -73290 -18956 -42086 -31392 -94727 -56503 -63361
13004 -63361 -59213 -66759 -128520 -26259 -97931 -41304 -58127 -50586 -32994 -61308 -46823 -81874
12992 -81874 -67284 -121333 -98078 -121546 -94764 -97526 -68841 -30228 -76430 -98751 -79902 -86730
12980 -86730 -47955 -68736 -81576 -43025 -100206 -97544 -34684 -37701 -61007 -31187 -40385 6959
12968 6959 -31598 -37769 -54054 -47660 -82849 -72468 -98433 -51332 -36632 -68819 -18734 -56309
12956e6309m2669K9313j0439K9126L7700o8906k3635K423P540J6422P110R923
12944f2401j4680J7807K6005j7145K6500m2530o532J2512k898K0235J9204l983
12932b7906n4586O247J6145l411O5965j7635l7064n0106K7611k638M3056l2428
12920f6750l750M0704j0867m1628N3038j2014o2750O0541K3505m8489k6877K0635
12908g4702J841J006j9518P665L4715j0979o6090L5837L3040J5479n9731O126
12896i5311L680N9739l8865N452n285K8643m6860K8501l7728Q0496o5799J2671
12884g0666k708K2582o1849O4080j5561n7632N0129k2750L0115l3239M7540o0615
12872a10574P2234l3139o0175Q2988o1799l8414Q8630r633L3992m6255K3968j4712
$$ plain form
12956 -56309 -98978 -69665 -80104 -50978 -13278 -82184 -105819 -103396 -95856 -79434 -72324 -62401
12944 -62401 -77081 -59274 -33269 -50414 -23914 -66444 -72976 -60464 -63362 -43127 -23923 -27906
12932 -27906 -82492 -76245 -60100 -63511 2454 -15181 -52245 -102351 -74740 -77378 -34322 -66750
12920 -66750 -70500 -29796 -40663 -82291 -29253 -41267 -104017 -43476 -19971 -68460 -95337 -74702
12908 -74702 -72861 -71855 -91373 -83708 -48993 -59972 -126062 -90225 -57185 -41706 -101437 -95311
12896 -95311 -91631 -31892 -70757 -65305 -70590 -41947 -88807 -60306 -98034 -17538 -83337 -70666
12884 -70666 -73374 -50792 -112641 -48561 -64122 -121754 -71625 -94375 -64260 -97499 -49959 -110574
12872 -110574 -38340 -71479 -131654 -48666 -110465 -148879 -60249 -69882 -35890 -82145 -58177 -72889
12860g2889R822L7815p2048L4745j6418K3430j0449J5289m0418k9793M1879J5324
12848f3711m273K8565l5225M1124k5528j1903J2797P117N732k1337j645O2604
12836e683p5171R492k195l433K9006j1676m5806L6493N5897l2863l0282K8772
12824d7449L1672l2491N2777M9935q2617J7420j3841j717J7876q4355N4336j528
12812c9982n342j7235r451j168j5717L326M3853K4825j8457l2031K26N5764J1751
12799C62o4104j0737O405J9280j6780J1335J1645k706m8415N3253j4028k9905
12787h4395P4951K4818m2315p5177M4833l3648R5947o2135N8494l1433j7737L1762
12775a6035m7691N0227m0308k179M6328j6593m9975K8938j3859N379n931l350
$$ plain form
12860 -72889 -63067 -25252 -97300 -62555 -78973 -55543 -65992 -50703 -91121 -120914 -79035 -63711
12848 -63711 -67984 -39419 -74644 -33520 -59048 -70951 -58154 -51037 -45305 -66642 -68287 -5683
12836 -5683 -80854 -71362 -73557 -76990 -47984 -59660 -105466 -68973 -13076 -45939 -76221 -47449
12824 -47449 -15777 -48268 4509 54444 -28173 -10753 -24594 -26311 -8435 -92790 -38454 -39982
12812 -39982 -45324 -62559 -72010 -73178 -88895 -85569 -41716 -16891 -35348 -67379 -67153 -11389 362
12799 362 -63742 -74479 -68074 -48794 -65574 -54239 -42594 -45300 -93715 -40462 -54490 -84395
12787 -84395 -9444 15374 -26941 -102118 -57285 -90933 5014 -57121 1373 -30060 -47797 -16035
12775 -16035 -63726 -13499 -53807 -55986 -9658 -26251 -76226 -47288 -61147 -55768 -61699 -65049
12763f5049K3047p770j0885k128J2584m1100M3467n0895M0623O605N0751m5743
12751d6493j495J716L0876m181j7674R889J4832k0674o4455N9967l0862m9886
12739a18440N8266J358K2174j8846J8373j6883R310o0368R4737n2672l7160L99
12727i9752O1335j1013K55l4660L9002Q457l6891q879L1485L4757l3086R235k0019
12714e9774j9732O7957n4057L9417l16l9627r305r570P105L3659j4971K82j3686
12701g2618J3873K9880n6174M6281m3989M4016q0560J3451P5829m6237J47j1755
12689h7856q445K6451p245J0919m4784K4284j8067P2171j3545r612K8478p6563
12677a03814K2311J6529o098k1693j4532N2400m0774r480Q260M3278k240l5782
$$ plain form
12763 -65049 -42002 -49772 -60657 -62785 -50201 -91301 -47834 -98729 -58106 -51501 -750 -46493
12751 -46493 -47988 -46272 -15396 -19577 -37251 -27362 -12530 -33204 -97659 -37692 -68554 -118440
12739 -118440 -60174 -58816 -36642 -55488 -37115 -53998 -44688 -105056 -10319 -62991 -100151 -99752
12727 -99752 -38417 -49430 -49175 -83835 -44833 -36376 -73267 -82146 -50661 -15904 -48990 -39755 -59774
12714 -59774 -79506 -11549 -65606 -26189 -26505 -66132 -75437 -85007 -77902 -44243 -59214 -58932 -72618
12701 -72618 -58745 -28865 -85039 -38758 -82747 -38731 -119291 -105840 -30011 -76248 -76101 -87856
12689 -87856 -96301 -69850 -77095 -66176 -110960 -86676 -104743 -32572 -46117 -55729 -27251 -103814
12677 -103814 -81503 -64974 -71072 -92765 -107297 -54897 -95671 -105151 -96891 -53613 -55853 -91635
12665i1635r792L4643K8023k2577J9733p7484N21J5822K9014l4714J4035R801
12653h4610K9456k610m4639K8587j6429M0983m6604j2602N6817k5471L6398l5190
12641g5914J5076k4222K1291k2412O1622j6307o5036j7551M1487L3746l1720J0718
12629f9222Q635j3935j7132K2259m3434M5724l309k9519J6894L0723j1303n1095
12617a14714K9334K9332o4460k673P7495k2325J0092m5489R666O1944n0876L6415
12605d6259J7233j0467l9921o482O9374n476k1113K5735o0592m4140L7881M4288
12593c9939j283k0119p1754O7259L6444o4632l0945R795K8627M0352m5414M5463
12581d6146l354o7550m259R820N3494l0287n819p421J3513r470j5494O4116k8313
$$ plain form
12665 -91635 -101427 -66784 -38761 -61338 -41605 -119089 -118568 -102746 -73732 -108446 -94411 -84610
12653 -84610 -55154 -57764 -102403 -73816 -90245 -49262 -95866 -108468 -51651 -77122 -40724 -75914
12641 -75914 -60838 -85060 -63769 -86181 -24559 -40866 -105902 -123453 -81966 -48220 -79940 -69222
12629 -69222 -60587 -74522 -91654 -69395 -112829 -67105 -70414 -99933 -83039 -52316 -63619 -114714
12617 -114714 -85380 -56048 -120508 -123181 -45686 -68011 -57919 -103408 -93742 -31798 -82674 -46259
12605 -46259 -29026 -39493 -79414 -85896 -16522 -21998 -43111 -17376 -77968 -122108 -84227 -39939
12593 -39939 -41222 -61341 -133095 -65836 -29392 -94024 -124969 -115174 -86547 -46195 -91609 -46146
12581 -46146 -49500 -117050 -121309 -111489 -57995 -88282 -94101 -101522 -88009 -97479 -112973 -48857 -77170
12568g7170r599J6735R29m4462P1926l2440J1681m7556j6274O344j1770O5828
12556f5828L8655m8024L243L2290l1210l6742N1765J4571p7726K4442N1825R730
12544c3009m5880M7567m0040o7173R0227J1978l5738K4211j5888k3457n226K7131
12532f5297l8711k4627O6763o1828L5484M3997o8309O8491k7734q1021P7626j0979
12520h6145j3946k3358R5338o4857M1667k1058J2572l8709K6003L2117k7934M5774
12508b2536k0505l2630M9371n2758O8l262K270jJ9310K5656k7311l131j1016J0771
12494f5704k9367M2182k7834j0748L0282k7831K9061R8j6416N5666q0714N8797
12482d2528o6223L7841r568K7000m3648k7228M9144p0028L1779N8976n872j799
$$ plain form
12568 -77170 -86769 -70034 -69105 -113567 -41641 -74081 -62400 -109956 -126230 -119886 -131656 -65828
12556 -65828 -27173 -75197 -71954 -39664 -70874 -107616 -55851 -41280 -119006 -94564 -42739 -33009
12544 -33009 -78889 -31322 -71362 -138535 -48308 -36330 -72068 -47857 -63745 -87202 -92428 -65297
12532 -65297 -104008 -128635 -61872 -123700 -88216 -44219 -112528 -44037 -71771 -152792 -75166 -86145
12520 -86145 -100091 -123449 -28111 -92968 -51301 -72359 -59787 -98496 -72493 -40376 -68310 -22536
12508 -22536 -43041 -75671 -26300 -79058 -78990 -82252 -79982 -79983 -60673 -35017 -62328 -65459 -76475 -65704
12494 -65704 -95071 -52889 -80723 -91471 -61189 -89020 -59959 -59861 -76277 -20611 -101325 -42528
12482 -42528 -108751 -70910 -80478 -53478 -97126 -124354 -75210 -145238 -113459 -54483 -60355 -62154
12470f2154L1206n3531J7282n0363K9055J1834J4066J7331l4386K5128p0182M4396
12458h0318J1269J5398N386l0078N73K1343j3643r74Q647j2227J6579Q277l6078
12445h5846M5795j0813l1656M527M6588m7025K5271K8727m3708k1747J9367k1961
12433i2481Q8248p9080J1436J6044m3891M2256J2978l6295O0810o0763K6543K1025
12421c3170N6316j19383M7593J897m0779N4405n8540K7655L8191m3864N4831k8204
12409d3052J339k0061j652O327P366j6889L4659k0972J2779j2184n4382K3794
12397h2928N1629O185j8669L2997m5784J3387l4222Q4156k5410p0137J5592L9645
12385c3559K1653M0101o0121J2903m350j68o4981R0383k7594N3506r2264K374
$$ plain form
12470 -62154 -30948 -84479 -67197 -117560 -88505 -76671 -62605 -45274 -79660 -54532 -124714 -80318
12458 -80318 -69049 -53651 -48265 -78343 -77770 -56427 -70070 -71044 -62397 -74624 -58045 -49768 -85846
12445 -85846 -40051 -50864 -82520 -77993 -31405 -78430 -53159 -24432 -68140 -89887 -70520 -92481
12433 -92481 -4233 -83313 -71877 -55833 -99724 -57468 -44490 -80785 -19975 -80738 -54195 -33170
12421 -33170 23146 -96237 -48644 -46747 -87526 -33121 -91661 -64006 -25815 -69679 -14848 -43052
12409 -43052 -41713 -61774 -63426 -57099 -49733 -66622 -31963 -52935 -40156 -52340 -106722 -82928
12397 -82928 -31299 -25114 -43783 -10786 -56570 -43183 -77405 6751 -18659 -88796 -73204 -33559
12385 -33559 -11906 28195 -31926 -19023 -23373 -23541 -88522 1861 -25733 27773 -64491 -62117
12373f2117K5365j8663M4546l6019M9494n864n8502J6360N8243n3132L9169k840
12361c960K5197n5250N942L9014l2563L311K4530K4086k3809l7373L380M4583
12349A7088q50M9789l8972j7508Q989j2119k5090K6387M4197P867n6752M0113
12337D3139l208j6629j7202K8951K4927l262J0182K435K4378m2636J8967p619
12325F2423N7593n97k1164K5770j8216L9855m58L2711O7209n1781K9972K9727
12313B53044N0201l2345J15871K0672L0953N4383J1587J01696Q1072L4063K06088
12302I27285O9991K65276N20023J142080J941739J367845R74701L731l74409r29838
12292E908424j441676r62490p61774o15101m84645m34808l53792j22162j54528
$$ plain form
12373 -62117 -36752 -55415 -10869 -46888 2606 -3258 -61760 -45400 12843 -40289 -1120 -3960
12361 -3960 21237 -34013 -28071 10943 -21620 -18309 6221 30307 6498 -30875 -27495 17088
12349 17088 16238 66027 27055 9547 18536 6417 -18673 7714 51911 59778 3026 43139
12337 43139 39931 23302 6100 35051 59978 56716 66898 69333 93711 51075 70042 62423
12325 62423 120016 119419 98255 124025 105809 145664 145206 177917 245126 193345 223317 253044
12313 253044 303245 270900 386771 407443 438396 492779 504366 606062 687134 721197 927285
12302 927285 997276 1262552 1782575 2924655 4866394 6234239 7208940 7212671 6838262 5908424
12292 5908424 4466748 3504258 2742484 2127383 1642738 1207930 854138 731976 577448
12283E77448m5450r0472p627m6746k9059K90j9281n8709l3698R805j6079J6377
12271B56799r758p4017J2997L3192m8058j9066m314K8492l1905k8905j1911L2354
12259A35900l5889K0810R944Q840m5178j578J968L6817q4669Q107N9490m3472
12247G1090l2325L062Q2K9622p4943N5177o2720L9184m473q247J5534J0334p8342
12234c6965J4982O7688n9231L7434j7583p392k5025J9964P91J2675l3471j3102
12222c9235R797O8349l5914m6028J291J1426J8236k4395K8967J1379n7772K8316
12210b5583K4867J0095n7618K2684m9231P4244J1754m2445o328J601m2213N2876
12198b5297m0661J05135n1563j9096K7496p1990M7151p9100O2027K1629o1048
$$ plain form
12283 577448 531998 441526 433899 387153 358094 358384 339103 280394 246696 256501 240422 256799
12271 256799 247041 173024 186021 219213 171155 152089 147775 176267 144362 115457 103546 135900
12259 135900 100011 120821 130765 139605 94427 92849 94817 131634 46965 55072 114562 71090
12247 71090 38765 41827 41909 71531 -3412 51765 -10955 28229 23756 15509 31043 41377 -36965
12234 -36965 -21983 45705 -13526 23908 6325 -1067 -26092 -6128 -5337 7338 -26133 -39235
12222 -39235 -29438 38911 2997 -43031 -41740 -30314 -12078 -36473 -7506 3873 -53899 -25583
12210 -25583 -716 9379 -48239 -25555 -74786 -542 11212 -31233 -37561 -35960 -78173 -25297
12198 -25297 -65958 39177 -12386 -31482 -3986 -75976 -28825 -107925 -45898 -24269 -85317
12187h5317M165M1736k6144r392M874l408L1105m6320J496n573N5843l4208K1130
12174e0013M3195n008K6541q8717O5588p8539L9940J7262q924k5597j8698L320
12162g9650J876K1286N0j9497K5256k2986J7820M1598n8960J6912p115K024J497
12149e9889J4693j5146J334L004J2768m3447l1625O3329P0982q4280J579j5800
12137h2498M7337j3252j9935L0320m1938O01K1904j1730m547l3426J0681M2347
12125e4136o623k3369J0430r137M2818o9799K1047J0163m3255L3407N9189k2497
12113e1762k2313K158j1625J8410j1719j8251j8177L7372l2454J9366J0764k9524
12101a07755L6273m417M596K3799j8730j9451M4325L464o3013m173K0451o5899
$$ plain form
12187 -85317 -81152 -39416 -65560 -74952 -70078 -73486 -42381 -88701 -87205 -92778 -36935 -71143 -50013
12174 -50013 -6818 -11826 14715 -74002 -8414 -86953 -47013 -29751 -38675 -64272 -82970 -79650
12162 -79650 -77774 -56488 -56438 -75935 -50679 -73665 -55845 -14247 -73207 -56295 -63410 -61386 -59889
12149 -59889 -45196 -60342 -59008 -56004 -43236 -86683 -118308 -54979 16003 -68277 -66698 -82498
12137 -82498 -35161 -48413 -68348 -38028 -79966 -79365 -57461 -69191 -73738 -107164 -96483 -54136
12125 -54136 -60759 -84128 -73698 -82835 -40017 -109816 -88769 -78606 -121861 -88454 -29265 -51762
12113 -51762 -74075 -71917 -83542 -65132 -76851 -95102 -113279 -75907 -108361 -88995 -78231 -107755
12101 -107755 -71482 -75899 -71303 -47504 -66234 -85685 -41360 -37896 -100909 -105082 -84631 -150530
12089a50530Q5945K2566m08m2205k5047M8533k7392j3994M9125K426k4789K1919
12077e3851k0429M674l1605N0842J921l1008j1068M690k482p295n321N4685k3873
12064g0120J6684l275j7860J7318k7239j8904L5811L318j2530n3628M9470J0961
12052f9994l8698Q7603o9205L0017n6499L3408j5023L7084l88j3858n786l9200
12040a20539L2154p081R661L9541m4099L9279k4735o541K9006k6759p218J2022
12028g5309p5954R3473k050K0636l029p6231K7060J0439M7152p1588J4977K2084
12016f8340p6483O3096k1786J3313L71K0520m0965N3425j9776k9041k1766N8729
12004f8703P148n7254K0673L2982m0342L9661M5209k2625k7625k7884K2557j9361
$$ plain form
12089 -150530 -64585 -42019 -42427 -84632 -109679 -61146 -88538 -102532 -53407 -50981 -75770 -53851
12077 -53851 -74280 -69606 -101211 -50369 -48448 -79456 -90524 -85834 -88316 -95611 -100932 -46247 -70120
12064 -70120 -53436 -56711 -74571 -57253 -84492 -103396 -67585 -64267 -76797 -130425 -80955 -69994
12052 -69994 -108692 -21089 -90294 -60277 -116776 -83368 -98391 -61307 -61695 -75553 -81339 -120539
12040 -120539 -88385 -95466 -85805 -46264 -90363 -51084 -75819 -82360 -53354 -80113 -87331 -75309
12028 -75309 -151263 -57790 -59840 -39204 -42233 -118464 -91404 -80965 -33813 -105401 -90424 -68340
12016 -68340 -144823 -81727 -103513 -90200 -89829 -69309 -110274 -56849 -76625 -105666 -127432 -68703
12004 -68703 -61555 -118809 -98136 -65154 -105496 -65835 -20626 -43251 -70876 -98760 -76203 -95564
11992i5564k3650M2277j7247K5510o2923N8839k2922K9535n6343L5674l1738O0579
11980e7973j5463m5869N3031n8509L2721L2930j05354R8033K7014j18354Q5823
11969g1970M1364n3785q04n0600Q9327n9517Q15M5512J155k9484n7196P4238k1699
11956i2644j5800L0035L436K7105l5056j6204N7192K865n9909L9808J9529m6441
11944h6084K6183n6214J2900j7749M9180k3251J6006l2518Q806l273N8948j8397
11932f5463n6985K5979P012K2171k8689L0605j3059m2599O4485n3835J2595M2912
11920e4871m2815Q042L8855n1281k5621N3376m7818L8750k749J1025o0183k5421
11908a60711R0569K8248k8278K5375o1580M1871J3746n3447N9867n8793O9997
$$ plain form
11992 -95564 -119214 -76937 -94184 -68674 -131597 -72758 -95680 -66145 -122488 -86814 -118552 -57973
11980 -57973 -73436 -119305 -66274 -124783 -92062 -59132 -164486 -66453 -39439 -157793 -71970
11969 -71970 -30606 -84391 -85195 -135795 -46468 -105985 -105170 -59658 -58503 -87987 -145183 -70945 -92644
11956 -92644 -108444 -78409 -74973 -47868 -82924 -99128 -41936 -39071 -98980 -59172 -39643 -86084
11944 -86084 -59901 -116115 -103215 -120964 -71784 -95035 -79029 -111547 -102741 -106014 -47066 -65463
11932 -65463 -122448 -96469 -89457 -67286 -95975 -65370 -78429 -121028 -56543 -110378 -97783 -54871
11920 -54871 -97686 -89644 -50789 -102070 -127691 -74315 -122133 -83383 -86132 -75107 -135290 -160711
11908 -160711 -70142 -41894 -70172 -44797 -106377 -64506 -50760 -104207 -44340 -103133 -33136
11897c3136l3613m1083N1636n155m0244J5293J5098o448p8458N9336O0319k3364
11885e9819j449k3809J2639l6326J00300q7278N1589J1728j2261r915Q0519n5752
11873b9834k6609o5947N0864k2419N7747l5200k4794L0507M8523n6272K1548n3745
11861a05631J7219M1783j9705n9271K7380J2925M5702k4649M352m1921k4193Q2193
11849d3816k1730K9448n2875M93o241J2352j3193J4696Q584q120M819l316k0007
11836i8906J9606K6589m134k5187O4395p0059j2459k9443N3345j6967L0969l4127
11824i6378O8546n0612k6792J7817j421Q578k6567N9263l6018l6182K9199N6491
11812c4076j6045l2477K5310n4919K3029M1907k7834K5571p3223K1407j468L2070
$$ plain form
11897 -33136 -66749 -107832 -56196 -61351 -101595 -86302 -71204 -77652 -156110 -96774 -36455 -59819
11885 -59819 -61268 -85077 -72438 -108764 -8464 -95742 -44153 -32425 -44686 -54601 25918 -29834
11873 -29834 -56443 -122390 -71526 -93945 -36198 -71398 -96192 -65685 -17162 -73434 -51886 -105631
11861 -105631 -88412 -46629 -66334 -125605 -98225 -85300 -39598 -64247 -59895 -101816 -126009 -43816
11849 -43816 -65546 -36098 -88973 -88480 -94721 -82369 -95562 -80866 -72282 -80402 -75583 -78899 -98906
11836 -98906 -79300 -52711 -56845 -82032 -17637 -87696 -100155 -129598 -76253 -93220 -62251 -96378
11824 -96378 -27832 -78444 -105236 -87419 -88840 -80262 -106829 -47566 -83584 -119766 -90567 -34076
11812 -34076 -50121 -82598 -57288 -112207 -89178 -47271 -75105 -49534 -122757 -101350 -102818 -70748
11800g0748l6742j6311K2689L0809m4411J2980K9894k4900M2781m5051R97J3025
11788h4988l2258L1927M3765j2634L327n1265k287M7856J7828o3702K3696k7792
11776a06527k3318N4927j772L4911o8152j0197P3848l6151o1303M1870N337J01507
11764D980j12844N8020k6234R979n362J2823j0460l3302K9189j0644j7054M0718
11752f0191n407p2m3271N3927j3608o561k0698j0575N838L558L981J24m6572M0128
11738i9399L2751K2548l0330l6741N2163j7724n4r76j4970J7180K7132k1009N0949
11725a8480j2996n1287j1156k9291J08998p5984j798M934N4198l3589j6179J2286
11713g0344K6853j4004m8821L5469O220j9448j3752M3265m2731O7534p9834P5015
$$ plain form
11800 -70748 -107490 -123801 -101112 -70303 -114714 -101734 -71840 -96740 -53959 -99010 -98013 -84988
11788 -84988 -117246 -85319 -41554 -54188 -50861 -102126 -104413 -56557 -38729 -102431 -78735 -106527
11776 -106527 -129845 -74918 -76690 -41779 -109931 -120128 -46280 -82431 -143734 -101864 -96527 4980
11764 4980 -107864 -49844 -76078 -66099 -71461 -58638 -69098 -102400 -73211 -83855 -100909 -60191
11752 -60191 -65598 -65670 -108941 -55014 -68622 -75183 -95881 -106456 -100618 -97060 -93079 -92955 -139527 -99399
11738 -99399 -66648 -44100 -74430 -111171 -59008 -76732 -76786 -77762 -92732 -75552 -48420 -69429 -18480
11725 -18480 -31476 -82763 -93919 -123210 -14212 -90196 -91994 -87060 -32862 -66451 -82630 -70344
11713 -70344 -43491 -57495 -106316 -70847 -64627 -84075 -97827 -54562 -97293 -29759 -109593 -34578
11701c4578l7534J763P707j2414J5309q978q315n179L3462m4371P111K2620k3730
11688h7127J5356l1405K5494P646K9943l0058J3760r184R233J1137k8364m8958
11676a22527N2668K2197p6981P3294k8754p416N5402m9894m4359O8014l8356J4851
11664h1861K9701J7866l5910o382N5589o0204L7030j3055K8079p7885J7152K751
11652h7129P9O2509j9511j9144M5061n4321j9051R1483k4608l4645j3428l0334
11640a03039L0175J7719k7799O807M913j0333K0283o7856O2717K2660n566l4992
11628h4311j5488J2877L8014k1688N1808m3420j2421j7688L8939q202J3693j9949
11616f7836L7121k9110L6811j7634l4475J9715Q204j3147o0447j0883Q851L1906
$$ plain form
11701 -34578 -72112 -70349 -62642 -75056 -59747 -68725 -77040 -82219 -48757 -93128 -86017 -63397 -87127
11688 -87127 -71771 -103176 -77682 -70036 -40093 -70151 -56391 -65575 -56342 -45205 -73569 -122527
11676 -122527 -69859 -47662 -124643 -51349 -80103 -87519 -32117 -82011 -126370 -58356 -96712 -81861
11664 -81861 -52160 -34294 -70204 -76586 -20997 -81201 -44171 -57226 -29147 -107032 -89880 -87129
11652 -87129 -87050 -24541 -44052 -63196 -18135 -72456 -91507 -24 -24632 -59277 -72705 -103039
11640 -103039 -72864 -55145 -82944 -76137 -71224 -81557 -61274 -129130 -66413 -43753 -49319 -84311
11628 -84311 -99799 -86922 -48908 -70596 -18788 -62208 -74629 -92317 -53378 -61580 -47887 -67836
11616 -67836 -30715 -59825 -23014 -40648 -75123 -55408 -47204 -60351 -120798 -131681 -122830 -90924
11604i0924J4710p488M8192m1616n917L6120l4802L1231l490l0636P921j2423
11592h9122j0655l2350L7353k57N0454j1570j6978j6878N1088r7366N7189k2548
11580a01640J04401j03654P3576m3986K3606l6211O4226l0412r738J8707n0751
11569i1876Q901J1573K022l942J7874l6700J0562N68j4542j4351L9366l267k7190
11556a01002M0643n1530K1425N4480o7219N8353k7975J2720j6777K9727l9099
11545h6254J0435K6946n3736L6125O2984o3968J067k3469O5742p891n7160J8052
11533g1127j4085l3607J1965N0768j0319n649K6817J7862J005l486J0912l6549
11521e5493j4060L2572j8589l9839N7760J442m6631K5635k3905K1895j8720L3385
$$ plain form
11604 -90924 -76214 -83702 -35510 -77126 -83043 -46923 -81725 -50494 -53984 -84620 -76699 -89122
11592 -89122 -99777 -132127 -94774 -95031 -44577 -56147 -73125 -90003 -38915 -136281 -79092 -101640
11580 -101640 2761 -100893 -27317 -71303 -47697 -83908 -19682 -50094 -59832 -41125 -91876
11569 -91876 -82975 -71402 -69380 -73322 -55448 -92148 -81586 -81018 -95560 -109911 -70545 -73812 -101002
11556 -101002 -60359 -111889 -90464 -35984 -103203 -44850 -72825 -60105 -76882 -47155 -86254
11545 -86254 -75819 -48873 -102609 -66484 -3500 -67468 -66401 -89870 -24128 -32019 -89179 -71127
11533 -71127 -85212 -118819 -106854 -56086 -66405 -72054 -45237 -27375 -26370 -29856 -18944 -55493
11521 -55493 -69553 -36981 -55570 -95409 -37649 -36207 -82838 -57203 -81108 -59213 -77933 -44548
11509d4548k1013K4682j9585l9163K77N6275n0652M1448k7176q1458R5911n3394
11497a18396P2732j4840K9433o183j8424l5479L6355l3184j2208N9525m6275N3068
11485c3876n200L90m1378n796N6878l2256m4090J1252J6788k0499K3381J7204
11473e7202n0856Q4789q1074N4776J4709k8279J1145j7529N752L1649m6339O32
11461g7827M0430p273J0224k4316m5774K0952M7911r256k0029k4125K6406L4912
11449b7765j2572o3707L3997M1475k4496m1690P3116n4971L3991j4041O0288m2505
11437c8880m0418L3618k8723J3888J5708m4729K0210p346L0922l4513K4074K6604
11425b9585k8931J4278L9799m5782r497M213K372J3434l794k843M246l5060l3096
$$ plain form
11509 -44548 -65561 -40879 -60464 -99627 -99350 -43075 -93727 -52279 -79455 -160913 -65002 -118396
11497 -118396 -45664 -60504 -31071 -37254 -55678 -91157 -54802 -87986 -100194 -40669 -86944 -33876
11485 -33876 -39076 -38686 -80064 -85860 -28982 -61238 -105328 -94076 -77288 -97787 -74406 -57202
11473 -57202 -108058 -23269 -104343 -49567 -34858 -63137 -51992 -69521 -63769 -32120 -78459 -77827
11461 -77827 -37397 -44670 -34446 -58762 -104536 -83584 -35673 -44929 -64958 -89083 -62677 -27765
11449 -27765 -40337 -104044 -70047 -28572 -53068 -94758 -21642 -76613 -42622 -56663 3625 -38880
11437 -38880 -79298 -45680 -74403 -60515 -44807 -89536 -69326 -76672 -45750 -80263 -56189 -29585
11425 -29585 -58516 -44238 -4439 -50221 -59718 -55505 -53133 -39699 -43493 -46336 -42090 -77150 -110246
11412a10246Q2698k5104p22J6607j5671M8589k7061j2626n1480K8483K4867l5345
11400g7011R4335o7034k3315L4075m0519r390M4926l2324m192K8203j7988L3162
11388c7072M53l2485L2900l0981M8332k6806J8923j6251M7529q3561N631o310
11376g9698K3295J711L6K3219k2544l4681M9503K4350k4068k6087q643J0248J2616
11363e0743J5837p620L0345j0511k9059j3113j970M0888j7519p977o71q47K5327
11350b7633J2518j5780J2902k3683j811l168K8952p5269O0397m056q132L9154
11338e609k4633N667k0866p0648M8164L8497m5836j4275J5924L4723j9431K9005
11326b9318o0830L0024J9920l0546N1846k0475j5597o209k6184P2515n0650l9980
$$ plain form
11412 -110246 -27548 -52652 -53374 -36767 -52438 -3849 -30910 -43536 -95016 -66533 -41666 -77011
11400 -77011 17324 -49710 -73025 -38950 -79469 -88859 -43933 -76257 -80449 -52246 -70234 -37072
11388 -37072 -36619 -69104 -36204 -67185 -18853 -45659 -26736 -42987 4542 -79019 -73388 -79698
11376 -79698 -56403 -54692 -54656 -31437 -53981 -88662 -39159 -14809 -38877 -64964 -73607 -63359 -50743
11363 -50743 -34906 -42526 -12181 -22692 -51751 -64864 -66834 -25946 -43465 -51442 -52113 -52960 -27633
11350 -27633 -15115 -30895 -17993 -41676 -43487 -46655 -17703 -92972 -32575 -36631 -44763 -5609
11338 -5609 -30242 -24575 -45441 -116089 -67925 -29428 -75264 -89539 -73615 -38892 -58323 -29318
11326 -29318 -90148 -60124 -40204 -70750 -18904 -39379 -54976 -61185 -87369 -14854 -65504 -105484
11314a05484N1645l315J9115m4297L4068L2644n0487K9330j2912p668k6693O4803
11302a9251m4024k654M8432k9661J7667m3141O4001K9680n5628m2178n399L0523
11290e1633j7864L4938M8623q8548J8522J7593o577L2968j7462L6873j6699j300
11278a0566o415q3044R0529l4689k2895l448O7457r3266Q1307j4403m1753M483
11266f6703k059N890j0030K3990J3141m0870M6952l1822M1885p2705O7663q685
11254c3353n5518O7024n9598J512M756J2005K797j255r278l1165R0732k8626j9304
11241e9271p999j6916N3625m8814J7141J2152P952j3028L0281o9560M4178J671
11229d8588j3693K8418n708k8019M8385o3505L0389k804L0645J6684k6953p8421
$$ plain form
11314 -105484 -53839 -57154 -38039 -82336 -48268 -15624 -66111 -36781 -49693 -57361 -84054 -19251
11302 -19251 -63275 -65929 -17497 -47158 -29491 -72632 -8631 21049 -34579 -76757 -82156 -51633
11290 -51633 -69497 -34559 14064 -74484 -55962 -38369 -44946 -11978 -29440 7433 -9266 -10566
11278 -10566 -16981 -100025 -9496 -44185 -67080 -70528 -3071 -96337 -15030 -29433 -71186 -66703
11266 -66703 -68762 -62872 -72902 -48912 -35771 -76641 -29689 -61511 -19626 -92331 -24668 -33353
11254 -33353 -88871 -21847 -81445 -79933 -75177 -63172 -60375 -61630 -70908 -102073 -11341 -39967 -59271
11241 -59271 -67270 -84186 -30561 -79375 -62234 -50082 -42130 -55158 -24877 -94437 -50259 -48588
11229 -48588 -62281 -33863 -39571 -67590 -19205 -82710 -52321 -55125 -24480 -7796 -34749 -113170
11217a13170Q3102j1083m1968L193K1978M7197l4752L1388K1726k3717j7930N081
11205b8955o323j2607l4095K9969k9176M1426p98Q067Q679L612j613R856m820
11192a6778j7443o3828O8591j7626j6683R259k0420K2311K9643m7755N2620K4708
11180F599n5457j0257O4264o4453K7032l2539J9402K0048p042k4380L3180n3057
11168g6660O3213l4336K3601m5581n84K2823L3645k2977j4246P338m88N1970n2918
11155d5200o262J999J9818j4397M953J1265j0745L6020j9478L4512o7734J076
11143e4173k3711J5807P371M7580o7833L1851L760N300K088k1150R236m205K9685
11130a8394r079m766m6303J2329L8217n108j276O714L839k1122j5044O0535p8152
$$ plain form
11217 -113170 -30068 -41151 -83119 -79926 -57948 -10751 -45503 -14115 7611 -16106 -34036 -28955
11205 -28955 -35278 -47885 -81980 -52011 -81187 -39761 -40559 -32492 -23813 -20201 -21814 -11958 -16778
11192 -16778 -34221 -98049 -29458 -47084 -63767 -54508 -74928 -52617 -22974 -70729 -18109 6599
11180 6599 -48858 -59115 5149 -59304 -32272 -64811 -45409 -25361 -32403 -56783 -23603 -76660
11168 -76660 -13447 -47783 -24182 -69763 -70347 -47524 -13879 -36856 -51102 -43764 -44252 7718 -45200
11155 -45200 -51462 -49463 -29645 -44042 -39089 -27824 -38569 -2549 -22027 12485 -55249 -54173
11143 -54173 -77884 -62077 -54706 -7126 -74959 -43108 -39348 -34048 -31960 -53110 -43874 -48079 -18394
11130 -18394 -27473 -32239 -78542 -66213 -27996 -33104 -34380 -27666 -23827 -44949 -59993 542 -77610
11117g7610q254Q6277n6668K4101K3369l1731L7383k4256j7821L8900k9500n5749
11105i1559N6985J545L785k6725P845k070K9072J3621j1776O943m8047Q3932l5250
11092a1699k5542k2043L6297l4400m579K8492J2366p941K5399j4418P271q709
11080a9506k8108J2789K4132J6640m4868M8547k1859j2436K3210n3681J7J8116
11068c7007k3090M4341J2112p9549P4331o9009L2677P607M1284J4371n2933L49
11056c4516l5131P361M1902k4310O317K9028j5421j0705J122K9876l1237K3392
11044a2322j0468j5080R500n773K2833L5410m2177l3246j7561O0422k6097k7051
11032f1610M5216J9921p3819M1859j7781L9367m2704m3157Q37M6285K9530q8844
$$ plain form
11117 -77610 -85864 413 -56255 -32154 -8785 -40516 -3133 -27389 -45210 -6310 -35810 -91559
11105 -91559 -34574 -33029 -29244 -55969 -48124 -50194 -21122 -7501 -19277 -12334 -60381 23551 -11699
11092 -11699 -37241 -59284 -22987 -57387 -61966 -33474 -21108 -29049 -3650 -18068 -10797 -19506
11080 -19506 -47614 -34825 -10693 5947 -38921 9626 -12233 -24669 -1459 -55140 -55123 -37007
11068 -37007 -60097 -15756 -3644 -83193 -8862 -77871 -45194 -37587 3697 18068 -34865 -34516
11056 -34516 -69647 -62286 -20384 -44694 -38377 -9349 -24770 -35475 -34353 -4477 -35714 -12322
11044 -12322 -22790 -37870 -28370 -34143 -11310 24100 -18077 -51323 -68884 -8462 -34559 -61610
11032 -61610 -16394 3527 -70292 -28433 -46214 -6847 -49551 -92708 -91871 -45586 -16056 -104900
11020a04900K2601R3559j8200m3178j7744L9052j3752K8642o423k8171l0263O1621
11008a7156j0480K1913n9857p889J0394j761L4425L9709k4747j2529k1229K1594
10996b7613P604k0828O054j3099P2748p6035l3931M4691j2231L1623o015J0113
10984a6919l2247L0945r175K5226l0080J0723l3273L6316j6923k2903L265J0466
10972d4579J5356n8248L4833K2535m1375J4N6855k9949L0667q740j2185J2243
10960b2573P3872j2653o6735L4931l8981m3963L0585K2359M7241q250n1563O7741
10948C2011J1752q6920L3788l1032J6295k977n2618J5970L0344l2511l00M6504
10936a9694J588k9824J1652M84J9602l5166K5356K8120j9434k8152K1065J2338
$$ plain form
11020 -104900 -82299 11260 -6940 -50118 -67862 -28810 -42562 -13920 -20343 -48514 -78777 -17156
11008 -17156 -27636 -5723 -65580 -73469 -63075 -64836 -30411 9298 -15449 -27978 -49207 -27613
10996 -27613 -20009 -40837 -34783 -47882 24866 -51169 -85100 -40409 -52640 -21017 -27032 -16919
10984 -16919 -49166 -18221 -27396 -2170 -32250 -21527 -54800 -18484 -35407 -58310 -55045 -44579
10972 -44579 -29223 -87471 -52638 -30103 -71478 -71464 -14609 -44558 -13891 -22631 -34816 -22573
10960 -22573 51299 38646 -28089 6842 -32139 -76102 -45517 -23158 24083 15833 -35730 32011
10948 32011 43763 -43157 -9369 -40401 -24106 -27083 -79701 -63731 -33387 -65898 -66198 -19694
10936 -19694 -18106 -47930 -36278 -35794 -16192 -51358 -26002 2118 -17316 -45468 -24403 -12065
10924a2065K1429m1295J6085p4652P1897n6371K7525k7796K3739k207J4231O768
10912c2712j356J027j5868M2375k4911K828P5960p1919j8261l0761J3643L5476
10900b4479N6612o1535K8012r359l640p508m9198L0199K7919j6692O010J5105
10888h554p661O351k9851L3955o121n6225K2854L8899l5702M8063l0858k0127
10876d4977O1081m3122r050L7527m9273L5076n278K18j4608J3819j3708J3089
10864a9206P838J019o4807L9575Q0583M197n1134m2729O7003k2416J6339K767
10852A9029k3164M3059l0325j2458M9424n4676L3994J1907l8969L3053l387K2309
10840D9796j9317r216N9757l2917K4995k7569Q436M7250k0744L7960j11545K2486
$$ plain form
10924 -12065 9364 -31931 -15846 -90498 -18601 -74972 -47447 -75243 -51504 -53711 -39480 -32712
10912 -32712 -34068 -33041 -48909 -6534 -31445 -28617 47343 -24576 -42837 -73598 -59955 -24479
10900 -24479 32133 -29402 -1390 -10749 -14389 -21897 -71095 -40896 -12977 -29669 -23659 -8554
10888 -8554 -16215 -9864 -39715 -5760 -11881 -68106 -45252 -6353 -42055 6008 -24850 -44977
10876 -44977 16104 -27018 -36068 1459 -47814 -12738 -18016 -17798 -32406 -18587 -32295 -19206
10864 -19206 -11368 -10349 -75156 -35581 45002 49199 -1935 -44664 22339 -77 16262 19029
10852 19029 -4135 38924 8599 -3859 45565 -9111 24883 36790 -2179 30874 27487 49796
10840 49796 30479 21263 81020 48103 73098 45529 53965 101215 80471 118431 6886 29372
10828B9372K1000J172o1263M1142k9852K4543j3185J0287J047k4574J310l687
10816b688l599K248p4238O1381J6341L0636o3881O1284m3391L8278j038l3936
10804a2603K3380m9971L0116q981j2018J7251l507L5579l1925L6575k0601L767
10792G062m1965P1441p2442M6585k1803J4046k4911n1553N1937L0362l3311K2885
10780a667m394m4166k299L0424J3011L3067J2624m5706k3682O7977r3470M2266
10768a6015O175N5339n3857J6251n9209O660K9214o486M9540m992l9441K4881
10756H060k6264L4000l1495q571R694K3906o917l8877K5801Q850m1985J1516L245
10743b9037O1693q9972P0298j4193N597K0499n9407Q2037n0887K2314l1852j5991
$$ plain form
10828 29372 50372 51544 -9719 31423 1571 26114 12929 23216 24263 -311 999 -2688
10816 -2688 -6287 -4039 -78277 -16896 -555 30081 -33800 27484 -15907 22371 21333 -12603
10804 -12603 10777 -39194 -9078 -18059 -30077 -12826 -16333 19246 -12679 23896 3295 7062
10792 7062 -34903 36538 -35904 10681 -11122 2924 -21987 -73540 -21603 8759 -24552 -1667
10780 -1667 -6061 -50227 -52526 -22102 -9091 23976 36600 -9106 -32788 35189 -58281 -16015
10768 -16015 -9840 45499 -8358 7893 -51316 -44656 -15442 -21928 27612 22620 -16821 8060
10756 8060 -18204 15796 -15699 -24270 -14576 9330 2413 -36464 -10663 -1813 -43798 -32282 -29037
10743 -29037 32656 -57316 12982 -1211 4386 24885 -34522 47515 -3372 18942 -12910 -28901
10731b8901L396j6807N8977m5069K3209l3990L3165j3427k9358j6371K7529K9750
10719g897q287p390J9790L531m9519L8453K1569j4267J5161k7077N0280o2914
10707b8567J2016l4610P9525n7836M9265q9272R2239n2220k3967M102O2244m9547
10695c6628j2344K5890L1331r1969Q4902K0228l7147l079L0162l5997j0102J6305
10683a8448L4085j3934o3352M1908p205j2563K9310l766j5934l2192O0115k8942
10671c0918J9970k644l0652M8701R659L43P725l2437M1915n43m5895j9303N8108
10658B4029n3544l747K6816k8898J1754J7775k3479r095K7718o258O246p531q931
10645b7145K2571P4978p2202o374q946o0933R7804p611j7908K1779k5298L2446
$$ plain form
10731 -28901 -25505 -42312 16665 -28404 -5195 -39185 -6020 -19447 -48805 -65176 -37647 -7897
10719 -7897 -16184 -23574 -3784 -253 -49772 -11319 10250 -4017 11144 -15933 34347 -28567
10707 -28567 -16551 -51161 28364 -29472 19793 -69479 22760 -29460 -53427 -49325 12919 -36628
10695 -36628 -48972 -23082 8249 -83720 1182 21410 -15737 -18816 11346 -24651 -34753 -18448
10683 -18448 15637 1703 -61649 -19741 -26946 -39509 -10199 -13965 -29899 -62091 -1976 -30918
10671 -30918 -10948 -13592 -44244 4457 14116 14459 22184 -10253 31662 31119 -14776 -34079 24029
10658 24029 -29515 -33262 -6446 -35344 -23590 -5815 -29294 -38389 -10671 -16929 -10683 -18214 -27145
10645 -27145 -4574 70404 -1798 -8172 -17118 -78051 19753 12142 -5766 16013 -9285 23161
10633B3161m8244K6808K4402k7906N367m3353M1049j3471R031M00m11N3796n7044
10620f415n3209O2315k6600J3281K4949m4111R7652n5598j9184j6654l560M3152
10608A6018l8929k184N1175K275o0236L6335m0595L8281p082j1490O4662m3518
10596D712K1303n9404K5051N5840l358j4893l1604j0984m2862J02641r7642O4431
10584A3231j8911l6445M4744L2049l8958J5112J8102l9941K7151o7078P1483m3829
10572b3290J3867j7227l7364L3325L7635n020o617j054L1710K0330J910m3277
10560D928j0268N6426j9825n5333L0180m159k4836K6917N050q116L6399l442Q86
10547C4807R937r789n5253P7848K0847l7387O612J6256j5362J7961j5398l573
$$ plain form
10633 23161 -25083 1725 26127 -1779 3588 -39765 1284 -12187 -3156 -2756 -3167 50629 -6415
10620 -6415 -59624 2691 -23909 -10628 14321 -29790 67862 12264 -6920 -23574 -27134 16018
10608 16018 -22911 -25095 26080 28355 -31881 4454 -36141 2140 -4942 -16432 48230 4712
10596 4712 26015 -33389 -8338 47502 44144 29251 -2353 -13337 -56199 46442 -51200 13231
10584 13231 -5680 -42125 2619 34668 -4290 10822 28924 -11017 16134 -50944 20539 -23290
10572 -23290 -9423 -26650 -64014 -30689 6946 1926 -4691 -5745 25965 46295 48205 4928
10560 4928 -5340 51086 31261 -24072 6108 1949 -22887 4030 9080 964 37363 33921 34807
10547 34807 44744 34955 -20298 57550 78397 41010 47622 63878 48516 66477 51079 47506
10535D7506m784k3653M6332L1857l5757K42R252k7933O117K2442n3206O750L1227
10522E6392K3123n5170K6632k9592N7379j790K7565q0103M2151j2580K2967L7444
10510A14418k6774M0797o8488l043L1037n8536K8501Q052K6855J200l2587j2768
10498D8664p408p317M6138R16P148k5665N7460m3571J2816p1294J05861p3054
10486E0694j691k1575L445J4636j8416r630O3601o2240K6052N3998l1393k8237
10474C9244r554M8432m8510K0168J1714r373J699j5671P599M4819k7415M569j6019
10461E1702p787J4786q064o597J1555J8146K6271l4778k7889J0869N9535n9361
10449D8388K0935K8280n2980M2712j3912M2997p9892J1552M1548p6006P7004o8492
$$ plain form
10535 47506 42722 19069 65401 97258 61501 61743 70995 43062 49179 71621 18415 25165 56392
10522 56392 79515 24345 50977 21385 78764 76974 104539 24436 66587 54007 76974 114418
10510 114418 87644 128441 59953 56910 87947 29411 57912 65964 92819 94019 61432 48664
10498 48664 41256 33939 80077 80993 88141 62476 119936 76365 89181 17887 123748 50694
10486 50694 49003 27428 30873 45509 27093 17463 81064 18824 44876 98874 67481 39244
10474 39244 29690 78122 29612 49780 61494 52121 53820 38149 45748 90567 63152 67721 51702
10461 51702 43915 58701 50637 44040 55595 73741 100012 65234 37345 48214 107749 48388
10449 48388 69323 97603 44623 87335 73423 116420 36528 48080 89628 13622 90626 22134
10437B2134N9950j9397k4298L4978l933j7899j1553N3710l1260l4506j5847R6821
10425A08900n0376Q296j5485Q6084p9475J5644J2783n3449K1783N606j1334K5991
10413G4968K731J0153n1714K718J4176M4743m0627K6983J47n5748M2640J9630
10401I0800J4490l5745O550n637k0901P4230o9324J9742K0780o513L0847L0977
10389A50296m6490R257k1026l337j8495L8241Q089j1360J9087j5032k7892L3497
10377A14835m842N4335p9562L635M4758j7089n743M3705r0432N5002J0764L3770
10365A63136k6416j7647N771J8818K2506m7952k882K0441J4048l0422M3793o1153
10353A02041P2527k1494K6340k0696L9964n4465o53K9541J1693J0241m3584K8990
$$ plain form
10437 22134 82084 62687 38389 73367 69434 51535 39982 93692 62432 27926 12079 108900
10425 108900 58524 66820 51335 137419 57944 73588 86371 32922 54705 60311 48977 74968
10413 74968 77699 87852 36138 38856 53032 97775 57148 84131 84278 28530 71170 90800
10401 90800 105290 69545 76095 70458 49557 123787 54463 74205 94985 88472 119319 150296
10389 150296 103806 113063 92037 88700 70205 108446 116535 105175 124262 109230 81338 114835
10377 114835 109993 164328 84766 88401 133159 116070 110327 154032 63600 118602 129366 163136
10365 163136 136720 119073 124844 143662 166168 118216 115334 135775 149823 119401 163194 102041
10353 102041 174568 153074 179414 158718 198682 144217 143564 173105 184798 195039 151455 180445
10341A80445k9422L1536j609n7604M0481O5017k4671J7274M252N277j9418k5970
10329A85588K8351L0413l7798k6196K6419l5295R8434m90J2874k0544K6698j3517
10317B74937j1k0623K406l7376O3576l076m1826J5579M0095K9529L1540p3228
10305B81522L0183n0044N7392k870J9279o690k1970K1355K5526J6960j0793M072
10293C63922q964L0534N477n464J2065k9333J176K3245K2482M7594p1170L7684
10281D29248K0528k3553o836M6688R722j6770K4324j3939L3590Q352m4174K6156
10269D93336Q044N0432j4554K0025L5491J8688j470N1760q956j6181O8242q149
10257F96708J9532O6999K833M1643N0603K5583M7444O84P9082L7244J10923J5125
$$ plain form
10341 180445 151023 182559 180950 123346 163827 228844 204173 221447 225699 230976 211558 185588
10329 185588 213939 244352 206554 180358 206777 171482 269916 269426 282300 261756 288454 274937
10317 274937 274926 254303 256709 219333 282909 279833 238007 253586 293681 323210 354750 281522
10305 281522 311705 261661 319053 316183 335462 328772 306802 328157 353683 370643 359850 363922
10293 363922 354958 385492 390969 385505 397570 368237 369413 392658 415140 462734 391564 429248
10281 429248 449776 426223 419387 466075 475797 459027 483351 469412 503002 511354 467180 493336
10269 493336 501380 551812 537258 557283 592774 611462 609992 661752 652796 636615 704857 696708
10257 696708 716240 783239 786072 827715 878318 903901 951345 952029 1031111 1068355 1179278 1194403
10245A194403R5472J32853N5505J52228J66000K78263J87198L46608N52208P26205
10235C886943R16813R69627P64094L22258L0691k94187m15034n23473l14339k45584
10225E097809j05968Q385J48802K47263K76125K82953L54400L04595M66272M98674
10215G579310N44641N14269K29351j7261l12359m28980l43051k84837l13252k68436
10205F899395k61008j83406k01285l00192q6656j39866K3975J40726M10282N76751
10195F878716O83491N46187K06114j81347m97130p87731q19733q30620o91725
10186D506222n84094m99930m66586k80283k30860o3358j17738m3150L379p9479
10176B144123o6609j5911j78495n3670j54277r5733n6776r0056L3566o355M0225
$$ plain form
10245 1194403 1289875 1422728 1478233 1630461 1796461 2074724 2261922 2608530 3160738 3886943
10235 3886943 4803756 5773383 6537477 6859735 6890426 6596239 6181205 5657732 5343393 5097809
10225 5097809 4991841 5000226 5149028 5396291 5672416 5955369 6309769 6614364 7080636 7579310
10215 7579310 8123951 8638220 8867571 8850310 8537951 8108971 7765920 7481083 7167831 6899395
10205 6899395 6638387 6454981 6253696 5953504 5866848 5726982 5750957 5891683 6301965 6878716
10195 6878716 7562207 8108394 8314508 8133161 7636031 6848300 6028567 5197947 4506222
10186 4506222 3922128 3422198 2955612 2675329 2444469 2381111 2263373 2220223 2223602 2144123
10176 2144123 2077514 2061603 1883108 1829438 1675161 1579428 1522652 1432596 1466162 1459807 1500032
10165A500032k6469j1525m0028n1644m3563n0722r0406j4306q7192j5231p0121
10154I98825j3308m7709k1613l3551L680j0080m0625J9793J8615n02k5390M3752
10142H91887k2507L3890m5724l4619L4206L9082o6J3532L8703M918O1668l4974
10130I79996n7786q3542m097n9843m6420o9663l5798N014N8682k8030o4336K7271
10118F21448j5476K808J8972j1384j8677m4094N2770n2968N3836m472J7236j6983
10106F03016N238K9872m4244q3701Q1381q4389J18544p9496N7191K0111m5772
10095E77751P3894l4133p71J0911l0309O9086m387l1279L2736k3065M381m077
10083F40738J0529N516j1101L341K6580K7634J9438p5611N8690l4216J993j1405
$$ plain form
10165 1500032 1473563 1462038 1422010 1370366 1326803 1276081 1185675 1171369 1084177 1068946 998825
10154 998825 985517 937808 916195 882644 886324 876244 835619 855412 874027 873525 848135 891887
10142 891887 869380 903270 857546 822927 857133 896215 896149 909681 948384 953302 1014970 979996
10130 979996 922210 838668 834571 774728 728308 658645 622847 627861 686543 658513 594177 621448
10118 621448 605972 608780 627752 616368 597691 553597 606367 553399 607235 602763 619999 603016
10106 603016 608254 638126 593882 510181 591562 507173 625717 546221 603412 623523 577751
10095 577751 651645 617512 616741 627652 597343 666429 662042 630763 663499 640434 644815 640738
10083 640738 651267 656783 645682 649023 675603 703237 722675 647064 705754 671538 673531 662126
10071F62126M9770r4464j6535J26692n1171k3266P7827J2608l4739j8088O7424
10060G58184L6495n8100K3832j3930L5961k128j3148O045J5103j8827J2609j8495
10048G63601K4509P2327q8465N6971j479J5409J032K7236m9774Q4311m1630M2908
10036I06956k9675J1358N4455j5273R187k0375N9486m1386J310l880J3204o87
10024I44680O805L3018k0416K4927N2516n2419M1539L0794n3426L8253N5851k7213
10012A074909M9211N68J9017L0170K7258k2471M8529K5720J5767j0411M7710K0524
10000A326501J6593J3916j4369M6547J4568m9792M4237M0387L619k100L9311n327
9988A474091K3119O4246M1253j8397J2365q981Q328R4474l0167R4174l4320L3922
$$ plain form
10071 662126 711896 617432 600897 727589 676418 653152 730979 743587 708848 690760 758184
10060 758184 794679 736579 760411 746481 782442 780314 767166 773211 788314 769487 782096 763601
10048 763601 788110 860437 771972 828943 827464 842873 843905 871141 821367 905678 864048 906956
10036 906956 877281 888639 943094 927821 937008 916633 976119 934733 936043 932163 945367 944680
10024 944680 951485 984503 964087 989014 1041530 989111 1030650 1061444 1008018 1046271 1102122 1074909
10012 1074909 1124120 1124688 1143705 1173875 1201133 1178662 1227191 1252911 1268678 1258267 1305977 1326501
10000 1326501 1343094 1357010 1342641 1389188 1403756 1353964 1398201 1438588 1442207 1440107 1479418 1474091
9988 1474091 1497210 1561456 1602709 1584312 1596677 1587696 1596024 1690498 1660331 1754505 1720185 1754107
9976A754107K6473j5185M7560R3143m8074l8739M3187P4043k0224k359Q8322K7618
9964B029872R804J9293P1401k9848M5945K7567K6655L0543O3309L1372K3378L0860
9952B380151N5059J5704O6011M7359N8484N9377J4152J428P1894M0871q859O6714
9940B868345M8706M9314J7806L2498O3714Q2242J1623R8107L9425O5463O5989
9929C443232L314J44505J5975Q1772N0620M1783M6152J02831Q5349N5695N2991
9918D124219J9609J13334L7664N9345J15902Q3715O6266P2813J02308Q1743Q6934
9907D963852R4518P6753R0984J10604J47043J36830J04244P5848J18524O7390
9897E986590P6203J63584R4470J08471J19004N9045J24256J73889J30683J50376
$$ plain form
9976 1754107 1780580 1765395 1812955 1906098 1858024 1819285 1862472 1936515 1916291 1913932 2002254 2029872
9964 2029872 2039676 2058969 2130370 2100522 2146467 2174034 2200689 2231232 2294541 2325913 2349291 2380151
9952 2380151 2435210 2450914 2516925 2564284 2622768 2682145 2696297 2697725 2769619 2810490 2801631 2868345
9940 2868345 2917051 2966365 2984171 3016669 3080383 3162625 3174248 3272355 3311780 3377243 3443232
9929 3443232 3446546 3591051 3607026 3688798 3739418 3781201 3827353 3930184 4015533 4071228 4124219
9918 4124219 4143828 4257162 4294826 4354171 4470073 4553788 4620054 4692867 4795175 4876918 4963852
9907 4963852 5058370 5135123 5226107 5336711 5483754 5620584 5724828 5800676 5919200 5986590
9897 5986590 6062793 6226377 6320847 6429318 6548322 6607367 6731623 6905512 7036195 7186571
9887G186571J74659J89219K03531K76704L28167K28278K51985J46436P7027J01123
9877I163700J2747J34820O7863J61210K16092J39603L31031J95866K66594J63982
9867A0853508K49267K28705K39489K74413L61602K37271K66283K26252J36532
9858A3073322K31978J57645K00377K84207K30495K85404K14675K69244K76775
9849A5224122L01950L04559L52896M14377M30126N25229N72880O07510N72127
9840A9305776M71376M72342M49099M10809M68454M58642N27600N54792O38308
9831B3757198O98668O03844Q32835Q72767Q52586Q90517J036594J023308J109943
9822C1678260J176461J229119J353969J382795J491185J601250J736568J787658
$$ plain form
9887 7186571 7361230 7550449 7753980 8030684 8358851 8587129 8839114 8985550 9062577 9163700
9877 9163700 9176447 9311267 9379130 9540340 9756432 9896035 10227066 10422932 10689526 10853508
9867 10853508 11102775 11331480 11570969 11845382 12206984 12444255 12710538 12936790 13073322
9858 13073322 13305300 13462945 13663322 13947529 14178024 14463428 14678103 14947347 15224122
9849 15224122 15526072 15830631 16183527 16597904 17028030 17553259 18126139 18733649 19305776
9840 19305776 19777152 20249494 20698593 21109402 21577856 22036498 22564098 23118890 23757198
9831 23757198 24455866 25059710 25892545 26765312 27617898 28508415 29545009 30568317 31678260
9822 31678260 32854721 34083840 35437809 36820604 38311789 39913039 41649607 43437265
9814D3437265J993776K076283K285798K450223K661230K928097L178033L503262
9806F4513967L770015M264724M651813N269492N703117O569183P209064Q093041
9798A10044416R073326J0288835J1588982J3109719J5057051J7147318J9649743
9791B05959390K2538068K5650951K8799509L1402192L3023285L2626157K9793051
9784D09792603K4141971J5974170N992116m236755j3894168k1578203k7036182
9777C89155552l0119482l1298541l0881918k9139137k6817097k3891129k1155428
9770A95852820j8392341j5918093j3849462j2045288j0538083r146866q138645
9763A07824042p091979o389438n710713n032336m673887m127441l804019l462242
$$ plain form
9814 43437265 45431041 47507324 49793122 52243345 54904575 57832672 61010705 64513967
9806 64513967 68283982 72548706 77200519 82470011 88173128 94742311 101951375 110044416
9798 110044416 119117742 129406577 140995559 154105278 169162329 186309647 205959390
9791 205959390 228497458 254148409 282947918 314350110 347373395 379999552 409792603
9784 409792603 433934574 449908744 455900860 451664105 437769937 416191734 389155552
9777 389155552 359036070 327737529 296855611 267716474 240899377 217008248 195852820
9770 195852820 177460479 161542386 147692924 135647636 125109553 115962687 107824042
9763 107824042 100732063 94342625 88631912 83599576 78925689 74798248 70994229 67531987
9755F7531987l167230k965913k705061k517114k310825k257765k022482j932626
9747D7652971j787698j636392j580823j464081j358754j300924j267855j098220
9739C6158224j112567j044304j022214r34965r44041q57258q77149q35563q24756
9730B7705407q26900p29570p59461p50828o45630o91890o12890n44538n40972
9721B1602728n43165m28239n06252m39114l68576m03944l70442l62961l82885
9712A7797150l40901l83656l43158m26716l30324l89546l13429l78216l28040
9703A4563164k94029k66766k64902k34843l16227j71969j97133j90495j86077
9694A2440723j65290k33207j56652k16015j50197k47856j72081l09704j78297
$$ plain form
9755 67531987 64364757 61398844 58693783 56176669 53865844 51608079 49585597 47652971
9747 47652971 45865273 44228881 42648058 41183977 39825223 38524299 37256444 36158224
9739 36158224 35045657 34001353 32979139 32044174 31100133 30242875 29365726 28530163 27705407
9730 27705407 26878507 26148937 25389476 24638648 23993018 23301128 22688238 22143700 21602728
9721 21602728 21059563 20631324 20125072 19685958 19317382 18913438 18542996 18180035 17797150
9712 17797150 17456249 17072593 16729435 16302719 15972395 15582849 15269420 14891204 14563164
9703 14563164 14269135 14002369 13737467 13502624 13186397 13014428 12817295 12626800 12440723
9694 12440723 12275433 12042226 11885574 11669559 11519362 11271506 11099425 10789721 10611424
9685A0611424k36662j68618k22330k07433k16141k13154r3479j92135j46251j52590
9675H762631j91227j26461o9809j62779o7779j27215j03058p6657j34411p7054
9665G626181j11281n4864q1961o3151r6418m5660p4611r6430o8580m0233l4746
9654F858246q1558m4666j16243q6315p8412q7034p5783j38323j9548p1030p3673
9643E985661k4456j06890l7125k2262n7864o6850q4152m9366J1502q8731P27r3687
9631E366507j0486m9760q9429q6912k6189p1468m9875o2052l1385j14518k8379
9620D746054m5284j75005R666n0287j05564r3747o8401l7004p1929p5527j00452
9609C932520L0583n1596o6719k6913k3415o4929n7308j6960j2035q6515j5563
$$ plain form
9685 10611424 10374762 10206144 9983814 9776381 9560240 9347086 9253607 9061472 8915221 8762631
9675 8762631 8571404 8444943 8375134 8212355 8144576 8017361 7914303 7837646 7703235 7626181
9665 7626181 7514900 7460036 7378075 7314924 7218506 7172846 7098235 7001805 6933225 6892992 6858246
9654 6858246 6776688 6732022 6615779 6529464 6451052 6364018 6288235 6149912 6130364 6059334 5985661
9643 5985661 5961205 5854315 5817190 5794928 5737064 5670214 5586062 5536696 5548198 5459467 5460194 5366507
9631 5366507 5356021 5306261 5216832 5129920 5103731 5032263 4982388 4920336 4888951 4774433 4746054
9620 4746054 4700770 4525765 4535431 4485144 4379580 4285833 4217432 4180428 4108499 4032972 3932520
9609 3932520 3963103 3911507 3844788 3817875 3794460 3729531 3672223 3655263 3643228 3556713 3541150
9598C541150n9737j0187l035l3449n354l7068r937q4065l0520q0162k5207p3437
9586C088992N4257n9432N905j06742L808r776n9425K2956n8525j3020l1693K7320
9574B864625j4471j2717J6655q810Q163N6498L7867j9198N9967K9727Q5353O4729
9562C168388Q4097L7564J15388L9893O9836N9254K1896J9898N8102J2293J9945
9551C706554j8082K5480P4643l0372J10342R1713J22790R5778J80471R2747J52095
9540D604159J49170P7459J49916P9109R7482R9320J3692k0189n9728j20315q1972
9529D988103r8472j13904n7332n0818N499N8445R8375J95439K07450J84452K32450
9518E649687J41464J58278L204o7609r0306k21559l33163k40700k42316l17127
$$ plain form
9598 3541150 3481413 3471226 3468191 3434742 3429388 3392320 3382383 3298318 3267798 3187636 3162429 3088992
9586 3088992 3143249 3083817 3089722 2982980 2986788 2977012 2917587 2940543 2882018 2868998 2837305 2864625
9574 2864625 2850154 2837437 2854092 2845282 2853445 2909943 2947810 2928612 2988579 3018306 3103659 3168388
9562 3168388 3252485 3290049 3405437 3445330 3515166 3574420 3596316 3616214 3674316 3686609 3706554
9551 3706554 3688472 3713952 3788595 3758223 3868565 3960278 4083068 4178846 4359317 4452064 4604159
9540 4604159 4753329 4830788 4980704 5059813 5157295 5256615 5270307 5250118 5190390 5070075 4988103
9529 4988103 4889631 4775727 4718395 4667577 4673076 4731521 4829896 5025335 5232785 5417237 5649687
9518 5649687 5791151 5949429 5952633 5885024 5794718 5573159 5239996 4999296 4756980 4439853
9508D439853l42047j77020k19513q1930j56878k8080j1066m2149m0058n2871N846
9497C294087l0510m8218K9496k8950N0007O722O4204L7875O2669J33222J43871
9486C714475L86623N06019O09295N70329N40424M43685K66448l5931j69289l53608
9476F478470m57987m65068m16105l28855k22457j65704j19611j469J47915L50862
9466D799991K97798M23192L25935L90509J31092k9333k55270k90653m00464l27845
9456E064952j30402j41928j53352k41889j63352j74190j98643r5610j46512J2503
9446C631577N4617P1120P7164o861l4178o5193o8732K8945j9489j5357q3556j22553
9434C447504j95048j35116j50343r2622q8805n1946r0665p7344j00251k4834J7279
$$ plain form
9508 4439853 4097806 3920786 3701273 3619343 3462465 3434385 3423319 3381170 3341112 3288241 3294087
9497 3294087 3263577 3215359 3244855 3215905 3265912 3272634 3336838 3374713 3437382 3570604 3714475
9486 3714475 4101098 4607117 5216412 5786741 6327165 6770850 7037298 7001367 6832078 6478470
9476 6478470 6020483 5555415 5139310 4810455 4587998 4422294 4302683 4301214 4449129 4799991
9466 4799991 5097789 5520981 5846916 6237425 6368517 6339184 6083914 5793261 5392797 5064952
9456 5064952 4934550 4792622 4639270 4397381 4234029 4059839 3861196 3765586 3619074 3631577
9446 3631577 3686194 3757314 3834478 3827617 3793439 3728246 3659514 3688459 3668970 3653613 3570057 3447504
9434 3447504 3252456 3117340 2966997 2874375 2785570 2733624 2642959 2565615 2465364 2440530 2457809
9423B457809o7772j0848o1374L829P088l6860Q1074j17304K6223l9578q354k9426
9411B204507l1971k9384o8878n126k5824j9725k5247j6774J323q5603N6767l7043
9399A917022L2778l7323o193l2322l3409j8096K3631m6670k8554p112j8770J9535
9387A764517M8165l2387M8279J6793P7458l5548k2965N2513j4598L9154k6424
9376A914957M3197k3604n8197p461K8974j2772L4098r045J8036K3380M4778K7952
9364B024293L7586m6020K8481J7524j0521J3910N4876M300M8538m8899K8680M1725
9352B194473M2406L8098P224R0451K5088k6719J6994L7921L2251j1235L207K5114
9340B475273j4765j8115J08851k7074J4084j5004O7702M9990m4736O1307l7331
$$ plain form
9423 2457809 2390037 2379189 2317815 2321644 2328732 2291872 2372946 2255642 2281865 2242287 2233933 2204507
9411 2204507 2172536 2143152 2074274 2069148 2043324 2023599 1998352 1981578 1982901 1897298 1954065 1917022
9399 1917022 1949800 1912477 1906284 1873962 1840553 1822457 1846088 1799418 1770864 1763752 1744982 1764517
9387 1764517 1812682 1780295 1828574 1845367 1922825 1887277 1864312 1916825 1902227 1941381 1914957
9376 1914957 1958154 1934550 1876353 1868892 1897866 1885094 1919192 1910147 1928183 1951563 1996341 2024293
9364 2024293 2061879 2015859 2044340 2061864 2051343 2065253 2120129 2124429 2172967 2124068 2152748 2194473
9352 2194473 2236879 2274977 2282201 2372652 2397740 2371021 2388015 2425936 2458187 2446952 2450159 2475273
9340 2475273 2460508 2442393 2551244 2524170 2538254 2523250 2590952 2640942 2596206 2657513 2620182
9329B620182M1068m8704p3983K3082m0124K7506J1004M3788K005K7140r602p077
9317B616285K3132m7222J1788o1863O9545n1421J3537o8858n74q0321j5406p4553
9305B334069j8597j0217n9779P0400l2314j9535k8411P9458r88M3970M3404N8394
9293B459854P410M0561P0740M9570J29842j5010L5652J7521Q832j05966o0070
9282B638936n9852k6415q4414l9296p9298j0472j09373N1554l0002P886O8656
9271B327910P587J12660J5624R8614N8069M653J8258j06500K0174n4184n8867
9260B443998q1926j1777o8826o906L468j12014j680o0234n9867K262j6089p1114
9248A959295r769j8418J9645j977j2251R282L4953L9543j7369k3207M2401k9097
$$ plain form
9329 2620182 2661250 2612546 2538563 2561645 2521521 2549027 2560031 2603819 2605824 2632964 2623362 2616285
9317 2616285 2639417 2592195 2603983 2542120 2611665 2560244 2573781 2504923 2504349 2424028 2408622 2334069
9305 2334069 2315472 2305255 2245476 2315876 2283562 2264027 2235616 2315074 2314086 2358056 2401460 2459854
9293 2459854 2467264 2507825 2578565 2628135 2757977 2742967 2778619 2796140 2804972 2699006 2638936
9282 2638936 2579084 2552669 2468255 2428959 2349661 2339189 2229816 2281370 2251368 2259254 2327910
9271 2327910 2335497 2448157 2463781 2562395 2620464 2625117 2643375 2536875 2557049 2502865 2443998
9260 2443998 2362072 2350295 2281469 2274563 2278031 2166017 2164337 2104103 2044236 2046498 2030409 1959295
9248 1959295 1949526 1931108 1950753 1948776 1936525 1945807 1980760 2020303 2002934 1979727 2022128 1993031
9236A993031n6455O2538q4196L2055m7120N8082p2963j0202K9404N1914m0126
9225A915962R717N9074l7058K8515J5585Q589l6779P0489M7842N3185N5338j6212
9213B174247N7692M3985J2540J06814j182M0139P4125R7340J01611P5588R6340
9202B879239J56765K04305J66917K90597K79575M37394M48904N94203Q11286R51079
9192G220264J203399J432454J464512J268433P55683K61928k92063p17717j007990
9183A1588903r96557j011595q53118q38653n59964l76876k29831j87658j21339
9174F413312j64879j99076j59791l29896k22848k24524j7378j3566J4386L3815
9164E129555l5297j52400j27887k79574j92365j75560k5810r3488q2204l1255
$$ plain form
9236 1993031 1936576 1999114 1914918 1946973 1899853 1957935 1884972 1874770 1904174 1956088 1915962
9225 1915962 1925679 1984753 1947695 1976210 1991795 2000384 1963605 2034094 2081936 2135121 2190459 2174247
9213 2174247 2231939 2275924 2288464 2395278 2394096 2434235 2508360 2605700 2707311 2782899 2879239
9202 2879239 3036004 3240309 3407226 3697823 3977398 4414792 4863696 5457899 6269185 7220264
9192 7220264 8423663 9856117 11320629 12589062 13344745 13606673 13314610 12596893 11588903
9183 11588903 10592346 9580751 8727633 7888980 7329016 6952140 6722309 6534651 6413312
9174 6413312 6248433 6049357 5889566 5559670 5336822 5112298 5094920 5081354 5095740 5129555
9164 5129555 5094258 4941858 4813971 4534397 4342032 4166472 4140662 4047174 3964970 3933715
9154C933715j7780J16939P0273J21079J48787J22027J48986O8463J58969L62288
9144E233746L50794P05413R04109J120369R67233M81321J61336k95336n06873
9135I122112n60616n24392l46559j53305l9136J9189J19327K53992K44433K32047
9125H367092J15407K86940L93192O08400P37395N74837L21027R7396j46840k04780
9115A1150066k51121k19881k47972k31178l30379k73746l11540l50320k31765
9106H702164j31307j14458L19572N10276Q92363Q80289O54539L58292L237l00574
9096A1774393o33618o62975o97609n75231m36649k06159L08445N88725N07520
9087I966842L88549J84761L08549M64283J126301J040885O60694K6088k83957
$$ plain form
9154 3933715 3915935 4032874 4103147 4224226 4373013 4495040 4644026 4712489 4871458 5233746
9144 5233746 5584540 6289953 7194062 8314431 9281664 9762985 9924321 9628985 9122112
9135 9122112 8561496 8037104 7690545 7537240 7498104 7517293 7636620 7890612 8135045 8367092
9125 8367092 8482499 8769439 9162631 9771031 10508426 11083263 11404290 11501686 11354846 11150066
9115 11150066 10898945 10679064 10431092 10199914 9869535 9595789 9284249 8933929 8702164
9106 8702164 8570857 8456399 8775971 9286247 10178610 11058899 11713438 12071730 12074967 11774393
9096 11774393 11140775 10477800 9780191 9204960 8768311 8562152 8870597 9459322 9966842
9087 9966842 10355391 10540152 10848701 11312984 12439285 13480170 14140864 14166952 13882995
9078A3882995j65193N77792J181296J062185L49665o70816o44274j034464k03334
9069A4335852O9313j42108o25840q47124j064867r87717m55029l54366m35171
9060I492943p04951p70052q88171p23337n14095m95089l92016k78535l63451j33116
9050D230130j67255j05561l8595J9022l3349R9351J4385l027R5264n8815n7815
9039C993735j16743j60850j10893l4425m5020j30854M3713l3185M6047l1163Q3360
9028C503722r9102j8049L3396L3688O9788M1606M3551N1076n4875o5066J5359
9017C555094k8875j0378j5570m6424l0943j27164l3842l9621o3284L7657l8213
9006C158437p262N8952J48624J40077k1291P4951K619p505j39333O4278n4124
$$ plain form
9078 13882995 13717802 14295594 15476890 16539075 16888740 16217924 15573650 14539186 14335852
9069 14335852 14405165 14263057 13637217 12790093 11725226 10737509 10282480 9928114 9492943
9060 9492943 8787992 8017940 7129769 6406432 5892337 5397248 5005232 4726697 4363246 4230130
9050 4230130 4062875 3957314 3918719 3937741 3904392 4003743 4018128 4015101 4110365 4051550 3993735
9039 3993735 3876992 3716142 3605249 3570824 3525804 3394950 3438663 3405478 3451525 3420362 3503722
9028 3503722 3404620 3386571 3419967 3453655 3523443 3565049 3608600 3659676 3604801 3539735 3555094
9017 3555094 3526219 3515841 3500271 3453847 3422904 3295740 3261898 3222277 3158993 3196650 3158437
9006 3158437 3151175 3210127 3358751 3498828 3477537 3552488 3555107 3547602 3408269 3472547 3418423
8995C418423m4791m3248m7118M4059j3946J7541L7448O2307R7053J96783K20652
8984C945163K29813L02685J99621K10489K900l7728j32002j76033k33465k39289
8974D072154j95482k55098j96471j76094j69053j20391j22863q2161o3766p1917
8964B618858q1674k3620q577K6823J6084l5228L7486m4390J03771L9235L7609
8953B686377l7950o5364R500L3768o7198l0570l0395k5849k8723M1972p5069R239
8941B419738N9436q522k3981N0274K6124P1433k5509N3598P315O0964J3922Q2154
8929B786946L4797O2192m0842R3243M3067N5735P5582Q174J8738O7676k3425K8014
8917C209897k4955n2668K6193j4636n2844L3018R1564K7249K5113O4698Q2701
$$ plain form
8995 3418423 3373632 3330384 3283266 3327325 3313379 3330920 3368368 3430675 3527728 3724511 3945163
8984 3945163 4174976 4477661 4677282 4887771 4890671 4852943 4720941 4544908 4311443 4072154
8974 4072154 3876672 3621574 3425103 3249009 3079956 2959565 2836702 2754541 2690775 2618858
8964 2618858 2537184 2513564 2504987 2531810 2547894 2512666 2550152 2505762 2609533 2648768 2686377
8953 2686377 2648427 2583063 2592563 2626331 2559133 2528563 2498168 2472319 2443596 2485568 2410499 2419738
8941 2419738 2479174 2470652 2446671 2496945 2523069 2594502 2568993 2622591 2629906 2690870 2704792 2786946
8929 2786946 2821743 2883935 2843093 2936336 2979403 3035138 3110720 3118894 3137632 3205308 3181883 3209897
8917 3209897 3184942 3132274 3158467 3143831 3090987 3124005 3215569 3242818 3267931 3332629 3415330
8906C415330Q6954M8848Q6542J23671P4657m623O1232N0309M7542M8645P1078
8895D110185m5144m4574j00242n1321j70972j37407j04875j69102j28219k5796
8885C132533p6953p4294m0903J2118M6770k143J0496m0470O9936j3825j8524r5377
8873B909364k3799j04317j16852p8258o4259j06132q4336j4803n1700o9972j2273
8862B182663q5191o352k3822n0691l494K368N5512k2515M4511K4628J7890p0297
8850B065210N1494m9003k9380n4474l0250l6931l9195k8276Q271k7700p5180m8490
8838A706096L8426p5371k9682M817n4512L7202n716n895M4361p320j8864m826
8826A628716l8894O770L5358j7432J2644j3277j1663Q629J0486j0911M5801L2140
$$ plain form
8906 3415330 3502284 3551132 3637674 3761345 3836002 3831379 3892611 3942920 3990462 4039107 4110185
8895 4110185 4065041 4020467 3920225 3868904 3697932 3560525 3455650 3286548 3158329 3132533
8885 3132533 3055580 2981286 2940383 2952501 2999271 2997128 3007624 2967154 3037090 3023265 3004741 2909364
8873 2909364 2885565 2781248 2664396 2586138 2521879 2415747 2331411 2316608 2264908 2194936 2182663
8862 2182663 2097472 2091120 2067298 2016607 2013113 2015481 2070993 2048478 2092989 2117617 2135507 2065210
8850 2065210 2116704 2067701 2038321 1983847 1953597 1916666 1877471 1849195 1857466 1829766 1754586 1706096
8838 1706096 1744522 1669151 1639469 1644286 1589774 1626976 1621260 1615365 1659726 1652406 1633542 1628716
8826 1628716 1589822 1596592 1631950 1614518 1627162 1613885 1602222 1610851 1621337 1610426 1656227 1688367
8814A688367J7915J2038L6066r631J3111L5233R4797m4952O8610N0341J3563J39095
8802B114553J36526J73439L18296K66815K19594J02605k028q3104j68042j95717
8792B882937j19339j07205j49167k6175o0794j3906p30o2911o5552k0711k464
8781B253983J5863J5008K6001k6617N8980l0896M2083p6202Q06o8963K7606m0974
8769B196678j0489K3744J7280k4317K6487j4204J8259J8878K926L2563n4713M4844
8757B277936k8187J20192l1461P8045J6126O6852K9817K3616N0493O1104K0281
8746B684814K6818J2956j0597L1405o2405L1307m9495P6980n1806N0704M5962
8735B786643K9870j9961J7403j2980o2402q6045k2289q1598k1836J177p1469k4234
$$ plain form
8814 1688367 1706282 1718320 1754386 1744755 1757866 1793099 1887896 1842944 1911554 1961895 1975458 2114553
8802 2114553 2251079 2424518 2742814 3009629 3229223 3331828 3329800 3246696 3078654 2882937
8792 2882937 2763598 2656393 2507226 2481051 2420257 2406351 2405621 2342710 2277158 2256447 2253983
8781 2253983 2269846 2284854 2310855 2284238 2343218 2312322 2354405 2278203 2279009 2210046 2237652 2196678
8769 2196678 2186189 2209933 2227213 2202896 2229383 2215179 2233438 2252316 2255242 2287805 2233092 2277936
8757 2277936 2249749 2369941 2338480 2416525 2432651 2499503 2529320 2552936 2603429 2664533 2684814
8746 2684814 2711632 2724588 2713991 2745396 2682991 2714298 2664803 2741783 2689977 2740681 2786643
8735 2786643 2816513 2796552 2813955 2800975 2738573 2652528 2630239 2548641 2526805 2527982 2456513 2432279
8723B432279K1238k2846K2862l9952J05438O8579O2071K9223J7826R4634K6347
8712B817699J55411J45025J4074l2352p4812q9897j38300j25926j18350j00754
8702B451818p7408j3935l022k9748K8193N874N028l8183M5639J7463q6271L4247
8690B339695Q63l8375K393m5638L8605J1099j0924m1665L2080L7699m0753K9208
8678B314287n4202O7998m1949M4484k5193J2360M8672j9118P9619Q9974L1210
8667B548142J49703J5513M7434J14151K7204j4380K4705L9043L0986L0034O5080
8656C077615R2955O1893P5633M3877O089K9053Q6102Q0604J00760Q9750J02784
8645C847115K33285J18899J78396J25172K31662K14548L11207L80925L44006N22559
$$ plain form
8723 2432279 2453517 2430671 2453533 2413581 2519019 2587598 2649669 2678892 2696718 2791352 2817699
8712 2817699 2973110 3118135 3132209 3099857 3025045 2935148 2796848 2670922 2552572 2451818
8702 2451818 2374410 2360475 2357453 2327705 2355898 2361772 2366800 2328617 2374256 2391719 2305448 2339695
8690 2339695 2340558 2302183 2304576 2258938 2297543 2308642 2297718 2256053 2288133 2325832 2285079 2314287
8678 2314287 2260085 2328083 2286134 2330618 2305425 2317785 2366457 2347339 2426958 2516932 2548142
8667 2548142 2697845 2713358 2760792 2874943 2902147 2887767 2912472 2951515 2982501 3012535 3077615
8656 3077615 3170570 3232463 3308096 3351973 3358062 3387115 3473217 3553821 3654581 3744331 3847115
8645 3847115 4080400 4199299 4377695 4502867 4734529 4949077 5260284 5641209 5985215 6507774
8635F507774O32618O88725P96178O53358M81108K35756M3575j4291l7193J64785
8625A0152393L47150K92616L32790K09908J77678J74540K89451M80448P32521
8616A3189495J452320K577492M692635P428130P947249N892126K400812r61914
8608D4618345l317031n309394n104513l918521l046044k505984k576112k401871
8600A6438875j964689j904065j589310j325163j032420q35337p04709o14895l89754
8591F078533l56071k57898j59033q4779j02195p0367j19422j62868j26056k23945
8581D415899k27642j85223k00335q7554j61879j29911p8097l5865p2522k8374
8571C208497j1565L2067M8223J11976J44914J79783K26588J44830J03014J6460
$$ plain form
8635 6507774 7140392 7829117 8625295 9278653 9759761 9995517 10039092 10024801 9987608 10152393
8625 10152393 10499543 10792159 11124949 11334857 11512535 11687075 11976526 12456974 13189495
8616 13189495 14641815 17219307 21911942 29340072 37287321 43179447 45580259 44618345
8608 44618345 41301314 35991920 30887407 26968886 23922842 21416858 18840746 16438875
8600 16438875 14474186 12570121 10980811 9655648 8623228 7787891 7083182 6468287 6078533
8591 6078533 5722462 5464564 5305531 5220752 5118557 5048190 4928768 4765900 4639844 4415899
8581 4415899 4188257 4003034 3802699 3715145 3553266 3423355 3345258 3309393 3236871 3208497
8571 3208497 3196932 3228999 3277222 3389198 3534112 3713895 3940483 4085313 4188327 4204787
8561D204787j19070p5793j39687l6307n3192r098J81347Q9494J34261J10547R141
8550D296430r6816k10056k79028j96177k71349k24275k37490j89553j65527p7891
8540B348268j47494p1277j02445n1825l8417o106o0693k11442q4113N9625j3078
8529A621003n1845J911m5134M7116m1133l892l9209o3616L3153M66R172k7477
8517A440515k0742J5828n104k2620k3345M0094L4660k8133K4975L0816O8571n1977
8505A503538k2944m6641l059k9215r9948K7357J3576p3817p5146L8951m1645n5637
8493A135370L6453o2448K8196n5297J0902J1369q691K1175j2461n2208M3180k1083
8481A074457J0996l3001J4400q302o0061K1225r031l6823J3933M2327M581j2237
$$ plain form
8561 4204787 4085717 4009924 3870237 3833930 3780738 3771640 3952987 4042481 4176742 4287289 4296430
8550 4296430 4199614 3989558 3710530 3514353 3243004 3018729 2781239 2591686 2426159 2348268
8540 2348268 2200774 2129497 2027052 1975227 1936810 1930704 1870011 1658569 1574456 1634081 1621003
8529 1621003 1569158 1571069 1525935 1573051 1531918 1528026 1488817 1425201 1458354 1458820 1467992 1440515
8517 1440515 1419773 1435601 1430497 1407877 1384532 1424626 1459286 1431153 1456128 1486944 1555515 1503538
8505 1503538 1480594 1433953 1430894 1401679 1301731 1329088 1342664 1268847 1193701 1232652 1191007 1135370
8493 1135370 1171823 1109375 1137571 1082274 1093176 1104545 1095854 1117029 1104568 1052360 1095540 1074457
8481 1074457 1085453 1052452 1066852 1058550 998489 1019714 1010683 973860 987793 1030120 1034701 1022464
8469A022464Q392K410M5132k6171K6481J3823j6474l0663K8299m4695L0956K345
8457A062299j7436K8365n0919M1187n90l3714j314K3793q119o3572L1057k9986
8445I81051K9720m3270p5313N8454k852Q8197J2797L5028N5929J475r521O0365
8433A192060j08968l6138j6973j6001M023N4664K627L5049K6225N6205k5999n9908
8421A106866k9778k8695k9074p8060q988j5358l4210m7661j7357l8568J2974m4177
8409G47914K6578N545j0836o89m2676K8870n5861L4613q0027j5098J4060M59K5061
8396F77913l5852o435P0264m6524K9449o1346M4530O046J6643q249p767M0319
8384G18991m997k1690m8J5574J8785N9070P667R2175M6746M7807j6647j6727m1707
$$ plain form
8469 1022464 1030856 1033266 1078398 1052227 1078708 1092531 1076057 1045394 1073693 1028998 1059954 1062299
8457 1062299 1044863 1073228 1022309 1063496 1062906 1029192 1027878 1051671 1043552 979980 1011037 981051
8445 981051 1010771 967501 892188 950642 947790 1035987 1048784 1083812 1139741 1141216 1131695 1192060
8433 1192060 1083092 1046954 1029981 1013980 1018003 1072667 1075294 1110343 1136568 1192773 1166774 1106866
8421 1106866 1077088 1048393 1019319 941259 932271 916913 882703 835042 817685 779117 792091 747914
8409 747914 774492 780037 769201 768512 725836 754706 698845 733458 653431 638333 652393 652852 677913
8396 677913 642061 635626 705890 659366 688815 627469 671999 678045 694688 686439 678672 718991
8384 718991 713994 692304 692256 707830 726615 785685 793352 885527 932273 980080 963433 946706 904999
8371I04999M4900n5852q1596k7451k5210r461l0303J6231k0463j8105j4514k4969
8359F58206O59J2343o3768M1304K0554N3009o7189J2889k5667P478L5431m6581
8347F38668M2179k7355l8792N089j6034O1662K5942m814q98n874J6326k1716k3772
8334F50611J1696M223j049o064M5371M2193M944J09800m0268O0106q0890L9715
8322H40388l2216O710m8207l1269O790l1644k0618j7664K4060k9449l9840J1083
8310F38124N3909l8266k1058K9642K8038l8524J2310M2380k1360q267K4471K2093
8298G23492o5390L0320m0541J0342o096N5517K4607M2104k7464m7744P1656j9353
8286G51450K6858j376O1676k5376q990K5833M5726L7935q0537K4412J4504j3185
$$ plain form
8371 904999 949899 894047 812451 785000 759790 750329 720026 736257 715794 697689 683175 658206
8359 658206 658865 671208 607440 648744 669298 722307 655118 668007 642340 649818 685249 638668
8347 638668 680847 653492 614700 619789 603755 665417 691359 686545 685647 679773 696099 674383 650611
8334 650611 662307 666530 665481 659417 704788 746981 751925 861725 821457 881563 800673 840388
8322 840388 808172 814882 766675 735406 742196 710552 689934 672270 696330 666881 627041 638124
8310 638124 692033 653767 632709 662351 690389 651865 664175 706555 685195 676928 701399 723492
8298 723492 658102 688422 647881 658223 652127 707644 732251 774355 746891 699147 770803 751450
8286 751450 778308 776932 838608 813232 804242 830075 875801 913736 833199 857611 872115 858930
8274H58930K2707K3044O5556n7388O3744k2233K0392P7957p998N3300R5864N0316
8262A244191M3143J25582P9183J43068J10398K11108J81224K69177L72544L26475
8252C106093L68764L21240K25600J35930l5273j0547j87068j04074j55087p8663
8242C586915j33786O4724J54284J77325J69407O1500j8783j39803k90135l11923
8232C319725k81943l13561k54221k44840k83148j33491j59380r3648j76328o4027
8222A315138p9333l6831l6121o3320p3493o9377n0858R481m5434l3004l1834N791
8210H10805m0906n2505K3021K3608m8009M6406K313q9630l9473P9366p6820K3543
8198F61719p3868L5782K7048l4376r7267J74892K50738m34179O3015p1059P518
$$ plain form
8274 858930 881637 904681 970237 912849 976593 954360 974752 1052709 1044711 1098011 1193875 1244191
8262 1244191 1287334 1412916 1492099 1635167 1745565 1956673 2137897 2407074 2779618 3106093
8252 3106093 3474857 3796097 4021697 4157627 4122354 4111807 3924739 3820665 3665578 3586915
8242 3586915 3453129 3517853 3672137 3849462 4018869 4080369 4061586 3921783 3631648 3319725
8232 3319725 3037782 2724221 2470000 2225160 1942012 1808521 1649141 1555493 1379165 1315138
8222 1315138 1235805 1198974 1162853 1099533 1026040 956663 905805 915286 869852 836848 805014 810805
8210 810805 769899 717394 740415 764023 716014 762420 764733 675103 635630 714996 638176 661719
8198 661719 587851 623633 650681 616305 519038 693930 944668 510489 573504 502445 509963
8187E09963j2876k3028K3215k362m06K4764k0998k7945L5352l2692M873k0405
8175D57455J5203j0117n889j3950N1442L3655p7438K4045l1431Q7368p3040O443
8163D63746j112Q758K7186j9647j1021J40764n6114l648j1853K2985o2687N3910
8151E51267l7274J881k3681l6836N682J8569p7663O7732l6674L9674p554K9925
8139D95048R028J5174l0017J9858K4287N0316m1313l3686p430n784L1701M3867
8127E71049l4999N4921P2105l6471K6529J0909L4950k0579J00377K6974M8274
8116H54039K4621O2037M7489J47817Q3127O2873N7231M1024J66034J17068J88793
8105A852153J63918L21652M12495P37808J346517J301816Q93236K66729k66759
$$ plain form
8187 509963 497087 474059 497274 494912 494506 519270 498272 470327 505679 472987 477860 457455
8175 457455 472658 462541 456652 442702 494144 527799 450361 474406 442975 530343 457303 463746
8163 463746 462634 471392 498578 478931 467910 608674 552560 548912 537059 560044 497357 551267
8151 551267 513993 515874 492193 455357 461039 479608 401945 469677 433003 472677 465123 495048
8139 495048 504076 519250 489233 509091 533378 583694 542381 508695 501265 495481 527182 571049
8127 571049 536050 590971 663076 626605 653134 664043 698993 678414 778791 805765 854039
8116 854039 878660 940697 988186 1136003 1219130 1282003 1339234 1380258 1546292 1663360 1852153
8105 1852153 2016071 2337723 2750218 3488026 4834543 6136359 7029595 7296324 7029565
8096G029565o24679r76069r47210p44259n80784m26067m23944k41293j69692r0371
8086A805197N4817R757r8818J902j52691j21542j80865r3374q4375q6664j9043
8075A034301n9739j28878Q951r0747m8295m185n1366l566k4030l3871L0793p9751
8063E49617M278J7647j8657q110k8376K9067L9220N4949j8365J9323q9967N2030
8051F02656k2878j4372k2308n7182k9840L6429p40j4368l5269j3399J4363j4091
8039D29001j0444j7146O8578o8846M8545L4445q3193N2775M2919n633l5292J196
8027D56905J5551M818m0604M397n5598j9070K5690M0574n0614P023m6735J5512
8015C57849J1330J518n2448k3779N9131N420j6884L148l5572K6712j0290L04K5138
$$ plain form
8096 7029565 6404886 5428817 4481607 3737348 3156564 2730497 2306553 2065260 1895568 1805197
8086 1805197 1860014 1869771 1770953 1772855 1620164 1498622 1317757 1224383 1140008 1053344 1034301
8075 1034301 974562 845684 854635 763888 715593 711408 660042 656476 632446 598575 629368 549617
8063 549617 553895 571542 552885 544775 516399 545466 584686 639635 621270 640593 550626 602656
8051 602656 579778 565406 543098 485916 456076 492505 491765 477397 442128 428729 443092 429001
8039 429001 418557 401411 469989 401143 449688 484133 400940 453715 496634 491001 455709 456905
8027 456905 472456 477274 436670 441067 385469 366399 392089 432663 382049 389072 342337 357849
8015 357849 369179 370697 318249 294470 353601 359021 342137 345285 309713 336425 326135 326439 351577
8002C51577m9004l2619J0758K6024k7644J9332J2860k0278L638L1548k4657m4023
7990B57512O0153k2839K8993j2804j3231j2499J5176n0847L9948O275j5100j0198
7978B70539N4623n8177j090R852K620L7442l2695P584m2701M9637p775m2972L7902
7965B84789R797n7195L6398k539P78n7463M8844k3593R0669q5607M2845m4698
7953B43025K3381l708m524L6338m7115o8288N9820J747N6637J404l1367J0305
7941B77655m0655J1836J4263K8836R769m2886Q940m0265J8539J1935P135q657
7929B56445j7848j6759p261Q20K9415j2217m307j1360j0856M0117K4542m8494
7917B22237k4265J3496J6573m5022N0029m178p298J1727J2139J8762k0530j1633
$$ plain form
8002 351577 302573 269954 280712 306736 279092 298424 311284 291006 294644 326192 301535 257512
7990 257512 317665 294826 323819 311015 297784 285285 300461 249614 289562 295837 280737 270539
7978 270539 325162 266985 265895 275747 278367 315809 283114 290698 247997 297634 289859 246887 284789
7965 284789 294586 237391 273789 271250 272028 214565 263409 239816 330485 244878 287723 243025
7953 243025 266406 262698 258174 294512 247397 179109 238929 240676 297313 298717 267350 277655
7941 277655 237000 248836 263099 291935 301704 258818 267758 227493 246032 257967 265102 256445
7929 256445 238597 221838 214577 215397 244812 232595 228288 216928 206072 246189 270731 222237
7917 222237 197972 211468 228041 183019 233048 228870 221572 233299 245438 264200 243670 232037
7905B32037k5674N8929j6488l6995l7313P5634m7590n2832J00637O572k9852L9775
7893B66840l6251l7229N0281k5557M8767l9177j5337o872k52K4411L9274J2665
7881B81563o3374j1975k0605K6852j3149J8168k806o755j2140M4702K7132j3210
7869B54403l7655K2277k5879k5512N9871j4058J3657j5556l855P680k5378J1644
7857B21639l2942J2187K1138l479l5680Q2141j73918L8843N7913N4458l1741l0775
7845A79784L4335r1191Q6506n696M4371m0070K1072J935l2198L4193M2585o4421
7833B11205J7358k0682L6687o830n7999O42k6321O8637l8396J5616K630m8203
7821A54344M3491K71J6084K644j596L8116m0815k3068K6985j8880N2323l3630
$$ plain form
7905 232037 206363 265292 248804 211809 174496 250130 202540 149708 250345 256917 227065 266840
7893 266840 230589 193360 243641 218084 266851 227674 212337 205465 205213 229624 268898 281563
7881 281563 218189 206214 185609 212461 199312 217480 214674 207919 195779 240481 267613 254403
7869 254403 216748 239025 213146 187634 247505 233447 247104 231548 227693 235373 209995 221639
7857 221639 188697 200884 222022 218543 182863 265004 91086 129929 187842 242300 210559 179784
7845 179784 214119 122928 209434 203738 248109 208039 229111 231046 198848 233041 275626 211205
7833 211205 228563 207881 244568 237738 179739 180381 154060 222697 184301 199917 202547 154344
7821 154344 197835 198106 214190 216834 215238 253354 212539 189471 216456 197576 249899 216269
7809B16269M485l4844J7960k1448J9344m134K9807Q600j0760j2895J791j7761
7797A96414p240L8206K558m2711Q719J0835J631j5320n197K3399K7479o810J7759
7784B49722k8000l2833O291k1538n698R730L5213M4102N674p7723M7957l1339
7772B01558K6245k1782R208j8295n777p48L6599n2488j0637M5299Q271k2951R1991
7759B86493j08034J2227R060K5547O823k5617k395j2712P6346q044j296k0869
7747B37529M4639o2601M0066k6326j1672J9651J3989J3143m9963K4350o8244O2678
7735B37239P5692n5323l2187j8943m528P6378l7337K6O334r475n241L1124J4805
7722B78564R545o5535J0936j0959N3492r815m004N9454n8404l1635L9365m0235
$$ plain form
7809 216269 220754 185910 203870 182422 201766 197632 227439 236039 225279 212384 214175 196414
7797 196414 189174 227380 229938 187227 195946 206781 208412 193092 187895 211294 238773 231963 249722
7784 249722 221722 188889 195180 173642 167944 177674 212887 256989 262663 184940 232897 201558
7772 201558 227803 206021 215229 196934 191157 190409 227008 174520 163883 209182 217453 194502 286493
7759 286493 178459 190686 199746 225293 232116 206499 204104 191392 267738 259694 258398 237529
7747 237529 282168 219567 259633 233307 221635 241286 255275 268418 218455 242805 174561 237239
7735 237239 312931 257608 225421 206478 201950 278328 240991 241017 247351 237876 232635 263759 278564
7722 278564 288109 222574 233510 222551 276043 266228 262224 321678 263274 231639 271004 230769
7710B30769J9644P814J4545j5472j0957O2451J9599k4186l3271k5320L6823l8325
7698B44114L3726p983M6871o4003M2994k3541k5035N2728m7019N4567q71l028
7686C03520k2154q31j1875N2774p2025L0181k6072J6413j8424M1531l634k8260
7674B61144K2721L5163m6432R164k3650k7527L3024j429m638q622n22l3218Q343
7661B23521L8327l4064L5520j9237k6155j194N3324m7554K1709L5366k8990K3051
7649B73624l9731L8005o6160L0074k8563j7712N3371o013J1726k480m2337L1265
7637B35069m277k5366J9479k451K1762k4995M5047q7279K9061M3759j6216o2483
7625A71110O5896n5391L4568N309l7693J9766l000q239j4953L1429l7472n67P0071
$$ plain form
7710 230769 250413 258227 272772 257300 246343 308794 328393 304207 270936 245616 282439 244114
7698 244114 277840 269857 316728 252725 295719 272178 247143 299871 252852 307419 306548 303520
7686 303520 281366 280535 268660 321434 249409 279590 253518 269931 251507 293038 289404 261144
7674 261144 283865 319028 272596 281760 258110 230583 263607 262178 257540 248918 248396 215178 223521
7661 223521 261848 227784 263304 244067 217912 216718 270042 222488 244197 279563 250573 273624
7649 273624 233893 271898 205738 235812 207249 189537 242908 236895 248621 246141 203804 235069
7637 235069 230792 205426 224905 222454 244216 219221 264268 176989 206050 249809 233593 171110
7625 171110 237006 181615 216183 221492 183799 203565 200565 192326 177373 208802 171330 170763 240834
7612B40834j4968o360n6121M4882l8820N7795n5775O7765k0354l3263J3504m3629
7600A55490M1312L6534l4166N6845m1444j3940L3561j0474j3551P891o360n0923
7588A60775K0091l793K4121L8538k2510l1087K5485m5086N434M2102k3944j8742
7576A71384o894J7128J8901J277j717K143k6582l9822N7735K7196j5072k6121
7564A79556P817J222M2536Q251o039m8583J214k446M6282o3348K9816o283J9505
7551B09500r140J750L1015k071j1692m9820l251L090O0388k7581K3102n2010K7189
7538B00469K0779K9864M719m8006j9457L8486l0182J1583O1885l7077j2362j0543
7526B10158J7646l2342L6416j4357l92K9791m6941K856J1547K5896l7258L0365
$$ plain form
7612 240834 225866 219506 163385 208267 169447 227242 171467 239232 218878 185615 199119 155490
7600 155490 196802 233336 199170 256015 214571 200631 234192 223718 210167 218058 211698 160775
7588 160775 180866 177073 201194 239732 217222 186135 211620 166534 171968 214070 190126 171384
7576 171384 164490 181618 200519 201796 200079 202222 175640 135818 193553 220749 205677 179556
7564 179556 187373 188595 231131 239382 233343 184760 185974 183528 229810 166462 196278 189995 209500
7551 209500 200360 202110 233125 231054 219362 169542 166291 169381 229769 202188 225290 173280 200469
7538 200469 221248 251112 255831 207825 188368 226854 196672 208255 270140 233063 220701 210158
7526 210158 227804 195462 231878 217521 217129 246920 199979 202835 214382 240278 203020 233385
7514B33385p03J4573M620j3434M7614l6369k5530R3977n1402K993K0356N622o2119
7501B33583M2211n3843O4235q563L538m8872N2415L9784j9783l4163N0645n2068
7489B69119L5057J5551j1265J6638l5587J0296K3850Q557L1079k2639k9087K3154
7477C34723j681O4189j2639l4572L5102P614j3810L612j6103K6095m559m0237
7465C47734P7220n9029N9000L5291J9598M927j7898K9718J6351J5099n8078P9650
7453E49583m9586K0339O4273L8500l7850K56j4779L6478m5422J8559j910R580
7441E88021L6984l8953N9118l0126K3903j3602Q2104j9538K7927L3489K6523N6720
7429H32570m2685L7942j206K4375l411O573L4312K7422N0256J2422O3598J04490
$$ plain form
7514 233385 232682 247255 251875 238441 286055 249686 224156 318133 266731 269724 290080 295702 233583
7501 233583 275794 221951 286186 277623 281161 232289 284704 324488 304705 270542 321187 269119
7489 269119 304176 319727 308462 325100 289513 299809 323659 332216 363295 340656 311569 334723
7477 334723 333042 397231 384592 350020 385122 392736 378926 382538 366435 392530 387971 347734
7465 347734 424954 365925 424925 460216 479814 484741 466843 496561 512912 528011 469933 549583
7453 549583 499997 520336 584609 623109 585259 585515 570736 607214 561792 580351 578441 588021
7441 588021 625005 586052 645170 615044 638947 625345 707449 687911 715838 749327 775850 832570
7429 832570 789885 827827 826621 850996 847585 854158 888470 915892 966148 978570 1042168 1146658
7417A146658M7791R9305J30721J10990L1708O0035J1865j18042o6059p7016j18356
7406A259600j46105q0073q9194j01533n6627j03130j8360j9075J1175q5671o8173
7395E02834K0995n6448K5928l8789j295j2671M7701o3236k7206k693j8943K8472
7383D04649k1737j3528l339J997o709p558J6547j4745j0586q244m5316K4763j8309
7370B97885j4720o241j5981N3295o2260j2568O490P9694n1107k3321J3558L572
7358B68296o119j3561K1943n1015L4368k5360M0668j5996j8016L540n4514O5144
7346B49378K657m2437J1631L4273q1398k5970P6066p557j3785L5870l4630k3374
7334A80724O2499n0050K725N4257n8572K0255L207J6094m5372K6736m706k0860
$$ plain form
7417 1146658 1194449 1293754 1424475 1535465 1567173 1627208 1639073 1521031 1454972 1377956 1259600
7406 1259600 1113495 1033422 944228 842695 786068 682938 664578 645503 656678 571007 502834
7395 502834 523829 467381 493309 454520 453225 440554 488255 425019 397813 395120 376177 404649
7383 404649 382912 369384 366045 368042 361333 353775 370322 355577 344991 336747 291431 316194 297885
7370 297885 283165 276924 260943 314238 251978 239410 245900 325594 274487 251166 264724 268296
7358 268296 262177 248616 270559 219544 253912 228552 269220 253224 235208 238748 184234 249378
7346 249378 252035 209598 221229 255502 174104 148134 224200 216643 202858 238728 204098 180724
7334 180724 243223 193173 195898 250155 191583 211838 215045 231139 185767 212503 207797 186937
7322A86937K6424M378o3789K1783J0599M2593l1480L3575p4227J14189r0575j3796
7310A66611j6670L0314n482J7452j2766J6478m0692L9315m1851J7487K6327j9821
7298A76702j3592L9409l5190j9283L8110L0820j6472j6986m874k7699j5764j475
7286A33706N3317m6355l5604N4005j0669J7794p122J0116K2446k9347K3329p1634
7274A13982L8070J6739J4128k9780j8576J5131l5683L7849L9460k4335j4883j7459
7262A34643M9074K7818r2889Q3803p7652P874l3652K8058k1978M8458J9746l4502
7250A38801Q412o855J1857n343L2217j0335j8006j2462K7521j9302l70n050M7584
7237A88669n8398l4410N4251J2442k7754m1516P9458k8727l9257K5107J5848J9342
$$ plain form
7322 186937 213361 217739 153950 175733 186332 228925 197445 231020 156793 270982 180407 166611
7310 166611 149941 180255 174773 192225 179459 195937 155245 194560 152709 170196 196523 176702
7298 176702 163110 202519 167329 148046 186156 216976 200504 183518 178644 150945 135181 133706
7286 133706 187023 140668 105064 159069 148400 166194 159072 169188 191634 162287 185616 113982
7274 113982 152052 168791 182919 153139 134563 149694 114011 151860 191320 166985 152102 134643
7262 134643 183717 211535 118646 202449 124797 132671 99019 127077 105099 153557 173303 138801
7250 138801 147213 140358 152215 146872 179089 168754 150748 138286 165807 146505 146135 141085 188669
7237 188669 130271 95861 150112 162554 134800 93284 172742 144015 104758 129865 145713 165055
7225A65055o4522K1161O0398j1304o9358K6345N1842m8297j7970p438R7417p6859
7213A26470M5562j3795k9270k6116M0016j2264M568l270r638j8412N9536o0512
7201A02875R133L8234j5528J5320J5565P624n9575N7964o0278L9528J3083m1528
7189A22417N976l2499P8459K7301n0492k7693M0010j1149O270k8305N7708J3086
7177B01089m8675N7847m266K0265r892J0075k3342k0556K392M0543l8205K2391
7165B09666R30k175Q357J7189q4450L0880O0103l1101K1479K7814J0058j3362
7153B55388n1653L4977Q2510l8227l6932J5639J3432m5119J9060J4970J0782p0045
7141B04782P0339K1133M3447m9037O1524p2618L5315o4921K9279M9675k9821l18
$$ plain form
7225 165055 100533 121694 182092 170788 101430 127775 179617 131320 113350 105912 203329 126470
7213 126470 172032 158237 128967 102851 142867 130603 135171 131901 122263 103851 163387 102875
7201 102875 112008 150242 134714 150034 165599 173223 113648 171612 111334 150862 163945 122417
7189 122417 128393 95894 174353 201654 151162 123469 163479 152330 158600 130295 188003 201089
7177 201089 152414 210261 205995 226260 216368 226443 203101 182545 184937 225480 187275 209666
7165 209666 210596 208421 216778 233967 149517 180397 240500 209399 230878 258692 268750 255388
7153 255388 203735 238712 321222 282995 246063 261702 275134 230015 249075 264045 274827 204782
7141 204782 275121 296254 339701 290664 352188 279570 314885 249964 279243 328918 299097 298779
7129B98779K0710k147k1923p528l0357Q7540k2059L6088l3218l3887O756P8029
7117C76783q8842N9295M9819J1089l244L5695J0442k5093J4952j7813K926K7586
7105D53595m0616o0283O624N6074o3302Q516n3808N0922j1985N36o6308L4241
7093C14206J7000J547Q389j8273L9470n4706R461N8156j6005m9937m432n634j5635
7080B83607j1848J8978J4338n0640j3184K5207J4513k9460o0070M7958N1934l5295
7068B56038o8580L6596M3623o2894J8636j8857j4302m7898M0951J0237L9727o7197
7056A66080j4769J7299J3873L4812m9451o975L6385n5400M007M4149o0343m1882
7044H7785P5628n871l9861K7980n2753L6021R8179j10527j0185q395J4364N4470
$$ plain form
7129 298779 319489 317342 295419 287891 257534 345074 323015 359103 325885 291998 298754 376783
7117 376783 287941 347236 397055 408144 404900 440595 451037 425944 440896 423083 426009 453595
7105 453595 412979 352696 359320 415394 352092 360608 306800 357722 345737 346273 279965 314206
7093 314206 331206 332753 341142 322869 362339 307633 317094 375250 359245 309308 304876 299242 283607
7080 283607 271759 290737 305075 254435 241251 266458 280971 251511 191441 239399 291333 256038
7068 256038 187458 224054 267677 204783 223419 204562 190260 142362 183313 193550 233277 166080
7056 166080 151311 168610 182483 217295 167844 160869 197254 141854 145861 190010 129667 87785
7044 87785 163413 157542 117681 145661 92908 128929 227108 116581 106396 98001 112365 166835
7032A66835j17227R2718k2250k9683Q870N4440k2463m0802M2728j7963L316l2176
7020H6343m297k23K5348k7102J4579j0018K190K0177m0361p961M5262l0036J0595
7007H4496J8852L8415k8333o1289N5598j3809m0265L1299k9463M9871o7432M8932
6995H6872j415j2574l5629L2463M7132K356n9712m850O9237k1610m1467J7599
6983G8402K1800n4058J654O8976j6444N6879n8918j2924K213J4558n0335K6658
6971G8461m5569K7704k362K709K5093k2730m7998K2859P9820m6765n51j1506L3864
6958I3029m969m1099J4779K9630o2708N069K2588P1384r3649L3512m5671P6681
6946I8576j7748m8542Q454O9477o2371p213P274N5098j13582J06198l8375r256
$$ plain form
7032 166835 49608 142326 120076 90393 99263 153703 131240 90438 133166 115203 118519 86343
7020 86343 82046 81823 107171 80069 94648 84630 86820 106997 66636 58675 103937 73901 84496
7007 84496 103348 141763 113430 52141 107739 93930 53665 84964 55501 105372 37940 86872
6995 86872 85457 72883 37254 69717 116849 119205 59493 54643 123880 102270 60803 78402
6983 78402 100202 46144 47798 116774 100330 157209 98291 85367 87580 102138 51803 78461
6971 78461 32892 60596 58234 60943 86036 63306 15308 38167 117987 71222 70671 59165 93029
6958 93029 88060 46961 61740 91370 28662 33731 56319 127703 34054 67566 21895 98576
6946 98576 80828 32286 40740 110217 47846 40633 47907 103005 -10577 95621 57246 47990
6934D7990J4231J1671L3076j1332r6455K3214M7897j9447o553k9510L9342M208
6922E8332J3604j5897J1014R306l7927J6510k100j0166j6721N0226p2509L1565
6910C5237J0899L765j8489J5683J8267l5146K442M9801k6308p213J1151K9875
6898H9964n9952j5794L7776m5967K3271J3646j8163N3648o0329P561m664K7202
6886D8199k0608K2567m990k321K4001j8755j5335M7329P52l105o0578Q569K9067
6873E4792N833o397J9685o741j9816r5l042N013J5903l5539P0898O156j00290
6860F360J0598K0930k2359K4030l2643L4769M4046l1697m7707J4554k1974M7169
6848D6076O73N6847m4292k4407L3355m8445O7428m3740m0093N473O5982l0154
$$ plain form
6934 47990 62221 73892 106968 95636 -819 22395 70292 50845 44292 14782 54124 58332
6922 58332 71936 56039 67053 76359 38432 54942 52842 42676 25955 76181 3672 35237
6910 35237 46136 49901 31412 47095 65362 30216 32658 82459 56151 48938 60089 89964
6898 89964 30012 14218 51994 6027 29298 42944 24781 78429 18100 25661 20997 48199
6886 48199 27591 50158 45168 42847 66848 48093 32758 80087 80839 77734 17156 25725 54792
6873 54792 60625 54228 73913 67172 47356 47261 44219 49232 65135 29596 100494 106650 6360
6860 6360 16958 37888 15529 39559 6916 41685 85731 54034 6327 20881 -1093 46076
6848 46076 46749 103596 59304 34897 68252 19807 87235 43495 3402 8875 74857 44703
6836D4703M394p806k5533k415M5195l490N936p4789N3867j0867j9818j5635L703
6823b555K0620L3289J4952m1004M6079k8583Q038m0104J4730J0294o126k5970
6811C660O5972M1101j10161P459K6775l2575K228K9373P401K7699k7850K2129
6799F3211k9074M9367m3938m5514K3591K2224L28l468R7L9921q0645O3958k0596
6786C9462k0997k5055K2189O1173l8911k5041k5071K1503K8033l6512l5205Q6099
6774E1667k4187k4008K6852M490L2274n3997M8071k7190n950N828m5886O0717
6762D8681K032j7211p0j2531K4165k9814K1625P541J8327n7743K0838J4341J383
6749D1564m3839j1468L9234N987o4432L1713N3236j5006l7282M1281m3929K4000
$$ plain form
6836 44703 49097 41291 15758 13343 58538 55048 60984 -13805 40062 29195 9377 -6258 -2555
6823 -2555 18065 51354 66306 25302 71381 42798 50836 10732 25462 35756 29630 3660
6811 3660 69632 110733 572 8031 34806 2231 4459 33832 41233 68932 41082 63211
6799 63211 34137 83504 39566 -5948 17643 39867 40195 36727 36824 76745 -3900 60058 39462
6786 39462 18465 -6590 15599 76772 37861 12820 -12251 9252 37285 773 -34432 51667
6774 51667 27480 3472 30324 34814 67088 13091 61162 33972 28022 33850 -12036 48681
6762 48681 50713 33502 33432 20901 45066 15252 36877 44418 62745 5002 25840 40181 41564
6749 41564 -2275 -13743 25491 31478 -32954 -1241 51995 36989 -293 40988 -2941 21059
6737B1059M0109j4451j0168l1592j278M7915O810p704k2524K3146m9295P6269
6725G8296n9318L0437J1450l0271k9028Q2555q3608K4767P881K8519l9054k1533
6713A093K1098M5190j7981n3062P981O2194r843J2658m4959O511O532l6884J482
6700B010R864L0661k3947j0063M5029m2227O3415n6925m317J7923K0470q230O605
6687E0268l0772L3738j8883P679j2364L5716j8435m2665J1963l808q350j3844
6675i757M0713J0097R745l4604K0185J4353O550l3379L2578J7601k5889j5704
6663C2489q313J1036J1780l1009O2933l6013J4270P33m7128l2584L7221k6282
6651a0867K9108J0530J7781K2907m0527l9874P4356N968m4573M3870m4976K0533
$$ plain form
6737 21059 61168 46717 36549 4957 3679 51594 58404 50700 28176 51322 2027 78296
6725 78296 18978 49415 60865 30594 1566 84121 513 25280 33161 61680 22626 1093
6713 1093 22191 67381 49400 -3662 4319 66513 56670 69328 24369 30880 37412 528 2010
6700 2010 11874 42535 18588 8525 53554 11327 74742 17817 13500 31423 51893 43663 50268
6687 50268 19496 53234 34351 42030 29666 65382 46947 4282 16245 12437 4087 -9757
6675 -9757 30956 41053 50798 16194 36379 50732 57282 23903 56481 74082 48193 32489
6663 32489 24176 35212 46992 15983 78916 42903 57173 57906 10778 -21806 15415 -10867
6651 -10867 18241 28771 46552 69459 28932 -10942 63414 69382 24809 68679 23703 44236
6639D4236m233o614K6078m6909P2420o7937K8365L6194k7772m5830O340K1352
6627C5690o0084L68P9466k564n7551O5847j437p0303l690K4750N4514q0888M2829
6614B6947p656j7174M5472l0466L3719k9710Q1885p1232k469l8148M0311j9303
6602A2176J8515k2214J8606j611J4018j0444m759j8374M3940q4355Q5748o1792
6590a0546N0347k294j6439l4435M2358m1396M8714K9380k842k4244n507m7787
6578a4691N0394n0734L6034M3896j772p5709N5725j5776M702l1174N350L2646
6566C8891j9066l0515L2651j9077J2097J3280P605O599m6040j3245N7132J1461
6554E1773m0874K4291m7101M4038n788n7256K6947L6654n0452M8141k7871N4077
$$ plain form
6639 44236 40003 33389 59467 12558 84978 17041 45406 81600 53828 7998 14338 35690
6627 35690 -24394 -24026 55440 52876 -4675 61172 59735 -10568 -14258 10492 65006 -15882 26947
6614 26947 19291 2117 47589 17123 50842 21132 103017 31785 29316 -8832 31479 12176
6602 12176 30691 8477 27083 25472 39490 29046 24287 5913 49853 -34502 51246 -10546
6590 -10546 39801 37507 21068 -13367 28991 -12405 36309 65689 62847 38603 33096 -14691
6578 -14691 35703 -15031 21003 64899 63127 -12582 43143 27367 32069 895 6245 38891
6566 38891 19825 -10690 21961 2884 14981 28261 35866 42465 -3575 -16820 40312 51773
6554 51773 10899 35190 -11911 32127 26339 -30917 -3970 32684 -17768 30373 2502 56579
6542E6579q1271L3483L325K1005N483l0364J5569M5269l2315O790n3378O8865
$$ plain form
6542 56579 -24692 8791 12116 33121 38604 8240 23809 69078 36763 43553 -9825 59040
$$ [...]
##END NTUPLES=NMR SPECTRUM
##END=
