##TITLE=abcd
##JCAMPDX= 6.0         $$ Bruker NMR JCAMP-DX V2.0
##DATA TYPE= NMR SPECTRUM
##DATA CLASS= NTUPLES
##ORIGIN= UXNMR, Bruker Analytische Messtechnik GmbH
##OWNER= root
$$ XWIN-NMR		Version 3.5
$$ Fri Apr 10 19:15:19 2026 Russian Standard Time (UT+4h)  servis@DPX200
##.OBSERVE FREQUENCY= 200.131235884673
##.OBSERVE NUCLEUS= ^1H
##.ACQUISITION MODE= SIMULTANEOUS
##.ACQUISITION SCHEME= undefined
##.AVERAGES= 32
##.DIGITISER RES= 18
##SPECTROMETER/DATA SYSTEM= spect
##.PULSE SEQUENCE= zg
##.SOLVENT NAME= CDCl3
##.SHIFT REFERENCE= (INTERNAL, CDCl3, 0, 16.4885)
##AUDIT TRAIL= $$ (NUMBER, WHEN, WHO, WHERE, WHAT)
$$ ##TITLE= Audit trail, XWIN-NMR		Version 3.5
$$ ##JCAMPDX= 5.01
$$ ##ORIGIN= Bruker BioSpin GmbH
$$ ##OWNER= servis
$$ F:\spectra/data/av/nmr/H1/1/pdata/1/auditp.txt
$$ ##AUDIT TRAIL=  $$ (NUMBER, WHEN, WHO, WHERE, WHAT)
(   1,<2026-04-10 19:13:46.85 +0400>,<servis>,<DPX200>,
      <created by zg, POWCHK disabled, PULCHK disabled
       configuration hash MD5:
       00 E9 B6 7A A2 85 ED C7 34 08 36 98 17 FE 4E 26
       data hash MD5: 32K
       DB 8A 24 D4 BE 8E 11 10 B8 8E FB 79 17 AD F2 35>)
(   2,<2026-04-10 19:14:30.00 +0400>,<servis>,<DPX200>,
      <Start of raw data processing
       efp BC_mod = 2 LB = 0.05 FT_mod = 6 PKNL = 1 PHC0 = -258.6379 PHC1 = -0.898437 SI = 16K 
       data hash MD5: 16K
       44 85 CD 4A F4 94 FE F9 05 CC 93 8E B8 AE D2 33>)
(   3,<2026-04-10 19:14:34.96 +0400>,<servis>,<DPX200>,
      <abs ABSG = 5 
       data hash MD5: 16K
       D5 3E B7 7F 77 97 8A 2B 81 33 F1 D5 94 40 6E E4>)
(   4,<2026-04-10 19:14:51.12 +0400>,<servis>,<DPX200>,
      <pk PHC0 = 1.2 PHC1 = 0 
       data hash MD5: 16K
       65 21 DA 75 19 D0 1F 89 85 A5 44 A5 C8 26 16 D5>)
$$ ##END=
$$ 
$$ hash MD5
$$ D3 EB ED 31 DD A1 19 63 64 9F 00 E5 0A 1D E3 38
##$RELAX= 
##$RELAX= 
##$RELAX= 
##$RELAX= 
##$RELAX= 
##$RELAX= 
##$RELAX= 
##$RELAX= 
$$ Bruker specific parameters
$$ --------------------------
##$DU= <F:\spectra>
##$EXPNO= 1
##$NAME= <H1>
##$PROCNO= 1
##$TYPE= <nmr>
##$USER= <av>
##$AMP= (0..31)
100 100 100 100 100 100 100 100 100 100 100 100 100 100 100 100 100 100 
100 100 100 100 100 100 100 100 100 100 100 100 100 100 
##$AQSEQ= 0
##$AQ_mod= 1
##$AUNM= <au_zg>
##$AUTOPOS= <>
##$BF1= 200.13
##$BF2= 200.13
##$BF3= 200.13
##$BF4= 200.13
##$BF5= 500.13
##$BF6= 500.13
##$BF7= 500.13
##$BF8= 500.13
##$BYTORDA= 1
##$CFDGTYP= 0
##$CFRGTYP= 5
##$CHEMSTR= <none>
##$CNST= (0..31)
1 1 145 1 1 1 1 1 1 1 1 1 1 1 1 1 1 1 1 1 1 1 1 1 1 1 1 1 1 1 1 1 
##$CPDPRG= <>
##$CPDPRG1= <>
##$CPDPRG2= <>
##$CPDPRG3= <>
##$CPDPRG4= <mlev>
##$CPDPRG5= <mlev>
##$CPDPRG6= <mlev>
##$CPDPRG7= <mlev>
##$CPDPRG8= <mlev>
##$CPDPRGB= <>
##$CPDPRGT= <>
##$D= (0..31)
0 2 0 0 0 0 0 0 0 0.06 0 0 0 0 0 0 0.0002 0 0 0 0 0 0 0 0 0 0 0 0 0 0 
0 
##$DATE= 1775834026
##$DBL= (0..7)
120 120 120 120 120 120 120 120 
##$DBP= (0..7)
150 150 150 150 150 150 150 150 
##$DBP07= 0
##$DBPNAM0= <>
##$DBPNAM1= <>
##$DBPNAM2= <>
##$DBPNAM3= <>
##$DBPNAM4= <>
##$DBPNAM5= <>
$$ [...]
##$SUBNAM5= <"">
##$SUBNAM6= <"">
##$SUBNAM7= <"">
##$SUBNAM8= <"">
##$SUBNAM9= <"">
##$SW= 20.6817932712277
##$SWIBOX= (0..15)
0 0 3 0 0 0 0 0 0 0 0 0 0 0 0 0 
##$SW_h= 4139.07284768212
##$TD= 32768
##$TD0= 1
##$TE= 0
##$TE2= 300
##$TE3= 300
##$TEG= 300
##$TL= (0..7)
0 120 120 120 120 120 120 120 
##$TP= (0..7)
150 150 150 150 150 150 150 150 
##$TP07= 0
##$TPNAME0= <>
##$TPNAME1= <>
##$TPNAME2= <>
##$TPNAME3= <>
##$TPNAME4= <>
##$TPNAME5= <>
##$TPNAME6= <>
##$TPNAME7= <>
##$TPOAL= (0..7)
0.5 0.5 0.5 0.5 0.5 0.5 0.5 0.5 
##$TPOFFS= (0..7)
0 0 0 0 0 0 0 0 
##$TUNHIN= 0
##$TUNHOUT= 0
##$TUNXOUT= 0
##$USERA1= <user>
##$USERA2= <user>
##$USERA3= <user>
##$USERA4= <user>
##$USERA5= <user>
##$V9= 5
##$VALIST= <valist>
##$VCLIST= <CCCCCCCCCCCCCCC>
##$VD= 0
##$VDLIST= <DDDDDDDDDDDDDDD>
##$VPLIST= <PPPPPPPPPPPPPPP>
##$VTLIST= <TTTTTTTTTTTTTTT>
##$WBST= 1024
##$WBSW= 30
##$XGAIN= (0..3)
0 0 0 0 
##$XL= 0
##$YL= 0
##$YMAX_a= 1363912
##$YMIN_a= -1320519
##$ZGOPTNS= <>
##$ZL1= 120
##$ZL2= 120
##$ZL3= 120
##$ZL4= 120
##$ABSF1= 16.48848
##$ABSF2= -4.193441
##$ABSG= 5
##$ABSL= 3
##$ALPHA= 0
##$AQORDER= 0
##$ASSFAC= 0
##$ASSFACI= 0
##$ASSFACX= 0
##$ASSWID= 0
##$AUNMP= <proc_1d>
##$AZFE= 0.1
##$AZFW= 0.1
##$BCFW= 0
##$BC_mod= 2
##$BYTORDP= 0
##$COROFFS= 0
##$CY= 18.4799938201904
##$DATMOD= 1
##$DC= 0
##$DFILT= <>
##$DTYPP= 0
##$F1P= 9.9274215381318
##$F2P= -0.165520771350173
##$FCOR= 1
##$FTSIZE= 16384
##$FT_mod= 6
##$GAMMA= 0
##$GB= 0
##$INTBC= 1
##$INTSCL= 4.127829e-11
##$ISEN= 128
##$LB= 0.05
##$LEV0= 0
##$LPBIN= 0
##$MAXI= 10000
##$MC2= 0
##$MEAN= 0
##$ME_mod= 0
##$MI= 50
##$NCOEF= 0
##$NC_proc= -4
##$NLEV= 6
##$NOISF1= 3.799351
##$NOISF2= 2.8
##$NSP= 0
##$NTH_PI= 0
##$NZP= 0
##$OFFSET= 16.48848
##$PC= 4
##$PHC0= -257.4379
##$PHC1= -0.898437
##$PH_mod= 1
##$PKNL= yes
##$PPARMOD= 0
##$PSCAL= 4
##$PSIGN= 0
##$REVERSE= no
##$SF= 200.130005582386
##$SI= 16384
##$SIGF1= 3
##$SIGF2= 2
##$SINO= 400
##$SIOLD= 16384
##$SREGLST= <1H.CDCl3>
##$SSB= 0
##$STSI= 16384
##$STSR= 0
##$SW_p= 4139.07284768211
##$SYMM= 0
##$S_DEV= 0
##$TDeff= 32768
##$TDoff= 0
##$TI= <>
##$TILT= no
##$TM1= 0
##$TM2= 0
##$TOPLEV= 0
##$USERP1= <user>
##$USERP2= <user>
##$USERP3= <user>
##$USERP4= <user>
##$USERP5= <user>
##$WDW= 1
##$XDIM= 16384
##$YMAX_p= 274125744
##$YMIN_p= -319223
$$ End of Bruker specific parameters
$$ ---------------------------------
##NTUPLES= NMR SPECTRUM
##VAR_NAME=  FREQUENCY,     SPECTRUM/REAL,   SPECTRUM/IMAG
##SYMBOL=    X,             R,               I
##VAR_TYPE=  INDEPENDENT,   DEPENDENT,       DEPENDENT
##VAR_FORM=  AFFN,          ASDF,            ASDF
##VAR_DIM=   16384,         16384,           16384
##UNITS=     HZ,            ARBITRARY UNITS, ARBITRARY UNITS
##FACTOR=    0.252644378177508, 1,           1
##FIRST=     3299.83951724647, 0,            0
##LAST=      -839.233330435636, 0,           0
##MIN=       -839.233330435636, -319223,     0
##MAX=       3299.83951724647, 274125744,    0
$$ Real data points
##PAGE= N=1
##DATA TABLE= (X++(R..R)), XYDATA
$$ [...]
7909a47406O6656l4782L1377k358m3417n5542Q1041P903K9489p6152J8956K5041
7897i9194m371K1998m6136l962j191K5823N1108m0901O2310m8954K8714O266k6001
7884g4491P2034o282j8262q519J3204P955L5918N1735m1919N2642p714L6331k4978
7871H7654N1705M7856J0910k1597J3917J5343l3602N766K7085m0127j6158L5334
7859A84086j5185n3026m4493L0359j3916o9112K9131L60867n99883J38748J0818
7848d1606k178k2015j6704m6087r528M0063K1191K743m5290J1500R446K903K3496
7835g2066j7022k3573K9009k4839o650O137j7820m5077Q9778n5944J2421J6202
7823a09444l4141O784j7860J6165j3534P210J960M1360l5430J8916K9476n7905
$$ plain form
7909 -147406 -80750 -115532 -84155 -86513 -129930 -185472 -104431 -96528 -67039 -143191 -124235 -99194
7897 -99194 -103565 -81567 -127703 -131665 -132856 -107033 -55925 -96826 -34516 -83470 -54756 -48490 -74491
7884 -74491 -2457 -8739 -27001 -35520 -22316 -14361 21557 73292 31373 84015 76301 112632 87654
7871 87654 139359 187215 198125 176528 190445 205788 172186 177952 205037 164910 148752 184086
7859 184086 168901 115875 71382 101741 87825 18713 47844 408711 -191172 -52424 -41606
7848 -41606 -43784 -65799 -82503 -128590 -138118 -98055 -76864 -74121 -119411 -107911 -98465 -95562 -72066
7835 -72066 -89088 -112661 -83652 -108491 -115141 -109004 -126824 -171901 -82123 -138067 -125646 -109444
7823 -109444 -143585 -136801 -154661 -138496 -152030 -144820 -142860 -101500 -136930 -118014 -88538 -146443
7811a46443l375J2877L6773k5245k8341J4354M7339k1308r173O296L0163k8949
7799a15032m7445K9118P399k667k1318o998m036K2789J1956l7496K05O2155p2806
7786a74176K0729l4335N4424J5947j7113l5228l2515L7644J9830k1270p632L5217
7774a38478q233k3376L2927n029k812J9932n3074j4213M2622j798P686m9830M1480
7761a52196J3143M033J9570m0292k2986J801K3604j3645J7060J0438k6796N1986
7749a14280O204n5803O2675o0223J5016l1516M3735l0652N3937p0119O7190l6536
7737a50372q136j9332K4994j799J3404m1094J7720k9878p21P0082K204n7192L039
7724a77081M1755j5432N4660l8475K5427n6417L0443M211m7905J0998m707O493
$$ plain form
7811 -146443 -149818 -136941 -100168 -125413 -153754 -139400 -92061 -113369 -122542 -116246 -86083 -115032
7799 -115032 -162477 -133359 -125960 -128627 -149945 -156943 -160979 -138190 -126234 -163730 -163525 -101370 -174176
7786 -174176 -153447 -187782 -133358 -117411 -134524 -169752 -202267 -164623 -144793 -166063 -173695 -138478
7774 -138478 -146711 -170087 -137160 -142189 -145001 -125069 -178143 -192356 -149734 -151532 -143846 -193676 -152196
7761 -152196 -139053 -135020 -115450 -155742 -178728 -176927 -153323 -166968 -149908 -139470 -166266 -114280
7749 -114280 -108076 -163879 -101204 -161427 -146411 -177927 -134192 -164844 -110907 -181026 -113836 -150372
7737 -150372 -158508 -177840 -152846 -154645 -141241 -182335 -164615 -194493 -195214 -125132 -122928 -180120 -177081
7724 -177081 -135326 -150758 -96098 -134573 -109146 -165563 -135120 -130909 -178814 -167816 -172523 -166030
7712a66030J5711J4755m826R50j9304J3775M994m5909N6159n2688K5143l2018
7700a89288L6706q135N2322l5930j1883L7671m6381M2827k5079R46K910J8732
7688a24582m8820M0699m4106L0111J2963J1578L6039q0215K3336J0924j3539j0459
7676a56071M5126j0968l1154K3180k3536K0128k6827j335O275m0227L3439m6026
7664b07996P9458N622o7577Q1279j5271n5497J5364L1498J2166M657l096O432
7652a12961m7966N6213p042l3321J8534l4873j165M2993j5357m4977p956L6839
7640a51039k439k9037O3785n5154J5566J3194K8033k9774R369m43j0286j8359
7628a66584N5033J549m5206N2941m9042q155j0123o628K3628J489J886Q1052n4263
$$ plain form
7712 -166030 -150319 -135564 -140390 -139440 -158744 -144969 -139975 -185884 -129725 -182413 -157270 -189288
7700 -189288 -152582 -160717 -108395 -144325 -156208 -118537 -164918 -122091 -147170 -146224 -143314 -124582
7688 -124582 -173402 -132703 -176809 -146698 -133735 -122157 -86118 -166333 -142997 -132073 -145612 -156071
7676 -156071 -110945 -121913 -153067 -129887 -153423 -133295 -160122 -161457 -155182 -195409 -161970 -207996
7664 -207996 -128538 -122916 -190493 -109214 -124485 -179982 -164618 -133120 -120954 -116297 -119393 -112961
7652 -112961 -160927 -104714 -111756 -145077 -126543 -161416 -162581 -119588 -134945 -179922 -187878 -151039
7640 -151039 -153478 -182515 -118730 -173884 -158318 -145124 -117091 -146865 -137496 -137939 -148225 -166584
7628 -166584 -111551 -110002 -155208 -102267 -151309 -159464 -169587 -176215 -152587 -151098 -149212 -68160 -122423
7615a22423l7351j5157M3768J4848l874n2338P8386n0745O2982r5600K4233L408
7603a49863J421J3705j5296J6560m3341J2670M6944k3381m490n50m2303r542O4892
7590a32574n3591R4870m5367m7528L5694j9459L1260M7287m6140J1208L929l1818
7578a52229L5712j8411l2231K7476p205l3055J7247O738J4992o176j714K9844
7566a19012p421J2192m8252K5207J2371K9844l3522n6476P4653l1425j0302k3737
7554a75880N5109k7722J2231m11P0887p4448J2861M9023o5091L3925j9552j6762
7542a45830Q733M0534k4917K867k7397Q369J7073n2130N9499l6403K7913K2699
7530i8990l0353k7754J6671O1035m2872M5477p3233O9408k9306l3099k0470o336
$$ plain form
7615 -122423 -159774 -174931 -131163 -116315 -120189 -172527 -94141 -144886 -81904 -177504 -153271 -149863
7603 -149863 -148442 -134737 -150033 -133473 -176814 -164144 -117200 -140581 -145071 -145621 -187924 -197466 -132574
7590 -132574 -186165 -91295 -136662 -184190 -148496 -167955 -136695 -89408 -135548 -124340 -120411 -152229
7578 -152229 -116517 -134928 -167159 -139683 -146888 -179943 -162696 -155958 -140966 -147142 -148856 -119012
7566 -119012 -126433 -114241 -162493 -137286 -124915 -95071 -128593 -185069 -110416 -141841 -152143 -175880
7554 -175880 -120771 -148493 -136262 -136673 -65786 -140234 -127373 -78350 -143441 -109516 -129068 -145830
7542 -145830 -137097 -96563 -121480 -118613 -146010 -137641 -120568 -172698 -113199 -149602 -121689 -98990
7530 -98990 -129343 -157097 -140426 -79391 -122263 -76786 -150019 -80611 -109917 -143016 -163486 -169822
7518a69822K157L7391K6428L405l5526L0241j8982r39K755J3461K0236o42K6792
7505f3045n6025k0446J7436k4028L950N3970q991k5023o019r126K1642J8348m0127
7492a37484m301K8799J6502m1042K1904j650n4216L1059M4494K6788p2072J5118
7480a26101O2322m0822k9388K8835k4192O8279q3627K4236l156k090Q932l4899
7468a51671P6580q6121R837K5782j5907K2085j479l2270R444M353j2847L5487
7456a16727l1046K7110j8109j6947L1228L4197q1463J0171j6326P914M1141L070
7444a25787L9135n8063P463j8099M1913q281N640M4835r0025J7256K6920k1602
7432a38695M1179k0881j200m3495M934K6915k2185J3719K6963m7510M41O1236
$$ plain form
7518 -169822 -167665 -130274 -103846 -100441 -135967 -105726 -124708 -125647 -122892 -109431 -89195 -89837 -63045
7505 -63045 -119070 -139516 -122080 -146108 -142158 -88188 -97179 -122202 -128221 -137347 -115705 -97357 -137484
7492 -137484 -141785 -112986 -96484 -137526 -115622 -117272 -171488 -140429 -95935 -69147 -141219 -126101
7480 -126101 -63779 -104601 -133989 -105154 -129346 -61067 -144694 -120458 -123614 -125704 -116772 -151671
7468 -151671 -75091 -161212 -151375 -125593 -141500 -119415 -120894 -153164 -143720 -139367 -152214 -116727
7456 -116727 -147773 -120663 -138772 -155719 -124491 -90294 -171757 -161586 -177912 -169998 -128857 -125787
7444 -125787 -86652 -144715 -137252 -155351 -113438 -121719 -116079 -71244 -161269 -144013 -117093 -138695
7432 -138695 -97516 -118397 -119597 -163092 -158158 -131243 -153428 -139709 -112746 -160256 -159815 -98579
7420i8579j7926L284m2803N7229j1510k311K934o8109K3944K7116k750M4154p662
7407i2989o860j6108j4623O547r351J1975P3631p0698n3596M8662k7229j982K8202
7394a24419J0853J9987p788K8683p2846K4589j153M8800l0520l4051L4147q964
7382a12682M3804r6988L5014J8520R570K9330J8293m1153l128K4661l8198L251
7370a09706L2281l2545K6715o0428K6954R603l966l7946N5881M931J4404l1939
7358a05761J8175k1363L4297l1097k399L4973j7111Q746m4959j9101M1034l2855
7346a37421j137k0034J8207k2393N9271k4475J4452J5997k2407j144K671j3519
7334a31932j7172M3192o823j2133Q429K1079j4357l3193l161J0633J6176j1112
$$ plain form
7420 -98579 -116505 -113221 -156024 -98795 -110305 -112616 -109682 -177791 -153847 -126731 -129481 -85327 -92989
7407 -92989 -99849 -115957 -130580 -124033 -133384 -121409 -47778 -118476 -172072 -123410 -150639 -152621 -124419
7394 -124419 -113566 -93579 -101367 -72684 -145530 -120941 -122094 -73294 -103814 -137865 -103718 -112682
7382 -112682 -68878 -165866 -130852 -112332 -102762 -73432 -55139 -96292 -99420 -74759 -112957 -109706
7370 -109706 -77425 -109970 -83255 -143683 -116729 -107126 -111092 -149038 -93157 -88226 -73822 -105761
7358 -105761 -87586 -108949 -74652 -105749 -108148 -73175 -90286 -81540 -126499 -145600 -104566 -137421
7346 -137421 -138558 -158592 -140385 -162778 -103507 -127982 -113530 -97533 -119940 -121084 -118413 -131932
7334 -131932 -149104 -105912 -112735 -124868 -116439 -95360 -109717 -142910 -146071 -135438 -119262 -130374
7322a30374N2399j1966n2569M0950n2890M3083k1060L595j6017Q9814p8209j1459
7310a44703K5983n53N822m0324L0047K5512m3921N235L0540k93k0334J961K3536
7297a01492p873k1658M4236j17593P6614J7921k731l2996K7465J7314L000k2978
7285a20771o469J5208J3228j9435j7939K9912j3491J1009o5589O8372o77M071
7273a02571j7317O479L6233o5639L0589r593J5303R249p762k8806r193L5792l2731
7260a39967o361K9929K3883k7110m9784L1698l053M2622p068L9869m0715K5575
7248h0482m3343J3677j0002J3552k0932L8343j9080L6510p9031J7161Q086n585
7236a31126M5879r007m4649N037j3560P7237l9592l7015L8060K19n2111M9736
$$ plain form
7322 -130374 -77975 -89941 -142510 -101560 -154450 -111367 -132427 -128832 -144849 -55035 -133244 -144703
7310 -144703 -118720 -119273 -113451 -153775 -123728 -98216 -142137 -136902 -106362 -106655 -126989 -125028 -101492
7297 -101492 -109365 -131023 -86787 -204380 -127766 -109845 -112576 -145572 -118107 -100793 -97793 -120771
7285 -120771 -127240 -112032 -98804 -118239 -136178 -106266 -119757 -108748 -174337 -105965 -106642 -102571
7273 -102571 -119888 -113409 -77176 -142815 -112226 -121819 -106516 -97267 -105029 -133835 -143028 -107236 -139967
7260 -139967 -146328 -116399 -92516 -119626 -169410 -137712 -140765 -98143 -105211 -65342 -106057 -80482
7248 -80482 -123825 -110148 -120150 -106598 -127530 -89187 -108267 -71757 -150788 -133627 -125541 -131126
7236 -131126 -85247 -94254 -138903 -133866 -147426 -70189 -109781 -146796 -108736 -108517 -160628 -110892
7224a10892o399j2445N179L0532k3811K0563M887l9369M3407k7939J4119L1440
7212g0728p4230L5016l040j6378L1169l5836K3742L7622o9235O0223k1975J8594
7200h5056j6558L502M9605m4201j7191k0854j70M9066K4306l3911k0848L3219
7188g9091m8545N9151J5345l6131m0093O2224n1186J0724K6105p0453N7995m182
7176i8137M093P400R91Q95j182J014R633k3157M3253k9166M434q780m6189O99
7162a34199P5666L2281r6475L4603l2082N4093m576p4990L5546j3674M6198k8496
7150a06105K3941l354k453j6982L7458n8841K17J7344K1455j0118L4564n5054
7138a17928J3323L1827N467o810J5550M788q8076N4088m2781N166l794Q4239r2720
$$ plain form
7224 -110892 -117291 -129736 -124557 -94025 -117836 -97273 -92386 -131755 -88348 -116287 -102168 -70728
7212 -70728 -144958 -109942 -112982 -129360 -98191 -134027 -110285 -72663 -141898 -81675 -103650 -85056
7200 -85056 -101614 -98112 -48507 -92708 -109899 -130753 -130923 -81857 -57551 -91462 -112310 -79091
7188 -79091 -127636 -68485 -53140 -89271 -129364 -67140 -118326 -107602 -81497 -151950 -93955 -98137
7176 -98137 -94044 -86644 -85653 -84758 -85940 -84926 -75293 -98450 -55197 -84363 -79929 -88709 -134898 -134199
7162 -134199 -58533 -26252 -122727 -88124 -120206 -66113 -70689 -145679 -110133 -123807 -77609 -106105
7150 -106105 -82164 -85518 -87971 -104953 -67495 -126336 -126119 -108775 -87320 -97438 -62874 -117928
7138 -117928 -104605 -72778 -67311 -74121 -58571 -53783 -141859 -87771 -130552 -125386 -129180 -44941 -137661
7125a37661L4542p567k630K5901n1619O7129m046r740k3952N8189J6767q2049
7113a16736N0597n0022P3058q5711n221L8037J0358l5243K0108q050K703j7046
7101a23168P9077n0137l0816J4303P646l853R582J143J4404k7587L6738J3305
7089e9363m1364K1955K0799m3631j051K1776m9296M2519J4886k3063N484J9758
7077g0591o857p777K314M302P443j0447L4313Q865m5546M9423k0056k7290j0687
7064i2591N2540l113k3732q309m5979O8211N771j7362P0627q6474J8129j3462
7052g5744k9313O6395m2323M0637l2501j1645l9507P5325l0624K1966m714m2255
7040a04303L1357J6459l7342j3563O1427O2255o1069k2181l374q029N2028K96
$$ plain form
7125 -137661 -103119 -110686 -113316 -87415 -139034 -71905 -75951 -85691 -109643 -51454 -34687 -116736
7113 -116736 -66139 -116161 -43103 -128814 -134035 -95998 -85640 -120883 -100775 -108825 -106122 -123168
7101 -123168 -44091 -94228 -125044 -110741 -103095 -106948 -97366 -96223 -81819 -109406 -72668 -59363
7089 -59363 -100727 -78772 -57973 -101604 -102655 -80879 -130175 -87656 -72770 -95833 -90349 -70591
7077 -70591 -77448 -85225 -82911 -78609 -71166 -81613 -47300 -38435 -83981 -34558 -54614 -81904 -92591
7064 -92591 -40051 -43164 -66896 -75205 -121184 -52973 -47202 -64564 6063 -80411 -62282 -75744
7052 -75744 -105057 -38662 -80985 -40348 -72849 -84494 -124001 -48676 -79300 -57334 -62048 -104303
7040 -104303 -72946 -56487 -93829 -107392 -45965 16290 -44779 -66960 -70334 -78363 -26335 -26039
7028b6039l2948k2945J5355J2309l1451m017J7953M991k7495R806K4507m3641
7016a03615k0729O6505l0126N0526O204j0162R04R027j0917L1059o094K1512j5388
7003a1294m665L0144k9817l0439K3666l1729K6830O54q567J2902J4213J5580l7122
6990b9644O1242p4588K6806K1907n122m2408l986M448J5565K3393l4012L6290
6978a09q991m5374K5857Q8838p1768m670K1095k2281m2493Q5007M002j3116l6579
6965b0582j054J9261Q065K2158k1429k1007K8715N060l245o95N448l5693J2006
6952b992O921r404R670L6516M7787j21750P6906n4333K6157J2737K146N5615j983
6939H3993j7147l27L136l4431L9730m0434q442L114M5861n3635M0110k3258K0430
$$ plain form
7028 -26039 -58987 -81932 -66577 -54268 -85719 -89736 -71783 -66792 -94287 -84481 -59974 -103615
7016 -103615 -124344 -57839 -87965 -37439 -31235 -41397 -40493 -31466 -42383 -11324 -17418 4094 -11294
7003 -11294 -15959 14185 -15632 -46071 -22405 -54134 -27304 -26650 -35217 -22315 -8102 7478 -29644
6990 -29644 31598 -42990 -16184 5723 601 -41807 -45793 -41345 -25780 -2387 -36399 -109
6978 -109 -9100 -54474 -28617 60221 -11547 -16217 4878 -17403 -59896 25111 29113 15997 -20582
6965 -20582 -21636 -2375 5690 27848 6419 -14588 14127 19187 15942 15247 20695 -14998 -2992
6952 -2992 3929 -5475 4195 40711 88498 -33252 43654 -10679 15478 28215 30361 85976 83993
6939 83993 66846 66519 69655 35224 74954 34520 26078 29192 75053 21418 61528 38270 58700
6926E8700o938O340m1790M0499k5469J4714K1948p451j2538K6503p030K2459m0021
6913D9926L5300M8776L67j5435L9872l5117k1188P494K429j038k5567m607M0979
6900A22191L2673p062N894k4928K005k2482n869m7241k9421N1245j0165j3015
6888E3825Q858J3047k5446N4153l1915L1439q558l219l650l7737K700J226R092
6875F3815M0886l7911M4656O4690m3818R423k1812l4807l4575M2343J6571l3362
6863G6099O026j0831K0514o436p1621R6472p4119M4776k6357L797k9552p368K5709
6850D7109n9540K9787k4106O5979n769Q357J0312R090n1701M6781j0180j9485
6838D6634p6175O7214l9383N1135J317J1090k7951j3214K0647J5571l8808K7418
$$ plain form
6926 58700 51762 58102 16312 56811 31342 46056 68004 60553 48015 74518 67488 89947 49926
6913 49926 85226 134002 134369 118934 158806 123689 102501 109995 112424 111386 85819 81212 122191
6900 122191 154864 147802 153696 128768 130773 108291 102422 55181 25760 77005 66840 53825
6888 53825 62683 75730 50284 104437 72522 103961 95403 92184 88534 50797 53497 54723 63815
6875 63815 104701 66790 111446 176136 132318 141741 119929 85122 50547 92890 109461 76099
6863 76099 82125 71294 91808 85372 13751 110223 36104 80880 54523 58320 28768 21400 47109
6850 47109 -12431 17356 -6750 59229 53460 61817 72129 81219 29518 76299 66119 46634
6838 46634 -29541 37673 -1710 49425 50742 61832 33881 20667 41314 56885 18077 45495
6826D5495k086m9322L7002J354m0781L3781M0750p486k0747j3352M9666n2786
6814B1488J389J3537K5287q7616J7382m5366N4539J3583Q781J0405J4055K171
6802D9635k0984q5813N3889j4176m510K0614L4137k1086J4746k6380M6569J9799
6790F6440m280k833J2421m9885j7831L29M5086j6239l6911K0969l6887N0350p100
6777B3629j0183K1898j7219k5832K1674J783j6545j4076O7124j5239m1400J1345
6765F959J4944J1766L819o6034M6261j5455N034k2543N3817O854n8241M959j160
6752i020J1625j3842M833J5643Q059l3078j8099j387M0998m0853N3465J3601L828
6739C5773j9377M4335n2611L2724n280M452K098N1047j3845m4517l872Q305k1522
$$ plain form
6826 45495 43409 -5913 31089 32443 -8338 25443 66193 58707 37960 24608 74274 21488
6814 21488 22877 36414 61701 -25915 -8533 -53899 640 14223 23004 33409 47464 49635
6802 49635 28651 -57162 -3273 -17449 -21959 -1345 32792 11706 26452 72 46641 66440
6790 66440 62160 59327 71748 21863 4032 4361 49447 33208 -3703 17266 -19621 30729 23629
6777 23629 13446 35344 18125 -7707 13967 15750 -795 -14871 52253 37014 -4386 6959
6765 6959 21903 33669 37488 -28546 17715 2260 7294 -15249 38568 45422 -12819 -7860 -9020
6752 -9020 2605 -11237 -6404 9239 17298 -15780 -33879 -35266 5732 -35121 18344 31945 35773
6739 35773 16396 60731 8120 40844 35564 40016 42114 93161 79316 34799 30927 39232 17710
6726A7710l696J4754m1862J1247L7007Q387n0838N4231l8848m3153P0370m2772
6714g463l249l612O4764k0972J259K9450k2670P1241N6476k7441k5900n34k0945
6701I0404N1082k5309n105J1825l2905p713m1704k3287M729N6613l2831K4873
6689G0672J7716l9839r015j5222N2579j0985k1377K5008l8680J17411j1944J7510
6677A53834k5448P5379O580j2419m8822J4055Q8584k5055J1919l1368l0331o5119
6665A11789n6705J1891j5728J4663K4562l3960K6463O305L2207M6552o246M296
6653A66089k0300j7122K3878j9965l3054j7097M3298J1778m855K9246J02998n1916
6641B12978K5279l6200k5848l0881j0969m6025J8419o6652N5435K9864N2769M7917
$$ plain form
6726 17710 14014 28768 -13094 -1847 35160 43547 -7291 46940 8092 -35061 35309 -7463
6714 -7463 -10712 -14324 50440 29468 30727 60177 37507 108748 165224 137783 111883 111349 90404
6701 90404 141486 116177 111072 122897 89992 82279 40575 17288 22017 78630 45799 70672
6689 70672 88388 48549 39534 24312 76891 65906 44529 69537 30857 148268 136324 153834
6677 153834 128386 203765 210345 197926 149104 163159 251743 226688 238607 207239 176908 111789
6665 111789 55084 66975 51247 65910 90472 56512 82975 89280 121487 168039 161793 166089
6653 166089 145789 128667 152545 132580 99526 82429 125727 137505 132650 161896 264894 212978
6641 212978 238257 202057 176209 145328 134359 88334 106753 40101 95536 125400 178169 226086
6629B26086P7350N6129P0267l2099r5926r9154k2227o0701l462l9845j9744J5734
6617G2408R709L4097j9856k4942O9695o9473K4689k0452n280m0363K0988M8438
6605I9658j1996O1250R663Q988J63867Q4518J09544m8712j05884m6731r1171n3128
6593A79866l8184q6137K984O3119q5521l8061P8269k5792j0233p338k0331K3990
6581C6631N845K1749L556l0153O6202j201K0864J3298N3255J12833J21029J0199
6569D34107m3864p1165j28547o908j2629l4178p8307K9188l2986j574m6413l6821
6557c0097P5616p891k5992m610j075L4369K2903m1107o05K9246K3875J3398K6299
6544A14329J0446R1205O4300K9391k5883q8788l4093m9854j756J5860j4458m4864
$$ plain form
6629 226086 303436 359565 429832 397733 301807 202653 180426 119725 116263 76418 56674 72408
6617 72408 82117 116214 96358 71416 141111 71638 96327 75875 70595 30232 51220 99658
6605 99658 87662 148912 158575 167563 331430 415948 525492 476780 370896 324165 232994 179866
6593 179866 141682 55545 58529 121648 36127 -1934 76335 50543 40310 32972 12641 36631
6581 36631 42476 64225 67781 37628 103830 102629 123493 136791 190046 302879 423908 434107
6569 434107 390243 319078 190531 183623 170994 136816 58509 87697 54711 53137 6724 -30097
6557 -30097 45519 37628 11636 7026 5951 40320 63223 22116 21511 50757 74632 88030 114329
6544 114329 124775 215980 280280 309671 283788 195000 160907 111053 109297 125157 110699 65835
6532F5835K7544p487m7419m4690l30Q454K149j529j5727L1312n0517J4432K4528
6519F555k6025L5203j8669N1994L6843K60l0209M2315j5756m907O276l2861K9453
6506H0472l6444l2693J9873L357l8417o731J9291O747j7200o638M1919p134m6999
6493b0597l9742N2777k7628L2708l7580P232N0508o5264Q1j2280K7437L8535l514
6480B673j6574J2086K1492k033k6271O84j5636J9141m2648J525P072M783J7867
6467a5839K9907l6169m5217L0585R414R668n143n141j2463J2613K9646k0695l110
6454b1944m6552M9298k7136L6534k7458j8645n1131M1963M2864k9796n139O463
6442e0679m991K1725R830L854l8594M8446J0734j4592o6484L5856K7061k3907
$$ plain form
6532 65835 93379 85892 38473 -6217 -6547 1907 4056 2527 -13200 18112 -32405 -17973 6555
6519 6555 -19470 15733 -2936 49058 85901 86161 55952 98267 82511 77604 83880 51019 80472
6506 80472 44028 11335 31208 34565 -3852 -10583 8708 15455 -1745 -8383 33536 26402 -20597
6493 -20597 -60339 -7562 -35190 -2482 -40062 -32830 17678 -47586 -47505 -59785 -32348 6187 2673
6480 2673 -13901 -1815 19677 17644 -8627 -7943 -23579 -4438 -47086 -45561 -38489 -33706 -15839
6467 -15839 14068 -22101 -67318 -36733 -27319 -17651 -22794 -27935 -40398 -27785 1861 -18834 -21944
6454 -21944 -68496 -19198 -46334 -9800 -37258 -55903 -107034 -65071 -22207 -52003 -57142 -50679
6442 -50679 -55670 -33945 -24115 -20261 -58855 -10409 325 -14267 -80751 -44895 -17834 -41741
6430d1741n6539R0470j8933M369n4676L5853J6474j6998K282L5615k3097K8819
6418A898m9330N8681l1011k4506N9370m7307N19k1274j3175O7506j3247K5105
6406A3229n9644J0318j264j1099L4587k3802J1279J6039j5195p1547R7478M0086
6394D0465l0899m5785L9706R430k2758r889M002q694R98j350k237K7018O423l2838
6380b6408L75J4447J0245l6657R892K842l6475K3275j7055M0376m4065K8161l775
6367c4822l4877K0118N4522m5494L7337o863j9973L1232q340k2022N7075L799
6355C1692k2911q797K4878k4314l6614K2406k8222L1740O208k8568M2884l1983
6343b1601m4352N519k9735L3518j6733P7616p4418J8728L3428q703N244O6145
$$ plain form
6430 -41741 -98280 -7810 -26743 -22374 -77050 -41197 -24723 -41721 -39439 -3824 -26921 1898
6418 1898 -47432 11249 -19762 -44268 15102 -32205 -31686 -52960 -66135 1371 -11876 13229
6406 13229 -46415 -36097 -37361 -48460 -13873 -37675 -26396 -10357 -25552 -97099 379 40465
6394 40465 9566 -36219 3487 12917 -9841 -19730 -15728 -24422 -23424 -24774 -27011 7 6430 -26408
6380 -26408 -26033 -11586 -1341 -37998 -28106 -25264 -61739 -38464 -55519 -15143 -59208 -31047 -34822
6367 -34822 -69699 -49581 4941 -40553 -3216 -10079 -30052 1180 -7160 -29182 27893 31692
6355 31692 8781 -16 24862 548 -36066 -13660 -41882 -10142 -3934 -32502 10382 -21601
6343 -21601 -65953 -60434 -90169 -56651 -73384 4232 -70186 -51458 -18030 -26733 -21489 44656
6331D4656j02377Q5888Q852j7664k9540N6175j1005k6622R533K347m3751O203
6319a7305O9818o1679L4803n3766J5707k6135K115J048K2838P850k4535L3091
6307C850o3762N5735K5274m2398J9707l2011N3179n7122j2507O2041K7931m9996
6295a0079K260N0485k0271l5055nR4753r5295L5298N529M949j13280K4231M4230
6282a2250P206L6773k9598K7284n6111L0422r898k8096N1177K1147m9631j3276
6270b4851J2146r40J31J7919L1232J0418l9504J3457r109L4526K2584o2284J4515
6257B0240L1960n8680K7793l0281J7287L3768m9485L3979K919J7751J0410l0635
6245B7026k1098L7170j0148J3705k1783M5140m8307J6251j7229J1935J6550k140
$$ plain form
6331 44656 -57721 28167 37019 19355 -10185 45990 34985 8363 17896 20243 -23508 -17305
6319 -17305 52513 -9166 25637 -28129 -12422 -38557 -36442 -35394 -12556 -4706 -29241 3850
6307 3850 -59912 -4177 21097 -21301 -1594 -33605 19574 -37548 -50055 11986 39917 -10079
6295 -10079 -7819 42666 22395 -12660 -12665 82088 -13207 22091 27620 32569 -80711 -56480 -12250
6282 -12250 -5044 31729 2131 29415 -26696 3726 -6172 -34268 16909 38056 -11575 -24851
6270 -24851 -12705 -13645 -13514 4405 35637 46055 6551 20008 10899 45425 68009 5725 20240
6257 20240 52200 -6480 21313 -8968 8319 42087 -7398 26581 29500 47251 57661 27026
6245 27026 5928 43098 32950 46655 24872 70012 21705 37956 20727 32662 49212 47072
6233D7072R641l8983p718M9676p5118Q0663j6691n0826L9428O211k5380M9485
6221F7460n384Q533j1522k5769k2902O3085K9598k3554j392k1648N1117J0689
6209A18311j2050N272J3621j3529J3229l2744J9125M5873n7315J8283L4921K0695
6197A73692M0284m9176k0710Q1256n0905J9486J0571L058J7460j246R989k9416
6185B04343J4534p4243K6880j6766n215j0357m2216N2097k8228K7804j2694o224
6173A29715M0585k2432m880m9170M3351J5755n6521j3794K1233n7611O9237J63
6161A15631J6724p0325N6649k0806m863j1015J5661j5869P8634j25030N5702K3014
6149A14107l8785M6727K4748j1785l0033P445n0378L1868l2756M0944l6359q031
$$ plain form
6233 47072 56713 17730 10012 59688 -15430 65233 48542 -2284 37144 43355 17975 67460
6221 67460 62076 70609 59087 33318 10416 73501 103099 79545 78153 56505 107622 118311
6209 118311 106261 111533 125154 111625 124854 92110 111235 157108 99793 118076 152997 173692
6197 173692 213976 164800 144090 225346 174441 193927 204498 207556 225016 223770 233759 204343
6185 204343 218877 144634 171514 154748 149533 139176 96960 149057 120829 148633 135939 129715
6173 129715 170300 147868 142988 93818 137169 152924 96403 82609 103842 46231 115468 115631
6161 115631 132355 62030 118679 97873 93010 81995 97656 81787 160421 35391 91093 114107
6149 114107 75322 122049 146797 135012 104979 112424 62046 93914 61158 102102 65743 57712
6137E7712L9967J0466n2759K1622m1944N2709J7763n320k5820l5367P9420j8851
6125I9598Q580L8808k3144L0221j1684q8695Q8486p537n9136L7133j0220l7333
6113F5077j5876M9053m747M7969l2164Q955P000k4552o433k228N1949k1469o075
6100A16459J9405m022k906k3851K8037J2630l9815M5286m007N6563n0958j2764
6088A40057J4629J9456k0977L0210p1639J962J1794M4092p113K6434L3996R122
6076B32023n9899P0784k6269N2589m2706l648n3977K703j1477N8548l0432l1123
6064A57116K0263J6231J3880O690n192j3588K6546k8782Q1480m9976L7023L1305
6052B92996l4734m3260N2410m82j7039M5337r001n70R529L8521j5754k904K6974
$$ plain form
6137 57712 97679 108145 55386 77008 35064 87773 105536 100216 74396 39029 118449 99598
6125 99598 108178 146986 123842 154063 142379 53684 142170 134633 75497 112630 102410 65077
6113 65077 49201 98254 93507 141476 109312 118267 125267 100715 94282 92054 144003 122534 116459
6100 116459 135864 131842 128936 105085 133122 145752 105937 151223 147216 203779 152821 140057
6088 140057 154686 174142 153165 183375 111736 113698 125492 169584 162471 188905 222901 232023
6076 232023 172124 242908 216639 269228 226522 222874 168897 171600 160123 218671 188239 157116
6064 157116 177379 193610 207490 214180 208988 195400 221946 193164 274644 224668 261691 292996
6052 292996 258262 215002 267412 266930 249891 295228 286227 285657 295186 333707 317953 315049 342023
6039C42023o335o328L1546R514j2637N7249J4284o2393K6190l6303Q5191k0334
6027D21667l3573O0727J8411j6490j3930n424K955J3289N0382m1933J8727l0235
6015D44573M4480K5760R056Q075K9457K2260n0206Q5800j5866L0222L449J8991
6003F56051K6778N803J7735l0779L4134r51L4427n5295M3837L4762M9452K4595
5991H40549J4572K4943J03019K8979P2408L4756L1292n507L9240p077j8506p2298
5979A086370J3943j9310o7509k7429K5385j9487m7072j3105L2947l0367j8646
5968I15720L7808K7250N5740L489O4033J5546J13630M7798J08322J21317Q3194
5957A593847J43402J32728L9229J44633M4630L842K120q6998l0927r6815j53576
$$ plain form
6039 342023 335688 329360 360906 370420 357783 415032 429316 366923 393113 356810 442001 421667
6027 421667 388094 448821 467232 450742 436812 431388 434343 447632 498014 456081 474808 444573
6015 444573 489053 514813 523869 531944 561401 583661 533455 619255 603389 633611 637060 656051
6003 656051 682829 688632 706367 675588 709722 708771 743198 687903 731740 766502 815954 840549
5991 840549 855121 880064 983083 1012062 1084470 1119226 1150518 1145011 1184251 1177174 1158668 1086370
5979 1086370 1100313 1081003 1013494 986065 1011450 991963 944891 931786 964733 934366 915720
5968 915720 953528 980778 1036518 1040007 1104040 1119586 1233216 1281014 1389336 1510653 1593847
5957 1593847 1737249 1869977 1909206 2053839 2098469 2102311 2104431 2017433 1986506 1889691 1736115
5946A736115m8441r7587n7279q3393q9701k8542m1626J6278K6732p7888O8299
5935A322967J2377P9529J3597Q0449M9037J04471N9620J07894J27621R3840R7457
5924B148859O7507J32454K2329j0903l8669j4881q5746j05002k5673j27774q2075
5913A880426j12386r4186j5397p8672L3939l0670L4291j9796M8780N3835K4381
5902A724545K9038J31639J4562R3840J462M9404J1848K3065O000M423P7623R562
5890B177011j5094n4212L3782n2667m249m3028O931O006n7170M2287K9571K7805
5878B096973L4435p03N8456L5502j908J18226O7587k6161J07543M6036j4216P951
5866B529721J7969J7646m173O0062L3523k5773M2193l931L8197J2530M9191J7157
$$ plain form
5946 1736115 1687674 1590087 1532808 1449415 1359714 1331172 1289546 1305824 1332556 1254668 1322967
5935 1322967 1335344 1414873 1428470 1508919 1557956 1662427 1722047 1829941 1957562 2051402 2148859
5924 2148859 2216366 2348820 2371149 2360246 2321577 2306696 2220950 2115948 2090275 1962501 1880426
5913 1880426 1768040 1673854 1658457 1579785 1613724 1583054 1617345 1597549 1646329 1700164 1724545
5902 1724545 1753583 1885222 1899784 1993624 1995086 2044490 2056338 2079403 2085403 2089826 2167449 2177011
5890 2177011 2161917 2107705 2141487 2088820 2084571 2041543 2048474 2054480 1997310 2039597 2069168 2096973
5878 2096973 2131408 2130705 2189161 2224663 2222755 2340981 2408568 2382407 2489950 2535986 2521770 2529721
5866 2529721 2547690 2565336 2561163 2621225 2654748 2628975 2671168 2667237 2705434 2717964 2767155 2784312
5854B784312L9609L2799j2564M0656q830j6711M4918J7177n3053M5660k1005K0137
5842B913105k7511P8654k7829M8519j8012L8209N6712j362l5466K2903L6184J0390
5830C094496k1227l2416K6956J4226r707K1600M4002L5575n0569K2551O3524J3170
5818C222181p516N0802R8749O0375k951O5980N1002Q7488M6036K0475M336J05220
5806C802177N5439Q6193J2222J03637O5952M4609K5010O6009K6933J04343P8196
5795D470720P0297M3327N4969J24188Q0892J09437J12160Q301J17040Q9514Q6709
5784E367554J06746R4964J22175J34866P9758J48132Q6969J59873J34599J69113
5774F604749J67016J52399K33731P5824J79648J63606J23270K12726J36359J87048
$$ plain form
5854 2784312 2823921 2856720 2844156 2884812 2875982 2859271 2904189 2921366 2868313 2913973 2892968 2913105
5842 2913105 2885594 2964248 2936419 2984938 2966926 3005135 3061847 3060485 3025019 3047922 3084106 3094496
5830 3094496 3073269 3040853 3067809 3082035 3072328 3093928 3137930 3173505 3122936 3145487 3209011 3222181
5818 3222181 3214665 3265467 3364216 3424591 3421640 3487620 3538622 3626110 3672146 3692621 3696957 3802177
5806 3802177 3857616 3943809 3956031 4059668 4125620 4170229 4195239 4261248 4288181 4392524 4470720
5795 4470720 4541017 4584344 4639313 4763501 4844393 4953830 5065990 5074291 5191331 5280845 5367554
5784 5367554 5474300 5569264 5691439 5826305 5906063 6054195 6141164 6301037 6435636 6604749
5774 6604749 6771765 6924164 7157895 7233719 7413367 7576973 7700243 7912969 8049328 8236376
5764H236376Q4079K28566R8954K28833J49103K24755J75147L17161K18445K96604
5754A0258023L08587L32744L44094M44260M36775M82605M92799N72754O13834
5745A4286475O38234P30166P83709R39128J003260J156377J345438J596309J861355
5736B4340451K351431L052305L913201N011085O173866P042826P756124Q007123
5728F7648412P999192P478102O064615L731329R89487j634074l753763n077047
5720H3446253o048319o469139o319221n711630m552078l350782k211636j258811
5712D7524637m78541K26549R00760J613083K255319K972415M132115N702114P760907
5703G2609358J0047291J2342538J4500254J7023381J9452927K0522203J9616728
$$ plain form
5764 8236376 8320455 8549021 8647975 8876808 9025911 9250666 9425813 9742974 9961419 10258023
5754 10258023 10566610 10899354 11243448 11687708 12124483 12607088 13099887 13672641 14286475
5745 14286475 14924709 15654875 16438584 17377712 18380972 19537349 20882787 22479096 24340451
5736 24340451 26691882 29744187 33657388 38668473 44842339 51885165 59641289 67648412
5728 67648412 75647604 83125706 89190321 92921650 93911137 92277063 88523300 83446253
5720 83446253 77397934 70928795 64609574 58897944 54345866 50995084 48783448 47524637
5712 47524637 47046096 47272645 48173405 49786488 52041807 55014222 59146337 64848451 72609358
5703 72609358 82656649 94999187 109499441 126522822 145975749 166497952 186114680
5696A86114680J7515530J4897726J1140723N826076K52830m787436r271046j3434230
5688B08254853j6390256j7703340j7488526j6607627j5150366j3158483j0826061
5681A00930194q409001n991047l896649k062769o43787P51952K012083L532444
5673H6223420N344477P999309J0843252J3788685J6066426J7856652J9517719
5666A77639940K0684335J9816441J6763263J2143080O832001J435543m305506
5659B51009097r808498j4389349j7380223j9245392j9898004j9867765j8473071
5652A31946795j6182147j3499667j0923410q447988o312632m482322k879184j494750
5644F7724695m79547M57426J204008K262768L491927M765043N940771P036678
$$ plain form
5696 186114680 203630210 218527936 229668659 235494735 235747565 230960129 221689083 208254853
5688 208254853 191864597 174161257 156672731 140065104 124914738 111756255 100930194
5681 100930194 92521193 86530146 82633497 80570728 79926941 80678893 82690976 86223420
5673 86223420 91567897 99567206 110410458 124199143 140265569 158122221 177639940
5666 177639940 198324275 218140716 234903979 247047059 253879060 255314603 251009097
5659 251009097 241200599 226811250 209431027 190185635 170287631 150419866 131946795
5652 131946795 115764648 102264981 91341571 82893583 76580951 72098629 69219445 67724695
5644 67724695 67245148 67702574 68906582 71169350 74661277 79426320 85367091 92403769
5636I2403769P916956Q863871R755129J0124935R460094P631784M784892J908252
5628A52849682q32714l115484m825086n819480o271368o103021n519880m707750
5620A15654899l836187l004763k069084j452860r65207m82485J0671O35805J372837
5611A05863626K165651K788802L096412L629294L971938M351656M300900L787620
5603A33955899L301018K816437K035346P59176n88435j601071k481431l587510
5595A34609429m567507n379439n644902n608070n480398n351649n139729m624928
5587I2812807l875287l075259k342248j846319j410071q03776l77134j16368o733
5578G8959612l07092p76778j125958j495497k064316k797090l446091l802747
$$ plain form
5636 92403769 100320725 109184596 118939725 129064660 138524754 146156538 150941430 152849682
5628 152849682 152016968 148901484 144076398 138256918 131985550 125882529 120362649 115654899
5620 115654899 111818712 108813949 106744865 105292005 104326798 103844313 103854984 104490789 105863626
5611 105863626 108029277 110818079 113914491 117543785 121515723 125867379 130168279 133955899
5603 133955899 137256917 140073354 142108700 142867876 142279441 140678370 138196939 134609429
5595 134609429 130041922 124662483 119017581 113409511 107929113 102577464 97437735 92812807
5587 92812807 88937520 85862261 83520013 81673694 80263623 79459847 79082713 78966345 78959612
5578 78959612 78652520 77875742 76749784 75254287 73189971 70392881 66946790 63144043
5570F3144043m050429m201792m180859m032291l820350l462302l120870k825584
5562C3449566k339921k095370j782559j626239j406914j343186j114976r85196
5554B0755205q24076q17741o58485o06526m70986m44637l50412k61623k82584
5545A6038135k11106j67904j46067k26353j66718j68263k16874j35074k29232
5536A4370544j67310k13886j93380j23351j45009o6352j21298J0779o7692K238
5526A3285283M3350L8691K3239J2982L5109J19558M0122J00670N7983K22200J56616
5515A4135803K32892L04313M03786M58374M97186O08488O48768P58839P54662
5506A8803111R65209J018852J060206J255530J400080J547764J908763K161474
$$ plain form
5570 63144043 59093614 54891822 50710963 46678672 42858322 39396020 36275150 33449566
5562 33449566 31109645 29014275 27231716 25605477 24198563 22855377 21740401 20755205
5554 20755205 19931129 19113388 18454903 17848377 17377391 16932754 16582342 16320719 16038135
5545 16038135 15827029 15659125 15513058 15286705 15119987 14951724 14734850 14599776 14370544
5536 14370544 14203234 13989348 13795968 13672617 13527608 13461256 13339958 13350737 13283045 13285283
5526 13285283 13328633 13367324 13390563 13403545 13438654 13558212 13598334 13699004 13756987 13979187 14135803
5515 14135803 14368695 14673008 15076794 15535168 16032354 16640842 17289610 18048449 18803111
5506 18803111 19768320 20787172 21847378 23102908 24502988 26050752 27959515 30120989
5498C0120989K499318K777521L229314L537345L636391L797532L843680L653040
5490E7095130L183689K680573K079455J693246J212777Q43472O02978L71863L71466
5481G0134649O14492Q97025J265864J663999K085979K749913L379272L999486
5473H6790679M461688N016197N310114N693487N976256N788817N279037M448529
5465A28764804L688578K680747J292554m31343j719589k695136l517485m414712
5457A23648418m894434n019104m709042m350241l734325l232465k753189k021141
5449I2934477j663443j274251j074356j102261j171654j448795j840342k291240
5441H1068135k827835l257776l622181l927440m075162m126546m303494m118543
$$ plain form
5498 30120989 32620307 35397828 38627142 42164487 45800878 49598410 53442090 57095130
5490 57095130 60278819 62959392 65038847 66732093 67944870 68788342 69391320 69763183 70134649
5481 70134649 70749141 71646166 72912030 74576029 76662008 79411921 82791193 86790679
5473 86790679 91252367 96268564 101578678 107272165 113248421 119037238 124316275 128764804
5465 128764804 132453382 135134129 136426683 135995340 134275751 131580615 128063130 123648418
5457 123648418 118753984 113734880 109025838 104675597 100941272 97708807 94955618 92934477
5449 92934477 91271034 89996783 88922427 87820166 86648512 85199717 83359375 81068135
5441 81068135 78240300 74982524 71360343 67432903 63357741 59231195 54927701 50809158
5433E0809158l983240l758674l516695l272906k988889k610979k328631k046651
5425B6302493j789906j543059j285149j152000r55318r60434q38484p36647o34456
5416A6407040o79417o27165n76898n70241n23971m51282m24827m08627m07220
5407A1737392l02338l23021k97034k45713k49687j92508k49334k49885k33365
5398I394507l20280k87895k83419m01815l35842k99239l11743k65127l10618k83946
5388F294583k17268k37399k14508j24144j91832j37467p1442r7970j62496m5810
5378D794247j19919j02804o9668l0678o6123L0812J2420o5783J3114o8845m5981
5367D280792m2679p1607j09632j44003r6628k6781j10344r9290p8499j06605k9820
$$ plain form
5433 50809158 46825918 43067244 39550549 36277643 33288754 30677775 28349144 26302493
5425 26302493 24512587 22969528 21684379 20532379 19577061 18616627 17778143 17041496 16407040
5416 16407040 15727623 15100458 14523560 13953319 13429348 12978066 12553239 12144612 11737392
5407 11737392 11435054 11112033 10814999 10569286 10319599 10127091 9877757 9627872 9394507
5398 9394507 9074227 8786332 8502913 8101098 7765256 7466017 7154274 6889147 6578529 6294583
5388 6294583 6077315 5839916 5625408 5501264 5309432 5171965 5100523 5002553 4840057 4794247
5378 4794247 4674328 4571524 4501856 4471178 4405055 4435867 4448287 4382504 4395618 4326773 4280792
5367 4280792 4238113 4166506 4056874 3912871 3816243 3789462 3679118 3579828 3501329 3394724 3364904
5356C364904j08120j7382o2054J6148l1244m700K9859l6348k03j9840n3085L4731
5344C112666q3988j9514p8304m7139l3929m9137n2216j11969q1888n7527m871
5333B492184o8692k1944p7613L1186n4156k9751j8805j1775m6499J0239P190L3301
5321B244865l4237O598j0630k47m4363k6385n4138l6225j12959k9018j03936k5416
5309A773909j4708p0867K4163l7211j1995k234o7863R739k6210J3678k251l5218
5297A552932l0486K9364L0444P2361L2456J9156p955K2857P5027N5056M6553L4507
5285A932272r4297p8439m8643j08582K854p5833J1782k2792o7346j2617k7629
5274A410730N6090P934M8563m5790R671k1239K7965P931O1966L0324K4554O4081
$$ plain form
5356 3364904 3256784 3239402 3177348 3193496 3162252 3157552 3187411 3151063 3150860 3131020 3077935 3112666
5344 3112666 3028678 3009164 2930860 2883721 2849792 2800655 2748439 2636470 2554582 2497055 2492184
5333 2492184 2423492 2401548 2323935 2355121 2300965 2271214 2252409 2240634 2194135 2204374 2211564 2244865
5321 2244865 2210628 2217226 2206596 2206349 2161986 2135601 2081463 2045238 1932279 1903261 1799325 1773909
5309 1773909 1759201 1688334 1712497 1675286 1663291 1661057 1593194 1602933 1576723 1590401 1588150 1552932
5297 1552932 1522446 1551810 1582254 1654615 1687071 1706227 1698272 1721129 1796156 1851212 1897765 1932272
5285 1932272 1837975 1759536 1710893 1602311 1605165 1529332 1541114 1518322 1450976 1438359 1410730
5274 1410730 1466820 1474754 1523317 1477527 1487198 1465959 1493924 1501855 1563821 1594145 1618699 1682780
5262A682780L0258L0903J14050P524J20349P0261r0732k2841m2878j03935j00795
5251A694944J2285p4679o5394N9448o1640j770M6263o7852K8932J1561R3679m5598
5239A630179k3243L9560k0895Q459K6856K9804L3648K2725Q6346P9463N5658l2776
5227A935784j5008j2326l1359o1799L8546m5211l0342m5435O8091n8451L2688
5216A775178J336q985j4181j3001P1542J161R71j050K7907k1982l7881l197l011
5203A774807O483l0484L9128r340l3640N8162q7391j4140o9811J693k2457l1648
5191A581362k653q494o0808K1257j6642l4127k3416J0138M1397l5684j1849r7
5179A460384j1445j4834j4502p947k1260N4413k3654K5394l1132l87k0355p841
$$ plain form
5262 1682780 1713038 1743941 1857991 1865515 1985864 2056125 1965393 1942552 1899674 1795739 1694944
5251 1694944 1707229 1632550 1567156 1626604 1564964 1563194 1609457 1541605 1570537 1582098 1675777 1630179
5239 1630179 1606936 1646496 1625601 1634060 1660916 1690720 1724368 1747093 1833439 1912902 1968560 1935784
5227 1935784 1920776 1908450 1877091 1815292 1853838 1808627 1778285 1732850 1800941 1742490 1775178
5216 1775178 1776514 1767529 1753348 1740347 1811889 1813050 1814021 1812971 1840878 1818896 1781015 1777818 1774807
5203 1774807 1781290 1750806 1789934 1780594 1746954 1805116 1717725 1703585 1633774 1635467 1613010 1581362
5191 1581362 1578709 1570215 1509407 1530664 1514022 1479895 1456479 1466617 1508014 1472330 1460481 1460384
5179 1460384 1448939 1434105 1419603 1411656 1390396 1444809 1421155 1446549 1415417 1415030 1394675 1386834
5167A386834K8112j8089J2742M4347m4550k7346R1157m222r488M148J1106K9035
5155A503786m9796O6342k7718O1276P694O0242J1997M2708P4417M7240K8945J1477
5143A838610j6864J7775J677m667L5861K4510L3351J3555l8574N1449K5351L7188
5131B019222M0050L2008K7772M9787j6688N9989L7509L475O152O7683O0105P7842
5119B464906P8086L5437J26125M9646O3387L7791P0626o531N5462k0712O1326
5108C015549K6840O6303L3521R1843N2894M5960J07861O0466J460R8950N380Q6351
5096C693378N2109Q5440P9479J20212O6605M8941J95127J42091J09200J73439
5086D766021J50598J49463J74944J35584J73237J88307J83943K41052J82052K59108
$$ plain form
5167 1386834 1414946 1396857 1409599 1453946 1409396 1382050 1473207 1468985 1459497 1463645 1474751 1503786
5155 1503786 1453990 1520332 1492614 1553890 1561584 1621826 1633823 1676531 1750948 1798188 1827133 1838610
5143 1838610 1821746 1839521 1841198 1836531 1872392 1896902 1930253 1943808 1905234 1956683 1982034 2019222
5131 2019222 2059272 2091280 2119052 2168839 2152151 2212140 2249649 2253124 2259276 2326959 2387064 2464906
5119 2464906 2542992 2578429 2704554 2754200 2817587 2855378 2926004 2919473 2974935 2954223 3015549
5108 3015549 3042389 3108692 3142213 3234056 3286950 3332910 3440771 3501237 3502697 3601647 3607027 3693378
5096 3693378 3745487 3830927 3910406 4030618 4097223 4146164 4341291 4483382 4592582 4766021
5086 4766021 4916619 5066082 5241026 5376610 5549847 5738154 5922097 6163149 6345201 6604309
5076F604309K81862K95929L39863L47743M52510M40496N85651P68371Q47130R50836
5066A1914700J198260J517529K063563L081447M528281N731316N780803M386507
5058D0202406J607790j551796m102322m667699l981791l105942k186231j517419
5050B0696996p31694J1542M54778L62394J9909k72319o867K66849O71759J099712
5040B2573059J512723J928224K450910L196641M465297O598093R136613J0701520
5032F2563080J0620481J0510542J2650619J4298249J0434049j14698j1111768
5025A09850554j6185074j5666670j2591225r374155o525622m205654k520783j969289
5017D0812082k011966j897151j250842n13694Q423M67273P86698J191203J677051
$$ plain form
5076 6604309 6886171 7182100 7521963 7869706 8322216 8762712 9348363 10116734 10963864 11914700
5066 11914700 13112960 14630489 16694052 19775499 24303780 30035096 35815899 40202406
5058 40202406 41810196 40258400 36156078 31488379 27506588 24400646 22214415 20696996
5050 20696996 19965302 19976844 20431622 20794016 20813925 20541606 20534739 20801588 21473347 22573059
5040 22573059 24085782 26014006 28464916 31661557 36126854 42724947 51861560 62563080
5032 62563080 73183561 83694103 96344722 110642971 121077020 120962322 109850554
5025 109850554 93665480 77998810 65407585 56033430 49507808 45302154 42781371 40812082
5017 40812082 38800116 36902965 35652123 35138429 35146852 35614125 36400823 37592026 39269077
5008C9269077K651618M149785O802232R395493J0477822J0448608J2301776J6664223
5000A12160634J9592825J6790236Q312649k837451j2859285j9323153k0359695
4993A01476760j7571132j3976594j0580059q007506n812096m146525k720352j954584
4985C6707912j508145r79552l14177J17800J35904j681P3026M78891J006131J881479
4975C7597588L109151N113813Q490393J2246333J4110131J3051541Q983369K511244
4967A05213563n422622j1636718j4004281j2982238j0570351q293696o433027
4960C5870630m997433l858177k951089k076562j491975p42724j89393j95214n06950
4951A8861113q96574q42309o91747l45304j07008J44324M86085R17380J703445
$$ plain form
5008 39269077 41920695 46070480 52872712 62268205 72746027 83194635 95496411 112160634
5000 112160634 131753459 148543695 156856344 154018893 141159608 121836455 101476760
4993 101476760 83905628 69929034 59348975 51341469 45529373 41382848 38662496 36707912
4985 36707912 35199767 34220215 33906038 34023838 34159742 34158061 34231087 34709978 35716109 37597588
4975 37597588 40706739 45820552 54310945 66557278 80667409 93718950 102702319 105213563
4967 105213563 99790941 88154223 74149942 61167704 50597353 42303657 35870630
4960 35870630 30873197 27015020 24063931 21987369 20495394 19752670 19563277 19368063 18861113
4951 18861113 17964539 17122230 16430483 16085179 15978171 16122495 16608580 17525960 19229405
4942A9229405K782304L588566L397768K177886L61771j666611l212867l729771
4934B2928451l373000k740657k072898j557138j274526j167148q69913p67002
4926I106169n23469m95179k67153l15858k03488k69637j69323n0766R7823K19260
4916G128379L11977N2471l35816l68882l01557l23801j93953j77242j36173q1981
4906E573422j47314m5726j10880m6580J2582j91852l6256o8031l6472k8523j9686
4895D854684l4123k7473k212p7789L7011n6637N2991k1593J4070q5393Q5110K1363
4883D760009o871M4945M3323m939L7128k5309J2401L8822k1670l207L6220L65
4871D911217k1336N6088O0271k3764K3186L3326M0419P5436O0940O7652J707J07729
$$ plain form
4942 19229405 22011709 25600275 28998043 31175929 31537700 29871089 26658222 22928451
4934 22928451 19555451 16814794 14741896 13184758 11910232 10743084 9873171 9106169
4926 9106169 8582700 8087521 7820368 7504510 7301022 7031385 6862062 6811296 6909119 7128379
4916 7128379 7440356 7492827 7157011 6788129 6486572 6162771 5968818 5791576 5655403 5573422
4906 5573422 5426108 5380382 5269502 5222922 5235504 5043652 5007396 4939365 4902893 4874370 4854684
4895 4854684 4820561 4793088 4790876 4713087 4750098 4693461 4746452 4724859 4738929 4653536 4738646 4760009
4883 4760009 4753138 4798083 4841406 4836467 4873595 4848286 4860687 4899509 4877839 4874632 4910852 4911217
4871 4911217 4889881 4945969 5006240 4982476 5005662 5038988 5079407 5154843 5215783 5283435 5285142 5392871
4859E392871L4522O0856J00120n070Q7972L3119Q8152Q8304O6446J04728Q9870
4848F141890J13412Q3286N3596R2619J27214J25354Q3641O8806J99415J18083
4838G207316J55612J45145J59309J46470J52618K23994K29258K24767J94728K64720
4828I103937L00670K30648K56600L54418L82753M05317M49498N00877N64987P02723
4818A3252428Q92659R12309Q83871O72144N96740N21941M72870N69180R09218
4809A9683360J338638J606148J734107J079845O38359L79157L74707O20373R66887
4800B8421581J367071J517314J274069R61137N25501K08899J10239L34896O92333
4791C5413040J013977J171261J383578J696247K326075L136653L879272M212599
$$ plain form
4859 5392871 5427393 5488249 5588369 5583299 5671271 5704390 5792542 5880846 5947292 6052020 6141890
4848 6141890 6255302 6338588 6392184 6484803 6612017 6737371 6821012 6889818 7089233 7207316
4838 7207316 7362928 7508073 7667382 7813852 7966470 8190464 8419722 8644489 8839217 9103937
4828 9103937 9404607 9635255 9891855 10246273 10629026 11034343 11483841 11984718 12549705 13252428
4818 13252428 14145087 15057396 15941267 16613411 17210151 17732092 18204962 18774142 19683360
4809 19683360 21021998 22628146 24362253 25442098 26080457 26459614 26834321 27454694 28421581
4800 28421581 29788652 31305966 32580035 33541172 34066673 34275572 34385811 34720707 35413040
4791 35413040 36427017 37598278 38981856 40678103 43004178 46140831 50020103 54232702
4783E4232702M317470M288679M609166N496041O715588P832066Q610866Q599197
4775A04701775P499770N740934L957995K499006J249233N30624J061813K330092
4767A29571242L486394M687657P651973J3693480K0384482K0954323J1927363
4760B12356914j278813r223276r429983n441824p64584L213349P039847J1232191
4752B07703821J4677585J6265597J5525857J2185413P040169P27302n464002j1300693
4744B57361049j5286757j6297236j5000055j2862423j0700644p352979j490835
4737A78370120O670857J2007851P905490l971203j4472994j7639845j5352989
4730A53517287j1466255q620012o780237n368141l641663k179228q88287n39678
$$ plain form
4783 54232702 58550172 62838851 67448017 72944058 79659646 87491712 96102578 104701775
4775 104701775 112201545 117942479 121900474 124399480 125648713 126179337 127241150 129571242
4767 129571242 133057636 137745293 145397266 159090746 179475228 200429551 212356914
4760 212356914 211078101 201854825 192424842 186983018 186218434 189431783 196471630 207703821
4752 207703821 222381406 238647003 254172860 266358273 273398442 274125744 268661742 257361049
4744 257361049 242074292 225777056 210777001 197914578 187213934 179860955 178370120
4737 178370120 185040977 197048828 204954318 200983115 186510121 168870276 153517287
4730 153517287 142051032 133431020 126650783 121282642 117640979 115461751 114573464 114033786
4722A14033786j140980k994371n305983p078096p648925p305185o699465n971107
4714F9889674n399504m907820m687555m472063m033167l451393k658026k215223
4706C8064923j694779j559963j343037j063533n80932j98578j8361o7009l72389
4697C1166342q48672j227327j271444j186466q54799m27752l01346o05693j053534
4688B3389309j469653j543072j453068j105541p80711n39902m99972l99508l54938
4679A5242944m59181o72250p20666p59897p47114n45976n14627n65389m22164
4670I835680m07929l39656l59668l20206k62523k39058k14526k09211k76137j37965
4660G068801k42868j67601j63116j69199j59393j53820j73949j57424o0643j28330
$$ plain form
4722 114033786 112892806 109898435 104592452 97514356 89865431 82560246 75860781 69889674
4714 69889674 64490170 59582350 54894795 50422732 46389565 42938172 40280146 38064923
4706 38064923 36370144 34810181 33467144 32403611 31822679 31624101 31605740 31538731 31166342
4697 31166342 30317670 29090343 27818899 26632433 25777634 25349882 25048536 24442843 23389309
4688 23389309 21919656 20376584 18923516 17817975 17037264 16497362 15997390 15597882 15242944
4679 15242944 14783763 14111513 13390847 12630950 11883836 11337860 10823233 10257844 9835680
4670 9835680 9427751 9088095 8728427 8408221 8145698 7906640 7692114 7482903 7206766 7068801
4660 7068801 6825933 6658332 6495216 6326017 6166624 6012804 5838855 5681431 5620788 5492458
4650E492458j31221j83133j07711o4279j48267j73210l0958j19529q8080o6659
4640D379411q3545m4176r4596q7220r6691o8034j15853l3304r8385r2383q9655
4629C475569J1917p4986r5918K1545o1324j25094P432j5562j55632k5546k6585
4618B935816j14522m1777m7121q5813K2517j09191K903q1351p6821j4848r261
4607B380531r3533m5958k7792L2758j02812k6304m8024l2237k2504n5179r593
4596A949353p284p3457o3912p035j1125p5545k5894l013k3770M263j2487m5402
4584A604692L507p4191M7791o6858o6058m4305N422l2202J2890n4200M5757o6110
4572A316135l7124J6467J5064p9687j1379R125K2082r8559J7186L8691k0291k5063
$$ plain form
4650 5492458 5361237 5178104 5070393 5006114 4857847 4684637 4653679 4534150 4446070 4379411
4640 4379411 4295866 4251690 4157094 4069874 3973183 3905149 3789296 3755992 3657607 3565224 3475569
4629 3475569 3487486 3412500 3316582 3338127 3276803 3151709 3159141 3143579 2987947 2962401 2935816
4618 2935816 2821294 2779517 2732396 2646583 2669100 2559909 2562812 2481461 2404640 2389792 2380531
4607 2380531 2286998 2241040 2213248 2246006 2143194 2116890 2068866 2036629 2014125 1958946 1949353
4596 1949353 1942069 1868612 1804700 1797665 1786540 1710995 1685101 1682088 1658318 1662581 1650094 1604692
4584 1604692 1608199 1534008 1581799 1514941 1448883 1404578 1410000 1377798 1390688 1336488 1382245 1316135
4572 1316135 1279011 1295478 1310542 1230855 1219476 1228601 1250683 1152124 1169310 1208001 1187710 1162647
4560A162647K6307L2582j1087j3490J7951n3446n4558J14083p1503O3080m0533
4549A172033O538R832J579n8263k0567L0463n742J0970j2862l936P986p23k6276
4536A111032k7621N263L5034P4623M18N9285J6409P4511L6989M5017J5648L7900
4524A484508J7952k1588n8339n2575j3981J3746k695n7557N2335P080m2992M4134
4512A370028p0252j0635K4102O0753L7885R8085L0136J20798O4264N9380K3202
4501A807746l7825K9093l2542l1492q8045K2175k8413l193m8390K7548m2866m6849
4489A526947n0140P055j2757k6188m4896q769J08755J9110P6143K0927N5854R453
4477A681494o6959m6667k9518n6998m2430O5569K8128O3179l3302r2384m646p9326
$$ plain form
4560 1162647 1188954 1221536 1210449 1196959 1214910 1161464 1106906 1220989 1149486 1212566 1172033
4549 1172033 1178571 1188403 1189982 1131719 1111152 1141615 1135873 1146843 1133981 1130045 1138031 1137308 1111032
4536 1111032 1083411 1088674 1123708 1198331 1198749 1258034 1274443 1348954 1385943 1430960 1446608 1484508
4524 1484508 1502460 1480872 1422533 1369958 1355977 1369723 1367028 1309471 1361806 1368886 1325894 1370028
4512 1370028 1299776 1289141 1313243 1373996 1411881 1509966 1540102 1660900 1725164 1784544 1807746
4501 1807746 1769921 1799014 1766472 1734980 1646935 1669110 1640697 1637504 1589114 1616662 1573796 1526947
4489 1526947 1476807 1483862 1471105 1444917 1400021 1391252 1500007 1519117 1595260 1616187 1672041 1681494
4477 1681494 1614535 1567868 1538350 1481352 1438922 1504491 1532619 1595798 1562496 1470112 1465466 1386140
4465A386140m0856q546m3552m6801M611K224k442J4344M7138m0399m0679k1700
4453A209482k1371j7684n1942O002o1068n1027k7718J1907k4081K2047L6243R15
4441A031705k588K2849k1406q547J5998k1106j0869M1696M636R2531k8210j7081
4429A099608l9173r0725q246m2180L4353j1012L2135P0159k1296j142p8220j1972
4417I32289k2583j5849L031j3057L4239L324N0242j988N0062K23J2441M0198J6871
4404A089443J8583j6554J8915n817r3480k2480j4073M6611L857j1476L0068L0899
4392A074496N0989o1602J8690N8952M2214M1646J83339P0209r8800n9520r647
4381A310966k2458N4441j6176o3006J4244j6781l218l9343n914p332J7023n3065
$$ plain form
4465 1386140 1345284 1336738 1293186 1246385 1250996 1253220 1250778 1265122 1312260 1271861 1231182 1209482
4453 1209482 1188111 1170427 1118485 1124487 1063419 1012392 984674 996581 972500 994547 1030790 1031705
4441 1031705 1029117 1051966 1030560 1022013 1038011 1016905 1006036 1047732 1052368 1144899 1116689 1099608
4429 1099608 1060435 969710 961464 919284 953637 942625 974760 1044919 1023623 1022481 944261 932289
4417 932289 909706 893857 896888 883831 918070 921394 971636 969648 1019710 1019933 1032374 1072572 1089443
4404 1089443 1108026 1091472 1110387 1104570 1011090 988610 974537 1021148 1025005 1013529 1043597 1074496
4392 1074496 1125485 1063883 1082573 1141525 1183739 1225385 1408724 1478933 1380133 1320613 1310966
4381 1310966 1288508 1342949 1326773 1263767 1278011 1261230 1258012 1218669 1212755 1205423 1222446 1169381
4369A169381K6343N3001N7240J48898k1592M8925m4961M9657M5429N2792K59257
4358A844370K38898J14896j08396j43591j70168m8312j05883l298J3588j22750
4348A509354m9995Q137k9735N0031m0913N4032K0073K5550K9460J79719J08874
4337A864587O8273M1153j143K7729N0577P7560L6243P9418P2402l6086q4595n7968
4325B138150j9379o3945K4248J14138P2888R4846m5721n6602J2094k3661p6087
4314B170969R4638k1238P0240P4299J41750M1481P7378P6055O5342Q3369K9165
4303B903448Q8375J22991L8922Q4458J14755J37336K07661K43877K18777L48538
4293D509138M74242N00490M34635L20350K88445M88064N55615P16888R09369R96273
$$ plain form
4369 1169381 1195724 1248725 1305965 1454863 1433271 1482196 1437235 1486892 1532321 1585113 1844370
4358 1844370 2083268 2198164 2089768 1946177 1776009 1727697 1621814 1618516 1632104 1509354
4348 1509354 1459359 1467496 1437761 1487792 1446879 1500911 1520984 1546534 1575994 1755713 1864587
4337 1864587 1932860 1974013 1972870 2000599 2051176 2128736 2164979 2244397 2316799 2280713 2196118 2138150
4325 2138150 2118771 2054826 2079074 2193212 2266100 2360946 2315225 2258623 2270717 2247056 2170969
4314 2170969 2265607 2244369 2314609 2388908 2530658 2572139 2649517 2725572 2790914 2874283 2903448
4303 2903448 2991823 3114814 3153736 3238194 3352949 3490285 3697946 3941823 4160600 4509138
4293 4509138 4983380 5483870 5918505 6238855 6527300 7015364 7570979 8287867 9197236 10193509
4283A0193509J037135R93072N86986j47084r46021j257581j406161j143141j029688
4274F881026q15527o72102n56211l76760l55910l17879j94845j60483j09399o2568
4264C259342Q266o2954r9370j82562j36743j49496j06580q9870j2354j14871k9621
4253B283187j20636m2324l5090j06982o4382j4292o1908l5271o5802p9336L068
4242A660232p8084k1889q0024o869k7923q3509j6838J5617p6500k2274P474j9790
4230A249623J5480k6601k5846o1689k2351j6192n1406L3169n9291p198J7214l1683
4218A013229R276k8222J231k26q2477J1953m5098Q903L9371l5181o6036J7826
4206H44549L9389o9601J9749Q479l7488J2377j5370M4776n2874k1350L5441l4797
$$ plain form
4283 10193509 11230644 12223716 12810702 12663618 11717597 10460016 9053855 7910714 6881026
4274 6881026 6065499 5393397 4837186 4460426 4104516 3786637 3591792 3431309 3321910 3259342
4264 3259342 3267608 3204654 3105284 2922722 2785979 2636483 2529903 2440033 2427679 2312808 2283187
4253 2283187 2162551 2120227 2085137 1978155 1913773 1899481 1837573 1802302 1736500 1657164 1660232
4242 1660232 1582148 1560259 1480235 1473366 1445443 1361934 1345096 1360713 1284213 1261939 1269413 1249623
4230 1249623 1265103 1238502 1212656 1150967 1128616 1112424 1061018 1094187 1034896 1027698 1044912 1013229
4218 1013229 1022505 994283 995514 995288 912811 924764 879666 888569 927940 892759 826723 844549
4206 844549 883938 814337 834086 842565 805077 817454 802084 846860 793986 772636 808077 773280
4194G73280l4040J9005Q23j2689l6370J8285l8035O6761o2772m335l95J3783k4378
4181F78923m7919K0717P5027n6993l7852l3626J7623N8555o0384Q221M3972n7642
4169F08622L5721m0251K629K1070l142n8354K7079O4103p7687m288K3406k4487
4157E74421N240K1690m5894r461J272P1625n1957j5091K0321k5040M568k8159
4145E23535l5505N7743M7812n7780M2775j0752n1074l474L4949m3566P69M4352
4133E49784l8891Q658K8386j3136l3831k6379O7275j5148o6034l1637J15093p1827
4121D72313J6401K452l4911j6930l4214R5855n7428N183n7151M9709l8654K2357
4109D24982P945J2894J8695l7633J1261m2670J9389R344l6437m568Q5904o4390
$$ plain form
4194 773280 739240 758245 759068 746379 710009 728294 690259 757020 694248 689913 689518 703301 678923
4181 678923 631004 651721 726748 669755 631903 598277 615900 674455 614071 622292 666264 608622
4169 608622 644343 604092 606721 627791 624649 566295 593374 657477 579790 575502 598908 574421
4157 574421 579661 601351 555457 545996 547268 618893 566936 551845 572166 547126 551694 523535
4145 523535 488030 545773 593585 535805 578580 567828 516754 513280 548229 504663 505432 549784
4133 549784 510893 519551 547937 534801 500970 474591 541866 526718 460684 429047 544140 472313
4121 472313 488714 491166 456255 439325 405111 500966 443538 448721 391570 441279 402625 424982
4109 424982 432927 445821 464516 426883 438144 395474 414863 424207 387770 383202 469106 404716
4097D04716J2584k0098n860J9210L7106l3454J4423n5166O2609j04573N9645M6910
4085D38052l3245k5305N4309j5377J4768l3782o4853M8279K6659J5441l9645J2421
4073C97722j9180M7554k2640k1883M0745L1371j3857m7479l1384P9998k1488K9185
4061D48664R614k9899j734J2775L497L8446p97m2810M2780j6098Q6953l0965l6836
4048D83590K0109J4424L0798j4309j7898k2828O5186l349n392q055K1201j5040
4036E48437k5127R9193q2278M8596q166J5643m7707P7818J5116J8063r036J7873
4024F68425M2932L5457N1902J0466r4922N4125J3610J7623M3206K4030O3555O907
4012I37316K1932K5572K3620Q5607o5618L2393L991k0446M4927j4568K7312K5299
$$ plain form
4097 404716 417300 397202 391342 410552 447658 414204 428627 373461 436070 331497 391142 438052
4085 438052 404807 379502 433811 418434 433202 399420 334567 382846 409505 424946 385301 397722
4073 397722 378542 426096 403456 381573 422318 453689 439832 392353 360969 440967 419479 448664
4061 448664 458278 428379 426645 439420 442917 481363 480566 437756 480536 464438 551391 520426 483590
4048 483590 503699 518123 548921 534612 516714 493886 559072 555723 550331 542276 563477 548437
4036 548437 523310 622503 540225 588821 580655 596298 548591 626409 641525 659588 650552 668425
4024 668425 711357 746814 798716 809182 714260 768385 781995 799618 842824 866854 930409 937316
4012 937316 959248 984820 1008440 1094047 1028429 1060822 1064813 1044367 1089294 1074726 1102038 1127337
4000A127337K7411m9135P3416o936J1251N6879N4678O5153K1092Q1997P9990J47185
3988A690318P3402J20256Q7804L4587r4876r5370j22369o3181p7549j0888o2631
3977A479503p5736j873M9974J1876j6089J27260K2761Q485m2361J21230l4320
3966A650710L7294J9677O3431M0734l1848L1775J0131q1435n2411o6747q0421
3955A540890o9373n1331j5324q3773j3816n1010K0766K7700l1939j8812J8338
3944A272316j936n7090k4634n2638l0215n7924K8446m3931r9225J0433r0634J50
3932H53118n9747m8957p6416J7563k0179l5425M8590p6231m7302P728j7843J9216
3920E64115K4279k7818r528n2605j1653O1867n5731L016J639n3172j0323J2965
$$ plain form
4000 1127337 1154748 1105613 1179029 1172093 1183344 1240223 1294901 1360054 1381146 1463143 1543133 1690318
3988 1690318 1763720 1883976 1971780 2006367 1911491 1816121 1693752 1630571 1553022 1542134 1479503
3977 1479503 1403767 1401894 1451868 1463744 1447655 1574915 1597676 1606161 1563800 1685030 1650710
3966 1650710 1688004 1707681 1771112 1811846 1779998 1811773 1821904 1740469 1688058 1621311 1540890
3955 1540890 1471517 1420186 1404862 1321089 1307273 1256263 1277029 1304729 1272790 1253978 1272316
3944 1272316 1270380 1213290 1188656 1136018 1105803 1047879 1076325 1032394 933169 943602 852968 853118
3932 853118 793371 744414 667998 685561 665382 629957 678547 602316 555014 562742 544899 564115
3920 564115 588394 560576 551048 498443 486790 548657 492926 495942 497581 444409 434086 447051
3908D47051M793l7580l7870L5621k7066N046M3665o8932P853K5413J357n7753
3896C41598R835j5899m883k7274L1148l1513L6791q4223L2821L0765n2022P5213
3884C42357j2343n9944P8765j07312Q1511k9432r868j9521N354n4765Q302L6418
3872B59522j6177j0111j3213n8610M0549r269J6623J8032k442p0385P4891J2891
3860B42301n4527M76l5774L3807o090J2929j7731L4435n2265L8344K3249n2163
3848A66991p56M0572j00924M7319J9991l4513K6396j7036p492J613j3436l0026
3836I8699J5862k0265P2329p526m0264Q335k9686L4340J6892J2357n8248L9801
3824A42626l4322k0970M9935q533J4361l1884m0724L8847N905m9309N8952K585
$$ plain form
3908 447051 451844 414264 376394 412015 384949 389995 433660 364728 372581 397994 399351 341598
3896 341598 351433 335534 330651 303377 334525 303012 339803 255580 288401 319166 267144 342357
3884 342357 330014 270070 348835 241523 323034 293602 283734 264213 269567 214802 223104 259522
3872 259522 243345 233234 220021 161411 201960 192691 209314 227346 224904 154519 229410 242301
3860 242301 187774 188250 152476 186283 180193 193122 175391 209826 157561 195905 219154 166991
3848 166991 166235 206807 105883 153202 173193 138680 165076 148040 140548 142161 128725 98699
3836 98699 114561 94296 166625 159099 118835 127170 97484 131824 148716 161073 102825 142626
3824 142626 108304 87334 137269 128736 143097 111213 70489 109336 115241 65932 124884 127469
3812A27469m7818m48J8466j4934J8651k5729j5658q161L8079L072j1818N3149
3800A34320n6618K9915j0212m0679L0683r640R538k3567M8800l4020j2830R207
3788G4897K467j5467J8037J4359L750l0419m7351J6982J4725j4908K5167J1202
3776G3441p339l8631N3160j0581O13m069m4517L5357K6354k9174m9153K547K7572
3763C5580K3487o413k437K0132k7047M2639k3139j5297J3198m1824J9507L0857
3751F9243k3804R962Q08j3743J0557n868K678K9628m9178K7002j9997J8159j773
3738E3674o11R493k7743p111J0183L7908k9241l621k5153J7341L7437j2915p615
3725E2026L8744k352n0234M1817J6484Q589n2534K0415L5172m3225M1552m9699
$$ plain form
3812 127469 79651 79203 97669 82735 101386 75657 59999 51838 89917 92989 81171 134320
3800 134320 77702 107617 97405 56726 87409 77769 87307 63740 112540 78520 65690 74897
3788 74897 77364 61897 79934 94293 98043 67624 20273 37255 51980 37072 62239 73441
3776 73441 66102 27471 80631 70050 70663 66594 22077 57434 83788 54614 5461 8008 35580
3763 35580 59067 52654 50217 70349 43302 85941 62802 47505 60703 18879 38386 69243
3751 69243 45439 55401 56209 42466 53023 47155 49833 79461 30283 57285 37288 55447 53674
3738 53674 53063 62556 34813 27702 37885 75793 46552 42931 17778 35119 72556 59641 52026
3725 52026 90770 88418 38184 80001 96485 105074 52540 72955 108127 64902 106454 56755
3713E6755O2274o9365j7383M7993l6842J1980k7114N3102K5835p832j4928k7336
3701E7139j9831k0591M1250k94l6424R837j4522j6806Q9245q5342K5769j2288
3689A7142L048M5309J547J620o534j6422K6209j5967J7124m7959l4079K3248K1519
3676C5805k8025K105O00J3784P561J9389m6005K5820q590N6125k3279m043r006
3663D2241K7514m5000J1653o11p794L1936j213j9723m2328m443J6515P0484J840
3650H1071k8001R775m5831M395K138K3728k1489L1468k6191l7705K6126J6492
3638C5976R790k7078k5874O5789n091r0248O5801l8449K3410M9360J696l1804
3626C3278j7506R662L6626n5896J7701M4121l0346j322K2791k8173J3181K7116
$$ plain form
3713 56755 119029 49664 32281 80274 43432 55412 28298 81400 107235 99403 84475 57139
3701 57139 37308 16717 57967 57673 21249 31086 16564 -242 89003 3661 29430 17142
3689 17142 20190 65499 67046 68666 62132 45710 71919 55952 73076 25117 -8962 14286 35805
3676 35805 7780 9885 10485 24269 31830 51219 5214 31034 22444 78569 55290 51247 42241
3663 42241 69755 24755 36408 35797 28003 59939 58726 39003 -3325 -7768 8747 79231 81071
3650 81071 53070 62845 17014 21409 23547 47275 25786 57254 31063 -6642 19484 35976
3638 35976 45766 18688 -7186 58603 53512 -36736 29065 -9384 14026 63386 65082 33278
3626 33278 15772 25434 62060 6164 23865 67986 37640 36318 59109 30936 44117 71233
3614G1233p834k8761L4060n4610M237N388L0399k4230L9615L3705p6364R984m289
3601C2533j5130K6935k4222O705N739l0656O3449n3775N0966K9785m0281J8324
3589G0372L3510k5131N3339m3879O2412j3365k3307m8146l593L684n1763K9397
3577D3530k9510O1837m2271J8927l0258N0850m1152K8976l9660K3182L4854n8962
3565B0343N3224j3705l1787K8004m71j9794L8579l1686K1682n1929n134O086L1232
3552D4644j0845R685l7932R525J8025K8714o308l65L5251n6907N4952l3353m4431
3539A0655L5201r140k2525L8525O021K438n5741J7605J8451k5678O5703Q939k0459
3526F9995n2128L4431J307L1864m7740J0544K3079J994m9469N1302M0927j6892
$$ plain form
3614 71233 63399 34638 68698 14088 18325 23713 54112 29882 69497 103202 26838 36822 32533
3601 32533 17403 44338 20116 26821 32560 1904 65353 11578 62544 92329 52048 70372
3589 70372 103882 78751 132090 88211 150623 137258 113951 65805 62212 65896 14133 43530
3577 43530 14020 75857 33586 52513 22255 73105 31953 60929 21269 44451 79305 20343
3565 20343 73567 59862 28075 56079 55608 35814 74393 42707 64389 12460 7326 13412 44644
3552 44644 33799 43484 5552 15077 33102 61816 55508 55143 90394 33487 88439 55086 10655
3539 10655 45856 36716 14191 52716 58737 61175 5434 23039 41490 15812 81515 90454 69995
3526 69995 17867 52298 53605 85469 37729 48273 71352 73346 23877 75179 116106 99214
3514I9214o6677j6313P1362o5214K4793L9007l2608N0266n2741O846j7000N2637
3502I3572j3090j6787K23r889L9387m6896J2592q37K9114n1829M4625J7416k9500
3489F8101j2551J3055M4604m1518N43K8525j0416m3137P1190J460n3943R725o892
3476F8746L0691N873o3383N2477K6347l2339k7986N9094j5736m1887J8631J5586
3464I6114o139j1534N1047p9591J8035K1170r425K4108L9499l1065p450k278K51
3451A02742r808k000J2417J9318n7803M0483q393r95L7528J1487k1850Q7369q8534
3438A21961M6001k7755M3442K798k8187O844J8003l5265K0162j2466l283K0799
3426A73054N2252q5089k2957M5811K8201n0696J5746J056L8029p6729O5797M3544
$$ plain form
3514 99214 32537 16224 87586 22372 47165 86172 53564 103830 51089 57935 40935 93572
3502 93572 80482 63695 63918 54029 93416 46520 59112 58275 87389 35560 80185 97601 68101
3489 68101 55550 68605 113209 71691 72234 100759 90343 47206 118396 119856 65913 75638 68746
3476 68746 99437 105310 41927 94404 120751 88412 60426 119520 103784 61897 80528 96114
3464 96114 89975 78441 129488 49897 67932 89102 79677 103785 143284 112219 104769 102491 102742
3451 102742 92934 90934 103351 122669 64866 105349 96956 95961 133489 144976 123126 210495 121961
3438 121961 167962 140207 183649 186447 158260 165104 183107 147842 168004 155538 152255 173054
3426 173054 225306 140217 117260 163071 191272 140576 156322 157378 195407 118678 184475 228019
3414B28019K738L2815n2157K7429j4850k1366M8437M7139m8232K1097q012l0216
3402B32841L4244K2903j9994M7923K6065o7240N0089K8432j912m748K9163k6600
3390C51166P5119j0361K3891l545J7116m0206M939O6727K0506K6498Q3683K2031
3378F37564R6212N6355O028O2488P4453N2458J17459J64025J94010J98422K11217
3367A870691N0488J17204J25023R1826J85872K93980L09611M75004O64790J146703
3357E331192K256851M266004N558611L299901r90650l893769l870739l014713
3349H942688k243294j577040j199807q71125n86710m50664k30034j30495n0882
3340A602637J9971k2719j52843j56160j43041r7717n5778q9799l7101p9995m3244
$$ plain form
3414 228019 230757 263572 211415 238844 223994 202628 251065 298204 249972 271069 263057 232841
3402 232841 267085 289988 269994 317917 343982 276742 326831 355263 353351 348603 377766 351166
3390 351166 426285 415924 439815 436270 453386 413180 418119 484846 505352 531850 615533 637564
3378 637564 733776 790131 796159 858647 933100 985558 1103017 1267042 1461052 1659474 1870691
3367 1870691 1921179 2038383 2163406 2255232 2441104 2735084 3044695 3519699 4184489 5331192
3357 5331192 7588043 11854047 17412658 20712559 19721909 15828140 11957401 8942688
3349 8942688 6699394 5122354 3922547 3051422 2464712 2014048 1784014 1653519 1602637
3340 1602637 1622608 1599889 1447046 1290886 1147845 1050128 994350 904551 867450 787455 744211
3329G44211l446r7343m0395m4892J4139l3452p887n7501k8454L2291l7241j8466
3317D21564m5119J6000m3547J0811k5748l4033L8733p747K1314k7614l6051m3443
3305B45120J2972n4108J04510q1692M5319J1836k9093j7252o3419M3410M8568
3294B66171l4320k7762q258L3668L2718p3068k7441N10J5528k0231L9092k4674
3282A71933P611m2108K2607j8166K8225k8759j4528L5055K7321j8228o995j6284
3270A47684o0347R0426o7671l4669N4783r056M5247n5602L6313k3421k2845N137
3258A05979J5234j5674K9773p439j8871k6832j8117K8109J2182J1333R288o3578
3246F1387M7703m0078L1607N675k375K950M882J0418m4209J879J4618n689j1251
$$ plain form
3329 744211 740765 643422 603027 558135 572274 538822 530935 473434 444980 477271 440030 421564
3317 421564 376445 392445 348898 359709 333961 299928 338661 330914 352228 324614 288563 245120
3305 245120 258092 203984 308494 226802 272121 283957 254864 237612 174193 217603 266171
3294 266171 231851 204089 195831 229499 262217 189149 161708 162218 177746 157515 196607 171933
3282 171933 179544 137436 160043 141877 170102 141343 126815 161870 189191 170963 163968 147684
3270 147684 87337 177763 110092 75423 130206 121150 166397 110795 147108 123687 100842 105979
3258 105979 121213 105539 135312 127873 109002 82170 64053 92162 104344 115677 124965 61387
3246 61387 109090 69012 100619 106294 103919 106869 111751 122169 77960 79839 94457 88768 77517
3233G7517k0761M0112k6506j4365M8003j6701N5607k7684m0962O669k672q194
3221G0063K9467j6471K1312j3940p3794P1122K3827m9535K8340j6435j3323K2189
3209H2822j621K7252l0264O051j4261L5451l3005K5347n0345L8135l4663n5316
3197d417r725O4338J461j3155J9928j9758O6031m6140N4066k3874l2778l0547
3185B5430Q0292k1337j7620r345j294l9747L4008q428M1698j5086J466j3459n05
3172E6073J3357j2781l540l6342K5377m6354P0189j5667P0481K148n2009m6924
3160B4008L3551K3213M3530o0857j2712L3203p6962R1793k1256j0801k386K5395
3148H9719k2468J6793j7776l5871L6171J1554P713K005J0167m5634J4560N0996
$$ plain form
3233 77517 56756 96868 70362 55997 104000 87299 142906 115222 74260 80929 78257 70063
3221 70063 99530 83059 104371 90431 16637 87759 111586 62051 90391 73956 60633 82822
3209 82822 81201 108453 78189 84240 69979 105430 72425 97772 47427 85562 50899 -4417
3197 -4417 -14142 50196 51657 38502 58430 38672 104703 58563 112629 88755 55977 25430
3185 25430 105722 84385 66765 57420 56126 16379 50387 41959 83657 68571 70037 56578 56073
3172 56073 69430 56649 53109 16767 42144 -4210 65979 50312 120793 122941 70932 24008
3160 24008 57559 80772 124302 63445 50733 83936 6974 98767 77511 66710 64324 89719
3148 89719 67251 84044 66268 30397 66568 78122 85835 87840 98007 52373 66933 117929
3136A17929l5163P216l5853L0622j3266L9791n8654M8904k3343L5459n1334j311
3124F0997j5215K9815K6920L5945M74N000M3831n6758j17k9956j701r863k8289
3111F1083m2936N9008k2400L4972k7818K901k8705j8368J8937N3270n1313l226
3099C5405N9228m8801J3719j781M928k5303N0211j4389j6695r730n89K1474k4369
3086D3308M1045j637k4577M279K5949k9746m3581O0426o6605L0597k087K049K2653
3073F2073j0518J1994L5127l3863j6060M1348r281l1476j6233K7873J1092j5358
3061E6718j6400J5900J4304M683k6534K4071k7449j6877M3642j5219K6256j7068
3049F6027J5111j3008J0357l3728m3902P9130J0314k3295M0049l0471K0997p757
$$ plain form
3136 117929 82766 89982 54129 84751 71485 111276 52622 101526 78183 113642 62308 60997
3124 60997 45782 75597 102517 138462 138936 143936 187767 131009 130892 100936 99235 89372 61083
3111 61083 18147 77155 54755 89727 61909 64810 36105 17737 36674 89944 38631 35405
3099 35405 94633 45832 59551 57770 62698 37395 87606 73217 56522 46792 46203 67677 43308
3086 43308 84353 82716 58139 62418 88367 58621 15040 75466 8861 39458 37371 39420 62073
3073 62073 51555 63549 98676 64813 48753 90101 80820 49344 33111 60984 72076 56718
3061 56718 40318 56218 70522 75205 48671 72742 45293 28416 72058 56839 83095 66027
3049 66027 81138 68130 78487 44759 857 79987 90301 67006 107055 76584 97581 89824
3037H9824l2831j0637K2763k2939o110J6444L5780J7237n4646K7210n337m1596
3025C5162M8752l6073O6513n2764L5096j8333k0770K3280l1757L5650J6698l6465
3013F4989n512P390j4140M732L9974j3687k7493M1976k8475o455M6646o3141r988
3000C6816N8013j9484o3111M2103k4934O770L0851j8095K3009k1802N8243p6710
2988C1669N527K690J5528o857L1037k2250J0435l2451k579j0895M1524k1572l9303
2975B503L7766L6972j5676J8974J6283m2251J7654l4510m957k9353Q0388K1145
2963A04938k6686j2045l8962Q999N4972l1539K1548m436m6045N162k0364L0085
2951D5627K9320J0356l9207P077j4142k02Q1203m2874J5850l7484J5311J7714
$$ plain form
3037 89824 56993 46356 69119 46180 40070 56514 92294 109531 54885 82095 76758 35162
3025 35162 83914 47841 114354 61590 96686 78353 57583 80863 49106 84756 101454 64989
3013 64989 59477 66867 52727 57459 97433 83746 56253 98229 69754 63299 109945 46804 36816
3000 36816 94829 75345 12234 54337 29403 36173 67024 48929 71938 50136 108379 31669
2988 31669 37196 39886 55414 48557 79594 57344 67779 35328 32749 21854 63378 41806 2503
2975 2503 40269 77241 61565 80539 96822 54571 72225 37715 32758 3405 83793 104938
2963 104938 78252 66207 27245 36244 91216 59677 81225 76789 30744 35906 15542 45627
2951 45627 74947 85303 46096 53173 39031 38829 120032 77158 93008 55524 70835 88549
2939H8549l5365Q220k3978Q1850j6813r456m7981M5119l8691l0495Q1145m1970
2927F0134k7995J2517M3098k9435L8305j2853n102L4834m4635j5920n571J0263
2915E7640J9015k290j109j7332K2149k7934L5617m8481J8889k3252M8072j1011
2903F9973m9433O2088l6580j3372Q4579l0752k3199l0109N9191Q770k6954J4565
2891H8767l9360j3011j029m862J8394J3962L6758j2111J3318m7777N0400j974
2879A01475k9240j9111J4653k4517K0772k1679J9219j7132M1034J4033k2546k4789
2867E2172J0070j2035Q591m46K2918K834k7704Q1102q9446L1913m3589Q507L0335
2854G5222k060j9343M5773P403m4117L4266L3199k3131M262n2406R479j0182M3459
$$ plain form
2939 88549 53184 61404 37426 119276 102463 93007 45026 90145 51454 20959 102104 60134
2927 60134 32139 44656 87754 58319 96624 83771 78669 113503 68868 52948 47377 57640
2915 57640 76655 74365 73256 55924 78073 50139 85756 37275 56164 32912 80984 69973
2903 69973 20540 82628 46048 32676 117255 86503 63304 33195 92386 101156 74202 88767
2891 88767 49407 36396 35367 30505 48899 62861 99619 87508 100826 53049 103449 101475
2879 101475 72235 53124 67777 43260 64032 42353 61572 44440 85474 99507 76961 52172
2867 52172 62242 50207 58798 58352 81270 84104 56400 137502 48056 79969 36380 44887 75222
2854 75222 73162 53819 99592 106995 62878 97144 130343 107212 111474 59068 68547 58365 101824
2841A01824q050k2237K779j5780J5328L994M4714n3207j2617K0039J9334n2368
2829D3753N9807l7131K8438j5634k4835m020L3953m7936L2533L6214k0912m9044
2817C5186O582M3840j4094N7414m9128M0644p2172N1412r3540M2921L3999M1495
2805A24559l4445n5190J9101k8811L3401J1319k0539J2557j2950M1662m5824L1362
2793G6202k5392M3536n6319N7441n7872J0992J5252j5257M4641M2129k7556l2110
2781G5687j2032o027Q29L4067j0044j7027k8071J1643m038K2982K0298j762m0744
2768D5761L4966K2174j431m5299l367O9647l8792m8698m068M0101K2298q55J1596
2755A04033K9686n5258j0615M3016l683n1495K9930N5454n5964o208L077L8707
$$ plain form
2841 101824 93774 71537 74316 58536 73864 77858 122572 69365 56748 76787 96121 43753
2829 43753 103560 66429 94867 79233 54398 50378 84331 36395 68928 105142 84230 35186
2817 35186 41768 85608 71514 128928 79800 120444 48272 99684 6144 49065 83064 124559
2805 124559 90114 34924 54025 25214 58615 69934 49395 61952 49002 90664 44840 76202
2793 76202 50810 94346 38027 95468 37596 48588 63840 48583 93224 135353 107797 75687
2781 75687 63655 57628 58457 92524 82480 65453 37382 49025 44987 67969 88267 86505 45761
2768 45761 80727 102901 101470 56171 52804 122451 83659 34961 30893 70994 93292 92437 104033
2755 104033 133719 78461 67846 110862 107179 55684 85614 141068 85104 78896 81973 120680
2743A20680j5378J3136p51k2900j7125J2807n812M0270p4055M7283R042k5910
2731H1287J2144j1394K0262l6219L2680l7141N2031j7842j784r625N1086n1552
2719H3933J2401j3986M5854k1905N068l4193J7617J3894P719j2615o724k7621
2707F9442M93J9513k064N6594m9564k1745J4338L948q255J2441m5300P2872k1173
2694A01540j7382K0925m1564N8356K7441l8713j5940m2801M532K0965M1805n1873
2682F7291K2289K2091m4670J4266K8928m0621o949M2632l9655N582P6678p9648
2670F8214J0476Q2416p6260j3305J1203J3705M617l2739J7772J6557J207m4176
2658E9687K4162R300L956M0081J5501m7971m893K2975n6330j938o891M6103q177
$$ plain form
2743 120680 105302 118438 117687 94787 77662 90469 84657 124927 50872 98155 107197 81287
2731 81287 93431 82037 102299 66080 98760 61619 113650 95808 94024 84399 135485 83933
2719 83933 96334 82348 128202 106297 111365 77172 94789 108683 116402 103787 97063 69442
2707 69442 69935 89448 87384 143978 94414 72669 87007 90955 82700 95141 49841 122713 101540
2694 101540 84158 105083 63519 121875 149316 110603 94663 51862 56394 77359 119164 67291
2682 67291 89580 111671 67001 81267 110195 69574 62625 105257 65602 71184 147862 68214
2670 68214 78690 161106 84846 71541 82744 96449 101066 68327 86099 102656 103863 59687
2658 59687 83849 93149 97105 137186 152687 104716 99823 122798 66468 64530 57639 103742 95565
2645I5565m151j5738O031L5130o796n1179M1345k6775p520l5857N1477O380l4206
2632E3706N792j6796P9988k4543J4634l9275l997j0390M4892j0265l0907J977
2620F4816M9276j9289n4289J0276K0379M0401l6558j6200L1179m5653J8005J1626
2608G3969M0727j8832J7825P00k6377j3777M978j6191k1168P4273k5885k6574
2596F3668J3894L4054r6292R8623m3565J1374l8691L246J1741N378L6972m189
2584I6213k5668L2396k3138O184J0211n482l1803O6784r332J5307m7810K6594
2572A10456j8295P925K0129l5607k2354K3744j7457N8252l0729j5545P321K672
2560I0512K3918k2632j2256j1641L402J7752j585J2026j2791M5637p9578K0646
$$ plain form
2645 95565 91414 75676 81707 116837 110041 58862 100207 73432 65912 30055 81532 87912 53706
2632 53706 59498 42702 122690 98147 112781 73506 69509 59119 104011 93746 62839 64816
2620 64816 114092 94803 40514 50790 71169 111570 75012 58812 89991 44338 62343 73969
2608 73969 114696 95864 113689 114389 88012 74235 79213 63022 41854 116127 90242 63668
2596 63668 77562 111616 15324 113947 70382 81756 43065 46311 58052 63430 100402 96213
2584 96213 70545 102941 79803 85987 96198 90716 58913 125697 116365 131672 83862 110456
2572 110456 92161 100086 120215 84608 62254 85998 68541 126793 96064 80519 87840 90512
2560 90512 114430 91798 79542 67901 71303 89055 87470 99496 86705 132342 52764 73410
2548G3410L8489M1675p9311J4286j6216m417M8526n4601M8856m355O852m1453
2536G1741k334O984Q568k9168N4926O1066o1922p6147K8314N6833n7991J7975
2524G8845K3806J1380k0869M1044q3103M6732J0421l6340L4553m5863M7215j5974
2512I1847l3939J9435J8497k3249J3487J8542l4510N8910j7375q371k4171J9351
2500I8454L737N962l1902L9403m982l302m0555L2871m4136O6436J064m0942q091
2487G4017J2711J9635j8923N4642l1203j3469r279O2646m9972K0918p3209Q1326
2475A29840n826o1759J7473j8716N1905Q308l3091K5862m984j5714j2888l9762
2463D0648P2718L69K9956o9241J5861j3064m620K0637n583K9494o6475K9643L2031
$$ plain form
2548 73410 111899 153574 74263 88549 72333 67916 116442 61841 110697 106342 113194 71741
2536 71741 69407 76391 84959 55791 110717 171783 109861 33714 62028 118861 60870 78845
2524 78845 102651 114031 93162 134206 51103 97835 108256 71916 106469 60606 107821 91847
2512 91847 57908 77343 95840 72591 86078 104620 70110 129020 111645 103274 79103 98454
2500 98454 102191 108153 76251 115654 110672 107370 66815 99686 55550 121986 123050 82108 74017
2487 74017 86728 106363 87440 142082 110879 97410 88131 150777 100805 121723 48514 129840
2475 129840 124014 62255 79728 61012 112917 121225 88134 113996 109012 93298 80410 40648
2463 40648 113366 113735 143691 74450 90311 77247 72627 93264 87681 117175 50700 80343 112374
2450A12374k5029M4944r449j9537J6213m1694k9905P776K8494J0091K5863j8111
2438A02030J1529L645k5929J8110Q393k3277J6184j2064j2080J4346n1200M6558
2426I6245j5994P451j7945l8330L9033p123L2693j9122K1803J7710r1207Q5492
2414A10706p1855O2587K4244l7887M2874j7039l6578M7440j7402j7080M3387j0278
2402A23119p056K3695n9063L4020L531K2328n0671J5575j2972K8110r3309M5620
2390G2927K2894L2161o6744M1391j0495J4941n4865M1595q716N1406n7325L0720
2378A09890l8817M2605o4487P7919K7757l4903o0214M7585J5258k0213J7712L1965
2366A52057q9533L9608k5781N0066M980l2778J4411p169J6436m3660N7642o2279
$$ plain form
2450 112374 87345 132289 122840 103303 119516 77822 47917 55693 84187 94278 120141 102030
2438 102030 113559 117204 91275 109385 117778 94501 110685 98621 86541 100887 49687 96245
2426 96245 80251 87702 69757 31427 70460 63337 96030 76908 98711 116421 25214 110706
2414 110706 38851 101438 125682 87795 130669 113630 77052 124492 107090 90010 133397 123119
2402 123119 116063 139758 80695 114715 118246 140574 89903 105478 92506 120616 27307 72927
2390 72927 95821 127982 61238 102629 92134 107075 52210 93805 85089 136495 79170 109890
2378 109890 71073 113678 49191 127110 154867 119964 59750 107335 122593 102380 120092 152057
2366 152057 62524 102132 76351 126417 131397 98619 113030 105861 122297 78637 136279 74000
2354G4000N5590k5831r433p7127Q6019q313k9298K6652j8974K4094J7279l4397
2342H0261M0959j0194r21K4120l2238J1681j7679O449j0129L4700K1603n7429
2330I1183K738L168K5630r200O465j5843K1342p9918M1858J6117l6159N4428j4564
2317A07245j2959K2712j0147J1394m5070M6414J1441O893m1989J8064j8693K2986
2305A18291k6658L1608j9914m0957K4954O0910l6101k112K5139k8938K4645n1053
2293G9814O3067m4079L411m2342R924L0286P625L0131j00839M7679L6251m8813
2281G2115N6214m1913j0842J3265L7145n03J6240j2516m6812L155k2306N2475
2269A15717K5084m3648k1261N193P1942k0651l8112J4610J5768l3417L0737l3613
$$ plain form
2354 74000 129590 103759 94326 17199 103218 94905 65607 92259 73285 97379 114658 80261
2342 80261 121220 111026 110105 134225 101987 113668 95989 102438 92309 127009 148612 91183
2330 91183 93921 97089 122719 113519 119984 104141 125483 45565 87423 103540 67381 121809 107245
2317 107245 94286 116998 106851 118245 73175 119589 131030 137923 95934 113998 95305 118291
2305 118291 91633 123241 103327 62370 87324 148234 112133 110021 135160 106222 130867 79814
2293 79814 142881 98802 102213 59871 69795 100081 107706 137837 36998 84677 120928 72115
2281 72115 128329 86416 75574 88839 125984 125481 141721 129205 82393 85548 63242 115717
2269 115717 140801 97153 75892 81085 153027 132376 94264 108874 124642 91225 121962 88349
2257H8349P453K5056J6057n360l6711M9993j5006M714j1008o2902O5605J4190
2245A40430l6911j3022N2235l1364K3425K4993n1004j5014l222N0648n0303M0490
2233A31381j1168j1029K4657l4566m588r409o26N1726j7962L0930l4111j4590
2221A00645k2371q086j5022Q1215n2227N9414n5052K3159J5796j0966j6918q085
2209I1502N2976K25p4447M2468Q343j2019l8111J0625O0258l0273N0400p0191
2197I1756j698K6025P5769o1650O844k1815n4237N1720O229N408j7969j7379l0829
2184E8174O2088L0592p0244J2713J1725r244M7586m0726J2615O077j6208J2414
2172A17562o4528K9179J6900l339J943L259N380k7036O8592m9498L9198j1221
$$ plain form
2257 88349 95802 120858 136915 131555 94844 144837 129831 134545 123537 60635 126240 140430
2245 140430 103519 90497 142732 111368 134793 159786 108782 93768 90546 141194 90891 131381
2233 131381 120213 109184 133841 99275 94687 85278 84652 136378 118416 149346 115235 100645
2221 100645 78274 70188 55166 136381 84154 143568 88516 111675 127471 116505 99587 91502
2209 91502 144478 144703 70256 112724 121067 109048 70937 81562 141820 111547 161947 91756
2197 91756 90058 116083 191852 130202 137046 115231 60994 112714 118943 124351 106382 89003 58174
2184 58174 120262 150854 80610 93323 105048 95804 143390 102664 115279 121356 105148 117562
2172 117562 53034 82213 99113 95774 97717 100976 106356 79320 147912 98414 137612 126391
2160A26391J0111m0590K4897j2133o508p0074Q2632J0813r450r03Q258j9416l0279
2147G3749J2498J452J4805L4111l7247M682p466l1688M2046l2308M0764k4708
2135I0690N5935l8533j583k4126o43J9684R803J1507j8799q573L7355l8657K3342
2122A17402j5192K3153l2389k566J169M2427n741O635k7039o6510L7815L9444
2110A18608n5099K1665M003K4001j9952j1810K1415L7076l241M2302m9354o7356
2098F2258K9016L2872o961q498q94j6981P928L0113l3565L3037J6178j8767l3031
2085I2705q817J8043O823K9167n9123L1428J9084K4171P967n6282K564M9390p8518
2072G8602M4638r12j7284M4609l9324l7291N6364R515J0553k5450m3021O0390
$$ plain form
2160 126391 136502 95912 120809 108676 102168 32094 114726 125539 116089 115186 123444 104028 73749
2147 73749 86247 87699 102504 136615 99368 104050 96584 64896 106942 74634 115398 90690
2135 90690 146625 108092 106509 82383 81740 101424 111227 122734 103935 95362 132717 94060 117402
2122 117402 102210 125363 92974 90408 91577 134004 128263 134898 107859 41349 79164 118608
2110 118608 63509 85174 89177 113178 93226 81416 102831 139907 136666 178968 129614 62258
2098 62258 91274 124146 117185 108687 107793 90812 98740 128853 95288 128325 144503 125736 92705
2085 92705 83888 101931 108754 137921 78798 110226 129310 153481 161448 105166 107730 157120 78602
2072 78602 123240 122328 105044 149653 110329 73038 129402 138917 149470 124020 80999 141389
2060A41389j9334j7075R59L0622l4343p07M5337p2152L6969J5537K3816l9922
2048A11096n255J4345n016j2915P894K355l2552K1679j5044N0870m106j0207p853
2035A15291R803j98l6499Q255P632Q565M5217m0425n201m8358K8787P9367n6338
2022A15898J6024k2278j6965n7935K5714L7312j960O3499K57m4892l4802M0081
2010A19953J6351k1854k208M9662j7893J7087m9229j8606N2318l9447K390l3911
1998G4613N3191n1064K2290L8552j8102J9488n5487L9404J4176p338m1444P737
1986I6016n205J4130P037l1034L8485j9932k8244J7105O6897m4899l8747M1104
1974A12713L899Q728Q218o2911P6188L0643p8364J991K60L6302J8173j4932l6371
$$ plain form
2060 141389 122055 104980 105939 136561 102218 101511 146848 74696 111665 127202 151018 111096
2048 111096 105841 120186 115170 102255 110149 112504 79952 101631 86587 137457 133351 123144 115291
2035 115291 125094 124896 88397 96652 104284 112849 158066 117641 112440 64082 92869 172236 115898
2022 115898 131922 109644 92679 34744 60458 97770 95810 159309 159566 114674 79872 119953
2010 119953 136304 114450 112242 161904 144011 161098 111869 93263 145581 106134 108524 74613
1998 74613 127804 76740 99030 137582 119480 138968 83481 122885 137061 129723 88279 96016
1986 96016 90811 104941 111978 80944 119429 99497 71253 88358 155255 110356 71609 112713
1974 112713 116612 125340 133558 70647 146835 177478 99114 101105 101365 137667 155840 140908 104537
1961A04537K7727l0206o019O070J5789k6837M6950m0888K6207K3914k497J3273
1949A58020m0087j2554L3519J112j1532j9697P145J8729q6708Q6937j9818K6266
1937A41332m7613k9777K9756R034K6837j5973M9011l6885J354L0554k6640l5403
1925I5587J333J6040J5276j1887J6500j4873N843m1769K0543J3877J7504l4105
1913I9869J5399k648R609l7684K4787N1439n1343N838j4552K9964J516l8398K8452
1900A22248J6928J7485m2113j3587j4023n927o89J5787K04k8909L1133J7417j513
1887A14441r995L0773l127l1682J968L4782j11P206k4541j9826K9200k662l9048
1874H7378L2259p123K2976J5269k7077n613l49K6184J9614n7137n088N6982n8369
$$ plain form
1961 104537 132264 102058 96039 102109 117898 91061 138011 97123 123330 147244 144747 158020
1949 158020 117933 105379 138898 140010 128478 108781 115926 134655 47947 134884 115066 141332
1937 141332 93719 63942 93698 102732 129569 113596 162607 125722 127076 157630 130990 95587
1925 95587 96920 112960 128236 116349 132849 117976 123819 82050 102593 116470 133974 99869
1913 99869 115268 112620 122229 84545 109332 160771 109428 115266 100714 130678 132194 93796 122248
1900 122248 139176 156661 114548 100961 86938 81011 80322 96109 96313 67404 98537 115954 114441
1887 114441 104446 135219 132092 100410 102378 137160 137049 144255 119714 99888 129088 126426 87378
1874 87378 119637 112514 135490 150759 123682 118069 117720 143904 163518 106381 101293 158275 99906
1861I9906J1522M7259k3961k3813K1232J7548n4268O267L4549o0008Q5628j0689
1849A51172j4170o8989J8325M9961l5445M2443j8063m389o9467O3693R77K4541
1837A40589m1205m631L1858j514m2509M9881Q252n274J0044j3058r830q76p674
1824A14053M214J3131k89l4557K1748L2462l3662K241l8707L5766L8647l8765
1812A16282r776K1141K418p556o426J2138l732k1588N1233l0012j3486k003J3099
1799A21732L3896m3191n5975J01911K3737n6986j1824L3210k6314l6598O959J0710
1787A01267J9723J3857J3030l8489q624K2728J9602j3737j1790M301j2536j6301
1775I3031j1674K216L9665l0948K119R101O124J8256p728j2966j749j9458M0354
$$ plain form
1861 99906 111428 158687 134726 110913 132145 149693 95425 101692 136241 76233 161861 151172
1849 151172 137002 68013 86338 136299 100854 143297 125234 120845 51378 115071 116048 140589
1837 140589 99384 94753 126611 125097 82588 132469 140721 135447 145491 132433 122603 121727 114053
1824 114053 118267 131398 131109 96552 118300 150762 117100 119341 80634 116400 155047 116282
1812 116282 106506 127647 130065 122509 116083 128221 124489 102901 154134 124122 110636 108633 121732
1799 121732 155628 112437 56462 158373 182110 125124 113300 146510 120196 83598 90557 101267
1787 101267 120990 134847 147877 109388 100764 123492 143094 129357 117567 121868 109332 93031
1775 93031 81357 83573 123238 92290 94409 103510 109634 127890 120162 107196 105447 85989 126343
1762A26343o0391M3606K429M9845j0326k7007j9388K2214K5278n7185K1129L5062
1750A51609Q960l8060k2883k2149j4451P6036l2471j4250O5501j3584k9150N169
1738A20277J3861j0256K037l5565J9440P2751q7921k1606Q6251m2412O1866l2309
1726A46414l1179o257j5547J5244J3684k2108Q617J9739l1187K9461n4598J3867
1714H6150P5491p004J2359n1745J4224m1349J7810k2220J3857J7201M8830p5403
1702H8201L9286k8579J9844P0161m3384N158n2537Q409J8629L6372K9322j17226
1690G3656Q0900j3438m175l902k1202r149L6333p464k5969j0034L3474j2676J6113
1677A32467n3047L4187L59J924J6127q783j2819N8876m9897j4170O144k068Q07
$$ plain form
1762 126343 65952 109558 111987 161832 151506 124499 105111 127325 152603 95418 116547 151609
1750 151609 160569 122509 99626 77477 63026 139062 106591 92341 157842 144258 115108 120277
1738 120277 134138 123882 125919 90354 109794 182545 94624 73018 159269 116857 178723 146414
1726 146414 115235 108978 93431 108675 122359 100251 108868 128607 97420 126881 72283 86150
1714 86150 161641 154637 166996 115251 129475 88126 105936 83716 97573 114774 163604 88201
1702 88201 127487 98908 118752 188913 145529 150687 98150 106559 125188 161560 190882 73656
1690 73656 154556 141118 136943 133041 111839 102690 139023 131559 105590 95556 129030 116354 132467
1677 132467 79420 113607 113966 115890 132017 123234 110415 169291 119394 105224 111368 109300 110107
1664A10107j0134J7015L0671l2686L0276J0121n0692m286N8316p4136M3544j9737
1652A08379j3043M4463n5393L9745L3827P335o6542j739K9447m9574L3272J0659
1640A20836K2538K5821r2197J1618J2486K5259K1913q12l4398n0357O5356J6040
1628A44103l2665p336J0563k1608R890J5799N9503n2045J6260p2498L1436R346
1616A10748j8382K8251j1467j8388M2457n7607R007o3J119N5923l7777M1735N001
1603A50557q0616M2217k2343O879N172M7217n9134J3082j8661M0779K493J570
1591A29212K154n2125L7159j2205J187J7221J2223l6673M8445m7822L1676J9571
1579A50023j8734L5819j0948m2984L4257m7655K0504l0727M6784r22k9210k9012
$$ plain form
1664 110107 99973 116988 147659 114973 145249 155370 104678 100392 158708 84572 128116 108379
1652 108379 95336 139799 84406 124151 157978 165313 98771 97032 126479 76905 110177 120836
1640 120836 143374 169195 76998 88616 101102 126361 148274 147462 113064 62707 128063 144103
1628 144103 111438 104102 114665 93057 102947 118746 178249 126204 142464 69966 101402 110748
1616 110748 92366 120617 109150 90762 133219 75612 84619 84556 85675 141598 103821 145556 150557
1603 150557 69941 112158 89815 96694 101866 149083 89949 103031 84370 125149 127642 129212
1591 129212 131366 79241 116400 104195 105382 122603 134826 98153 146598 98776 130452 150023
1579 150023 131289 167108 156160 113176 147433 99778 120282 89555 136339 135417 106207 77195
1567G7195J7813N546q98L398K4410j790l1830R587K7885m161n2551J2356M0022
1554A26982J1722M6721o9316K828j3507p8137J02806J5064o6989M0679M918m8011
1542G5760N5375l1449Q998l3176L6379l637M8134n3685K7337K9188o3410K7882
1530A23696K5203l3782K6997J3214m3310k90M3417l7562m337L5411k7909k5512
1518I5236L5862p6291J4043M2029l1468P0487n6721j3776K3878J7546K3803j4510
1506A30118L2720j7516n1384L3576k7918J9203R813K3596R184l6743o422j015
1494A17212P161L9179j14647Q0235j697p921l3280J973j772N1382j8287L331j7511
1481A05358L5254j4159j0729M2876l7338M303m612j8779J3786J430J7651K2130
$$ plain form
1567 77195 95008 100554 99656 103054 127464 125674 93844 103431 131316 127155 74604 86960 126982
1554 126982 138704 185425 116109 118937 105430 27293 130099 145163 78174 118853 123771 75760
1542 75760 131135 99686 108684 75508 111887 108250 156384 102699 130036 159224 95814 123696
1530 123696 148899 115117 142114 155328 112018 111728 155145 117583 113246 148657 120748 95236
1518 95236 131098 54807 68850 110879 79411 149898 93177 79401 103279 120825 144628 130118
1506 130118 162838 145322 93938 127514 99596 118799 128612 152208 161392 124649 118227 117212
1494 117212 124373 163552 48905 129140 127443 119522 86242 88215 86443 137825 119538 122869 105358
1481 105358 140612 126453 115724 158600 121262 125565 120953 102174 115960 117390 135041 157171
1469A57171k3787o5977O1804k3578J6768m9904M4816j7168N3386o1956K0080J228
1457A12883J6630k901J3109l9305R321l4641M7876l0594m421N4801j7856j2936
1445A11966R786J593k5430q603L2664n0346K7611L2089R131o6153M3682j2411
1433A05579p83r95L1510j8376k1457P8580r894l1003m2736L2032j9733L6803k3211
1420A16316P071m937k9006J2135L1653q8906N9648O2022l7436n9795J00230j15780
1408E3215P2537l889L3718M284l5157L4159M93n6581M327j3128M3130l5850L3344
1395A34602m8510N8005P93n5418M6158M075k01r044Q526k6374Q826l1714n304
1382H4420j0000J2825j9717K1846M5837k639R742n5111L3631q2846L9122O9717
$$ plain form
1469 157171 133384 67407 129211 105633 122401 72497 117313 100145 153531 91575 111655 112883
1457 112883 129513 126612 139721 100416 109737 75096 122972 92378 87957 142758 124902 111966
1445 111966 121752 123345 97915 89312 121976 71630 99241 131330 140461 74308 117990 105579
1433 105579 104796 103801 135311 116935 95478 174058 164164 133161 90425 122457 102724 139527 116316
1420 116316 123387 118450 89444 101579 133232 44326 103974 165996 128560 68765 168995 53215
1408 53215 125752 121863 155581 159865 124708 158867 159360 102779 107106 93978 137108 101258 134602
1395 134602 86092 144097 144890 89472 135630 139705 139504 130460 138986 112612 121438 89724 84420
1382 84420 74420 87245 67528 89374 135211 132572 142314 87203 120834 37988 77110 146827
1370A46827j6035o242l3900O4299l4975k7027j0991N5540r271o2646Q5063n7781
1358I2861J623K9398L0065n1033J7394J323j6975K4438k8700J2363Q816K7939
1346A49512o4004N2900j1952l2869k3552M0558m8466N3640k0502L4235J928J5987
1334A47415k7138J4443j3705k7676J8746l4495q812L7171J2905r165j1590K8809
$$ plain form
1370 146827 130792 124550 90650 154949 119974 92947 81956 137496 128225 65579 150642 92861
1358 92861 94484 123882 153947 102914 120308 121631 104656 129094 100394 112757 121573 149512
1346 149512 85508 138408 126456 93587 70035 110593 62127 115767 95265 129500 131428 147415
1334 147415 120277 134720 121015 93339 112085 77590 68778 105949 118854 109689 98099 126908
$$ [...]
##END NTUPLES=NMR SPECTRUM
##END=
