##TITLE=abcd
##JCAMPDX= 6.0         $$ Bruker NMR JCAMP-DX V2.0
##DATA TYPE= NMR SPECTRUM
##DATA CLASS= NTUPLES
##ORIGIN= UXNMR, Bruker Analytische Messtechnik GmbH
##OWNER= root
$$ XWIN-NMR		Version 3.5
$$ Mon May 18 14:48:35 2026 Russian Standard Time (UT+4h)  servis@DPX200
##.OBSERVE FREQUENCY= 200.131235884673
##.OBSERVE NUCLEUS= ^1H
##.ACQUISITION MODE= SIMULTANEOUS
##.ACQUISITION SCHEME= undefined
##.AVERAGES= 32
##.DIGITISER RES= 18
##SPECTROMETER/DATA SYSTEM= spect
##.PULSE SEQUENCE= zg
##.SOLVENT NAME= CDCl3
##.SHIFT REFERENCE= (INTERNAL, CDCl3, 0, 16.4885)
##AUDIT TRAIL= $$ (NUMBER, WHEN, WHO, WHERE, WHAT)
$$ ##TITLE= Audit trail, XWIN-NMR		Version 3.5
$$ ##JCAMPDX= 5.01
$$ ##ORIGIN= Bruker BioSpin GmbH
$$ ##OWNER= servis
$$ F:\spectra/data/av/nmr/H1/1/pdata/1/auditp.txt
$$ ##AUDIT TRAIL=  $$ (NUMBER, WHEN, WHO, WHERE, WHAT)
(   1,<2026-05-18 14:42:13.25 +0400>,<servis>,<DPX200>,
      <created by zg, POWCHK disabled, PULCHK disabled
       configuration hash MD5:
       00 E9 B6 7A A2 85 ED C7 34 08 36 98 17 FE 4E 26
       data hash MD5: 32K
       80 63 A3 F6 95 BD 2D 9D A6 E8 5A 0C C3 D1 D1 E2>)
(   2,<2026-05-18 14:48:04.57 +0400>,<servis>,<DPX200>,
      <Start of raw data processing
       efp BC_mod = 2 LB = 0.05 FT_mod = 6 PKNL = 1 PHC0 = -411.19 PHC1 = 3.101563 SI = 16K 
       data hash MD5: 16K
       D6 4D FD B1 9E C0 B5 83 B2 35 76 69 9D 40 5F CC>)
(   3,<2026-05-18 14:48:15.53 +0400>,<servis>,<DPX200>,
      <pk PHC0 = 2 PHC1 = 0 
       data hash MD5: 16K
       0B 2D 98 7C 96 2F 18 7E D5 F7 2A 8A 75 F2 2F 3A>)
$$ ##END=
$$ 
$$ hash MD5
$$ 39 5B A6 80 1C 5B 16 67 AD A4 C2 8F 48 48 FB 4A
##$RELAX= 
##$RELAX= 
##$RELAX= 
##$RELAX= 
##$RELAX= 
##$RELAX= 
##$RELAX= 
##$RELAX= 
$$ Bruker specific parameters
$$ --------------------------
##$DU= <F:\spectra>
##$EXPNO= 1
##$NAME= <H1>
##$PROCNO= 1
##$TYPE= <nmr>
##$USER= <av>
##$AMP= (0..31)
100 100 100 100 100 100 100 100 100 100 100 100 100 100 100 100 100 100 
100 100 100 100 100 100 100 100 100 100 100 100 100 100 
##$AQSEQ= 0
##$AQ_mod= 1
##$AUNM= <au_zg>
##$AUTOPOS= <>
##$BF1= 200.13
##$BF2= 200.13
##$BF3= 200.13
##$BF4= 200.13
##$BF5= 500.13
##$BF6= 500.13
##$BF7= 500.13
##$BF8= 500.13
##$BYTORDA= 1
##$CFDGTYP= 0
##$CFRGTYP= 5
##$CHEMSTR= <none>
##$CNST= (0..31)
1 1 145 1 1 1 1 1 1 1 1 1 1 1 1 1 1 1 1 1 1 1 1 1 1 1 1 1 1 1 1 1 
##$CPDPRG= <>
##$CPDPRG1= <>
##$CPDPRG2= <>
##$CPDPRG3= <>
##$CPDPRG4= <mlev>
##$CPDPRG5= <mlev>
##$CPDPRG6= <mlev>
##$CPDPRG7= <mlev>
##$CPDPRG8= <mlev>
##$CPDPRGB= <>
##$CPDPRGT= <>
##$D= (0..31)
0 2 0 0 0 0 0 0 0 0.06 0 0 0 0 0 0 0.0002 0 0 0 0 0 0 0 0 0 0 0 0 0 0 
0 
##$DATE= 1779100932
##$DBL= (0..7)
120 120 120 120 120 120 120 120 
##$DBP= (0..7)
150 150 150 150 150 150 150 150 
##$DBP07= 0
##$DBPNAM0= <>
##$DBPNAM1= <>
##$DBPNAM2= <>
##$DBPNAM3= <>
##$DBPNAM4= <>
##$DBPNAM5= <>
##$DBPNAM6= <>
##$DBPNAM7= <>
##$DBPOAL= (0..7)
0.5 0.5 0.5 0.5 0.5 0.5 0.5 0.5 
##$DBPOFFS= (0..7)
0 0 0 0 0 0 0 0 
##$DE= 6
##$DECBNUC= <off>
##$DECIM= 32
$$ [...]
##$SUBNAM4= <"">
##$SUBNAM5= <"">
##$SUBNAM6= <"">
##$SUBNAM7= <"">
##$SUBNAM8= <"">
##$SUBNAM9= <"">
##$SW= 20.6817932712277
##$SWIBOX= (0..15)
0 0 3 0 0 0 0 0 0 0 0 0 0 0 0 0 
##$SW_h= 4139.07284768212
##$TD= 32768
##$TD0= 1
##$TE= 0
##$TE2= 300
##$TE3= 300
##$TEG= 300
##$TL= (0..7)
0 120 120 120 120 120 120 120 
##$TP= (0..7)
150 150 150 150 150 150 150 150 
##$TP07= 0
##$TPNAME0= <>
##$TPNAME1= <>
##$TPNAME2= <>
##$TPNAME3= <>
##$TPNAME4= <>
##$TPNAME5= <>
##$TPNAME6= <>
##$TPNAME7= <>
##$TPOAL= (0..7)
0.5 0.5 0.5 0.5 0.5 0.5 0.5 0.5 
##$TPOFFS= (0..7)
0 0 0 0 0 0 0 0 
##$TUNHIN= 0
##$TUNHOUT= 0
##$TUNXOUT= 0
##$USERA1= <user>
##$USERA2= <user>
##$USERA3= <user>
##$USERA4= <user>
##$USERA5= <user>
##$V9= 5
##$VALIST= <valist>
##$VCLIST= <CCCCCCCCCCCCCCC>
##$VD= 0
##$VDLIST= <DDDDDDDDDDDDDDD>
##$VPLIST= <PPPPPPPPPPPPPPP>
##$VTLIST= <TTTTTTTTTTTTTTT>
##$WBST= 1024
##$WBSW= 30
##$XGAIN= (0..3)
0 0 0 0 
##$XL= 0
##$YL= 0
##$YMAX_a= 1077100
##$YMIN_a= -1607415
##$ZGOPTNS= <>
##$ZL1= 120
##$ZL2= 120
##$ZL3= 120
##$ZL4= 120
##$ABSF1= 0
##$ABSF2= 0
##$ABSG= 0
##$ABSL= 0
##$ALPHA= 0
##$AQORDER= 0
##$ASSFAC= 0
##$ASSFACI= 0
##$ASSFACX= 0
##$ASSWID= 0
##$AUNMP= <proc_1d>
##$AZFE= 0.1
##$AZFW= 0.1
##$BCFW= 0
##$BC_mod= 2
##$BYTORDP= 0
##$COROFFS= 0
##$CY= 18.4799938201904
##$DATMOD= 1
##$DC= 0
##$DFILT= <>
##$DTYPP= 0
##$F1P= 9.9274215381318
##$F2P= -0.165520771350173
##$FCOR= 1
##$FTSIZE= 16384
##$FT_mod= 6
##$GAMMA= 0
##$GB= 0
##$INTBC= 1
##$INTSCL= 4.127829e-11
##$ISEN= 128
##$LB= 0.05
##$LEV0= 0
##$LPBIN= 0
##$MAXI= 10000
##$MC2= 0
##$MEAN= 0
##$ME_mod= 0
##$MI= 50
##$NCOEF= 0
##$NC_proc= -4
##$NLEV= 6
##$NOISF1= 3.799351
##$NOISF2= 2.8
##$NSP= 0
##$NTH_PI= 0
##$NZP= 0
##$OFFSET= 16.48848
##$PC= 4
##$PHC0= -409.19
##$PHC1= 3.101563
##$PH_mod= 1
##$PKNL= yes
##$PPARMOD= 0
##$PSCAL= 4
##$PSIGN= 0
##$REVERSE= no
##$SF= 200.130005582386
##$SI= 16384
##$SIGF1= 3
##$SIGF2= 2
##$SINO= 400
##$SIOLD= 16384
##$SREGLST= <1H.CDCl3>
##$SSB= 0
##$STSI= 16384
##$STSR= 0
##$SW_p= 4139.07284768211
##$SYMM= 0
##$S_DEV= 0
##$TDeff= 32768
##$TDoff= 0
##$TI= <>
##$TILT= no
##$TM1= 0
##$TM2= 0
##$TOPLEV= 0
##$USERP1= <user>
##$USERP2= <user>
##$USERP3= <user>
##$USERP4= <user>
##$USERP5= <user>
##$WDW= 1
##$XDIM= 16384
##$YMAX_p= 272871530
##$YMIN_p= -603520
$$ End of Bruker specific parameters
$$ ---------------------------------
##NTUPLES= NMR SPECTRUM
##VAR_NAME=  FREQUENCY,     SPECTRUM/REAL,   SPECTRUM/IMAG
##SYMBOL=    X,             R,               I
##VAR_TYPE=  INDEPENDENT,   DEPENDENT,       DEPENDENT
##VAR_FORM=  AFFN,          ASDF,            ASDF
##VAR_DIM=   16384,         16384,           16384
##UNITS=     HZ,            ARBITRARY UNITS, ARBITRARY UNITS
##FACTOR=    0.252644378177508, 1,           1
##FIRST=     3299.83951724647, 0,            0
##LAST=      -839.233330435636, 0,           0
##MIN=       -839.233330435636, -603520,     0
##MAX=       3299.83951724647, 272871530,    0
$$ Real data points
##PAGE= N=1
##DATA TABLE= (X++(R..R)), XYDATA
$$ [...]
8833A01522L8641j7697j7528L0125L7977r4257J07398j9747o6758N2850p3062
$$ 101522 140163 122466 104938 135063 173040 78783 186181 166434 99676 152526 79464
8822G9464Q3408M7914l7295j17698M0726J7462Q3813n0330q5989N9117q3396J55071
$$ 79464 162872 210786 173491 55793 96519 113981 197794 147464 61475 120592 37196 192267
8810A92267p6520J19823j17169J5959K9764J070p699m1278J7652n5877Q0417k3157
$$ 192267 115747 235570 118401 134360 164124 165194 157495 116217 133869 77992 158409 135252
8798A35252o3582O0041j8837m4567J19393P2444o9183P0930r9354K485m5607j7187
$$ 135252 71670 131711 112874 68307 187700 260144 190961 261891 162537 165022 119415 102228
8786A02228R9723k8049j59568P4017O8913o0750j7865K5164j2730N4434p187N6928
$$ 102228 201951 173902 14334 88351 157264 96514 78649 103813 91083 145517 138330 195258
8774A95258J6876j956n5005m0155J23860j10564R0963j40300M0250q8376J46938
$$ 195258 212134 210178 155173 115018 238878 128314 219277 78977 119227 30851 177789
8763A77789j21857p8549J81314o1196Q748m4091J23628j346n1023q1552P2633
$$ 177789 55932 -22617 158697 97501 106249 62158 185786 184440 133417 51865 124498
8752A24498p2280J61353j76325N1924j648J40438j63108K5840Q3464j50109L6983
$$ 124498 52218 213571 37246 89170 87522 227960 64852 90692 174156 24047 61030
8741F1030N5942J05464j18875O1437O6241r7144J1147N0370n6230l4228O8852
$$ 61030 116972 222436 103561 164998 231239 134095 145242 195612 139382 105154 174006
8730A74006r5044M0199J18988r4246r7573Q0664K4372n7394P1755J390q622q5750
$$ 174006 78962 119161 238149 143903 46330 126994 151366 93972 165727 167117 158495 72745
8718G2745J04035j7596M0188j37475M2226K3665k677J18052j74323p0049R7133
$$ 72745 176780 159184 199372 61897 104123 127788 125111 243163 68840 -1209 95924
8707I5924J22160j3736n0924K062L354l4443j0582p3772N4590J1288P1969j4561
$$ 95924 218084 204348 153424 155486 158840 124397 113815 40043 94633 105921 177890 163329
8695A63329K5569N452j2758o0965l1090M2077k3349J2278J596P1092j52397J30954
$$ 163329 188898 194350 181592 120627 89537 131614 108265 120543 122139 193231 40834 171788
8683A71788m7938J78693j11366n1757j45113Q8537M0500J24703m7863R328l7111
$$ 171788 123850 302543 191177 139420 -5693 82844 123344 248047 200184 209512 172401
8672A72401j202K9031m6887P5125l1382Q4344j11943o4178Q4759j045m3732L4921
$$ 172401 171199 200230 153343 228468 197086 281430 169487 105309 190068 189023 145291 180212
8660A80212j0264O483m7539O3043p8480P1892r8390J9740J10010q400O650j09329
$$ 180212 169948 176431 128892 191935 113455 185347 86957 106697 216707 208307 214957 105628
8648A05628Q8777j4339P163j20740m867k326J73820j01360l4400L129P3825k1872
$$ 105628 194405 180066 187229 66489 61622 59296 233116 131756 97356 100485 174310 152438
8636A52438l7941q8768J26083J401M6708L5820q4070r7675L7625J38503p8753
$$ 152438 114497 25729 151812 153213 199921 235741 151671 53996 91621 230124 151371
8625A51371l0654K1426n7102L4478R3009K896J3690q4372j4117R4742N0578n4807
$$ 151371 120717 142143 85041 119519 212528 215424 229114 144742 130625 225367 275945 221138
8613B21138r2999O4439m7736P6802R1687k56453K24861k22290L9863L0524J39032
$$ 221138 128139 192578 144842 221644 313331 56878 281739 59449 99312 129836 268868
8602B68868j12622M2437j16805O8962Q1910q7821J37670j23791l6268N954J9914
$$ 268868 156246 198683 81878 150840 232750 144929 282599 158808 122540 128494 148408
8591A48408q5377J56439L6052k02079j7396J57683Q9087n8214j3048L3788j27156
$$ 148408 63031 219470 255522 53443 36047 193730 282817 224603 211555 245343 118187
8580A18187O4134j6246o5876O0570j3994Q513J9175J00309n1617j55565Q4961
$$ 118187 182321 166075 100199 160769 146775 155288 174463 274772 223155 67590 152551
8569A52551j469J74012j34042r8028m7441J74838J5876j27921R2160Q7307j14426
$$ 152551 151082 325094 191052 93024 45583 220421 236297 108376 200536 287843 173417
8558A73417M5061k2289J9894n3136R4737j01687q8663J17052O2257k0900n0815
$$ 173417 218478 196189 216083 162947 257684 155997 67334 184386 246643 225743 174928
8547A74928N2267o0134O071J7826J7051m2520j11016J42111J3138j07736J91614
$$ 174928 227195 167061 173132 190958 208009 165489 54473 196584 209722 101986 293600
8536B93600j49649J6867K4757O9687j22889O5965J886K620j4911K0157k1666L1019
$$ 293600 143951 160818 185575 255262 132373 198338 200224 202844 187933 208090 186424 217443
8524B17443q7322k136l3018M0704R1915k1759k19159J17139J76143o9961P6969
$$ 217443 130121 127985 94967 135671 227586 205827 -13332 103807 279950 209989 286958
8513B86958N6992j27505j29457J15451j16815M9581J33273j3899j02696N5894
$$ 286958 343950 216445 86988 202439 85624 135205 268478 254579 151883 207777
8503B07777q608J7563j67620J11354N5317l5518o7447N9573k7870R4532j00433
$$ 207777 199169 216732 49112 160466 215783 180265 112818 172391 144521 239053 138620
8492A38620J49723l4383N6766j28840j51261J18562J08855o6897j12811K28749
$$ 138620 288343 253960 310726 181886 30625 149187 258042 191145 78334 307083
8482C07083j61336O6620j43040R4618K3836J11644k8619j01251R1903j28634L890
$$ 307083 145747 212367 69327 163945 187781 299425 270806 169555 261458 132824 136714
8471A36714J5462J35138Q456j03893k8102p075J01736j10602L4749L0020q1475
$$ 136714 152176 287314 295770 191877 163775 156700 258436 147834 182583 212603 131128
8460A31128J59169p7912j7075k362Q5206o6416j2221N1078p761l8556o4359O4799
$$ 131128 290297 212385 195310 192948 278154 211738 199517 250595 242834 204278 139919 204718
8448B04718K3203J10245k3764r4562p339m7141j7074P6479M0422m1357p1707o8740
$$ 204718 227921 338166 314402 219840 212501 165360 148286 224765 265187 223830 152123 83383
8436H3383Q1162J29066m4296m7454j1052L8238P016m9590r1286J37491K2040J7430
$$ 83383 164545 293611 249315 201861 190809 229047 236063 186473 95187 232678 254718 272148
8424B72148o9821J60284j63417M3852J5456o3276J7550N7538j06119L7000N9804
$$ 272148 202327 362611 199194 243046 258502 195226 212776 270314 164195 201195 260999
8413B60999L1536p3079L0318k0488J50825j46332l9155R3794q7382k8567O6208
$$ 260999 292535 219456 249774 229286 380111 233779 194624 288418 201036 172469 238677
8402B38677J02874j39869L5174j5808L5245j1683n3623L2776J727n0570P4373
$$ 238677 341551 201682 236856 221048 256293 244610 190987 223763 225490 174920 249293
8391B49293J0665j46127J88160l3426N5176j15201J04743j97094k743J50517k1917
$$ 249293 259958 113831 301991 268565 323741 208540 313283 116189 113446 263963 242046
8380B42046N8567j07450J79763j96571M9059P925K2660k04767J10489P5070j8739
$$ 242046 300613 193163 372926 176355 225414 233339 255999 51232 161721 236791 218052
8369B18052j8093O7295n9814k4008K1975R7858j58969Q3817J31234j61907L2613
$$ 218052 199959 267254 207440 183432 205407 303265 144296 228113 359347 197440 230053
8358B30053N1774j0921q9418m3622J44125m6610r9624Q4955l766L2696J3963k0489
$$ 230053 281827 270906 181488 137866 281991 235381 135757 220712 216946 249642 263605 243116
8346B43116m8517J54244m2194q5203O9030k4378l1730j8454j9023P3755k4995
$$ 243116 194599 348843 306649 221446 290476 266098 234368 215914 196891 270646 245651
8335B45651o999q1257J04115k2010J7953n1023j5604J40555o3710O6331K4480
$$ 245651 238652 157395 261510 239500 257453 206430 190826 331381 267671 334002 358482
8324C58482m0348k8513j74660J45408r5709J67424q511j24876N5735Q2150m7422
$$ 358482 318134 289621 114961 260369 164660 332084 323573 198697 254432 336582 289160
8313B89160j66674Q5980O9336q9376J29123k1337n3365m2909r343J6258m4169
$$ 289160 122486 208466 277802 188426 317549 296212 242847 199938 190595 206853 162684
8302A62684J66565r9222J01610p0789O6392k546j28875N0104P9107q073n7694
$$ 162684 329249 230027 331637 260848 327240 324694 195819 245923 325030 316957 259263
8291B59263M0358k1681k1422J17868j57119J47721r6953J7431p2911N6193o5244
$$ 259263 299621 277940 256518 374386 217267 364988 268035 285466 212555 268748 203504
8280B03504J15105p1395n7802J16359q512o1450M9789p8581Q7932Q2O2633j75626
$$ 203504 318609 247214 189412 305771 297259 235809 285598 207017 294949 295031 357664 182038
8268A82038Q4198K1276K887j2741j4633O4879j51727J57042j71897J43266j46130
$$ 182038 266236 287512 290399 277658 263025 327904 176177 333219 161322 304588 158458
8257A58458J01847j4051P3040j4401o9623N2523p4808J07058j19812K1151K7674
$$ 158458 260305 246254 319294 304893 235270 287793 212985 320043 200231 221382 249056
8246B49056J01138j01714o2580J76385r4598M2268j0202o5053M7536Q1365K8632
$$ 249056 350194 248480 185900 362285 267687 309955 299753 234700 282236 363601 392233
8235C92233j13519j1153N8434j2365l7469j43411J79744o0469L9669J8066j39266
$$ 392233 278714 267561 325995 313630 276161 132750 312494 252025 291694 309760 170494
8224A70494J32041j4357J46199j34653M0237p7537l537Q230l0526L5691L7859
$$ 170494 302535 288178 434377 299724 339961 262424 258887 267117 236591 272282 310141
8213C10141O665k982l8229r897o1025L8100R5263M6762j09643N2168q663m34P8483
$$ 310141 316806 313824 275595 265698 204673 242773 338036 384798 275155 327323 318660 318226 396709
8200C96709l1380J6237j10327R3022k7571n4361n2262K08675l25653L7200Q8671
$$ 396709 365329 381566 271239 364261 336690 282329 230067 438742 113089 150289 238960
8189B38960J12847o0684N3659p6215n081L2090j0078Q9150j32179N7046K7487
$$ 238960 351807 291123 344782 268567 263486 295576 285498 374648 242469 299515 327002
8178C27002R46m5785K2356L7197j49273K19378k08463J56453j06604R3678m5443
$$ 327002 327948 282163 304519 341716 192443 411821 203358 359811 253207 346885 301442
8167C01442J8228M9093l6132R06m8964R0961n7265j54452Q9521J28807l5188k5636
$$ 301442 319670 368763 332631 333537 284573 375534 318269 163817 253338 382145 346957 321321
8155C21321l9345J06358q2908Q9232p0606o9430K7211j16985J56361j9778K0824
$$ 321321 281976 388334 305426 394658 324052 254622 281833 164848 321209 301431 322255
8144C22255J92293l20171Q4660P3542Q980o8747P8005j9376q8648J28461p7111
$$ 322255 514548 194377 279037 352579 361559 292812 370817 351441 262793 391254 314143
8133C14143J4355N3744n8720j5818p4501J98006r3565j05284J6549J72777l1527
$$ 314143 328498 382242 323522 307704 233203 431209 337644 232360 248909 421686 390159
8122C90159n9071K3434m2717j7515N0230l0379J5702K9191j1909n4087l2682P3042
$$ 390159 331088 354522 311805 294290 344520 314141 329843 359034 347125 293038 260356 333398
8110C33398M0099J5814n4773j1175m9061L6428K1852N1624M2373r8531k2134M2507
$$ 333398 373497 389311 334538 323363 274302 310730 332582 384206 426579 328048 305914 348421
8098C48421O7183n5177l2789n2774O5623K8435q5005N4355o8976J06781r105r415
$$ 348421 415604 360427 327638 274864 340487 368922 283917 338272 269296 376077 366972 357557
8086C57557j63L5320k5552m923N0614M7912p8505j2818j41718J06351J7580O003
$$ 357557 357394 392714 367162 362239 412853 460765 382260 369442 227724 334075 351655 357658
8074C57658k9385K2898J5215m8783N3582R8809l4523j2649L9454j25823K354K8762
$$ 357658 328273 351171 366386 317603 371185 469994 435471 422822 462276 336453 338807 367569
8062C67569l8678j04578J77904P000N9520j74035R6073M2523q1436N0727k4053
$$ 367569 328891 224313 402217 409217 468737 294702 390775 433298 351862 402589 378536
8051C78536j4116q516Q3654q3388j7871Q9605M9665r1991j0989k5713J05650q075
$$ 378536 364420 355904 439558 356170 338299 427904 477569 385578 374589 348876 454526 446451
8039D46451m3268M5522r4046n009M767J20139j9981M1098p3946n3075R8854k9957
$$ 446451 403183 448705 354659 349650 354417 474556 454575 495673 421727 368652 467506 437549
8027D37549j07026j6962K18907K3044j06418O6177O5822r336k16249P8540M992
$$ 437549 330523 313561 532468 555512 449094 515271 581093 571757 355508 434048 439040
8016D39040Q337N0215n0462n528p9958J36216J6069N86N3627l8078L125r7957
$$ 439040 447377 497592 447130 441602 361644 497860 513929 514515 568142 530064 533189 435232
8004D35232M4770K6404P5360O6067p2399l5825J03422K1956k1376l5531P8176
$$ 435232 480002 506406 581766 647833 575434 539609 643031 664987 643611 608080 686256
7993F86256Q128l2208N5403J45835K4398k16928K49383J04184O5665m4439J4978
$$ 686256 694384 662176 717579 863414 887812 670884 920267 1024451 1090116 1045677 1060655
7982A060655L1911R2216J72456p517K33498j33944P9676j3679p3763N8497J57893
$$ 1060655 1092566 1184782 1357238 1349721 1583219 1449275 1528951 1515272 1441509 1500006 1657899
7971A657899m6952j12008J04915j70115j16943P2100j88446p4572m9023P818j41506
$$ 1657899 1610947 1498939 1603854 1433739 1316796 1388896 1200450 1125878 1076855 1084673 943167
7960I43167J43906k21288J0318k3382q1893R5015k3525o2187r1182Q8550l7323
$$ 943167 1087073 865785 876103 852721 770828 865843 842318 780131 688949 777499 740176
7949G40176o9947Q2682k05538J57190p9936n816O1983j42731J6524O275L7106
$$ 740176 670229 752911 547373 704563 624627 618811 680794 538063 554587 560862 597968
7938E97968r7131O5900K9731j76829J48199m7597M9311p5814L1306j5906n098
$$ 597968 500837 566737 596468 419639 567838 520241 569552 493738 525044 509138 504040
7927E04040K1821R5071j96496J16904l5445P5003j33431K02347j7677j95842L7194
$$ 504040 525861 620932 424436 541340 505895 580898 447467 649814 632137 436295 473489
7916D73489j1737L4006l8760J46407n1574r8015J31038j94944N8377K3914N8832
$$ 473489 461752 495758 456998 603405 551831 453816 584854 389910 448287 472201 531033
7905E31033j32125m321Q1906j1915l8426J9841Q0275j6854k386m0895M0481k10171
$$ 531033 398908 394587 476493 464578 426152 445993 526268 509414 507028 466133 506614 296443
7893B96443J15978j6153J00289m3301L6699m3185J5870P5071p6359n8504j3809
$$ 296443 412421 396268 496557 453256 489955 446770 462640 537711 461352 402848 389039
7882C89039J8968M0071l1284j22680J26782K6334p2622O4349m8621M7163l5682
$$ 389039 408007 448078 416794 294114 420896 447230 374608 438957 390336 437499 401817
7871D01817P9992J8666j9853p4518M5205M3227p1325J09833q2835M1576j02559
$$ 401817 481809 500475 480622 406104 451309 494536 423211 533044 450209 491785 389226
7860C89226J06347M5863Q332J59787m48084K23809j42820Q7972q9135K9329m8328
$$ 389226 495573 541436 549768 709555 261471 485280 342460 430432 341297 370626 322298
7849C22298j4244J27758J2383j2999J5297j32248M0397J17522l5441o2674m1056
$$ 322298 308054 435812 448195 435196 450493 318245 358642 476164 440723 378049 336993
7838C36993J33993j16409Q5541P5919j8985K4002o9383M1794l4854k0469j11945
$$ 336993 470986 354577 440118 516037 497052 521054 451671 493465 458611 438142 326197
7827C26197K2675Q061Q3428R6880j47714O5144r2373J0327Q1059l818l2192K4685
$$ 326197 348872 356933 440361 537241 389527 454671 362298 372625 453684 449866 417674 442359
7815D42359N2705j54861L3350Q0338m2562l7459K5079J35594j56857M9786r8328
$$ 442359 495064 340203 373553 453891 411329 373870 398949 534543 377686 427472 329144
7804C29144P8306M5989P0829j4081j7989j46462M8404l7738R0102N1190p5294
$$ 329144 407450 453439 524268 510187 492198 345736 394140 356402 446504 497694 422400
7793D22400o9011J2371J44646j07887j2299L9722p1755Q8930j7514L7855l9771
$$ 422400 353389 365760 510406 402519 390220 429942 358187 447117 429603 467458 427687
7782D27687N9634j305P273K3017j63641L4997j7131P3944m9464N8839M411N7686
$$ 427687 487321 486016 493289 516306 352665 387662 370531 444475 395011 453850 458261 515947
7770E15947m0253j2618P7950j51056r9942J65126L2232J0495j09005L6898j18455
$$ 515947 475694 463076 541026 389970 290028 455154 487386 497881 388876 425774 307319
7759C07319J36284M6861l3322n7698j9650n5758J15166n2776J70886j10734o226
$$ 307319 443603 490464 457142 399444 379794 324036 439202 386426 557312 446578 440352
7748D40352m2706K6363m0893N5493N7018j47741m790K0705M7424N2942J9759o0934
$$ 440352 397646 424009 383116 438609 495627 347886 343096 363801 411225 464167 483926 422992
7736D22992j16774M0925L5793R9419j43671M5335P1182O9896j06501P5082j16443
$$ 422992 306218 347143 382936 482355 338684 384019 455201 525097 418596 493678 377235
7725C77235K6947j1313j9893O9925K2883j6014j30377J81026l0637l3908j3567
$$ 377235 404182 392869 372976 442901 465784 449770 319393 500419 469782 435874 422307
7714D22307J6106j4531j26419L4421J20062p3661J04472j11735L3054j42579K40854
$$ 422307 438413 423882 297463 331884 451946 378285 482757 371022 404076 261497 502351
7703E02351p6534k4652N4836k30r4916R2973M8563m5160j30278L4071N5519n0015
$$ 502351 425817 401165 456001 455771 360855 453828 502391 457231 326953 361024 416543 366528
7691C66528j3896P7271j47884J00449l114J27164n7942n5333N2923r3198j8347
$$ 366528 352632 429903 282019 382468 379354 506518 448576 393243 446166 352968 334621
7680C34621K9423J18355n7734J9076K5143j32181N7929j5649r1105J24023J7795
$$ 334621 364044 482399 424665 443741 468884 336703 394632 378983 287878 411901 429696
7669D29696k7653p4878R3386R498P8193m9877K8038r0156L2266j29224J46178
$$ 429696 402043 327165 420551 430049 508242 458365 486403 396247 428513 299289 445467
7658D45467m6603j3845N2274n2337L3622P646l26q9588J34300p7016J7511n1798
$$ 445467 398864 385019 437293 384956 418578 426224 425898 336310 470610 393594 411105 359307
7646C59307k9379J79723j05241m3106P5199q6318m3238O5068R769o8989J55786
$$ 359307 329928 509651 404410 361304 436503 350185 306947 372015 381784 312795 468581
7635D68581o8853l7937k2295J43630J7117j34436o9243J97646j20536P9539q5941
$$ 468581 399728 361791 339496 483126 500243 365807 296564 494210 373674 453213 367272
7624C67272K3304m794Q564L110n2942R5949r947r5687L7262K88J55527j38946
$$ 367272 390576 385782 394346 397456 344514 440463 430516 334829 372091 372379 527906 388960
7612C88960n036N8153n2178N8623p4876k4085N116l0012k4431M7188J39700r0595
$$ 388960 383924 442077 389899 448522 373646 349561 354677 324665 300234 347422 487122 396527
7600C96527k6682l5580J92657o4166r067j25240M4941R6316j06253K4009O573
$$ 396527 369845 334265 526922 462756 453689 328449 373390 469706 363453 387462 394035
7589C94035N5968n686p7879M7356p4880J01616j30591Q6090l5186l8977L5552
$$ 394035 450003 444317 366438 413794 338914 440530 309939 396029 360843 321866 357418
7578C57418j9005O6751l5438J56417q4811Q156p5012k819l4016K2470O1478q0456
$$ 357418 338413 405164 369726 526143 441332 449488 374476 371657 337641 360111 421589 341133
7566C41133Q4313q6628P4205j29590P2618J26638l7542p9120J21160K2270k43806
$$ 341133 425446 338818 413023 283433 356051 482689 445147 366027 487187 509457 265651
7555B65651O6922J03415M9846j52535O0669j8273J7264k5792K7436J10339j80880
$$ 265651 332573 435988 485834 333299 393968 375695 392959 367167 394603 504942 324062
7544C24062J52002k3033k4636R2056n1148l5537j23967Q4036m2395O811l6856
$$ 324062 476064 453031 428395 520451 469303 433766 309799 393835 351440 358251 321395
7533C21395R1322k4114P563M2035L2459n9678N5098o8831m5695L2118J69757r7776
$$ 321395 412717 388603 396166 438201 470660 410982 466080 397249 351554 383672 553429 455653
7521D55653n2521n3866O1362Q8544k4694r8563m0657Q8488j49n9286Q4518p0697
$$ 455653 403132 349266 410628 499172 474478 375915 335258 423746 423597 364311 448829 378132
7509C78132j7951q8076J16957M3635j01741P4081m9746P5781l303j60038J52654
$$ 378132 360181 272105 389062 432697 330956 405037 355291 431072 427769 267731 420385
7498D20385p008M966o8953M2204l3189l6180K6499l2457P0950k6594J9584J10452
$$ 420385 413377 418343 349390 391594 358405 322225 348724 316267 387217 360623 380207 490659
7486D90659j35282k9314P7777q8581k1019J10501L2061q2972O2452k9316L0800
$$ 490659 355377 326063 403840 315259 294240 404741 436802 353830 416282 386966 417766
7475D17766j58500J20692r6252J40925o0163j068m3807l8026J61611n1744j45063
$$ 417766 259266 379958 283706 424631 364468 363400 319593 281567 443178 391434 246371
7464B46371Q5985J6388p0364p8242J04783J2551P2950j02644M4822l0939J7681
$$ 246371 332356 348744 278380 200138 304921 317472 390422 287778 332600 301661 319342
7453C19342m4013J29007N0022q3270o745l2660K6597r3857J26329j29858L1576
$$ 319342 275329 404336 454358 371088 364343 331683 358280 264423 390752 260894 292470
7442B92470O3590n4915k1290j299Q7004j4528P4687q6717Q6277k9035j6014j17159
$$ 292470 356060 301145 279855 278556 365560 351032 425719 339002 425279 396244 380230 263071
7430B63071l84J66756n2811j07054o4466J46820k9984m9160J21402j10136l0231
$$ 263071 262687 429443 376632 269578 205112 351932 321948 272788 394190 284054 253823
7419B53823M2189O0117n7641R0403l537r2897j193J00900q3964l0820L6746M5241
$$ 253823 296012 356129 298488 388891 385354 292457 291264 392164 308200 277380 314126 359367
7407C59367N1763n1682k5596m2012n302l3993L6458K6668n961N2941j12969j3372
$$ 359367 411130 359448 333852 291840 286538 252545 289003 315671 309710 362651 249682 236310
7395B36310J01828m535P9064j32765P5047l9548q037o2132J02541L5206p5443
$$ 236310 338138 333603 412667 279902 354949 315401 307364 245232 347773 382979 307536
7384C07536k0179N6892J4600q1409J752J41744j02463l0960L2467o145l4692J8366
$$ 307536 287357 344249 358849 277440 279192 420936 318473 287513 319980 313835 279143 297509
7372B97509O9468j651j9980j13435J8772o2364J41513j53893J42360m9368o946
$$ 297509 366977 365326 345346 231911 250683 188319 329832 175939 318299 268931 261985
7361B61985k0036M0071j7926p109K2098L7397q7061l8995P1087P5716j72504J03853
$$ 261985 241949 282020 264094 256985 279083 316480 229419 190424 261511 337227 164723 268576
7349B68576L0232M8279j03533Q7837l7312p2583m7312M7808Q2077j29643J47654
$$ 268576 298808 347087 243554 331391 294079 221496 174184 221992 304069 174426 322080
7338C22080q2385k4246O0340J48345j05980j44180J5982O4040O4846l7587R51
$$ 322080 239695 215449 275789 424134 318154 173974 189956 253996 318842 281255 282206
7327B82206k4209n1871J9789Q3464j34857R795K049O0291K2830J4574o6868j13549
$$ 282206 257997 206126 225915 309379 174522 184317 186366 246657 269487 284061 217193 103644
7315A03644J85728q6612R7798p1711J15379q1404m30j2499j9126J07461j75417
$$ 103644 289372 202760 300558 228847 344226 262822 262392 249893 230767 338228 162811
7304A62811J15374l7243q7489M5993K2549L3338q5658J71761o7458k7938j06635
$$ 162811 278185 240942 153453 199446 221995 255333 169675 341436 273978 246040 139405
7293A39405R3484J24398j30729j4816P2374j4526m8742k2821M7122M4662K233
$$ 139405 232889 357287 226558 211742 284116 269590 220848 198027 245149 289811 292044
7282B92044j743j27900L9342N7478K9694m8617o7422N6527Q2677k3297j62731
$$ 292044 290301 162401 201743 259221 288915 240298 172876 229403 312080 288783 126052
7271A26052O7910P5959j4536L4739O656L7931k02778O1707n0283K04520j64038
$$ 126052 193962 269921 255385 290124 296780 334711 131933 193640 143357 347877 183839
7260A83839N0224n5491J59906j33368o6580Q7443L743J11264k477j29492L0136
$$ 183839 234063 178572 338478 205110 138530 225973 229716 340980 338503 209011 239147
7249B39147M5037P075J5977j18925J03704R377j1793j62798J46239n8957k4971
$$ 239147 284184 291259 307236 188311 292015 301392 289599 126801 273040 214083 189112
7238A89112P4600j0200O2835o8048p963K9814j5199O9411j68213J83460r1600
$$ 189112 263712 253512 316347 248299 240336 270150 254951 324362 156149 339609 248009
7227B48009M7476q1418j1182J12481j9905p6374n5396n163M0308p2680J40358
$$ 248009 295485 214067 202885 315366 295461 219087 163691 158528 198836 126156 266514
7216B66514k4039J22293l6194m5205M2145K806M7616j00553N0253l0534j8959
$$ 266514 242475 364768 328574 283369 325514 328320 375936 275383 325636 295102 276143
7205B76143n6539J0979L7585N8187k4444k209j64523J75442q2042J4140j8171
$$ 276143 219604 230583 268168 326355 301911 299702 135179 310621 228579 242719 224548
7194B24548j1588p6530Q4160J37882j2081j49748J44486m266n7015k05Q2580p2473
$$ 224548 212960 136430 220590 358472 346391 196643 341129 336863 279848 279643 362223 289750
7182B89750l4773Q1272n0278M9969q2965J11875q4938j52451P4120k7270N0360
$$ 289750 254977 336249 285971 335940 252975 364850 279912 127461 201581 174311 224671
7171B24671R833L3672r110M4304r135k85661J55542Q5802L9412q1424Q8830M1513
$$ 224671 234504 268176 259066 303370 294235 8574 164116 249918 289330 207906 296736 338249
7159C38249j69212K6361J24585n9082J5245p5434O9115r73m4482L7114L7837j03766
$$ 338249 169037 195398 319983 260901 276146 200712 269827 268854 224372 261486 299323 195557
7147A95557O2675O0331r4846j8117O6685j24701O0645K2648l2831K314k0917O493
$$ 195557 258232 318563 223717 205600 272285 147584 208229 230877 198046 200360 179443 185936
7135A85936K8624Q7956k8131l291l1770j41605J53081l1489M3094p3353R0739
$$ 185936 214560 302516 274385 271094 239324 97719 250800 219311 262405 189052 279791
7124B79791m9280M5557p3735j0947J13260o1585p6955M9210k9795r9953Q1755
$$ 279791 230511 276068 202333 191386 304646 243061 166106 215316 185521 85568 167323
7113A67323L6003Q0468l2017n9704P1595p320n2030J23072j21670q649r5836J36038
$$ 167323 203326 283794 251777 192073 263668 256348 204318 327390 205720 197071 101235 237273
7101B37273j01558J11342m8730Q5295j03121J01533n4988q2958k3375P9822j4900
$$ 237273 135715 247057 198327 283622 180501 282034 227046 144088 120713 200535 185635
7090A85635J32386q6064m9781J19366m8445k5125L0809J7814o1199N663k8675
$$ 185635 318021 231957 182176 301542 253097 227972 258781 276595 215396 221059 192384
7079A92384J09261p7600J3720m0968K9418P0787L5236j57535k0723J08089L343
$$ 192384 301645 224045 237765 196797 226215 297002 332238 174703 153980 262069 265412
7068B65412L1258p4305J11651j9206j63726L6126L1441l3805P2232n5165J02221
$$ 265412 296670 222365 334016 314810 151084 187210 218651 184846 257078 201913 304134
7057C04134L2188l3823l2345Q320L7877j9647N4207j23889J13687j00701K0662
$$ 304134 336322 302499 270154 278474 316351 296704 350911 227022 340709 240008 260670
7046B60670Q6938r3552J63880r8892R003M1044M8238r3843j14598J97745m80l011
$$ 260670 347608 254056 417936 319044 328047 369091 417329 323486 208888 406633 406153 403142
7034D03142j21157N2762n9660J17402n7403K4178o7211O6463L0824J5953K324
$$ 403142 281985 334747 275087 392489 335086 359264 292053 358516 389340 405293 407617
7023D07617L9156n3423o2677L415J06051o5215k4880N4184J02852j56178J43136
$$ 407617 446773 393350 330673 334088 440139 374924 350044 404228 507080 350902 494038
7012D94038j11401j1584l7376J38201l3648n1717R7273J6606M8516j57851J67014
$$ 494038 382637 371053 333677 471878 438230 386513 483786 500392 548908 391057 558071
7001E58071j34626L9683L2893m8643J05442m1644J50806q3002J10059o3002j5174
$$ 558071 423445 463128 496021 447378 552820 511176 661982 578980 689039 626037 610863
6990F10863p1768N5270J00017j08030Q2962P8721j7218q0906j4230J11100M9071
$$ 610863 539095 594365 694382 586352 669314 748035 730817 649911 635681 746781 795852
6979G95852R8922n0335j46360J84617j24746J19934k6388J57987l3141l6301N4552
$$ 795852 894774 844439 698079 882696 757950 877884 851496 1009483 976342 940041 994593
6968I94593l6896P6948k7440J23664J4941J6607J65562p8508O2811J69123J49590
$$ 994593 957697 1034645 1007205 1130869 1145810 1162417 1327979 1249471 1312282 1481405 1630995
6957A630995o827J18135J04004J80190K76323K90663M56100N37197J012996J539620
$$ 1630995 1624168 1742303 1846307 2026497 2302820 2593483 3049583 3586780 4599776 6139396
6947F139396K183719K229128P54717q12846j190588j045883j269652j149754r60694
$$ 6139396 8323115 10552243 11306960 10494114 9303526 8257643 6987991 5838237 4877543
6938D877543n07192m62418j61554j79000j84524L0928M455K39226r8783L66366
$$ 4877543 4370351 3907933 3746379 3567379 3382855 3413783 3418238 3657464 3558681 3925047
6928C925047J40189L37520L87268N66584Q34298R70572J727337K397498M398839
$$ 3925047 4065236 4402756 4790024 5356608 6190906 7161478 8888815 11286313 15685152
6919A5685152O537923P921710M230405k547551m452651m292162l920275m067169
$$ 15685152 22223075 30144785 34375190 31827639 27374988 23082826 19162551 15095382
6911A5095382k954282k092921j508450j169478n54374o24836m33403l56790L1923
$$ 15095382 12141100 10048179 8539729 7370251 6815877 6191041 5757638 5400848 5432771
6902E432771j83220O1825J80446P9704K58586N27140P53224P78231J440365K462400
$$ 5432771 5249551 5311376 5491822 5571526 5830112 6357252 7110476 7888707 9329072 11791472
6892A1791472L908809O260249P798651N384659j635190m715145m497052m125401
$$ 11791472 15700281 21960530 29759181 35143840 33508650 28793505 24296453 20171052
6884B0171052m222703l350539k233875j781238j145869q50335o63273p91777l20747
$$ 20171052 15948349 12597810 10363935 8582697 7436828 6586493 5923220 5131443 4810696
6875D810696k64485k38308k07662l2177M5614j53279P1034K92139J93187L34022
$$ 4810696 4546211 4307903 4100241 4068064 4113678 3960399 4031433 4323572 4516759 4850781
6865D850781O78872J264643J688607K450638J604519j97334j362903j410991j448506
$$ 4850781 5529653 6794296 8482903 10933541 12538060 12340726 10977823 9566832 8118326
6856H118326j465058j286749p53977p00419m96632m02594j65621k95139j38639
$$ 8118326 6653268 5366519 4612542 3912123 3415491 3012897 2847276 2552137 2413498
6847B413498j44831j75205j01565m8439q0400j12045k8388m2741j00786q5663
$$ 2413498 2268667 2093462 1991897 1943458 1863058 1751013 1722625 1679884 1579098 1493435
6837A493435k0378R925p4926j26381M7795k8380n3822j45693R6240p518n2084
$$ 1493435 1473057 1482982 1408056 1281675 1329470 1301090 1247268 1101575 1197815 1190297 1138213
6826A138213n6053P20k7927j01774O875K0496J8836o2269j79699K4847k1635K09859
$$ 1138213 1082160 1082880 1054953 953179 960054 980550 999386 937117 757418 782265 760630 970489
6814I70489j18438k5194j28596R2611M8463n0538r5036o802K5986k7907J608l5124
$$ 970489 852051 826857 698261 790872 839335 788797 693761 686959 712945 685038 686646 651522
6802F51522l7220m2184N7363l5300l168q7151J54056p9494K3277o0680Q110p633
$$ 651522 614302 572118 629481 594181 591013 503862 657918 578424 601701 541021 549131 541498
6790E41498M36L494k44640J23037R1986M0746r9966m0509k0659L0864K0706J0794
$$ 541498 541934 545428 300788 423825 515811 556557 456591 416082 395423 426287 446993 457787
6778D57787n9640l99n7793J40325l1720j96946N2398J8178J2083P94J12331p8845
$$ 457787 398147 397748 339955 480280 448560 251614 304012 322190 334273 335067 447398 368553
6766C68553m3561J54109j84329J5358j29731K49365p6269j51270J03808j0299
$$ 368553 324992 479101 294772 310130 180399 429764 353495 202225 306033 295734
6756B95734J43334k11582J61798r8011j6768M228L0498J15855j12218l6761j24867
$$ 295734 439068 227486 389284 291273 274505 278733 309231 425086 312868 276107 151240
6745A51240J93113j01112k4823k4354J57942n2822J05010l8031q7039K3077L6750
$$ 151240 344353 243241 218418 194064 352006 299184 404194 366163 279124 302201 338951
6734C38951r2052o7643K22982p2122Q9714j27844Q563l6521M1290Q2905j34249
$$ 338951 246899 179256 402238 330116 419830 291986 300549 264028 305318 388223 253974
6723B53974L3000m5040j9942l3215J87791l647j81495Q0563J70599q4024m2536
$$ 253974 286974 241934 221992 188777 376568 372921 191426 271989 442588 358564 316028
6712C16028J50903p1709j6021J29906J05972k27519r372M7152J75871k09399J12823
$$ 316028 466931 395222 379201 509107 615079 387560 378188 425340 601211 391812 504635
6701E04635k1119j84397O1864J62260J82419j28533J38530P9020K61420L41307
$$ 504635 483516 299119 360983 523243 705662 577129 715659 794679 1056099 1397406
6691A397406L84327L39371Q7045o7525k29980k78203k33089o9025k50473l0357
$$ 1397406 1781733 2121104 2208149 2140624 1910644 1632441 1399352 1330327 1079854 1049497
6681A049497r5524M417k25336P2184M8392l3569K2444l9360R8208j04606J51831
$$ 1049497 953973 958390 733054 805238 853630 820061 842505 803145 901353 796747 948578
6670I48578J30880Q4891J23022J31306N21556L36836R75769J222196J524160O52666
$$ 948578 1079458 1164349 1287371 1418677 1940233 2277069 3252838 4475034 5999194 6651860
6660F651860n73734p83566r91789p25941p32764m39562m60354j22966k09110j80227
$$ 6651860 6078126 5294560 4302771 3576830 2844066 2404504 1944150 1821184 1612074 1431847
6650A431847p4143j48671J0557O6038j14713k0972J31736q382m1732K55881n995
$$ 1431847 1357704 1209033 1219590 1285628 1170915 1149943 1281679 1273297 1231565 1487446 1481451
6639A481451K81865J45776N14136P53396J252208J521844R18027m70747q95798
$$ 1481451 1763316 1909092 2423228 3176624 4428832 5950676 6868703 6397956 5502158
6630E502158p33567q84466q36697n42675m42956l46224k27179l0904j39260l7574
$$ 5502158 4768591 3884125 3047428 2504753 2061797 1715573 1488394 1457490 1318230 1280656
6620A280656p3982J25346J598N5294j15627j14576k2386J03531l2356j10841n9306
$$ 1280656 1206674 1332020 1333618 1388912 1273285 1158709 1136323 1239854 1207498 1096657 1037351
6609A037351K73205K86035K13745N07197L16119J06907j58840j87569l81281l24649
$$ 1037351 1310556 1596591 1810336 2317533 2633652 2740559 2581719 2394150 2012869 1688220
6599A688220k21740k83455j30876q7424r3209q7959J3912J29479J03188p1448
$$ 1688220 1466480 1183025 1052149 964725 871516 783557 797469 926948 1030136 958688
6589I58688k4056P4468m3390j14542j39112q9532K0384n0737l2163K8598j2914
$$ 958688 934632 1009100 965710 851168 712056 622524 642908 592171 560008 588606 575692
6578E75692J16227K17754K18279J59688L61223q8757j31516j68497j57096k63953
$$ 575692 691919 909673 1127952 1287640 1648863 1560106 1428590 1260093 1102997 839044
6568H39044k08529P246j72473J11657l3679k6641k42245J49751K22294L3019j83767
$$ 839044 630515 637761 465288 576945 543266 516625 274380 424131 646425 679444 495677
6557D95677o9378J06505j78788N1455K2440n5607K8308O3348K19594J35456K63074
$$ 495677 426299 532804 354016 405471 427911 372304 400612 463960 683554 819010 1082084
6546A082084L12972J06323j13596j49478j59646l99142j60863l943r5110j35337
$$ 1082084 1395056 1501379 1387783 1238305 1078659 679517 518654 514711 419601 284264
6536B84264k7828J9066p9169O3152r1220P9025m5204P6685j30391j5069J04184
$$ 284264 256436 275502 196333 259485 168265 247290 202086 278771 148380 133311 237495
6525B37495o8149J34937j55357l588J33413N3101P0315J34400O3668k03006J11027
$$ 237495 169346 304283 148926 145338 278751 331852 402167 536567 600235 397229 508256
6514E08256j71696k1276j58039M2888n763l1572J18624l0603j01008j02832J59743
$$ 508256 336560 315284 157245 200133 194370 162798 281422 250819 149811 46979 206722
6503B06722m1784j24860j4881J3312K0392K4302M0994j39348J10782J2231m358
$$ 206722 164938 40078 25197 38509 58901 83203 124197 -15151 95631 107862 103504
6492A03504o2610P3504p0172L437k2699l5179J56675k19912O5975M9152p5906
$$ 103504 40894 114398 44226 47663 24964 -10215 146460 -73452 -7477 41675 -34231
6481c4231J15020Q600q1633J7790l6062J17748k02235J34644l9875N4065r6700
$$ -34231 80789 89389 7756 25546 -10516 107232 -95003 39641 -234 53831 -42869
6470d2869J97313j10058j22286L1235O6290K8490o7353J02253r5041j6079J00303
$$ -42869 154444 44386 -77900 -46665 19625 48115 -19238 83015 -12026 -28105 72198
6459G2198K9288k29323J04700R0502r7204l3528M1615O2803j34984L9452k5716
$$ 72198 101486 -127837 -23137 67365 -29839 -63367 -21752 41051 -93933 -54481 -80197
6448h0197L2860J1940N6843n7806j216P2629j74209J49981j18986J98576p4386
$$ -80197 -47337 -35397 21446 -36360 -37576 35053 -139156 10825 -108161 90415 16029
6437A6029o6409j3598L7631K9889j4527j1190o8017K8992O6978p1467J18154j72412
$$ 16029 -50380 -63978 -26347 3542 -10985 -22175 -90192 -61200 5778 -65689 52465 -119947
6425a19947J27509m3147k8635K3480P3396j67093M4841R9023n229j14456Q5207
$$ -119947 7562 -35585 -64220 -40740 32656 -134437 -89596 9427 4198 -110258 -25051
6414b5051K8896l9357l4730K7269r1847Q8173J12011j32311N049j22300J05215
$$ -25051 3845 -35512 -70242 -42973 -134820 -46647 65364 -66947 -61898 -184198 -78983
6403g8983M5439K7671J40823j55560L0716o726M1195p1825J3250Q307r2373J48252
$$ -78983 -33544 -5873 134950 -20610 10106 3380 44575 -27250 -14000 -5693 -98066 50186
6391E0186m3216n6303j27359J53245J09702J7535j79785M5593o8652J25114O794
$$ 50186 6970 -49333 -176692 -23447 86255 103790 -75995 -30402 -99054 26060 32854
6380C2854j18782P384P009J5788N7504R0949m3389j18633k2335J07927L6890j0351
$$ 32854 -85928 -78544 -71535 -55747 1757 92706 49317 -69316 -91651 16276 53166 42815
6368D2815q6435j42063J33670Q3437J69J2098J1450n6150o5751j742J0635p288
$$ 42815 -43620 -185683 -52013 31424 31593 43691 55141 -1009 -66760 -68502 -57867 -65155
6356f5155k8065J14095M857K423j8107l161L64K4181Q021j37714m9073K9933J17417
$$ -65155 -93220 20875 25732 28155 10048 6887 7251 31432 39453 -98261 -147334 -117401 16
6343A6J5339j16206K554O9178K6761J3553j29786o389K8335M1723L9339m0883
$$ 16 15355 -100851 -98297 -29119 -2358 11195 -118591 -124980 -96645 -54922 -15583 -56466
6331e6466k6192J7815K168o976R4129J2542k75917K99580j63774P2201k9623p223
$$ -56466 -82658 -64843 -62675 -69651 24478 37020 -238897 60683 -103091 -30890 -60513 -67736
6319f7736n441J19731J59180j93529j17923M0970p919J4085j55700K16865o8774
$$ -67736 -73177 46554 205734 12205 -105718 -64748 -72667 -58582 -214282 2583 -66191
6308f6191j36961K29721k0000j11270K8175M5775l5578P8198P6964j61650j1571
$$ -66191 -203152 26569 6569 -104701 -76526 -30751 -66329 11869 88833 -72817 -84388
6297h4388R0344j8198j07087P3954N0465n8431J02152n3166P9797j45041R0266
$$ -84388 5956 -12242 -119329 -45375 5090 -53341 48811 -4355 75442 -69599 20667
6286B0667m580N3509o7620P3491j59874J2324N1760M3452j21156N7149o75p29
$$ 20667 16087 69596 1976 75467 -84407 -72083 -20323 23129 -98027 -40878 -41553 -42282
6274d2282N9860r8101Q2109k7443M0716K6560o5781k8313N7891L4208q6665l0935
$$ -42282 17578 -80523 1586 -25857 14859 41419 -24362 -52675 5216 39424 -47241 -78176
6262g8176O2246O9440P9478o2324j14215O7836M6600m3307O2881q250j53302P212
$$ -78176 -15930 53510 132988 70664 -43551 24285 70885 27578 90459 82209 -71093 -63881
6250f3881J70476q5444M7790j15488M8044j9907J15850j67539O7042k021j18052
$$ -63881 106595 21151 68941 -46547 1497 -18410 97440 -70099 -3057 -5078 -123130
6239a23130J22790l8374J38062m3530j55405Q7720l8508J18357j60368K24130
$$ -123130 -340 -38714 99348 55818 -99587 -11867 -50375 67982 -92386 131744
6229A31744j17270K5017O0424j13358Q3081j09935J93071k05897J22927j7930
$$ 131744 14474 39491 99915 -13443 69638 -40297 152774 -53123 69804 51874
6219E1874j8249p1389m5482J00411O2599p6415M4860p99P160o2012J07735m2073
$$ 51874 33625 -37764 -83246 17165 79764 3349 48209 47410 54570 -7442 100293 58220
6207E8220l4050J21058j02051J0460M4854j02640k2837J0132Q1396q0469R0182
$$ 58220 24170 145228 43177 53637 98491 -4149 -26986 -16854 64542 -15927 74255
6196G4255m5298J69078p9110o9148Q8258N0950m4891k8819P4754q0755J4645N1843
$$ 74255 28957 198035 118925 49777 138035 188985 144094 115275 190029 109274 123919 175762
6184A75762o6501q8040P0616r9786J26713j12170J33451k8418N2246j65366O2708
$$ 175762 109261 21221 91837 -7949 118764 6594 140045 111627 163873 -1493 61215
6173F1215j8765p119R1191j92370J01663n3519J9946M90J48072j11369o032Q0052
$$ 61215 42450 35331 126522 -65848 35815 -17704 2242 2732 150804 39435 33403 113455
6161A13455j40140O3721M7832N4707j34820m1522J02338l8215R2147k6196o7763
$$ 113455 -26685 37036 84868 139575 4755 -36767 65571 27356 119503 93307 25544
6150B5544j26807P1819P9218M6164l499r9740L6537N2636j3776Q595q2237j2559
$$ 25544 -101263 -29444 49774 95938 92439 -7301 29236 81872 68096 76691 -5546 -18105
6138a8105R6620L4587j32660J5268R4254j00024j27917J46363j4436J10327j96975
$$ -18105 78515 113102 -19558 -4290 89964 -10060 -137977 8386 -6050 104277 -92698
6127i2698J91445R62k2274J5953L4301q4717m6922J01555j67748Q4966L1572n92
$$ -92698 98747 99709 77435 93388 127689 42972 -3950 97605 -70143 14823 46395 45803
6115D5803j15770J04791m638O4674r4198O0030j2265r9456J12533k6780k9889
$$ 45803 -69967 34824 30186 94860 662 60692 48427 -51029 61504 34724 4835
6104D835K4707O3486N885j14625N5469k0347M9356n8808m5589K4048J25226K7290
$$ 4835 29542 93028 98913 -15712 39757 19410 68766 9958 -35631 -11583 113643 140933
6092A40933j33724K1686l4223j947J02631n6260k9059j16723O2162R3783P5886
$$ 140933 7209 28895 -5328 -7275 95356 39096 10037 -106686 -44524 49259 125145
6081A25145p0020L498N3271j6306l5519o1096R3814k1262O0187j0916j12496j6403
$$ 125145 55125 58623 111894 95588 60069 -1027 92787 71525 131712 120796 8300 -8103
6069h103j18120Q5432J66854l5350j40243J39986M8393L7634l7342o5150o2699
$$ -8103 -126223 -40791 126063 90713 -49530 90456 138849 176483 139141 73991 11292
6058A1292n6862Q8646K2319p6708O1164Q2762L0790k22804K11909k1506p3979
$$ 11292 -45570 43076 65395 -11313 49851 132613 163403 -59401 152508 131002 57023
6047E7023l6005J29756K3380j65705M5799K5878N5146o4114N5632q5981J79891
$$ 57023 21018 150774 174154 8449 54248 80126 135272 71158 126790 40809 220700
6036B20700j85897P9120r114j9199K7362j9482j9861M6248R3774j64193J02606
$$ 220700 34803 113923 104809 85610 112972 93490 73629 119877 213651 49458 152064
6025A52064O1120q4616j34250K18892j00547M6500k8565P6296Q9965j94473j5371
$$ 152064 213184 128568 -5682 213210 112663 159163 130598 206894 296859 102386 87015
6014H7015J0253L7625P717O3900R8661j68951M1392m968l4142O8142q041j08268
$$ 87015 97268 134893 142610 206510 305171 136220 177612 172644 138502 206644 198603 90335
6002I0335J22509K5811L735l4196k7460K4395L3492N9909j27090J14205m6931
$$ 90335 212844 238655 242390 208194 180734 205129 238621 298530 171440 285645 238714
5991B38714M5267n7J1685N4283q1297l4077Q0139M0871O2191j34006K2354r6890
$$ 238714 283981 283924 295609 349892 268595 234518 314657 355528 417719 283713 306067 209177
5979B09177J22477k3799K9647j33976Q7945P3062m0465O2094m8199J14665l3047
$$ 209177 331654 307855 337502 203526 291471 364533 324068 386162 337963 452628 419581
5968D19581o6114R7583J01214k6213N3691q4764N626J2946R0123j56048O0496
$$ 419581 353467 451050 552264 526051 579742 494978 500604 513550 603673 447625 508121
5957E08121R8446j6075l9183N3995J80073l7843L2023J13569J10048O3805N5730
$$ 508121 606567 590492 551309 605304 785377 747534 779557 893126 1003174 1066979 1122709
5946A122709m8673j04959M9883J90808j68082R0072j3687K1066r7217q159p7905
$$ 1122709 1074036 969077 1018960 1209768 1041686 1131758 1118071 1139137 1041920 1033761 955856
5935I55856j16892J12880k6979L6706P310l0846J0845l3169J96612j24138L1324
$$ 955856 838964 951844 924865 961571 968881 938035 948880 915711 1112323 988185 1019509
5924A019509j8662J39351l7139J72934J44066J10684J25773K53752l1863k6891
$$ 1019509 1000847 1140198 1103059 1275993 1420059 1530743 1656516 1910268 1878405 1851514
5914A851514J20599n1331o4009j38362J14829k61006p675k188j12133n5493l6670
$$ 1851514 1972113 1920782 1856773 1718411 1833240 1572234 1564559 1562371 1450238 1394745 1358075
5903A358075r5254j32596L8679J03433r4816L5523j14549K27211j44274N2410
$$ 1358075 1262821 1130225 1168904 1272337 1177521 1213044 1098495 1325706 1181432 1233842
5893A233842J23426n0403J13347M3278P5118J06989J51870Q2518j16548J73224
$$ 1233842 1357268 1306865 1420212 1463490 1538608 1645597 1797467 1879985 1763437 1936661
5883A936661n9599j12593m3337M7183N4663j11557k2916Q8735P4449o413k2517
$$ 1936661 1877062 1764469 1721132 1768315 1822978 1711421 1688505 1777240 1851689 1845276 1822759
5872A822759M7063j33455J66431K4214n9901m5292q319O8266j29042J45698l2141
$$ 1822759 1869822 1736367 1902798 1927012 1867111 1821819 1813500 1881766 1752724 1898422 1866281
5861A866281j45553k3018K5011P1370n1854L7774L2402J12015J08643p2709j1269
$$ 1866281 1720728 1697710 1722721 1794091 1742237 1780011 1812413 1924428 2033071 1960362 1949093
5850A949093J6963P8818K52971r256K26330M9418J95379J12379J37269K6588M5868
$$ 1949093 1966056 2044874 2297845 2288589 2514919 2564337 2759716 2872095 3009364 3035952 3081820
5839C081820n2929J27853J13346j03711J3840r2894L7249r601N6793L4795K5091
$$ 3081820 3028891 3156744 3270090 3166379 3180219 3087325 3124574 3114973 3171766 3206561 3231652
5828C231652m5957O0586P3912K10729J68264J97074J92863K90383L08692K25831
$$ 3231652 3185695 3246281 3320193 3530922 3699186 3896260 4089123 4379506 4688198 4914029
5818D914029K90158J44643J92712Q1621N4555Q9545j95160J05j84201q7165j89495
$$ 4914029 5204187 5348830 5541542 5623163 5677718 5767263 5572103 5572208 5388007 5300842 5111347
5807E111347k14803j28763n2792j42256n7391j545j1732l0535J56786O4370l0671
$$ 5111347 4896544 4767781 4714989 4572733 4515342 4513797 4502065 4471530 4628316 4692686 4662015
5796D662015K22607J14925L58196K03649M89450M16150L87089M96610K80827N46898
$$ 4662015 4884622 4999547 5357743 5561392 6050842 6466992 6854081 7350691 7631518 8178416
5786H178416K50931K43842r1132p6623j89138l73741l54678l53854l53120k15948
$$ 8178416 8429347 8673189 8582057 8505434 8316296 7942555 7587877 7234023 6880903 6664955
5776F664955k65507q5212j50730m8660j41796m2981J33974k3487K641J85072J18480
$$ 6664955 6399448 6314236 6163506 6114846 5973050 5930069 6064043 6040556 6043197 6228269 6346749
5765F346749J13281K32977L06304J05581K57179L99998L24653L16784K48859K88495
$$ 6346749 6460030 6693007 6999311 7104892 7362071 7762069 8086722 8403506 8652365 8940860
5755H940860Q3379K10038M5577J08251m0040K8360q9526p0399K0744K20703K56500
$$ 8940860 9024239 9234277 9279854 9388105 9348065 9376425 9286899 9216500 9237244 9457947 9714447
5744I714447K47274K88998M81806N66302P97979Q24961J005980J206223J297737
$$ 9714447 9961721 10250719 10732525 11298827 12096806 12921767 13927747 15133970 16431707
5735A6431707J338666J270421J538480R88501P17914M38406l9656j70423n11672
$$ 16431707 17770373 19040794 20579274 21567775 22285689 22724095 22684439 22514016 22002344
5726B2002344m56530o20080o09319m02064k25254k35152k38364K98136N5758K99112
$$ 22002344 21545814 20925734 20316415 19914351 19689097 19453945 19215581 19513717 19569475 19868587
5716A9868587M16370P07853N69453R27990J224727J285953J598514K089477K177177
$$ 19868587 20284957 20992810 21562263 22490253 23714980 25000933 26599447 28688924 30866101
5707C0866101K628380K963234K974803L037404K845808K754090K064379J643039
$$ 30866101 33494481 36457715 39432518 42469922 45315730 48069820 50134199 51777238
5699E1777238J137065J156765J232973J622905K860064M053243N821761P359643
$$ 51777238 52914303 54071068 55304041 56926946 59787010 63840253 69662014 77021657
5691G7021657R180850J0271393J1330487J1337387R853052P137507L180326p25997
$$ 77021657 86202507 96473900 107804387 119141774 128994826 136132333 139312659 138586662
5683A38586662m365669o762632q164202q642999q666717p887763o562873n247859
$$ 138586662 134220993 127458361 119294159 110651160 101984443 94096680 87533807 82285948
5675H2285948l571445k312281j236312l83560M64003Q06829J478805K459770L678352
$$ 82285948 78714503 76402222 75165910 74782350 75246353 76053182 77531987 79991757 83670109
5666H3670109N561947P818603J0399306J3517155J6926680K0396065K3261716
$$ 83670109 89232056 97050659 107449965 120967120 137893800 158289865 181551581
5659A81551581K4961939K4909048K2042983J4616599M789380m219070j1307159
$$ 181551581 206513520 231422568 253465551 268082150 272871530 268652460 257345301
5652B57345301j7217700k0545287k1841841k1459028j9936495j7873250j4934357
$$ 257345301 240127601 219582314 197740473 176281445 156344950 138471700 123537343
5645A23537343j1944186r242324o851406m580887k704537j510547j33854O04040
$$ 123537343 111593157 102350833 95499427 90918540 88214003 86703456 86569602 87173642
5637H7173642J220900K065135L160639M547784O336453Q431437J0218082J1516798
$$ 87173642 88394542 90459677 93620316 98168100 104504553 112935990 123154072 134670870
5629A34670870J2203063J2683629J1789521P965215K304668l093200p394038j0351922
$$ 134670870 146873933 159557562 171347083 179312298 181616966 178523766 171129728 160777806
5621A60777806j2501024j3824571j3946580j2820259j1411051r803356p734653
$$ 160777806 148276782 134452211 120505631 107685372 96274321 86470965 78736312
5614G8736312o333391m889155l713110k905844k233506j929920j209679r07976
$$ 78736312 72402921 67513766 63800656 60894812 58661306 56731386 55521707 54613731
5606E4613731l66367k52916K54276N34752Q60958J245331J277061J727831J844840
$$ 54613731 54247364 53994448 54248724 54783476 55644434 56889765 58166826 59894657 61739497
5597F1739497K111767K088411K374420K374617K415445K247814K283192K092687
$$ 61739497 63851264 65939675 68314095 70688712 73104157 75351971 77635163 79727850
5589G9727850J653975J805290J452800J277105Q99493P43291P09152P66290J092103
$$ 79727850 81381825 83187115 84639915 85917020 86816513 87559804 88268956 89035246 90127349
5580I0127349J252589J787937K005372K498508K905904L244071L295448L113958
$$ 90127349 91379938 93167875 95173247 97671755 100577659 103821730 107117178 110231136
5572A10231136K696050K312832J748099P80542k02689q10391j250446j979454
$$ 110231136 112927186 115240018 116988117 117768659 117565970 116755579 115505133 113525679
5564A13525679k366504k700522k401647k162496k144886j986547j989341j910945
$$ 113525679 111159175 108458653 106057006 103894510 101749624 99763077 97773736 95862791
5556I5862791j792951k046298k057649k280366k091521k223912j918395j855696
$$ 95862791 94069840 92023542 89965893 87685527 85594006 83370094 81451699 79596003
5548G9596003j932677j610006j954595j879383k017409k330780k699705k946085
$$ 79596003 77663326 76053320 74098725 72219342 70201933 67871153 65171448 62225363
5540F2225363l028072l118559l227686k803861k651964k226510j983900j432390
$$ 62225363 59197291 56078732 52851046 50047185 47395221 45168711 43184811 41752421
5532D1752421j127997p19170m66880k83519m62746m84632o38457r86491j372033
$$ 41752421 40624424 39905254 39438374 39154855 38692109 38207477 37569020 36582529 35210496
5523C5210496j291230j631147j556613j565470j442667j414902j110069q15829
$$ 35210496 33919266 32288119 30731506 29166036 27723369 26308467 25198398 24382569
5515B4382569q47418n72459l24594k81228m54029j00130L5097j69459J0788K42401
$$ 24382569 23535151 22962692 22638098 22356870 21902841 21802711 21837808 21668349 21679137 21921538
5505B1921538J54084L01590L61773N36611M77265R25246J040624J247307J454926
$$ 21921538 22075622 22377212 22738985 23275596 23752861 24678107 25718731 26966038 28420964
5496B8420964J684927K022642K248083K512758K717667K763175K649149K422404
$$ 28420964 30105891 32128533 34376616 36889374 39607041 42370216 45019365 47441769
5488D7441769K123340J794434J376963R13340P23074M75654K75135K35051K30549
$$ 47441769 49565109 51359543 52736506 53649846 54372920 54848574 55123709 55358760 55589309
5479E5589309L05349N19484Q96919J261844J558401K177921K510065K992017L321204
$$ 55589309 55894658 56414142 57311061 58572905 60131306 62309227 64819292 67811309 71132513
5470G1132513L979415L946463M242656M580828M308210L936964L389884K641621
$$ 71132513 75111928 79058391 83301047 87881875 92190085 96127049 99516933 102158554
5462A02158554J781566N65062n21520j461508k064475k891567l257819l498271
$$ 102158554 103940120 104505182 103983662 102522154 100457679 97566112 94308293 90810022
5454I0810022l408118l148236k870702k505930j937525j629070j249413p08991
$$ 90810022 87401904 84253668 81382966 78877036 76939511 75310441 74061028 73352037
5446G3352037p57114l92395n39933o33997p80188j003613j359037j751468j959797
$$ 73352037 72594923 72202528 71662595 71028598 70248410 69244797 67885760 66134292 64174495
5437F4174495k183401k150224k313302k525684k232419k275484k225805k186335
$$ 64174495 61991094 59840870 57527568 55001884 52769465 50493981 48268176 46081841
5429D6081841j928625k131142j703246j801160j714060j612299j297141j325915
$$ 46081841 44153216 42022074 40318828 38517668 36803608 35191309 33894168 32568253
5421C2568253j024027r37273o63806n79203m16247j41973J76785K53186M88065
$$ 32568253 31544226 30606953 29943147 29363944 28947697 28805724 28982509 29235695 29723760
5412B9723760O17407Q10263Q97887R29759R48000Q21536O00445L41924J64504
$$ 29723760 30341167 31151430 32049317 32979076 33927076 34748612 35349057 35690981 35855485
5403C5855485l38228n59188p31886r96680j177613j054031j307853j176006j169502
$$ 35855485 35517257 34958069 34226183 33229503 32051890 30997859 29690006 28514000 27344498
5394B7344498r61189j012376o65239o63778m63786n76513l60657k58972k89381
$$ 27344498 26383309 25370933 24705694 24041916 23578130 23001617 22640960 22381988 22092607
5385B2092607j87858k02158k52352m45032m18343p99361o53990q57166r95000
$$ 22092607 21904749 21702591 21450239 21005207 20586864 19787503 19133513 18276347 17281347
5376A7281347j048994r71181r11032j076605q48943p62295n49673n17821o71771
$$ 17281347 16232353 15261172 14350140 13273535 12424592 11662297 11112624 10594803 9923032
5367I923032m80376m32457k04841n15508k53561l38276p4212l51085l33978k17238
$$ 9923032 9442656 9010199 8805358 8289850 8036289 7698013 7623801 7272716 6938738 6721500
5357F721500l57772k34153k56930m9109l00169o7380k88050k8692j22658j0233
$$ 6721500 6363728 6129575 5872645 5823536 5523367 5455987 5167937 5139245 5016587 5006354
5347E006354k41349j01639O5064n4180j97147k25059n8046n8530L5421p4579j97411
$$ 5006354 4765005 4663366 4728430 4674250 4477103 4252044 4193998 4135468 4170889 4096310 3898899
5336C898899m4734p5322j3944j69062r8778K2959o1924p9835k5861j42965m1677
$$ 3898899 3854165 3778843 3764899 3595837 3497059 3520018 3458094 3378259 3352398 3209433 3167756
5325C167756P3213j46356l8902Q6893j11091j64422J17487L0751p0497p5121L7128
$$ 3167756 3240969 3094613 3055711 3142604 3031513 2867091 2984578 3015329 2944832 2869711 2906839
5314B906839p2844k9035K0187j88451j1397l972j9915o2716j8254O4587j51905
$$ 2906839 2833995 2804960 2825147 2636696 2625299 2621327 2601412 2538696 2520442 2585029 2433124
5303B433124p0030j35528O0730j30381O6136q8664r2222J05713N4136q7081N3865
$$ 2433124 2363094 2227566 2288296 2157915 2224051 2135387 2043165 2148878 2203014 2115933 2169798
5292B169798k5666j43628M2854L5168k1155j00160p2573l4659L9468M8058R928
$$ 2169798 2144132 2000504 2043358 2078526 2057371 1957211 1884638 1849979 1889447 1937505 1947433
5281A947433n2306J13129o5165m5116K6097L702K6881R03M1996J11176k61692
$$ 1947433 1895127 2008256 1943091 1897975 1924072 1927774 1954655 1955558 1997554 2108730 1847038
5270A847038o7846R7670j01009Q1558Q8424j2762p0392J6748o7679L3544K3451
$$ 1847038 1779192 1876862 1775853 1857411 1945835 1933073 1862681 1879429 1811750 1845294 1868745
5259A868745j13715R1568m329j06538j051M2308J38537K5081J12151l767O1342
$$ 1868745 1755030 1846598 1842269 1735731 1734680 1776988 1915525 1940606 2052757 2048990 2110332
5248B110332J74609R1592M3407l2043J2257J76124o7879j48157r9729j32617K5628
$$ 2110332 2284941 2376533 2419940 2387897 2400154 2576278 2508399 2360242 2260513 2127896 2153524
5237B153524K6740q8166j13571O0565k03795J9856k2418j19551p503J43714q0446
$$ 2153524 2180264 2092098 1978527 2039092 1835297 1855153 1832735 1713184 1705681 1849395 1768949
5226A768949M7753j67054J06809Q8925J4285O7338J16571q9518P8064R7181J3965
$$ 1768949 1816702 1649648 1756457 1845382 1859667 1927005 2043576 1954058 2032122 2129303 2143268
5215B143268p008o2357j76201J2749J7466j2727j75509r4051Q5581l7099j68880
$$ 2143268 2136260 2073903 1897702 1910451 1927917 1915190 1739681 1645630 1731211 1694112 1525232
5204A525232Q9142l4302j50593j3258L3301Q3095j31933K9812q5750P6145j07597
$$ 1525232 1614374 1580072 1429479 1416221 1449522 1532617 1400684 1430496 1344746 1420891 1313294
5193A313294J05706p3237k462P0188q1954o7003L7573J21332o7626j48996K85819
$$ 1313294 1419000 1345763 1343301 1413489 1331535 1264532 1302105 1423437 1355811 1206815 1492634
5182A492634k69939J00917j31501j9906q0477Q1200p2938l5699l6605J42746L2561
$$ 1492634 1222695 1323612 1192111 1172205 1091728 1172928 1099990 1064291 1027686 1170432 1202993
5171A202993j23433O6610k1834P8621j75908O3045n2076J02910J0191j1028M0342
$$ 1202993 1079560 1146170 1124336 1202957 1027049 1090094 1038018 1140928 1151119 1140091 1180433
5160A180433k6672N568k6663J33513j1788l6496k3208j0962R8973j10306N7127
$$ 1180433 1153761 1159329 1132666 1266179 1254391 1217895 1194687 1183725 1282698 1172392 1229519
5149A229519o7459J06785O739N4821n5600N9547j920J2436J21029J3615k22577
$$ 1229519 1162060 1268845 1275584 1330405 1274805 1334352 1332432 1344868 1465897 1479512 1256935
5138A256935J27688M7738P9352P9270M2490J00636o5339L6326l796K0928M4807
$$ 1256935 1384623 1432361 1511713 1590983 1633473 1734109 1668770 1705096 1701300 1722228 1767035
5127A767035q4361j2129q0690J68132l8712j29609P3341J64256j49134j0403R5524
$$ 1767035 1682674 1670545 1589855 1757987 1719275 1589666 1663007 1827263 1678129 1667726 1763250
5116A763250l8513J37546j17613J09869n240J73278j05858P3048J14693K10479
$$ 1763250 1724737 1862283 1744670 1854539 1849299 2022577 1916719 1989767 2104460 2314939
5106B314939k9339Q2302R749R060L6603q1183M8745L349J23536j17448p2074K32893
$$ 2314939 2285600 2367902 2377651 2386711 2423314 2342131 2390876 2394225 2517761 2400313 2328239 2561132
5094B561132N3062J52737k11206K54483o6137M2285j8473L0808J33763L3468J85545
$$ 2561132 2614194 2766931 2555725 2810208 2744071 2786356 2767883 2798691 2932454 2965922 3151467
5083C151467P103K01445N6405K14942j3989J69639J26358J73502J4696J52653
$$ 3151467 3158570 3360015 3416420 3631362 3617373 3787012 3913370 4086872 4101568 4254221
5073D254221J30819Q0328O3489P1272J09450L8220O8250K37849R2134J28228K42294
$$ 4254221 4385040 4465368 4528857 4600129 4709579 4747799 4816049 5053898 5146032 5274260 5516554
5062E516554K53919Q4586N06565M63981M33637M77197O15614R88363R76910J525588
$$ 5516554 5770473 5855059 6361624 6825605 7259242 7736439 8352053 9340416 10317326 11842914
5052A1842914K034087L352332M065332M520553L604206K236815K95023j931135
$$ 11842914 13877001 17229333 21294665 25815218 29419424 31656239 31951262 30020127
5044C0020127k959377k807714k732784k103731j598508r02820o78225J2868J62388
$$ 30020127 27060750 24253036 21520252 19416521 17818013 16915193 16236968 16249836 16412224
5035A6412224p6824R2110J5070R1193L15872P17781Q78649J115203J890347K425339
$$ 16412224 16335400 16427510 16442580 16533773 16849645 17567426 18446075 19561278 21451625 23876964
5025B3876964L391193M895955P185189Q767451R210438Q592229P940290Q654098
$$ 23876964 27268157 32164112 39349301 48116752 57327190 65919419 73859709 82513807
5017H2513807P877368L737837l825104q794381r927106r217061q355111o690926
$$ 82513807 90391175 94129012 90303908 81509527 71582421 62365360 54010249 47319323
5009D7319323m947970l328932k138055j701660j878244j339054m68617j33230
$$ 47319323 42371353 39042421 36904366 35202706 33324462 31985408 31516791 31383561
5001C1383561J99107O53033J167505J504598K605020M089329N677445P908947
$$ 31383561 31582668 32235701 33403206 34907804 37512824 41602153 47279598 55188545
4993E5188545R600921R636584R557907J0982002J2487759J2291853P543035M24175
$$ 55188545 64789466 74426050 83983957 94965959 107453718 119745571 127288606 127712781
4985A27712781m889225j0718300j3964624j3890790j1961219j0137883q195836
$$ 127712781 122823556 112105256 98140632 84249842 72288623 62150740 53954904
4978E3954904o274249m434035l157280k156902j619705r09807k73901M3097K03471
$$ 53954904 47680655 43246620 40089340 37932438 36312733 35402926 35129025 35172122 35375593
4969C5375593M66501R58307J563702K298072L045425M005248N648334P104138
$$ 35375593 35842094 36800401 38364103 40662175 43707600 47712848 53361182 60465320
4961F0465320R156758R848711Q491594N281300K089369k868608p346207r734785
$$ 60465320 69622078 79470789 87962383 93243683 95333052 92464444 85118237 75383452
4953G5383452j0064394r333685p991942o558839m998370l844574k971958k150516
$$ 75383452 65319058 55985373 47993431 41434592 36436222 32591648 29619690 27469174
4945B7469174j565689j185283p56921l21751m81709k53736k33850K18683P23315
$$ 27469174 25903485 24718202 23961281 23639530 23157821 22904085 22670235 22888918 23612233
4936B3612233Q50546J341140J638913J762018J582895J478927J763041J252708
$$ 23612233 24462779 25803919 27442832 29204850 30787745 32266672 34029713 35282421
4928C5282421P05809m68664j228449k820841l049813k845276j984953r19558k00847
$$ 35282421 35988230 35519566 34291117 31470276 28420463 25575187 23590234 22670676 22469829
4919B2469829p19885k005030j879977j629503j635169j362372r58102o06002n20087
$$ 22469829 21749944 19744914 17864937 16235434 14600265 13237893 12279791 11673789 11153702
4910A1153702m34315l33622j65609j6490J26078J05535K7474J03425J7081j16524
$$ 11153702 10719387 10385765 10220156 10203666 10329744 10435279 10462753 10566178 10583259 10466735
4900A0466735l12819l64597m78570m22012n29268l02850l72462k72079l12630
$$ 10466735 10153916 9789319 9310749 8888737 8359469 8056619 7684157 7412078 7099448
4891G099448j23817k46372j08985q047k75482j78946l2522j4286p9354r0789P46
$$ 7099448 6975631 6729259 6620274 6612227 6336745 6157799 6125277 6110991 6031637 5940848 5941594
4880E941594j56473k5130l2114j8592q4838L0389J00248J3055j38378q8148L4416
$$ 5941594 5785121 5759991 5727877 5709285 5624447 5654836 5755084 5768139 5629761 5541613 5576029
4869E576029K1478q364J42271j56150j34949l8194J09221k1472J1584M462J1261
$$ 5576029 5597507 5589143 5731414 5575264 5440315 5402121 5511342 5489870 5501454 5505916 5517177
4858E517177J12483J36119m4277o6604n6554N9716O4010K6406O7143j33379J70572
$$ 5517177 5629660 5765779 5721502 5654898 5598344 5658060 5722070 5748476 5815619 5682240 5852812
4847E852812K9040J25366P3432K9708M6643j9725K07100Q0027N8096R9596J60605
$$ 5852812 5881852 6007218 6080650 6110358 6157001 6137276 6344376 6424403 6482499 6582095 6742700
4836F742700J02478O2410J51045K07768K5774R2025J21457J91466J41659L43985
$$ 6742700 6845178 6907588 7058633 7266401 7292175 7384200 7505657 7697123 7838782 8182767
4826H182767J47797J44784L32625L42199L34967L63959M18280M36776M60697O38385
$$ 8182767 8330564 8475348 8807973 9150172 9485139 9849098 10267378 10704154 11164851 11803236
4816A1803236P75638Q38007P78840P50220O58681M91223M59952N98371O99173
$$ 11803236 12578874 13416881 14195721 14945941 15604622 16095845 16555797 17154168 17853341
4807A7853341P77939J213796J221044J090944P75814O91555N82489P26903Q30686
$$ 17853341 18631280 19845076 21066120 22157064 22932878 23624433 24206922 24933825 25764511
4798B5764511J044926J183254J109774Q86649N94130J63631L32101K80403O34044
$$ 25764511 26809437 27992691 29102465 29989114 30583244 30746875 31078976 31359379 31993423
4789C1993423P19333R38736J002060J385544J694812K362416K770504L190926
$$ 31993423 32712756 33651492 34653552 36039096 37733908 40096324 42866828 46057754
4781D6057754L265932L499945L979317M625876N419193O229825O769183P023910
$$ 46057754 49323686 52823631 56802948 61428824 66848017 73077842 79847025 86870935
4773H6870935O602964N148722L692887K704753J334298M74433L63377J331948
$$ 86870935 93473899 98622621 102315508 105020261 106354559 106828992 107192369 108524317
4765A08524317K347131L200622N106988Q797697J3996945J6410076J2487254L138275
$$ 108524317 110871448 114072070 119179058 127976755 141973700 158383776 170871030 174009305
4757A74009305l497484m450064k859683m42635K067799N341245Q677539J1893433
$$ 174009305 170511821 166061757 163202074 162759439 164827238 170168483 178846022 190739455
4749A90739455J3173426J2941926J1563099Q154985L565825j334570o389230j0584375
$$ 190739455 203912881 216854807 228417906 236572891 240138716 238804146 232414916 221830541
4741B21830541j2462014j2387654j0645207q980831o708815l219449K261710P167018
$$ 221830541 209368527 196980873 186335666 177354835 170646020 167426571 169688281 176855299
4733A76855299P874658N78985p682341j0509954j0176837r027751p533895o039535
$$ 176855299 184729957 185308942 177626601 167116647 156939810 147912059 140378164 134338629
4725A34338629m371932k998707k028226j751797j433086j762849l260689m933943
$$ 134338629 129966697 126967990 124939764 123187967 121754881 119992032 116731343 111797400
4717A11797400o273013o722570o857787o482709n928185n271823m761175m457776
$$ 111797400 105524387 98801817 91944030 85461321 79533136 74261313 69500138 65042362
4709F5042362l897627l879072l212509k637480k230887j804400j455186j344633
$$ 65042362 61144735 57265663 54053154 51415674 49184787 47380387 45925201 44580568
4701D4580568j193252n77656m52548j86336m15437m75399r13850j555449j513312
$$ 44580568 43387316 42809660 42357112 42170776 41755339 41279940 40366090 38810641 37297329
4692C7297329j559238j137381j013454p24898q55316j292675j352465j258105
$$ 37297329 35738091 34600710 33587256 32862358 32007042 30714367 29361902 28103797
4684B8103797j622686j380776j040374q70865o90298m98851o75659n43074n48337
$$ 28103797 26481111 25100335 24059961 23189096 22498798 21999947 21324288 20781214 20232877
4675B0232877p30252o14198p33963q26088o00881p35870p27354l98339n76943
$$ 20232877 19502625 18888427 18154464 17328376 16727495 15991625 15264271 14865932 14288989
4666A4288989n44881l93925l24714m74617m25914l78736l26899m59724k38322
$$ 14288989 13744108 13350183 13025469 12550852 12124938 11746202 11419303 10959579 10721257
4657A0721257k43889m66979l61924k26286l23085k09201l28703j89395l45783
$$ 10721257 10477368 10010389 9648465 9422179 9099094 8889893 8561190 8371795 8026012
4648H026012l72131j53318j53256k89943k07687o1995j84807j23358j33643l21261
$$ 8026012 7653881 7500563 7347307 7057364 6849677 6787682 6602875 6479517 6345874 6024613
4638F024613r1260N8677j58638j66018n8738l0261j74249j47827j22172l5344
$$ 6024613 5933353 5992030 5833392 5667374 5608636 5578375 5404126 5256299 5134127 5098783
4628E098783j70540j90499L561j44916j16957j11223L9566k13290K0297j08646
$$ 5098783 4928243 4737744 4741305 4596389 4479432 4368209 4407775 4194485 4214782 4106136
4618D106136r3844l9485j45884l2988n1077j36700k0336J5043j36069o5521m2250
$$ 4106136 4012292 3972807 3826923 3793935 3742858 3606158 3585822 3600865 3464796 3399275 3357025
4607C357025O6537Q2538q6848n8430q6078j30125o5158k4736j19045j28034N4427
$$ 3357025 3423562 3506100 3419252 3360822 3274744 3144619 3079461 3054725 2935680 2807646 2862073
4596B862073k22011J24216j38252m7591j23520N2499o1975Q6671k38238J14564
$$ 2862073 2640062 2764278 2626026 2578435 2454915 2507414 2445439 2532110 2293872 2408436
4586B408436P755q8514j55943R0526q3900k4828O507J7062l482L951J3165k1881
$$ 2408436 2416191 2327677 2171734 2262260 2178360 2153532 2160039 2177101 2173619 2177570 2190735 2168854
4574B168854k69964J10446M381J7779j50362k020K3395r0028R0541k57371J59865
$$ 2168854 1898890 2009336 2013717 2031496 1881134 1879114 1902509 1812481 1903022 1645651 1805516
4563A805516j31979K02559j72379J0032j3319o0143O4531j97423J64916p7839
$$ 1805516 1673537 1876096 1703717 1713749 1700430 1640287 1704818 1507395 1672311 1594472
4553A594472Q7419p4993j42775K07089j69789J31113k4059J48136k47422K3271
$$ 1594472 1681891 1606898 1464123 1671212 1501423 1632536 1608477 1756613 1509191 1532462
4543A532462q627r5855K4687J13877q4973R374L8792J7559j08387m7905Q3490
$$ 1532462 1523835 1427980 1452667 1566544 1481571 1490945 1529737 1547296 1438909 1391004 1474494
4532A474494j3941r3723J61021p442k0409J52374L5906L6939M4541m1771q2185
$$ 1474494 1460553 1366830 1527851 1520409 1500000 1652374 1688280 1725219 1769760 1727989 1645804
4521A645804l2415J27669j13595o4383Q6657K5804j17730N5313O4654j50911j2507
$$ 1645804 1613389 1741058 1627463 1563080 1649737 1675541 1557811 1613124 1677778 1526867 1514360
4510A514360P6026j57702K3308J87152Q523L48L728O0392J43354O2741j02968
$$ 1514360 1590386 1432684 1455992 1643144 1651667 1652015 1655743 1716135 1859489 1922230 1819262
4499A819262j9898J5353k5851Q7547j28755M0780N5757q5673L579J8865N8561
$$ 1819262 1799364 1814717 1788866 1876413 1747658 1788438 1844195 1758522 1762101 1780966 1839527
4488A839527j60110J08118j80492L6525K0709l2938q447M5754J34798j6490J7209
$$ 1839527 1679417 1787535 1607043 1643568 1664277 1631339 1622892 1668646 1803444 1786954 1804163
4477A804163L6315m6266Q3805p7667m0110j07124N4677k3770j34423J27275j35774
$$ 1804163 1840478 1794212 1878017 1800350 1760240 1653116 1707793 1684023 1549600 1676875 1541101
4466A541101J08190L8190K5483R4587j65702Q1838j21797J09865o346J34435j22390
$$ 1541101 1649291 1687481 1712964 1807551 1641849 1723687 1601890 1711755 1705409 1839844 1717454
4455A717454p3873J21727l6749q093o0727J41718r8477q7116R2859J06054M9625
$$ 1717454 1643581 1765308 1728559 1720466 1659739 1801457 1702980 1615864 1708723 1814777 1864402
4444A864402k46919O7321M3714l029O0809j02105j27576J31393J04184n2484R677
$$ 1864402 1617483 1684804 1728518 1725489 1786298 1684193 1556617 1688010 1792194 1739710 1749387
4433A749387N8001P2920l5818l2049L0183R2370q7185J13639k977M7133J4946
$$ 1749387 1807388 1880308 1844490 1812441 1842624 1934994 1847809 1961448 1958471 2005604 2020550
4422B020550l3828p1403K00468K05763r591R4897l0819q1655P6667n9434R2865
$$ 2020550 1986722 1915319 2115787 2321550 2311959 2406856 2376037 2294382 2371049 2311615 2404480
4411B404480l0789K85552j51353K0375K0445J91774J09728N2073J23571M5208
$$ 2404480 2373691 2659243 2507890 2528265 2548710 2740484 2850212 2902285 3025856 3071064
4401C071064K05796P1158J59570J22185K50909J30623L08681L97563M02366N25902
$$ 3071064 3276860 3348018 3507588 3629773 3880682 4011305 4319986 4717549 5119915 5645817
4391E645817L91154P86068J040519J526813K142764L572545N922001P937534O780576
$$ 5645817 6036971 6823039 7863558 9390371 11533135 15105680 21027681 28965215 35745791
4382C5745791K79455l459486m422627m088280m039759l371920k729877j661260
$$ 35745791 36025246 32565760 28143133 24054853 20015094 16643174 13913297 12252037
4374A2252037j144389p63819l80385l28330K7157J65699N56734J137383J614638
$$ 12252037 11107648 10343829 9963444 9635114 9662271 9827970 10384704 11522087 13136725
4365A3136725K088509J633302M64188K01373P27964J428559K734117N600770J0722993
$$ 13136725 15225234 16858536 17322724 17524097 18252061 19680620 22414737 28015507 38738500
4356C8738500J5911950J5646791K342157q338460r330667q642007q416382p964162
$$ 38738500 54650450 70297241 72639398 64300938 54970271 46328264 37911882 29947720
4348B9947720n472321l962210k477396j986463j215722j014948n45991o0772N04962
$$ 29947720 24475399 20513189 18035793 16049330 14833608 13818660 13272669 13211897 13716859
4339A3716859J142184K284253L576745K603277l95719j482569j238497o88168
$$ 13716859 14859043 17143296 20720041 23323318 22927599 21445030 20206533 19518365
4331A9518365k28119J459569L659245O114646O954742K365393k914483m208927
$$ 19518365 19290246 20749815 24409060 30523706 37478448 39843841 36929358 32720431
4323C2720431l962457m454880m180295l208408k341493j666824j244871p39584
$$ 32720431 28757974 24303094 20122799 16914391 14572898 12906074 11661203 10921619
4315A0921619o67127l75866k65263K5500L85661Q41257J321498J092677q2063
$$ 10921619 10254492 9878626 9613363 9638863 10024524 10865781 12187279 13279956 13197893
4306A3197893q81222q02578q74530o86407p06988l62158p9319L9099L54027P09532
$$ 13197893 12316671 11514093 10639563 9953156 9246168 8884010 8804691 8843790 9197817 9907349
4296I907349J169037J104086L27489j69195K95024N16627N67725O77506Q82832
$$ 9907349 11076386 12180472 12507961 12338766 12633790 13150417 13718142 14395648 15278480
4287A5278480Q38228K43926m56857r96935j486204j336483j291219j113071r38401
$$ 15278480 16116708 16360634 15903777 14906842 13420638 12084155 10792936 9679865 8741464
4278H741464o08583p28231o17576k73520k99317k80952l38906n5115j70683n936
$$ 8741464 8132881 7404650 6787074 6513554 6214237 5933285 5594379 5539264 5368581 5362645
4268E362645L48523K50230q8207k05166m76621l91690k19940j42675k63448l14357
$$ 5362645 5711168 5961398 5873191 5668025 5191404 4799714 4579774 4437099 4173651 3859294
4258C859294j81620j15296K7306j47442N6967l52123j21423J04146q3732j47065
$$ 3859294 3677674 3562378 3589684 3442242 3499209 3147086 3025663 3129809 3046077 2899012
4248B899012p2849n7601j61421j08367M7525j22693j2453j72604J58024p0842
$$ 2899012 2826163 2768562 2607141 2498774 2546299 2423606 2411153 2238549 2396573 2325731
4238B325731j96767J9943j58576J46080j36400j2081j22270J6359k4240k7502
$$ 2325731 2128964 2148907 1990331 2136411 2000011 1987930 1865660 1882019 1857779 1830277
4228A830277j03595L1790r842m5921J2785q2749m1361q815q789j32765J03341
$$ 1830277 1726682 1758472 1748630 1702709 1715494 1632745 1591384 1582569 1573780 1441015 1544356
4217A544356k1112j01834p8735r0206J51598p4434R9538j40562P3816j60913N471
$$ 1544356 1523244 1421410 1342675 1252469 1404067 1329633 1429171 1288609 1362425 1201512 1206983
4206A206983M4894j49009J19715p3789J1470j04933J82071j92687n22K6407O9954
$$ 1206983 1251877 1102868 1222583 1148794 1160264 1055331 1237402 1044715 1044193 1070600 1140554
4195A140554n0596j01755N003l2820R054L5586j6953j36482J0660K5619j4257
$$ 1140554 1089958 988203 993206 960386 969440 1005026 988073 851591 862251 887870 873613
4184H73613L3729M0368q5251j28768J71422L6547j12092O2268K7663l1111j34916
$$ 873613 907342 947710 862459 733691 905113 941660 829568 891836 919499 888388 753472
4173G53472Q8853j00062P4855j05614M6886p0507J58763j01358j03417m5465J72123
$$ 753472 842325 742263 817118 711504 758390 687883 846646 745288 641871 596406 768529
4162G68529k2196m4664J31806j24595L2710j12456N7716o8344r1282R0582n2100
$$ 768529 746333 701669 833475 708880 741590 629134 686850 618506 527224 617806 565706
4151E65706L1040k8436N3204q6250O6703N0034P2288j61806K5272J4049j6426
$$ 565706 596746 568310 621514 535264 601967 652001 724289 562483 587755 601804 585378
4140E85378l8642J922K9835p6185Q1666o506p504N916R9649m7802P0625o6584
$$ 585378 546736 548658 578493 502308 583974 577468 569964 575880 675529 627727 698352 631768
4128F31768L8254L616j59624P2442r8573p835j33981R5106k2528J4445l6137n750
$$ 631768 670022 673638 514014 586456 487883 480048 346067 441173 418645 433090 396953 391203
4116C91203K05684j37456M4820o8177K00672j31255o0200K9316Q3557q6264l3632
$$ 391203 596887 459431 504251 436074 636746 505491 445291 474607 558164 471900 438268
4105D38268P0324R161J21102O0916P0311o8003p0623L4356j70532Q4839j14782
$$ 438268 508592 517753 638855 699771 770082 702079 631456 665812 495280 580119 465337
4094D65337O802r7838N0420O8489j577j16493l424K1472q090J64322p3108M685
$$ 465337 472139 374301 424721 493210 491633 375140 371716 393188 385098 549420 476312 480997
4082D80997q1383N0780r2546M1145L1265o5761M8687O2598K3279Q7676j17434
$$ 480997 399614 450394 357848 398993 430258 364497 413184 475782 499061 586737 469303
4071D69303J01480j37486J8474n1053N1797r8831Q1670Q3857m4547j63186L016
$$ 469303 570783 433297 451771 400718 452515 353684 435354 519211 474664 311478 314494
4060C14494P1329L1099j69621K16299R170J30999m0622k7291P9103j39597M6304
$$ 314494 385823 416922 247301 463600 472770 603769 563147 535856 614959 475362 521666
4049E21666r6585Q4920m2321J59354l029q4039k6039q0442O3746P4502K7321p1953
$$ 521666 425081 510001 467680 627034 624005 539966 513927 433485 497231 571733 599054 527101
4037E27101j72632J04639J05812O2537l1343N5582n6465M3575K6195R940m9977
$$ 527101 354469 459108 564920 627457 596114 651696 595231 638806 665001 674941 624964
4026F24964Q450M5782k653M0780K7563J23102r9984J63881k2009l953l8793J02535
$$ 624964 633414 679196 676543 717323 744886 867988 768004 931885 909876 905923 867130 969665
4014I69665M8173o8575N382R4055J01776r7446J5144n2758r3909K5647J37765
$$ 969665 1017838 949263 954645 1048700 1150476 1053030 1068174 1015416 921507 947154 1084919
4003A084919Q0841k1975K7795N6197K9369l7721J62191n584J63103P1478K1270
$$ 1084919 1165760 1143785 1171580 1227777 1257146 1219425 1381616 1376032 1539135 1610613 1631883
3992A631883K02193J56760P3612j3911j07562j99649O7725j51698q0245q9848
$$ 1631883 1834076 1990836 2064448 2050537 1942975 1743326 1811051 1659353 1579108 1489260
3982A489260j20121R1437l8155J33220m7974O5465r2171J51031J3957M99Q6958
$$ 1489260 1369139 1460576 1422421 1555641 1507667 1573132 1480961 1631992 1645949 1646448 1733406
3971A733406n8726J8983l3952J35068P0446j3278q1483J19772k23274j66205R0774
$$ 1733406 1674680 1693663 1659711 1794779 1865225 1851947 1770464 1890236 1666962 1500757 1591531
3960A591531r8445p390m8746j12048j05972J7724O5860q7184L3930L6610O0887
$$ 1591531 1493086 1485696 1436950 1324902 1218930 1236654 1302514 1215330 1249260 1285870 1346757
3949A346757q1832j3090o9683O2676j01665P1464j34799j24126o695M4557n6515
$$ 1346757 1264925 1251835 1182152 1244828 1143163 1214627 1079828 955702 949007 993564 937049
3938I37049j73187l7810q9510J33388r3594l0648m3766r9337j28887K22631M2410
$$ 937049 763862 726052 636542 769930 676336 645688 601922 502585 373698 596329 638739
3927F38739j47250O602P5594J6408j07977k2988m7332k7988J14451J3797q3432
$$ 638739 491489 498091 573685 590093 482116 459128 411796 383808 498259 512056 428624
3916D28624j99422J37297l3945R3299o8118n0060o7800J36091N2269o8704j45741
$$ 428624 229202 366499 332554 425853 357735 307675 239875 375966 428235 359531 213790
3905B13790Q7386Q5669j13027m8736Q8621j07749R708j20054O8576P1185l2037
$$ 213790 301176 386845 273818 225082 313703 205954 215662 95608 164184 235369 203332
3894B03332K9741r3318J29547k0126n7774P18m9957q317Q220j8136K4787l1616
$$ 203332 233073 139755 269302 249176 191402 192120 142163 133846 142066 123930 148717 117101
3882A17101j4961R01R6254j6079k5510o4181N5665r343j3133j45645J35528m2549
$$ 117101 102140 103041 199295 183216 157706 93525 149190 139847 126714 -18931 116597 74048
3870G4048J1892j965J9287j06266J8911J07922n4669M3189j33597J73718j17387
$$ 74048 85940 83975 103262 -3004 15907 123829 69160 112349 -21248 152470 35083
3859C5083l0883M3741K8012j3462j7537J7417r1897j2483J33587r8445J04181
$$ 35083 4200 47941 75953 62491 44954 62371 -29526 -42009 91578 -6867 97314
3848I7314q6021J08735j01067k4879j8490K2224L735l1705J04184m9182K761m6304
$$ 97314 11293 120028 18961 -5918 -24408 -2184 1551 -30154 74030 24848 27609 -18695
3836a8695j39790R7680P1574m2172o0047J09533m2953p1608P6400J0062q937j15416
$$ -18695 -158485 -60805 10769 -31403 -91450 18083 -24870 -96478 -20078 -10016 -18953 -134369
3824a34369J05853j00189N6549L9702k9427n058J8361J04724k1515j63282p0775
$$ -134369 -28516 -128705 -72156 -32454 -61881 -66939 -48578 56146 34631 -128651 -199426
3813a99426J42196j0592L2122m512j17866N3651Q0437k737j02828J51397j75208
$$ -199426 -57230 -67822 -35700 -40212 -158078 -104427 -23990 -26727 -129555 21842 -153366
3802a53366J6590J17522o5383r7012J10010o918K5330L3356n9850k0141o7618
$$ -153366 -136776 -19254 -84637 -181649 -71639 -78557 -53227 -19871 -79721 -99862 -167480
3791a67480n725m1817Q0871M4389N7022k7445j10978M1581N868M7122M8225k0599
$$ -167480 -173205 -215022 -134151 -89762 -32740 -60185 -171163 -129582 -123714 -76592 -28367 -48966
3779d8966q4871j1846j5575N8170J13873m9891j85126J33710P6527j99975J19162
$$ -48966 -133837 -145683 -161258 -103088 10785 -39106 -224232 -90522 -13995 -213970 -94808
3768i4808K1713k541q1050Q0814o3893K7472j0740k6574m364N5301p7723J11649
$$ -94808 -73095 -75636 -156686 -75872 -139765 -112293 -123033 -149607 -153971 -98670 -176393 -64744
3756f4744j11618N6271J6150l5729o9339J90542o9568r6853N1689p7304P1554
$$ -64744 -176362 -120091 -103941 -139670 -209009 -18467 -88035 -184888 -133199 -210503 -138949
3745a38949R3905m0857P086m0967j15746O2119J2838L9002R429R5489j78196R9548
$$ -138949 -45044 -85901 -78815 -119782 -235528 -173409 -160571 -121569 -112140 -16651 -194847 -95299
3733i5299L4475l9342m7023m012J7253J7762o370r780J8755O6820k5523o6180
$$ -95299 -60824 -100166 -147189 -151201 -133948 -116186 -122556 -132336 -113581 -46761 -72284 -138464
3721a38464M5716m2916N2854q0842R7702P7021k41302J38310j7994k9317K9671
$$ -138464 -92748 -135664 -82810 -163652 -65950 11071 -230231 -91921 -109915 -139232 -109561
3710a09561M6401k4022q8504J21517j2630j62846P5789J1917j1325k7034J22805
$$ -109561 -63160 -87182 -175686 -54169 -66799 -229645 -153856 -141939 -153264 -180298 -57493
3699e7493l3709k68986K36724P2475J0494j98656J02704L4394M954J60595j93612
$$ -57493 -91202 -360188 -123464 -50989 -40495 -239151 -136447 -102053 -97099 63496 -130116
3688a30116o420j55172K34965o1001M681m1081l7977R0068o7607J84160j89087
$$ -130116 -136536 -291708 -56743 -117744 -113063 -154144 -192121 -102053 -169660 14500 -174587
3677a74587J286r0591m3593J83516n2353J07738j17917N6073j9951l765r2334
$$ -174587 -173301 -263892 -307485 -123969 -176322 -68584 -186501 -130428 -150379 -154144 -246478
3666b46478Q6419K260m4187J01394n4234L3968m9000R7799m5150K732J21292q9317
$$ -246478 -160059 -157799 -201986 -100592 -154826 -120858 -169858 -72059 -117209 -114477 6815 -82502
3654h2502j0705j07314Q5031k4547n1313K9651M7323p4170R1049q3500L114r1041
$$ -82502 -93207 -200521 -115490 -140037 -191350 -161699 -114376 -188546 -97497 -180997 -177883 -268924
3642b68924P3284J09210j26696J06090j67364R3489J182Q2107n7753j07769M9503
$$ -268924 -195640 -86430 -213126 -107036 -274400 -180911 -179729 -97622 -155375 -263144 -213641
3631b13641J01042m266J091r745o0863m7465J55008k9720n0376k2750r0182R5821
$$ -213641 -112599 -116865 -115774 -125519 -186382 -233847 -78839 -108559 -158935 -181685 -271867 -176046
3619a76046Q4679q0512J6032p3710J48613l9485j130k4206j2808q9152M8953J08110
$$ -176046 -91367 -171879 -155847 -229557 -80944 -120429 -121559 -145765 -158573 -247725 -198772 -90662
3607i0662j14533R812L4705j5813N9235N6024N2842j36622J18807j24879j5769
$$ -90662 -205195 -195383 -160678 -176491 -117256 -61232 -8390 -145012 -26205 -151084 -166853
3596a66853K3069p005J14563n7784J6143q614n2731M6575J5430R791j32074K9906
$$ -166853 -143784 -150789 -36226 -94010 -77867 -86481 -139212 -92637 -77207 -67416 -199490 -169584
3584a69584K1292q152J1349q0202Q2725J42506j58521l7592R5764j21928j9521
$$ -169584 -148292 -156444 -145095 -225297 -142572 -66 -158587 -196179 -100415 -222343 -241864
3573b41864M3753J00172q2921p3654J32841J7781l0286M922J2568n2440J42272
$$ -241864 -198111 -97939 -180860 -254514 -121673 -103892 -134178 -129256 -116688 -169128 -26856
3562b6856l8900o2849p0461Q375J34984r9565M4530P130M2530j14517L5242p5567
$$ -26856 -65756 -128605 -199066 -190691 -55707 -155272 -110742 -103612 -61082 -175599 -140357 -215924
3550b15924N4961o0245l9310J20121o8576L6837p9267K27510m4208j10356P5455
$$ -215924 -160963 -221208 -260518 -140397 -208973 -172136 -251403 -23893 -68101 -178457 -103002
3539a03002l7105j06346N9325J00530j07059M7586k8822O29m5340R1428l7041
$$ -103002 -140107 -246453 -187128 -86598 -193657 -146071 -174893 -174264 -219604 -128176 -165217
3528a65217P7869q4128N1874o1695J4982N7905l886n9911n051J06965k3348j24894
$$ -165217 -87348 -171476 -119602 -181297 -166315 -108410 -112296 -172207 -177258 -70293 -93641 -218535
3516b18535J21880K4670p1563p3109R3547q8154R1136k6457m5922Q4517p7055
$$ -218535 -96655 -71985 -143548 -216657 -123110 -211264 -120128 -146585 -192507 -107990 -185045
3505a85045N4435O434j7372n4648O9096j08992J05758J02233j18528j371Q669
$$ -185045 -130610 -124176 -141548 -196196 -127100 -236092 -130334 -28101 -146629 -148000 -139331
3494a39331j0383k9822J1167j2770J34908m0997r4332o6668Q0623O9244Q626j06747
$$ -139331 -149714 -179536 -168369 -181139 -46231 -87228 -181560 -248228 -167605 -98361 -89735 -196482
3482a96482P3406L9828j3277q7295J34675l9759J8821p7149N5023n2962M8228
$$ -196482 -123076 -83248 -96525 -183820 -49145 -88904 -70083 -147232 -92209 -145171 -96943
3471i6943q3051J33991m2841o0474m1220P8256k5304L7721R9292j88610L783Q9623
$$ -96943 -179994 -46003 -88844 -149318 -190538 -112282 -137586 -99865 -573 -189183 -185400 -95777
3459i5777Q3717j40018J06616L2094k8056j16307M7269L1569n9505Q187K2801
$$ -95777 -12060 -152078 -45462 -13368 -41424 -157731 -110462 -78893 -138398 -130211 -107410
3448a07410k7700j470K8668N1633j6764K931k21R9651j43593M8651n2454J1361
$$ -107410 -135110 -136580 -107912 -56279 -73043 -70112 -70333 29318 -114275 -65624 -118078 -106717
3436a06717N2888m9459K00487j11553j31455L3413J22813p7452K2447J2617k2816
$$ -106717 -53829 -103288 97199 -14354 -145809 -112396 10417 -67035 -44588 -31971 -54787
3425e4787N6102l3183j38089P1850Q1742r0479Q0595O2234k1226n9280M1701R4365
$$ -54787 1315 -31868 -169957 -98107 -16365 -106844 -26249 35985 14759 -44521 -2820 91545
3413I1545q6098M6725p3634l973o104J10123n5825o1103o1084K18562N797p4444
$$ 91545 5447 52172 -21462 -25435 -31539 78584 22759 -38344 -99428 119134 124931 50487
3401E0487R8947n5150P2098J541l6413m6467J02128r3448l4583J29195K5581J0391
$$ 50487 149434 94284 166382 167923 131510 85043 187171 93723 59140 188335 213916 224307
3389B24307p7052J12144M0072j4368n7830L8862J39938R9370j14148L8086J22035
$$ 224307 147255 259399 299471 285103 227273 266135 406073 505443 391295 429381 551416
3378E51416n7322K04329J05444P4770K29698K45050P5637P5087J8608J72424J87062
$$ 551416 494094 698423 803867 878637 1108335 1353385 1429022 1504109 1522717 1695141 1882203
3367A882203O6487K22990M11545M45605Q93888J738315L065489M585860N569807
$$ 1882203 1948690 2171680 2583225 3028830 3922718 5661033 8726522 13312382 18882189
3358A8882189K242459k383936l367810k774377k685366k538093j895382j323990
$$ 18882189 21124648 18740712 15372902 12598525 9913159 7375066 5479684 4155694
3350D155694p82642p03304l48255l51152K3112k57854J73629k56826j45883k09682
$$ 4155694 3373052 2669748 2321493 1970341 1993453 1735599 1909228 1652402 1506519 1296837
3340A296837q8813n5519j68210J3518l7747j66511j64757K3779O9443j26928J1472
$$ 1296837 1208024 1152505 984295 997813 960066 793555 628798 652577 722020 595092 606564
3329F06564j52964r3074j6915J58860j09804q7484O4972J16361j10271n6541Q0842
$$ 606564 453600 360526 343611 502471 392667 305183 370155 486516 376245 319704 400546
3318D00546j72565M562r1141K57435j96432L5293L7947j66140J29808k1688K1694
$$ 400546 227981 232543 141402 398837 202405 237698 275645 109505 239313 217625 239319
3307B39319k3805j9854j38829L5357j9226j7903R7143n6128J0412J5126j9977
$$ 239319 215514 195660 56831 92188 72962 55059 152202 96074 106486 121612 101635
3296A01635o5712R4406J961q8610K2779j0411K7168k10493J27969K0099Q7092
$$ 101635 35923 130329 132290 43680 66459 56048 83216 -127277 692 20791 107883
3285A07883o0728j4020j4649j1978q9013J02869J18685q1838k0386j59058Q0709
$$ 107883 47155 33135 18486 6508 -82505 20364 139049 57211 36825 -122233 -41524
3274d1524j7974j9703j33852J17114L7184n252p9509K2350k5626N3540M0566N717
$$ -41524 -59498 -79201 -213053 -95939 -58755 -64007 -143516 -121166 -146792 -93252 -52686 -46969
3262d6969Q384K8921j31831R8529p2963J18382j02145k1813r0446K07856k9859
$$ -46969 -38585 -9664 -141495 -42966 -115929 2453 -99692 -121505 -211951 -4095 -33954
3251c3954j50226J21353L4634L4776j34019O7247q1183M4022m543L0270K3201
$$ -33954 -184180 -62827 -28193 6583 -127436 -60189 -141372 -97350 -101893 -71623 -48422
3240d8422m0071j41509m8187K6218M8902Q9323N1802p6758m2395M9194j13027
$$ -48422 -88493 -230002 -278189 -251971 -203069 -113746 -61944 -138702 -181097 -131903 -244930
3229b44930Q6570J48834j42071p0627R316J66386j45020L0419n635N1156l7094
$$ -244930 -158360 -9526 -151597 -222224 -212908 -46522 -191542 -161123 -166758 -115602 -152696
3218a52696p8100K3252O767R5781m8852n0464l0362K06139j37039o2167J50620
$$ -152696 -230796 -207544 -200777 -104996 -153848 -204312 -234674 -28535 -165574 -227741 -77121
3207g7121K4110p5882M781o4294R8976K1082Q83k37692J94688J27829j81783o2247
$$ -77121 -53011 -128893 -124112 -188406 -89430 -68348 -67465 -305157 -110469 17360 -164423 -226670
3195b26670P4132P4648q0901j12112K15814j43015Q6242p4572K033q763k8370
$$ -226670 -152538 -77890 -158791 -270903 -55089 -198104 -111862 -186434 -184401 -193164 -221534
3184b21534R1857j50609K16077j11969m437j7788M363J01252m814j3988k13098
$$ -221534 -129677 -280286 -64209 -176178 -180615 -198403 -194040 -92788 -97602 -111590 -324688
3173c24688J59397K3593n3439M5535J5172J02158j68666Q9892n4796R053J8540
$$ -324688 -165291 -141698 -195137 -149602 -134430 -32272 -200938 -111046 -165842 -156789 -138249
3162a38249p8113J8057k1905P8877L1048j90956K53229l8113m9768p7496r0749
$$ -138249 -216362 -198305 -220210 -141333 -110285 -301241 -48012 -86125 -135893 -213389 -304138
3151c04138J36582K1742J4676p6616L4221M6455o6220O1896o4291k8790o9971
$$ -304138 -167556 -145814 -131138 -207754 -173533 -127078 -193298 -131402 -195693 -224483 -294454
3140b94454J35795l6742Q2913k1002j9343p3163k5065J14979L884j49809M5436
$$ -294454 -158659 -195401 -112488 -133490 -152833 -225996 -251061 -136082 -132198 -282007 -236571
3129b36571L1178K0706J05303j2854m8237J00512N3343j24335j6192l4592k9919
$$ -236571 -205393 -184687 -79384 -92238 -140475 -39963 13380 -110955 -127147 -161739 -191658
3118a91658N2547l2676N8430o8283J5324k2213j69560K05472k0528p569j18524
$$ -191658 -139111 -171787 -113357 -181640 -166316 -188529 -358089 -152617 -173145 -180714 -299238
3107b99238J94004M027r9421j9663J16346m4477l1266m2390k6292n8204K50743
$$ -299238 -105234 -101207 -200628 -220291 -103945 -148422 -179688 -222078 -248370 -306574 -55831
3096e5831n7106j59084R0371j3649n7426K9163M1765O1682j28786J21489J8291
$$ -55831 -112937 -272021 -181650 -195299 -252725 -223562 -181797 -120115 -248901 -127412 -109121
3085a09121r3194j0157J95955l159j89173j3025K0669l3903q665J17074n6023
$$ -109121 -202315 -212472 -16517 -19676 -208849 -221874 -201205 -235108 -243773 -126699 -182722
3074a82722L5173k2677o2835K9821j0987r904Q7120j7382n5584N6335J16126j37462
$$ -182722 -147549 -170226 -233061 -203240 -214227 -224131 -137011 -154393 -209977 -153642 -37516 -174978
3062a74978l5453L9908n6956J26649n7084r7997K8278m7122N0624Q8453L4578
$$ -174978 -210431 -170523 -227479 -100830 -157914 -255911 -227633 -274755 -224131 -135678 -101100
3051a01100J630j28601L0324k5335P0237m035N0129r4853M7976N1436j4723k8534
$$ -101100 -99470 -228071 -197747 -223082 -152845 -156880 -106751 -201604 -153628 -102192 -116915 -145449
3039a45449r4052J25169j82582M2922L0265J34305j36465O4188L1189o2594l0162
$$ -145449 -239501 -114332 -296914 -253992 -223727 -89422 -225887 -161699 -130510 -193104 -223266
3028b23266R3007o6184K6407o6157j2222R3051J00469j22838K9937r1496l8108
$$ -223266 -130259 -196443 -170036 -236193 -248415 -155364 -54895 -177733 -147796 -239292 -277400
3017b77400P6239J04125p3765K065k5828j2098J9040k8737L6635m9455l2765k6799
$$ -277400 -201161 -97036 -170801 -168736 -194564 -206662 -187622 -216359 -179724 -229179 -261944 -288743
3005b88743J71140q6644l1205K4078J14455j5014p7416o231J7606O0287p1486
$$ -288743 -117603 -204247 -235452 -211374 -96919 -111933 -189349 -195580 -177974 -117687 -189173
2994a89173J3650m1803J01026l2330j19862m1871J14036K2335n4702R9826R13
$$ -189173 -175523 -217326 -116300 -148630 -268492 -310363 -196327 -173992 -228694 -128868 -127955
2983a27955j0094q9493m2718J37524q0108M0981j01564P2965M5848L6508j36609
$$ -127955 -138049 -227542 -270260 -132736 -212844 -171863 -273427 -200462 -154614 -118106 -254715
2972b54715K2756Q6290J3568n055j31410N3598N9170n9850j9127J04903N1700
$$ -254715 -231959 -145669 -132101 -137156 -268566 -214968 -155798 -215648 -234775 -129872 -78172
2961g8172j06727m2528J6098L1832k3664J092K2181p5338Q4864m8195j9268j4337
$$ -78172 -184899 -227427 -211329 -179497 -203161 -202069 -179888 -255226 -170362 -218557 -237825 -252162
2949b52162K20291j11559k09210J35689l0056P4905r0388O1617r851J51511j43026
$$ -252162 -31871 -143430 -352640 -216951 -247007 -172102 -262490 -200873 -210724 -59213 -202239
2938b02239L3484r3689P8479O4967p9966m3711R0094Q303q7730J6350Q3372j43677
$$ -202239 -168755 -262444 -183965 -118998 -198964 -242675 -152581 -144278 -232008 -215658 -132286 -275963
2926b75963M6049k8343N0958k1383N6030r386L7274k3732J21479k07688m8169
$$ -275963 -229914 -258257 -207299 -228682 -172652 -182038 -144764 -168496 -47017 -254705 -302874
2915c02874J49030j3743K031j51854K11889j74694Q9315n8278Q6625k8638O827
$$ -302874 -153844 -167587 -165556 -317410 -105521 -280215 -190900 -249178 -162553 -191191 -184364
2904a84364L3096k7104o7946j032N3513k6583M3093L8306j24878M4508O9197O4250
$$ -184364 -151268 -178372 -246318 -247350 -193837 -220420 -177327 -139021 -263899 -219391 -150194 -85944
2892h5944j67200L8269j0389Q9634o1832M1475k8342l8712L5654O2927L5609m2673
$$ -85944 -253144 -214875 -225264 -135630 -197462 -155987 -184329 -223041 -187387 -124460 -88851 -131524
2880a31524j7380m7628K1286m0573M6687q3830q695R1499p4337O0969o9903R4317
$$ -131524 -148904 -196532 -175246 -215819 -169132 -252962 -261657 -170158 -244495 -183526 -253429 -159112
2868a59112m0091O6504r0780M9271P5726j68811J34447j36005R1772M9869l881
$$ -159112 -199203 -132699 -223479 -174208 -98482 -267293 -132846 -268851 -177079 -127210 -131091
2857a31091n8156j17855J04429L0118Q247r1439J78496N340l1108R715j42305
$$ -131091 -189247 -307102 -202673 -172555 -164308 -255747 -77251 -71911 -103019 -93304 -235609
2846b35609O1441j00809O9756j24199K11862K7005o3827l1325M7525m1809m3251
$$ -235609 -174168 -274977 -205221 -329420 -117558 -90553 -154380 -185705 -138180 -179989 -223240
2835b23240N4652o2146q5371R3357K6622n6328J25564J131n2504j0783M6078M895
$$ -223240 -168588 -230734 -316105 -222748 -196126 -252454 -126890 -125759 -178263 -189046 -142968 -138073
2823a38073m2300m771O5353j5705r4208j434M3877J3402N0166o8134j1517N857
$$ -138073 -180373 -185144 -119791 -135496 -229704 -231138 -187261 -173859 -123693 -191827 -203344 -197487
2811a97487k7335n226J009K2439j25778J51740J7397n5808J01642n3274p9062
$$ -197487 -224822 -230048 -229039 -206600 -332378 -180638 -163241 -219049 -117407 -170681 -249743
2800b49743p6715N9019P2368K7972J32986j44712O446m1213P0897n7651n6581
$$ -249743 -326458 -267439 -195071 -167099 -34113 -178825 -172379 -213592 -142695 -200346 -256927
2789b56927J19380j24639R7272K0588L3971j05244K5507R9544j37605L3116q0227
$$ -256927 -137547 -262186 -164914 -144326 -110355 -215599 -190092 -90548 -228153 -195037 -275264
2778b75264J79320j09859P6168j61575J28159j26492J51580J4064q2480J37173
$$ -275264 -95944 -205803 -129635 -291210 -163051 -289543 -137963 -123899 -206379 -69206
2768f9206j15384N955j08440L21615k85677M3392q6390J08153K8040j1340l6068
$$ -69206 -184590 -178635 -287075 34540 -251137 -207745 -294135 -185982 -157942 -169282 -205350
2757b05350K8814M108l9646k352l2095Q198l1086N2610J09733l7091j24267L7920
$$ -205350 -176536 -172428 -212074 -214426 -246521 -238323 -269409 -216799 -107066 -144157 -268424 -230504
2745b30504j4871Q196J42383n7350K4757m6540M8006j32083K8334L63P4033l8391
$$ -230504 -245375 -237179 -94796 -152146 -127389 -173929 -125923 -258006 -229672 -229309 -155276 -193667
2733a93667J4291m4470P311J4238n2453o6720R5154J04536n1626p084l892l1535
$$ -193667 -179376 -223846 -216535 -202297 -254750 -321470 -226316 -121780 -173406 -180490 -184382 -215917
2721b15917m5753Q5349N7507l7478J0621o8541J69O106J04302p6499r3367J20328
$$ -215917 -261670 -176321 -118814 -156292 -145671 -214212 -214043 -207937 -103635 -180134 -273501 -153173
2709a53173j39009J89058j2800O5092k24150K32815m3918j67834l511N8790N1249
$$ -153173 -292182 -103124 -115924 -50832 -274982 -42167 -86085 -253919 -257430 -198640 -147391
2698a47391o2906q962j05830P9815N3096J4459K0109j26067J40966L5703L0605
$$ -147391 -210297 -219259 -325089 -245274 -192178 -177719 -157610 -283677 -142711 -107008 -76403
2687g6403j37014N6063j72271O7344P7045R573j2587n1511j1008O3888R2406j56022
$$ -76403 -213417 -157354 -329625 -262281 -185236 -175663 -188250 -239761 -250769 -186881 -94475 -250497
2675b50497R8702n7162M2474q3528N2789O2552q6771q2897r7687K27470N307J1654
$$ -250497 -151795 -208957 -166483 -250011 -197222 -134670 -221441 -304338 -402025 -174555 -169248 -157594
$$ [...]
##END NTUPLES=NMR SPECTRUM
##END=
