##TITLE=abcd
##JCAMPDX= 6.0         $$ Bruker NMR JCAMP-DX V2.0
##DATA TYPE= NMR SPECTRUM
##DATA CLASS= NTUPLES
##ORIGIN= UXNMR, Bruker Analytische Messtechnik GmbH
##OWNER= root
$$ XWIN-NMR		Version 3.5
$$ Fri Aug  7 17:47:58 2026 Russian Standard Time (UT+4h)  servis@DPX200
##.OBSERVE FREQUENCY= 200.131235884673
##.OBSERVE NUCLEUS= ^1H
##.ACQUISITION MODE= SIMULTANEOUS
##.ACQUISITION SCHEME= undefined
##.AVERAGES= 32
##.DIGITISER RES= 18
##SPECTROMETER/DATA SYSTEM= spect
##.PULSE SEQUENCE= zg
##.SOLVENT NAME= CDCl3
##.SHIFT REFERENCE= (INTERNAL, CDCl3, 0, 16.4885)
##AUDIT TRAIL= $$ (NUMBER, WHEN, WHO, WHERE, WHAT)
$$ ##TITLE= Audit trail, XWIN-NMR		Version 3.5
$$ ##JCAMPDX= 5.01
$$ ##ORIGIN= Bruker BioSpin GmbH
$$ ##OWNER= servis
$$ F:\spectra/data/av/nmr/H1/1/pdata/1/auditp.txt
$$ ##AUDIT TRAIL=  $$ (NUMBER, WHEN, WHO, WHERE, WHAT)
(   1,<2026-08-07 17:44:54.65 +0400>,<servis>,<DPX200>,
      <created by zg, POWCHK disabled, PULCHK disabled
       configuration hash MD5:
       00 E9 B6 7A A2 85 ED C7 34 08 36 98 17 FE 4E 26
       data hash MD5: 32K
       11 03 88 95 1A 7B 27 E0 23 76 34 7E 11 72 9E DE>)
(   2,<2026-08-07 17:47:37.15 +0400>,<servis>,<DPX200>,
      <Start of raw data processing
       efp BC_mod = 2 LB = 0.05 FT_mod = 6 PKNL = 1 PHC0 = -413.9518 PHC1 = 3.101563 SI = 16K 
       data hash MD5: 16K
       80 75 EE 6F 48 91 C1 F6 7D 79 CE BE 67 D0 1C 71>)
$$ ##END=
$$ 
$$ hash MD5
$$ 1C EA B6 F6 16 FB A0 85 D3 27 28 B6 8F 1E 02 F3
##$RELAX= 
##$RELAX= 
##$RELAX= 
##$RELAX= 
##$RELAX= 
##$RELAX= 
##$RELAX= 
##$RELAX= 
$$ Bruker specific parameters
$$ --------------------------
##$DU= <F:\spectra>
##$EXPNO= 1
##$NAME= <H1>
##$PROCNO= 1
##$TYPE= <nmr>
##$USER= <av>
##$AMP= (0..31)
100 100 100 100 100 100 100 100 100 100 100 100 100 100 100 100 100 100 
100 100 100 100 100 100 100 100 100 100 100 100 100 100 
##$AQSEQ= 0
##$AQ_mod= 1
##$AUNM= <au_zg>
##$AUTOPOS= <>
##$BF1= 200.13
##$BF2= 200.13
##$BF3= 200.13
##$BF4= 200.13
##$BF5= 500.13
##$BF6= 500.13
##$BF7= 500.13
##$BF8= 500.13
##$BYTORDA= 1
##$CFDGTYP= 0
##$CFRGTYP= 5
##$CHEMSTR= <none>
##$CNST= (0..31)
1 1 145 1 1 1 1 1 1 1 1 1 1 1 1 1 1 1 1 1 1 1 1 1 1 1 1 1 1 1 1 1 
##$CPDPRG= <>
##$CPDPRG1= <>
##$CPDPRG2= <>
##$CPDPRG3= <>
##$CPDPRG4= <mlev>
##$CPDPRG5= <mlev>
##$CPDPRG6= <mlev>
##$CPDPRG7= <mlev>
##$CPDPRG8= <mlev>
##$CPDPRGB= <>
##$CPDPRGT= <>
##$D= (0..31)
0 2 0 0 0 0 0 0 0 0.06 0 0 0 0 0 0 0.0002 0 0 0 0 0 0 0 0 0 0 0 0 0 0 
0 
##$DATE= 1786110294
##$DBL= (0..7)
120 120 120 120 120 120 120 120 
##$DBP= (0..7)
150 150 150 150 150 150 150 150 
##$DBP07= 0
##$DBPNAM0= <>
##$DBPNAM1= <>
##$DBPNAM2= <>
##$DBPNAM3= <>
##$DBPNAM4= <>
##$DBPNAM5= <>
##$DBPNAM6= <>
##$DBPNAM7= <>
##$DBPOAL= (0..7)
0.5 0.5 0.5 0.5 0.5 0.5 0.5 0.5 
##$DBPOFFS= (0..7)
0 0 0 0 0 0 0 0 
##$DE= 6
##$DECBNUC= <off>
##$DECIM= 32
##$DECNUC= <off>
##$DECSTAT= 4
##$DIGMOD= 1
##$DIGTYP= 9
##$DL= (0..7)
0 120 120 120 120 120 120 120 
##$DP= (0..7)
150 150 150 150 150 150 150 150 
##$DP07= 0
##$DPNAME0= <>
$$ [...]
##$SUBNAM4= <"">
##$SUBNAM5= <"">
##$SUBNAM6= <"">
##$SUBNAM7= <"">
##$SUBNAM8= <"">
##$SUBNAM9= <"">
##$SW= 20.6817932712277
##$SWIBOX= (0..15)
0 0 3 0 0 0 0 0 0 0 0 0 0 0 0 0 
##$SW_h= 4139.07284768212
##$TD= 32768
##$TD0= 1
##$TE= 0
##$TE2= 300
##$TE3= 300
##$TEG= 300
##$TL= (0..7)
0 120 120 120 120 120 120 120 
##$TP= (0..7)
150 150 150 150 150 150 150 150 
##$TP07= 0
##$TPNAME0= <>
##$TPNAME1= <>
##$TPNAME2= <>
##$TPNAME3= <>
##$TPNAME4= <>
##$TPNAME5= <>
##$TPNAME6= <>
##$TPNAME7= <>
##$TPOAL= (0..7)
0.5 0.5 0.5 0.5 0.5 0.5 0.5 0.5 
##$TPOFFS= (0..7)
0 0 0 0 0 0 0 0 
##$TUNHIN= 0
##$TUNHOUT= 0
##$TUNXOUT= 0
##$USERA1= <user>
##$USERA2= <user>
##$USERA3= <user>
##$USERA4= <user>
##$USERA5= <user>
##$V9= 5
##$VALIST= <valist>
##$VCLIST= <CCCCCCCCCCCCCCC>
##$VD= 0
##$VDLIST= <DDDDDDDDDDDDDDD>
##$VPLIST= <PPPPPPPPPPPPPPP>
##$VTLIST= <TTTTTTTTTTTTTTT>
##$WBST= 1024
##$WBSW= 30
##$XGAIN= (0..3)
0 0 0 0 
##$XL= 0
##$YL= 0
##$YMAX_a= 120387
##$YMIN_a= -181352
##$ZGOPTNS= <>
##$ZL1= 120
##$ZL2= 120
##$ZL3= 120
##$ZL4= 120
##$ABSF1= 0
##$ABSF2= 0
##$ABSG= 0
##$ABSL= 0
##$ALPHA= 0
##$AQORDER= 0
##$ASSFAC= 0
##$ASSFACI= 0
##$ASSFACX= 0
##$ASSWID= 0
##$AUNMP= <proc_1d>
##$AZFE= 0.1
##$AZFW= 0.1
##$BCFW= 0
##$BC_mod= 2
##$BYTORDP= 0
##$COROFFS= 0
##$CY= 18.4799938201904
##$DATMOD= 1
##$DC= 0
##$DFILT= <>
##$DTYPP= 0
##$F1P= 9.9274215381318
##$F2P= -0.165520771350173
##$FCOR= 1
##$FTSIZE= 16384
##$FT_mod= 6
##$GAMMA= 0
##$GB= 0
##$INTBC= 1
##$INTSCL= 4.127829e-11
##$ISEN= 128
##$LB= 0.05
##$LEV0= 0
##$LPBIN= 0
##$MAXI= 10000
##$MC2= 0
##$MEAN= 0
##$ME_mod= 0
##$MI= 50
##$NCOEF= 0
##$NC_proc= -7
##$NLEV= 6
##$NOISF1= 3.799351
##$NOISF2= 2.8
##$NSP= 0
##$NTH_PI= 0
##$NZP= 0
##$OFFSET= 16.48848
##$PC= 4
##$PHC0= -413.9518
##$PHC1= 3.101563
##$PH_mod= 1
##$PKNL= yes
##$PPARMOD= 0
##$PSCAL= 4
##$PSIGN= 0
##$REVERSE= no
##$SF= 200.130005582386
##$SI= 16384
##$SIGF1= 3
##$SIGF2= 2
##$SINO= 400
##$SIOLD= 16384
##$SREGLST= <1H.CDCl3>
##$SSB= 0
##$STSI= 16384
##$STSR= 0
##$SW_p= 4139.07284768211
##$SYMM= 0
##$S_DEV= 0
##$TDeff= 32768
##$TDoff= 0
##$TI= <>
##$TILT= no
##$TM1= 0
##$TM2= 0
##$TOPLEV= 0
##$USERP1= <user>
##$USERP2= <user>
##$USERP3= <user>
##$USERP4= <user>
##$USERP5= <user>
##$WDW= 1
##$XDIM= 16384
##$YMAX_p= 521050488
##$YMIN_p= -1272654
$$ End of Bruker specific parameters
$$ ---------------------------------
##NTUPLES= NMR SPECTRUM
##VAR_NAME=  FREQUENCY,     SPECTRUM/REAL,   SPECTRUM/IMAG
##SYMBOL=    X,             R,               I
##VAR_TYPE=  INDEPENDENT,   DEPENDENT,       DEPENDENT
##VAR_FORM=  AFFN,          ASDF,            ASDF
##VAR_DIM=   16384,         16384,           16384
##UNITS=     HZ,            ARBITRARY UNITS, ARBITRARY UNITS
##FACTOR=    0.252644378177508, 1,           1
##FIRST=     3299.83951724647, 0,            0
##LAST=      -839.233330435636, 0,           0
##MIN=       -839.233330435636, -1272654,    0
##MAX=       3299.83951724647, 521050488,    0
$$ Real data points
##PAGE= N=1
##DATA TABLE= (X++(R..R)), XYDATA
$$ [...]
9757 403958 191925 468320 -203081 155348 307061 366133 417691 412818 458585 -217322 -102328
9746 -102328 -527648 204036 256298 -316770 -73007 146297 401582 103684 -87093 -269470
9736 -269470 319969 220138 220111 118338 176541 332496 831975 579211 279548 -137138 234052
9725 234052 308130 -179435 -227937 393692 351926 296947 803128 869846 383376 499038 109221
9714 109221 23820 -19049 592462 -249081 218832 224475 210096 913478 -653484 -105110
9704 -105110 167350 120187 7712 319862 366711 597057 355853 318412 262155 -296509
9694 -296509 -109077 -83777 -296458 322323 728323 501120 112298 162307 831722 264065
9684 264065 283475 -238528 449795 66822 477806 330705 -113654 237285 -274760 165116
9674 165116 89723 -115824 -160405 -141674 436243 350465 406179 518495 59170 -88235 -137973
9663 -137973 -11699 428224 -504389 -144656 -127 255234 -175490 -309477 -436491 -151594
9653 -151594 312518 564035 40910 -215690 497171 795600 428816 576920 -103089 90767
9643 90767 257548 472360 112971 -151765 472873 20985 194043 918620 169322 671983
9633 671983 223841 536671 832644 217679 416929 117984 171352 52820 541293 718948
9623 718948 20037 42606 -91310 183969 -3956 11262 -232082 406943 182053 413307
9613 413307 323506 119333 14850 -875 276835 -100356 -291275 10404 -420303 234765
9603 234765 -91478 -18339 -41770 296039 374225 195324 450083 -16555 33463 604625
9593 604625 367036 231606 -53234 288887 317113 521501 151615 270749 132204 -419602
9583 -419602 -116492 329201 268063 530813 303761 261621 660365 305878 379680 -689383
9573 -689383 -54212 107790 169940 -210165 -380329 31056 -183168 367454 696631 341552
9563 341552 41796 375304 374028 588973 -9142 831594 92008 444240 773490 731534
9553 731534 -117629 -459765 345429 712406 519059 421641 -99750 780687 269532 1035079
9543 1035079 137774 137516 15928 212278 434620 260305 471581 420104 -51466 105006
9533 105006 67338 -317831 -134276 171901 -34762 28999 434517 45961 -393367 17994
9523 17994 59364 -17232 -341819 -278909 39757 231662 57362 -314767 667446 135532
9513 135532 665667 362813 314712 780578 -116168 276615 425201 959472 605544 391579
9503 391579 -60162 715882 14220 140915 46372 203302 177361 211084 502206 533725
9493 533725 -32975 282037 -291503 552784 -162726 -67287 262831 141708 276433 178259
9483 178259 594303 435197 199653 171483 306909 371260 14126 203017 596529 497563
9473 497563 722679 877870 -61862 204091 91787 624388 248620 191231 30692 112878
9463 112878 872193 319115 574644 -241189 -225372 -207197 -4076 437044 260427 -89888
9453 -89888 63742 284134 -27411 -249186 42510 273770 -173897 -360688 -207804 301123
9443 301123 -76135 112009 476188 122721 636654 295541 64668 498588 418661 175728
9433 175728 202952 394152 253601 -258210 315094 215826 374367 -172890 -329196 -98680
9423 -98680 -38013 201076 85285 660880 248235 25733 263969 305142 143608 -10732
9413 -10732 -207178 417330 -394547 442006 232960 -162862 222680 202512 277083 351338
9403 351338 332963 382100 348692 425503 144569 550458 586905 107752 -211961 -113202 625122
9392 625122 87079 91237 506042 509739 402217 -138964 289294 -163678 669177 430491
9382 430491 6515 261267 -81643 260167 200531 445883 -22677 250122 324681 232161
9372 232161 -201124 -208116 -60261 354871 -160041 36806 362893 386317 211617 126939
9362 126939 220120 457130 -21971 -266138 309892 -25842 85500 259862 -23980 597033
9352 597033 445752 949652 269433 93684 294688 484412 293879 340116 379044 312571
9342 312571 102308 -122952 462036 369622 297304 -413081 -68303 -5957 484885 -391013
9332 -391013 -26771 219121 81110 211872 100925 -88046 305399 363282 3989 276138
9322 276138 601085 -160961 215374 274613 461555 303310 63283 -245527 563530 153018
9312 153018 251965 331604 -53972 181572 132987 652822 105944 226432 -20848 401032
9302 401032 522591 231121 240562 537097 -23639 744259 352148 556875 614 136803
9292 136803 670557 736196 499257 321366 122949 159824 -27234 172649 -287731 -103029
9282 -103029 394574 -62729 76977 305738 -43069 89241 161238 667431 134845 133168
9272 133168 67250 486394 374263 592156 734398 558447 427179 434259 798727 -196227
9262 -196227 115482 489899 160938 511396 319228 17176 502883 489547 95937 324086
9252 324086 171115 -17928 372079 277838 779036 422165 19699 -8418 537403 384730
9242 384730 332389 108535 149265 -44853 714775 494403 101437 105471 308741 771126
9232 771126 444643 522772 311871 388566 132321 366610 557628 -58485 603398 -31757
9222 -31757 -129062 433399 314238 471429 357258 214945 702801 963991 779773 672024
9212 672024 645668 855363 515637 728015 475898 911295 516156 307687 605291 224665
9202 224665 1011127 292926 351945 752725 983713 641770 628308 830716 1007256 774207
9192 774207 354543 489427 476075 819616 795354 763089 616227 436867 176773 511337
9182 511337 668726 388345 563170 578979 493471 863524 530254 571048 151357 391790
9172 391790 594455 730273 198082 897668 561251 652432 659647 443783 729320 660855
9162 660855 656229 480413 470483 991243 513594 535636 681218 423392 1033242 884707 861965
9151 861965 963734 911656 884026 1300400 910861 751806 1144854 863833 962595 1304852
9141 1304852 878868 1230319 951155 1123425 1098497 1254130 1402419 1356415 1575324 1441563
9131 1441563 1398557 1678848 1346103 1762780 1646171 1579983 1357748 1937464 1539599 1646838
9121 1646838 1700457 1598653 1770292 1662645 1829659 2156082 2131776 2079130 2128429 2215893
9111 2215893 2428546 2372320 3010914 2819233 3488619 3760492 3668350 3804790 4044725 4526221
9101 4526221 4991705 5502092 6062938 6019250 6529717 6544972 7113533 7656161 9143529 11500270
9091 11500270 15520980 22620956 32845790 44352146 59018145 69326412 68683601 64783158
9083 64783158 54677697 42513712 28750564 19691174 15393427 11692094 10426768 8990878
9075 8990878 7633301 6123312 5097587 5272234 4957141 4579601 4283304 3847743 3297121
9066 3297121 3132784 3108847 3266964 2813469 2567768 2500917 2374757 2545521 2650429 2208702
9056 2208702 1850613 1918748 2022198 2352758 1960722 1807843 1703255 1835875 2304330 1366476
9046 1366476 1500106 1886934 1908485 2079796 1368410 1212432 847624 1342601 1081190 1425431
9036 1425431 1366142 1254513 757005 1521879 1470466 1298050 659465 1164016 1170840 1461964
9026 1461964 1210478 1346481 1004354 1014336 873428 851639 569502 612170 241141 788928
9016 788928 657164 863251 849125 697599 882989 604917 659893 677353 -107773 249945
9006 249945 126733 978419 264382 587029 549757 652948 626944 687129 1116057 753279
8996 753279 636887 774817 854094 1004237 461562 605798 335434 274208 101640 586581
8986 586581 150457 425495 928875 799635 320324 548581 397078 642197 511025 643509
8976 643509 700067 540817 239429 428593 490644 701059 630209 518632 262821 630675
8966 630675 540477 245221 564760 430714 587120 682898 504977 511997 711275 449554
8956 449554 362815 429846 248777 185407 756129 520150 541025 393789 465448 478523 94460
8945 94460 143203 473888 476318 57005 275198 553380 -117428 602983 591516 -211356 51816
8934 51816 388259 192516 153166 681761 966477 519517 341849 270528 56642 -735
8924 -735 292198 871267 627755 569482 608679 395321 262845 269564 58889 435912 267547
8913 267547 954722 582459 529622 124319 883530 127420 186154 273723 52623 178964
8903 178964 -61948 466808 40808 301964 319424 362164 296291 533573 610353 392143
8893 392143 493014 185864 492102 477071 812229 646877 -155156 76417 84288 127198
8883 127198 166825 26661 198568 138220 379266 58802 173619 232729 -265572 108368
8873 108368 490917 -253257 305787 -23879 -340134 -265642 212465 -62569 137435 793465
8863 793465 203600 542708 109834 359012 903017 513181 414851 223060 -329991 134489
8853 134489 54929 34596 -464225 -688085 188885 140634 244921 -75969 6578 57352 269484
8842 269484 119284 677745 113687 6571 422458 191189 247992 252615 -55662 44207
8832 44207 309061 496578 816899 600545 667275 758971 624935 528565 233775 348536
8822 348536 -100138 457713 149721 137322 53549 30491 568760 -53647 15710 64466 79084
8811 79084 256592 -116194 137211 490832 343889 80063 -164709 155399 196194 353401
8801 353401 222242 -308 -14216 -503062 -228526 -36470 298781 184733 -7952 168220
8791 168220 551527 487053 400772 536325 -190635 -228440 9874 395390 258367 562100
8781 562100 441000 97641 261104 60263 97527 214077 178871 352285 -73630 333827
8771 333827 37095 -95024 -203148 179195 76072 -51552 -238565 51872 -167827 175053
8761 175053 -14932 -113797 143821 104632 266387 680251 506282 498506 69171 546266
8751 546266 410843 330782 165844 361380 194148 429258 366610 -117492 311319 307563
8741 307563 234663 446983 452132 77621 608654 392675 303037 267237 -43909 -711392 -517520
8730 -517520 -22803 -285025 166877 285641 17370 419081 694150 160155 -156926 293903
8720 293903 262638 90502 693299 168653 -75386 -125752 467485 641937 410481 -238249
8710 -238249 13439 200699 472798 907255 563495 -132551 50405 86314 485491 451184
8700 451184 140533 -32022 505366 37815 681787 155494 -111357 759387 667577 420905
8690 420905 -14666 114745 -298263 -126702 169498 569338 304725 -219579 -92604 847311
8680 847311 242493 414100 21583 81893 24851 185508 420839 874694 880977 822871 1031181
8669 1031181 1309664 982668 948575 424723 735777 534120 1003341 687075 583149 674767
8659 674767 203262 198027 36270 -149382 296654 226510 447894 681633 154218 -29117
8649 -29117 270868 -30805 575092 556088 44647 -120075 573192 110989 25111 144595
8639 144595 63253 205750 204883 167183 377080 252853 153286 186996 563046 230766 42603
8628 42603 -17202 3783 302268 22335 282770 103826 452436 542281 240340 578718
8618 578718 396089 83711 37784 363122 -105024 101550 149928 874499 -290544 409459
8608 409459 337967 177258 38379 -571388 366776 301032 609520 252327 365468 407791
8598 407791 420741 376337 98147 364433 307933 88560 292713 570168 612179 276399
8588 276399 600284 499441 520908 488729 171025 506734 585442 640009 404374 628908
8578 628908 311282 229998 392258 147573 116361 64482 444717 297954 -258396 481306
8568 481306 796254 249341 340600 270661 -107990 231063 358989 249181 378114 176418
8558 176418 403107 451218 220543 -448094 -162193 572944 -92454 528895 216674 438926
8548 438926 -65094 24714 362315 52088 -71545 -132237 238757 77095 356456 517591
8538 517591 349029 772855 109507 209843 943430 -1272654 918964 447356 627732
8529 627732 829261 379794 172279 368404 932165 328554 488989 212242 390283 577738
8519 577738 205353 5524 247624 368568 172611 447449 397189 -159554 791307 376048
8509 376048 600290 1272019 451717 355638 471367 636454 495934 331689 709392 -148939
8499 -148939 345705 508031 309297 655939 445167 1023503 551735 714869 518130 140969
8489 140969 341359 308368 312234 737558 31837 -11676 60568 -171848 745101 934691 142234
8478 142234 337786 90752 696013 595753 252341 456457 357592 347425 170672 82580
8468 82580 683939 405779 505918 90251 431062 354720 647388 393111 -28062 467424
8458 467424 346515 92451 -58679 266799 408639 959862 514454 370135 391843 511423
8448 511423 376622 377156 626578 346156 675747 856280 507375 448299 550185 327354
8438 327354 732343 905510 549537 546344 865745 523399 558931 449635 506676 695271
8428 695271 419751 917493 570222 431088 835604 74328 1068485 420445 478442 79411
8418 79411 460812 425703 803433 842500 278965 303577 459159 817139 862121 645700 716209
8407 716209 580332 906579 598997 654107 965342 451832 718742 784326 452120 1145932
8397 1145932 686729 452582 421735 413349 1155266 1318878 435957 275375 420075 431708
8387 431708 679769 274160 754637 551362 930046 548933 936930 1163016 660861 716943
8377 716943 608923 728725 1037564 517953 340738 1049187 693030 1107030 557031 468036
8367 468036 1125562 968009 877930 838988 654826 817817 856510 1053807 840945 590964
8357 590964 851870 819194 1002731 1059734 315823 852403 1001992 714464 546434 631550
8347 631550 548544 1082637 810287 1032066 663377 848853 524509 861442 658858 781721
8337 781721 653014 903035 1222842 1337191 1016868 1378722 1290041 896714 1144756 1048201
8327 1048201 305350 660090 680885 1227481 1379466 1311837 1045916 1144326 999143 1171847
8317 1171847 576458 842431 1047310 1429668 1178975 956091 1173546 1359776 1546610 1559412
8307 1559412 1051438 931046 1426379 1190924 1433569 1808489 1347618 1173697 991912 1246447
8297 1246447 1220863 1206617 944203 1221518 1124093 1671840 1793477 1605876 1557540 1544615
8287 1544615 1439241 1387938 1386478 1417106 1394092 1809045 1295821 1100226 1448152 1467881 1291946
8276 1291946 1759024 1733783 1783397 1774814 1823576 1592843 2296585 2083565 1545701 1576454 1674885
8265 1674885 1939127 2193582 1824621 2010323 2302911 1790786 2265239 1968535 2145036 1916208
8255 1916208 1625542 2242406 2605089 2337055 2122458 2041045 1814185 2397150 2433895 2146585
8245 2146585 1395975 2400276 2208739 2392441 2478183 2043990 2081693 2520185 2537063 2779100
8235 2779100 2519536 2711554 3247237 3255492 3184868 2934089 3113880 2594086 3083985 2960711
8225 2960711 3039617 3225260 3114674 3487974 2758313 3418816 3005269 2626034 3408336 2732836
8215 2732836 3580831 3325802 3195868 3427900 3583611 3652681 3688338 3288512 3010650 3412673
8205 3412673 3417183 3475316 4008294 3603022 4158190 4459956 4340226 4292029 4486738 4478339 4837542
8194 4837542 4930338 5162449 5608404 3688000 4633596 4201467 4862747 4314476 5210592 4934272
8184 4934272 4639105 5289817 5291412 5133189 5297454 5022266 5341483 5447877 5186015 5008005
8174 5008005 5226004 4942667 5291044 5541802 6097020 5698694 5980339 5446226 5928272 6164417
8164 6164417 6497702 6171783 6726748 6763711 7040920 6704246 6632312 7051879 7084333 7117988
8154 7117988 7170757 7375602 7704432 7506324 7773528 7500151 7869908 7791226 7491720 7873368
8144 7873368 8252258 8217269 8874949 8294760 8883857 8083138 8774043 8502859 8430247 8432614
8134 8432614 8409937 8567902 8461408 8592465 9156659 9097865 9206806 8698514 8676691 9064676
8124 9064676 9133723 9334775 9516603 9234999 9253344 9163079 9037975 9417993 9214361 8981564
8114 8981564 8963754 9219782 9372661 9166548 8634435 9220181 9819408 9209870 9240826 9029166
8104 9029166 9314423 8998133 9254023 9050375 8629580 8476008 8600165 8721089 8677764 8973923
8094 8973923 8586588 8377767 8513816 8431993 8604238 8156516 8304422 7932224 8069179 7567989
8084 7567989 7350866 8052419 7675704 7319812 7242882 7214802 7210788 7027513 6877623 7524909
8074 7524909 6914318 7001387 7120985 6761233 6802345 6784235 6536980 6491364 6391757 6706549
8064 6706549 6278211 5595853 6211640 6020267 6292866 5320845 5591858 5623470 5790616 5725747
8054 5725747 5517339 5226144 5221726 5389117 5487977 5167756 5043865 5351827 4866437 5177531
8044 5177531 4739550 4861183 4870918 4710672 4718868 4480820 4271473 4089510 4222151 3879933
8034 3879933 4235628 3782121 3706738 3873998 3669824 3643816 3471895 3294018 3025615 3583705
8024 3583705 2689091 2805787 3299695 2846040 3133048 3039018 3079366 3190366 3554525 3098698
8014 3098698 3260041 3270018 2884587 2817731 2612619 2987732 3213605 3070033 2780244 2304094
8004 2304094 2516756 3196541 2680280 2849833 2386458 2793817 2213713 2319384 2352835 2534397
7994 2534397 3139826 2500070 2599648 1553119 1938343 1635892 2208918 1801166 1817932 1943640
7984 1943640 1857040 1960039 1789519 1950407 2088451 1486297 1952475 1939422 1790842 1887862
7974 1887862 1638621 2200376 2115179 1905433 2055149 1830696 2045669 2225569 1836090 1789476
7964 1789476 2067421 1814146 1822910 1937686 1307929 1606538 1289510 1108188 1795731 1711901
7954 1711901 1196379 1486311 1864910 1480064 1217769 846660 845406 1721428 1887458 1781545
7944 1781545 1646529 1618759 1012496 1188432 973362 1115831 1255990 1113386 1799651 1611161
7934 1611161 1538050 1459873 1239316 1158663 933892 1649032 1450962 1228407 1290814 1312658
7924 1312658 1347383 1260754 1103729 1211889 1160932 1236301 926458 720367 1008075 1004954 1410464
7913 1410464 1082594 1086934 1286081 1247440 402899 1072421 421953 1019719 1077269 841122
7903 841122 868871 690162 1122656 1039989 733943 607373 802650 1221112 873628 837521
7893 837521 727957 755502 736323 749403 672715 632008 1447474 842935 1017639 792976 900116
7882 900116 1204304 900386 1220909 871565 464713 756773 243378 627574 742116 1295755
7872 1295755 543925 840258 589007 477733 419949 133090 485706 785381 451616 993915
7862 993915 921031 913865 507993 775333 573043 640628 664616 177576 1035154 451222 275077
7851 275077 4966295 185048 602946 1178995 886518 977698 580759 826133 577841 571128
7841 571128 801418 504144 939615 1083044 486070 -31896 263826 122582 724269 471050
7831 471050 306681 101862 98743 609938 978033 607358 309605 327531 361288 814334
7821 814334 511921 590427 596264 1082120 798607 468665 207763 176003 -103643 231273
7811 231273 952840 903435 148879 188017 480390 392692 1052498 663770 -401930 37507
7801 37507 782923 530897 247485 354859 443562 2249 610816 430118 302166 471616
7791 471616 456514 1009619 1177150 755087 410429 330015 897970 1357065 978241 713796
7781 713796 400419 757199 603349 1076818 609048 583798 405516 448554 765949 663155
7771 663155 -20009 208430 797832 719222 166400 544076 562680 29072 249827 -53940
7761 -53940 373463 -133613 51201 536346 375948 708150 356470 177884 461842 586230
7751 586230 691060 421341 269549 262875 -99431 640697 533153 369846 -42402 232245
7741 232245 342563 600154 565562 91168 468837 827492 779979 852270 134354 189419
7731 189419 640820 64193 320986 545208 160271 54083 626129 125641 658050 667252
7721 667252 253528 99090 92826 317759 617007 167375 -25577 613261 279145 658136
7711 658136 374682 550810 332730 625485 499698 749767 338504 545512 539252 708572
7701 708572 350475 -32283 515335 614920 801773 793576 778935 755318 775237 541425 334095
7690 334095 405631 373191 -82428 651888 398403 397765 285744 -138897 587215 355169 199026
7679 199026 400944 478317 350866 133861 -62575 17498 404242 -104398 437460 392195
7669 392195 282326 269800 397089 478752 550486 -282949 289170 324328 562491 409719
7659 409719 285578 118554 119220 128636 180055 257507 264359 249452 666390 633040 173267 437700
7647 437700 286605 664190 434741 767528 238557 442252 518100 -100422 357823 300501
7637 300501 180474 -164539 280768 747293 294226 237716 55701 453956 564452 -87013
7627 -87013 73978 -3368 -136560 163284 145952 40574 134621 97438 187879 197855 593268
7616 593268 900512 927509 659747 314430 806545 402277 146180 231530 59633 326110
7606 326110 589379 936053 994050 561892 374072 1196220 666382 840791 -14520 107479
7596 107479 330854 624793 402580 -29969 -292792 89057 318593 626056 -189502 -119242
7586 -119242 314420 -323200 265926 231486 250086 195327 365600 233566 681849 329543
7576 329543 150195 455846 194960 193441 727504 171064 68472 -146001 617211 373563
7566 373563 413702 200802 242043 901575 572021 517351 -99954 302459 553417 655645
7556 655645 33201 220520 -178344 415950 481166 739469 -20581 -12268 209077 274592
7546 274592 443107 550403 439303 33229 705354 590126 383208 66260 204666 351426
7536 351426 313107 -175557 809285 43731 120084 620318 340122 1013327 147671 339829
7526 339829 678328 690581 573061 287699 819738 302762 169624 -16510 314411 543643
7516 543643 632894 192353 491141 711723 710338 713646 741625 431146 894319 356230 521671
7505 521671 190423 -353426 571919 620752 40122 131091 -88445 301973 242762 244912 102268
7494 102268 498575 317804 255709 470514 270071 -19819 681539 229825 -264356 -75936
7484 -75936 453648 191223 60618 -188594 393618 408100 457825 214229 566345 326099
7474 326099 472435 401613 36368 256224 413548 51046 -15258 590902 246656 94480
7464 94480 232949 219085 179594 485201 -67448 541613 -35245 643607 671977 914234
7454 914234 606034 -273053 156830 -236609 243492 229840 369771 472183 578241 182352
7444 182352 485998 84210 420041 270166 340735 370496 331184 169821 548476 255555
7434 255555 238569 -84982 -251176 310523 416045 897695 533527 701215 566328 240827
7424 240827 279835 148751 -338501 435632 406239 113910 495783 264419 412347 243602
7414 243602 254637 157583 8343 328777 633141 342422 235270 95982 362658 10643
7404 10643 290034 85511 599779 220545 115199 -143592 354458 580909 121471 260076
7394 260076 183895 -13276 54167 -217869 136524 55341 -155217 15957 315510 513383
7384 513383 606010 -22037 280894 525380 312212 305841 741880 450345 909905 530740
7374 530740 860404 610156 189190 680485 -107338 808879 637967 566641 554468 346438
7364 346438 654092 210752 470773 231658 79891 187278 596403 -169559 622298 -110324
7354 -110324 28118 18155 402840 182288 -186484 -451755 547952 -65522 505932 -91968
7344 -91968 -351188 343790 218065 75152 357216 317132 615444 347178 568309 675908
7334 675908 560583 616939 309717 299061 199322 128600 478490 -44533 715699 460302
7324 460302 570378 124343 291699 522863 273863 93999 210047 -168756 -119348 565532
7314 565532 395181 266041 84518 -266044 -90643 -206255 179723 382710 860336 181903
7304 181903 232248 630836 213714 134876 316743 432807 415701 255552 684708 301403
7294 301403 613763 586219 457766 585486 456123 346340 -94343 516400 560246 688618
7284 688618 637461 369688 239555 492039 525331 345882 -98780 -39629 -24522 341383
7274 341383 148323 239387 342134 -10099 181042 258144 188325 -268162 26266 519664
7264 519664 279763 359935 -116081 -13489 493174 108378 499814 -8176 94713 196270
7254 196270 485363 483748 326577 334996 198065 255939 714605 158837 221058 641204 158160
7243 158160 507523 366072 144270 153085 271662 73339 345616 351962 276778 98312 127933
7232 127933 -24676 646619 535095 208819 890744 422071 396390 560202 441400 109028
7222 109028 839951 378066 251487 278762 323332 584510 360144 349774 232983 -13130
7212 -13130 601027 209979 873916 213565 307626 401414 -248796 -38899 -300654 -442170
7202 -442170 683814 712683 -18426 477412 239221 501927 405460 540697 -81496 388726
7192 388726 571648 611585 217786 116548 426158 181352 133328 115604 128903 60540 398011
7181 398011 678007 395589 638111 814379 243551 346021 965105 830759 743339 666904
7171 666904 218074 587594 257213 113317 -141581 277034 428801 378873 374818 204738
7161 204738 429995 338772 561155 724198 197593 493881 597270 -220623 565338 355346
7151 355346 395580 868207 230310 482086 304063 963475 383498 432847 229808 347482
7141 347482 815854 802058 729660 405854 444465 330961 524984 349567 307994 280518 283368
7130 283368 514047 389503 360646 9054 18097 627204 299422 245200 -270179 -8447
7120 -8447 430394 645078 229711 60816 350721 419819 149923 46839 177843 505008
7110 505008 139097 544248 907414 -3461 393976 331345 491669 1077883 265872 262524
7100 262524 297847 618074 522542 291585 663581 -70339 210743 281776 472780 -23801
7090 -23801 3606 -141764 667170 20552 56753 222527 -27171 238656 540466 558004
7080 558004 180523 100189 616648 548692 874168 859161 312416 117663 290899 1025418
7070 1025418 658054 243677 504211 314871 675461 397655 498784 96060 -3529 142977
7060 142977 433017 250867 204458 -23089 203893 492493 -97925 62267 -137746 171001
7050 171001 75896 268288 65046 20407 299016 237996 422811 371672 558405 295732
7040 295732 105889 893751 1129964 639852 18001 431027 408065 1055414 692076 -143048
7030 -143048 320341 261248 394298 68980 417266 617885 549786 397618 790426 653201
7020 653201 453751 -322696 -112685 273150 316841 29719 600322 316230 748433 153374
7010 153374 409169 15682 564126 738094 682756 722325 469139 771883 160564 578504
7000 578504 586938 217938 -220651 403254 438550 688490 790563 564846 155735 294196
6990 294196 217169 1301958 1032214 440259 258397 111511 123978 182807 161900 -38460
6980 -38460 222133 248687 324314 604322 -128993 283997 361277 518616 807128 87965
6970 87965 526249 13507 368662 647792 195694 418878 491455 486718 647420 306713
6960 306713 491608 779320 644807 250837 547506 420220 570420 436429 278171 571241
6950 571241 341849 477672 146813 344380 130842 -335502 156352 321758 314078 363306
6940 363306 64477 466413 417541 589546 347229 475711 203048 683509 767057 720441
6930 720441 431891 586745 601145 677376 97310 616374 143111 253902 678386 315430
6920 315430 133381 286857 626282 730971 418978 289750 409637 145509 227497 121290
6910 121290 39420 -104664 194381 181068 271654 457396 382862 77384 585043 938155
6900 938155 533973 249749 135881 387012 740298 413756 103906 185699 -188382 608508
6890 608508 613722 383210 622950 912348 612147 708599 473343 539702 260748 362354
6880 362354 443626 190851 58748 605658 512648 350713 216291 268148 519282 418456
6870 418456 360787 473545 360746 114844 -175531 426113 315865 -127022 182247 201629
6860 201629 363221 -138803 389513 429484 740966 292806 223652 183455 309871 199477
6850 199477 163661 162688 599901 407779 631302 751964 471643 122414 296216 633489
6840 633489 715262 735924 277101 601794 22878 557634 223209 607221 680142 172319
6830 172319 293758 696237 358893 542908 206727 422665 577830 701285 154091 -50856
6820 -50856 -305620 346479 873741 375915 -81750 602589 828085 756397 803766 197950
6810 197950 283022 648685 184350 308037 663144 621515 494401 475570 772742 935461
6800 935461 571026 365135 842837 266802 375229 770756 710907 804361 334746 692967
6790 692967 694257 472557 392928 -271167 239663 -36114 155594 747012 480020 557735
6780 557735 636978 466387 342183 221108 357564 -248031 82787 112859 552424 332896
6770 332896 322345 521973 777582 595741 649125 771325 759069 720822 554713 50280
6760 50280 351667 239346 2496 1074218 370332 499208 151099 315402 781092 79828
6750 79828 586755 598911 486681 311769 -195328 447230 449946 292197 348497 327622 859490
6739 859490 98907 71784 889823 609238 345447 443841 368416 531716 427559 366027
6729 366027 359588 154604 261437 480050 330518 551847 98602 92962 273122 696353
6719 696353 739118 606000 14284 475763 85337 365620 286567 181170 595901 480420
6709 480420 219942 745795 220296 920794 427212 559354 1155463 359602 291043 594458
6699 594458 1046269 918220 1087322 832131 742081 962475 640015 906314 873829 880300
6689 880300 422574 366455 406777 517122 300730 56994 518172 556843 473160 -102601
6679 -102601 441857 886502 255082 365851 586814 499720 688681 220967 703933 931974
6669 931974 531539 479847 200464 336228 686097 584036 687218 1017903 1088415 974431
6659 974431 977680 849250 754563 489192 566368 312721 267052 640295 731113 334237 530240
6648 530240 820850 849335 374311 604282 1011027 924856 845538 -99586 429530 678704
6638 678704 470736 525623 318080 593100 807279 1072727 526182 552312 278000 859094
6628 859094 872351 915014 1487294 1081395 1556327 1871051 1818396 1907103 1864844 1283575 1562148
6617 1562148 1407659 1326890 417041 808446 871092 1002705 830458 1033322 1230891 1205290
6607 1205290 643534 973399 1035617 547763 1398136 772386 889946 1071483 1303025 1660266
6597 1660266 1976390 2642101 3314227 3482129 3578888 2669381 3070203 3121748 2098619 1789168
6587 1789168 1794016 1748251 1150094 880082 1150518 1276108 1170235 1029594 904515 1108325
6577 1108325 608182 777052 1133079 1390799 1410598 1438666 1449782 1675439 2289643 1839618
6567 1839618 3089866 3081903 3547521 2862346 2987528 3003090 2327479 1664097 1507680 1440386
6557 1440386 1522966 1305856 1270058 1294644 1164288 1210028 797621 981729 541114 703552
6547 703552 1210265 485132 313255 707879 760415 970821 1315907 1195162 1250390 1950040
6537 1950040 1422513 1925388 1198264 1466126 1453044 651717 715097 813611 581332 647407
6527 647407 635154 680729 1391120 743670 793013 821155 1053917 668389 173536 661289
6517 661289 497383 821930 121254 248514 948973 632734 215068 621567 748488 604648
6507 604648 263249 591757 555412 779949 797945 706287 341754 32371 350270 249597
6497 249597 388423 -20298 362353 283577 645766 295335 560175 807648 708029 589006
6487 589006 1133604 818306 629507 444410 1020426 517885 957740 167222 77860 487694
6477 487694 166636 743368 891269 462707 1175505 889615 858075 509922 663180 135625
6467 135625 757543 999413 409686 961486 429168 563708 362302 858505 736883 195468
6457 195468 176387 487549 890176 688946 330803 890521 994446 1046043 827942 171620
6447 171620 841713 392416 630064 771707 869110 454352 646841 522716 493854 879565
6437 879565 655612 601048 1007549 923018 1217104 368396 589802 755277 1071920 268279
6427 268279 -55282 414175 167080 789899 623938 408912 608693 439000 541966 416894
6417 416894 619430 949447 430934 481755 270860 727857 734348 779898 539005 825523
6407 825523 310403 709033 570523 -31954 599546 919286 1099347 1130948 571648 860493
6397 860493 808756 322437 234392 478969 713936 521579 370704 492975 1254993 1087496
6387 1087496 583306 532808 766275 487726 824492 546990 726279 835950 656568 960021
6377 960021 1129395 785305 944312 591575 820593 763020 591529 969897 836664 985163
6367 985163 551304 607368 877136 885092 677572 1051010 556554 556250 834474 473438 714184
6356 714184 576608 552015 564214 -252932 1138850 506590 571608 724615 903439 1145110
6346 1145110 737262 611321 681147 933834 1015964 375075 916695 933662 641396 954494
6336 954494 769477 1179075 855747 546617 1192681 967980 690789 602598 1135386 651101
6326 651101 953320 375286 535493 832695 380807 527927 788585 963256 785538 914768
6316 914768 1136708 499627 1256534 513337 777242 836050 455078 617058 551759 880875
6306 880875 853049 1269900 833893 722295 984757 740611 1283035 1034289 925890 837100
6296 837100 879033 1025345 1165750 1125426 972699 1100284 1129490 1063344 1266046 891629
6286 891629 1236471 1457868 1549360 1029185 1193946 1052522 781376 1023749 841946 1587175
6276 1587175 1223523 872757 1624280 1092930 713393 1539166 1235251 1147495 1184311 1178987
6266 1178987 1244131 1355512 1352541 819727 995043 1597975 1497321 722909 510276 1025235
6256 1025235 1381308 841417 1127621 1202336 1204104 798554 987656 1329912 1143169 784243
6246 784243 1153381 1161680 1427683 1158679 1805141 934755 1343982 1315298 936320 1436647
6236 1436647 1290360 875236 1077641 1350861 1478503 1349576 1420392 1482223 1251723 1444273
6226 1444273 922624 1060077 1112804 1090285 1014193 1478400 1276939 1044659 1624631 767586
6216 767586 1557085 1314622 1186792 1800881 1451968 1831016 1681725 1470430 1450040 1516592
6206 1516592 1522559 1051557 1481204 1647159 1548299 1789439 1359238 1492148 1379500 1015196
6196 1015196 1358567 1543002 1578539 1656388 1502953 1207095 1702904 1565059 1339344 1720789
6186 1720789 1029526 1211845 1568907 1701330 910986 1765844 1490555 1408209 1981838 1223439
6176 1223439 1116327 1117818 2094329 1693941 1532678 1636716 1516777 1774709 1565404 1796747
6166 1796747 2310010 1844916 1719744 1388333 1879701 1903303 1984342 1771486 1700695 2094131
6156 2094131 2191440 1985003 1314737 1619951 2011213 1733879 2053423 1787395 1693826 1756279
6146 1756279 2030853 1815551 1595014 1844506 1731349 2031373 2030973 2087034 2209717 2446711
6136 2446711 2037279 2259579 2175203 2431897 2272726 2671416 2558984 2420760 2092169 2820657
6126 2820657 2279365 2259668 2198860 2476240 2069313 2154329 2597488 2392330 2207021 2102922
6116 2102922 2436643 1770917 1819357 2160748 1905471 2466950 2169382 2447480 2249669 2653671
6106 2653671 2581538 2577123 2753624 2642109 2266222 3176574 2722125 3091166 3231834 3110045
6096 3110045 3354105 3313269 2956945 2752535 3002345 2735235 2539968 2820173 3093494 3071482
6086 3071482 3170943 2495466 2943014 2748870 2730280 2828335 3124499 3227373 2980005 3367194
6076 3367194 3030015 3517925 3104758 3514726 3156191 3406828 3430217 3331394 3323408 3435476
6066 3435476 3510627 3281548 3815298 3713119 3676778 3120643 3388165 3036571 2921866 3406007
6056 3406007 2922999 2960727 3122548 3082091 3680393 3164380 3470591 3700878 3628607 4311738
6046 4311738 3686597 3779177 4464897 4167571 3783383 3644168 3670893 3649827 3718964 3936256
6036 3936256 4019238 4138204 4602459 3966043 4009561 3439012 3944907 4216667 4632115 4969088
6026 4969088 4474915 4419400 4261390 4740888 4558328 4914892 4504600 4643534 4808688 5830699
6016 5830699 5594173 5688332 5965330 5999760 6072032 6105085 7008277 7084034 8002678 7242950
6006 7242950 8312338 8217405 8799365 9210008 9772745 10390929 9971848 10360865 9963070 10373430
5996 10373430 9810199 9705384 9593304 8878963 9205456 8877078 8719390 8802988 8428534 8950601
5986 8950601 9300633 9553231 9971078 9730933 9898671 10512903 11343614 11812037 12652198 13145421
5976 13145421 13794662 15277066 16016227 16031200 16955774 16914858 16855487 16585716 15980768 15574007
5966 15574007 14792443 14360344 13447809 12537586 11764070 11333332 11197096 10900065 10681514
5957 10681514 10494379 10356873 9908839 10138557 9845948 10024849 10317661 10304512 10678137 11433367
5947 11433367 11665084 11488139 11873300 11965661 12761972 12735440 12584068 12245037 12232169 12282160
5937 12282160 12394807 12123409 11697669 11197294 10526511 10000107 9816021 9991268 9484075
5928 9484075 9117421 9530425 9492379 9057696 9234768 9223801 9545300 9184957 9076621 9471637
5918 9471637 9739251 9519325 10214798 10423005 10344679 11090185 11139950 11263584 11651094 12417893
5908 12417893 13237308 13381799 14705111 15293219 16502822 17812409 19571462 21381405 23272878
5899 23272878 24673617 26393690 27889440 28425831 28626049 29505445 29182684 28649057 27830708
5890 27830708 27285940 26694987 25955283 25009387 24153754 24129411 23587875 23798372 23893557 23914652
5880 23914652 24997803 25849650 26318824 27662687 29223763 31098158 32965319 35973978
5872 35973978 38580742 42316354 45478028 48894085 52586108 54646824 56596896 58092723
5864 58092723 58689756 58847889 58493812 56869672 55162901 53778402 51885140 50457909 48897446
5855 48897446 47622064 46880550 46807630 47330138 48007553 50872666 53883117 58204234 63581247
5846 63581247 69537101 74450107 75935130 76052293 74207247 71575420 68502153 66017899
5838 66017899 64081529 63484071 63779926 64186109 64400684 65066561 65752099 67575731 70285355
5829 70285355 74426433 78358899 82678365 86196955 88086487 88630300 88378372 88407511 91501751
5820 91501751 96972148 107933363 123060164 139147283 151585508 155171116 150524061 140195878
5812 140195878 125450548 108896192 93001865 81274302 74579698 70408514 68320366
5805 68320366 67480500 68710131 73431926 79231529 89814288 103892860 121411001 140130873
5797 140130873 154676524 162305444 161147276 155895114 146302823 137839533 132311617 134679996
5789 134679996 144855060 157483663 167781433 169570773 163162397 151142017 134636909
5782 134636909 116654186 99168213 86034996 76943256 72323420 69047083 67735940 68549686
5774 68549686 71352577 77657062 87439794 101397444 118763968 137193457 152571232 158921224
5766 158921224 156436974 147498256 134445381 119990077 105916543 98206980 95300716 95203820
5758 95203820 95693248 94102074 90728837 86092810 79823123 73591692 67489551 62236999
5750 62236999 59087586 57200887 55738952 55351907 54790757 56070100 58302628 61996900
5742 61996900 66460876 72871661 79783166 85071174 87401993 87315338 85320770 81723834
5734 81723834 76979036 72142981 68856902 66152745 64319555 62753279 61679406 60259969
5726 60259969 58698605 57363883 56108943 54654237 53297336 51807287 51236286 50521103
5718 50521103 49967843 49687168 49575411 49705123 49560557 49936269 50317378 50688218 50888284
5709 50888284 50667535 50908319 49625544 49314217 48401734 46446742 44954041 42974934 42172894
5700 42172894 40803094 38745378 37437649 35931234 34834778 33010745 32154220 31208193
5692 31208193 29330875 29015922 28224761 27943271 27103232 25963782 25847285 25634192 25052723
5683 25052723 24582165 24133698 23743612 23624870 23369602 22217139 21218187 20900024 19919786
5674 19919786 19474684 18731749 17820126 17317677 16467380 16345199 15793808 14850440 14649019
5665 14649019 13455421 13486982 11946731 11909755 11181311 11083106 10554518 10260798 9800462 9639518
5655 9639518 8933979 9173956 8764559 8555888 8238583 8185324 7944575 7955246 7998482 7486670
5645 7486670 7111865 7553519 7272624 6969051 6948242 6422770 6760023 6819034 6351872 7013568
5635 7013568 6969471 6726565 7027550 6896294 6618989 6873341 7003200 6655639 7229921 7384419
5625 7384419 7178308 7260927 7387383 7856102 8180195 8386454 8872137 8932438 10014794 9943680
5615 9943680 10605152 11250489 12035994 13266410 14159546 16343176 17004393 19177731 20850847
5606 20850847 21247916 22607505 22394909 22931619 22601398 21810249 21145706 20025166 18997616
5597 18997616 17600520 16935599 16190245 15853054 16023794 15541173 15852894 15608492 16508873
5588 16508873 17373767 17698300 18828159 20188350 22031203 23392068 25552587 28573766
5580 28573766 30091069 33262683 35170366 36723893 37553329 37928262 37930633 36927960 34931633
5571 34931633 33091255 31010871 28434061 26745707 24491571 22799713 21227794 20031052
5563 20031052 18711792 18094442 17367586 16912031 16315778 16716491 16036868 16530960 16755509
5554 16755509 17336161 18536927 19290413 20438074 22186107 24236212 25224643 26251474 26399119
5545 26399119 26357979 26298465 24791369 23204450 20711920 19471847 16874890 15366528 13689540
5536 13689540 12194967 11222390 9624545 9626463 8638075 7993806 7753671 6750539 6296996
5527 6296996 6162079 5502884 5376650 5563537 5046694 4671042 4747119 4204916 4412358 4708467
5517 4708467 4871140 5076637 4806127 5218946 4657170 4669885 4390895 4256098 4702932 4210024
5507 4210024 4131137 4008353 3533057 4146427 4124566 3307222 3334457 3320975 3107336 3439649
5497 3439649 3304667 2965692 2911598 2810863 2746536 2892557 3092392 2620050 2301663 2688857
5487 2688857 3062511 3094933 2562413 2295778 3199542 2817563 2974599 2604905 2591706 2720157
5477 2720157 2871970 3261901 2868986 2385503 2630759 2421798 2576479 2709215 2204523 1962533
5467 1962533 1867753 2551095 2168074 2346477 2433107 2175073 2300584 2518684 2498879 2366970
5457 2366970 2358517 2194274 2189377 2606148 2280116 2363868 1943728 2397998 1969535 2330957
5447 2330957 2051668 1901867 1919986 2171519 2482846 2294440 1871088 1920284 2326451 2148439
5437 2148439 2305918 1912676 1518764 1429686 1718971 1750779 2047218 1597073 1487963 1257805
5427 1257805 1834308 1684576 1763406 1395487 1681355 2404231 2255009 2505288 1754942 1574420
5417 1574420 1830372 1800856 2132976 2164839 1954114 2293942 2860851 2103381 2374169 2308518
5407 2308518 1721849 2043551 2100878 1795959 2241070 1802627 1699852 1929672 1997237 1747510
5397 1747510 1433033 1651553 1380532 1717057 1473139 1806091 1814112 2065940 1894450 2215862
5387 2215862 1717181 1749201 2015131 1685982 2026932 1918831 1509976 2328173 1710321 2189883
5377 2189883 1880464 2728831 1966623 2334034 2693723 2483380 2661836 2413696 2413126 2726264
5367 2726264 2466657 2449890 2687874 2838560 2708065 3433089 3066090 3071303 3201796 2702802
5357 2702802 3263262 3046150 2893907 3032105 2800298 3047525 3072454 3667535 3255025 3565005
5347 3565005 3609158 3518963 3535840 2917541 3376032 3653293 3972501 4097690 4445506 4499980
5337 4499980 4631184 4522389 4661289 4900857 4702887 4975429 5764215 6192139 5676839 5930049
5327 5930049 6242101 7009310 7224737 7226851 7526657 8302288 8964692 8851270 10561450 11279725
5317 11279725 12310967 12913193 13585714 14975338 16185968 16794780 17991695 18782409 19739333
5308 19739333 20700342 20796383 21687298 21941236 22203083 22764859 22413145 22827972 22918855 23738418
5298 23738418 24219308 24362990 25298117 26523925 27216697 29293849 30663671 31882439 33652821
5289 33652821 34833665 36201633 37221444 37478763 37201518 36243815 35681444 34970691 33239338
5280 33239338 31748905 29562792 28005051 25737200 24690810 23601850 21801445 21417432
5272 21417432 20979507 20485327 20243437 20364574 20889556 20803072 20940668 21131356 21359254 20990275
5262 20990275 20692177 20083017 19613153 18985970 17667421 16545276 15330608 14268367 13338663
5253 13338663 11615849 11255939 9952301 9136344 8675328 7769540 7852112 7194270 6506107
5244 6506107 5891048 5831608 5875576 5901370 5012940 4897442 4650424 4651767 4075749 4358542
5234 4358542 4295949 4316215 4539452 4305894 3941315 3609668 3619786 4012711 3782819 3586871
5224 3586871 2660899 3748858 3454783 3412064 3474957 3038369 2794887 3285853 3193716 3337280
5214 3337280 2889417 2925677 3062397 2826476 3062569 2808140 2987270 2757793 3042843 3226560
5204 3226560 3663293 2638649 3255713 3580238 3197302 3163602 2872203 2889197 2566362 2522997
5194 2522997 3274146 2828678 3213513 3206436 2800655 2538497 2345625 2803141 2920623 2418825
5184 2418825 2607513 2440577 2932647 2773102 3510898 2900279 2734818 3388603 2821183 2749075
5174 2749075 2766179 2887790 3303721 3482356 3397768 3771484 3400700 2914521 3331351 3333884
5164 3333884 3833700 3424215 3373961 3696971 3704073 3715977 3731218 3376053 3137507 3181473 3560817
5153 3560817 3681916 3900545 4057210 4019365 4600791 4014573 4410327 4564960 4230537 5108090
5143 5108090 5142924 5271571 5638694 5786116 5524437 6166206 6640417 7124711 8027041 8383868
5133 8383868 9339011 10014192 11116029 11579921 11800149 12135268 11930891 11568504 11164477
5124 11164477 11476504 11260546 10603459 10365564 10074225 10567723 10457700 10529346 10625534 11466067
5114 11466067 11352577 11767446 11951152 12697792 13779602 13772931 15303853 16341954 16920238
5105 16920238 18762742 20542277 21529915 23179148 24521880 26483731 27888155 28864625
5097 28864625 28381754 28209165 27156154 25901609 24916087 24205835 23322517 22194831 21018391
5088 21018391 21465491 20672241 20979817 20826441 21239309 21254819 22118210 22754227 22812364 23876141
5078 23876141 24528328 25873400 27015722 28124167 29788910 31564235 33098125 34918894
5070 34918894 36176797 36558231 37230341 37168429 35817302 34653178 33007701 31415555 29089433
5061 29089433 27871283 26766833 25945868 25120796 24602756 23567488 24393469 23639717 23387121
5052 23387121 23324688 22988180 22784874 22759609 23061853 22993845 23489388 23781488 25027842 26101433
5042 26101433 26899423 27277704 27594091 27715178 27617163 27031483 25876049 24203666 22795473
5033 22795473 21447249 20724301 19231393 18586394 17411289 16787869 16501465 16219354 15947050
5024 15947050 15168475 15197885 14648233 14131799 13970118 13277950 13592322 13017147 12612427 12044577
5014 12044577 12013963 12393951 12691732 12667688 12587145 12727766 12135513 11976551 10937107 10537812
5004 10537812 10779363 10303329 9515609 9223222 8891958 8830736 8325562 8035931 8472338 8400354
4994 8400354 8316188 7823118 8261054 7500789 7710532 7019267 7196173 7523745 7310332 7208945
4984 7208945 7475895 7381440 7162369 6893872 6870128 6241720 6759188 7460296 6473987 6528658
4974 6528658 6579129 6680585 7061149 6572210 6723442 6842690 6899106 6886604 7127511 6921444
4964 6921444 6812179 7158147 7082271 7272341 7545911 7786890 7917876 7605970 7731316 8315216
4954 8315216 8298569 7999079 8404292 8257343 8589002 9083725 9289358 8876310 9368464 10556568
4944 10556568 11102311 12855678 14794279 17722908 20688326 22015806 21048122 19717440
4936 19717440 19136719 17591612 15901378 14011114 12368220 12223706 11422024 11060770 11040232
4927 11040232 10739875 10915323 10692557 11071554 10961824 11012350 11156160 10794365 10572369 10590854
4917 10590854 11017656 11009470 11325216 11371858 11425846 11893895 11894981 12822753 12190343 12785565
4907 12785565 12126947 12645017 13318512 12798406 12935285 13223523 13302891 13594099 13698962 13950631
4897 13950631 13726938 14074980 14135210 14941948 14720579 14905118 15583041 15180863 15300436 15485900
4887 15485900 15295957 15285763 15365913 15698530 15557251 16253446 15998853 16192935 16727648 16286455
4877 16286455 17055900 16821308 16579149 16499841 16880454 16995458 17154846 16977411 17243733 17488507
4867 17488507 17578416 17686044 17445355 17676167 17948501 18104786 18395486 18531923 18827347 19044116
4857 19044116 18683635 19163300 19235044 19923641 20023293 19845650 20658831 20768377 21139442 21263257
4847 21263257 21293551 21276133 21924871 22350197 22337762 22997802 22752435 23566610 23968616 24350127
4837 24350127 24430684 25010912 25339972 25024253 25847814 26610812 26314035 27394563 27240764
4828 27240764 28833394 29027541 30135106 30530319 31620114 32535069 33513802 34932193 35484501
4819 35484501 35733869 37388946 38282573 39923827 41325892 42472713 44033114 45218754
4811 45218754 46501291 48448671 49450542 50188220 51098967 51787695 52557452 53681763 53846100
4802 53846100 55268324 56381099 57594288 58646893 60934479 62900938 64759745 67023829
4794 67023829 69687036 71845846 73162970 75168198 76689136 77851965 77926561 77655234 77904243
4785 77904243 76291391 76148581 74959739 74496244 73925660 72950064 72392670 71486512 70638836
4776 70638836 70031325 69230044 68536762 67835511 67110795 66134292 65570790 65513916 65143419 64401985
4766 64401985 63485057 62549213 61270446 58863413 56227300 53451807 50873238 47674342
4758 47674342 45086545 42749433 40936745 39295961 37313241 36251960 34712686 33335767
4750 33335767 32787383 31420964 30838669 29998317 29483562 29099533 28567505 27890218 27397147
4741 27397147 26143804 24998970 24106364 23546058 22458009 21371188 20642449 19862590 18895922
4732 18895922 18409392 17894669 17281478 16360890 16308402 16201403 15911346 15571549 15078374 14331228
4722 14331228 14657438 14208477 14069866 13718009 13166857 12543525 12491470 11680715 11236223 11032541
4712 11032541 10444026 9985603 10130416 9605403 9304029 9299885 8676850 8730927 8767107 8354679
4702 8354679 8530965 8786721 8133801 8515280 8574181 8645539 8453447 8653035 8540499 7960220
4692 7960220 7778774 6873156 6749777 6286291 6109162 5794902 5356208 5550082 5077481 5448779
4682 5448779 5209288 4914080 4893055 4829765 4786775 5292342 5228425 4579420 4852690 4303276
4672 4303276 4651451 5010867 4905694 5701524 5203232 5656241 5537771 5274975 5149261 4721950
4662 4721950 4811543 3777447 3970914 3995639 4037406 4348688 3937218 4384749 3589922 4041885
4652 4041885 4197302 3598971 4154819 3682961 4258152 3920616 3775048 3852734 3576326 3395697
4642 3395697 3807562 3378563 3625886 3674941 3552697 3495592 3906290 4259877 3936068 3734791
4632 3734791 3054233 3426744 3408412 2710315 3312769 3280374 3313678 3528741 3390823 3552144
4622 3552144 3170036 3518908 3425764 3315563 3386107 3528256 3624861 3574285 3620364 3886523
4612 3886523 3385058 3474105 3156591 3852749 3697555 3947519 3787317 4421148 4533756 4133963
4602 4133963 4438262 3717736 3414311 3946379 3711558 3461823 3928725 3422337 4013339 4407310
4592 4407310 3826058 4133896 4035721 3717742 3685359 4357383 3918986 4230266 4434902 4240779
4582 4240779 4208214 4727284 4157287 3991239 4040049 3658528 4739181 5010833 4329998 4903154
4572 4903154 5124043 5143328 5707084 5338973 5093646 5508729 5913001 5395877 5830958 5395425
4562 5395425 5871948 6418586 5827867 6412785 5854541 6317230 6288222 6252254 6365277 6534238
4552 6534238 6978363 6104644 6422199 6638418 6501797 6509678 6397752 6981860 7197803 7886392
4542 7886392 7676733 7838269 7936034 8154051 8976560 8601961 8640343 8818376 8685402 9425129
4532 9425129 9847765 9833285 9485167 9969761 9701716 10075412 10410879 10157227 10681434 11138269
4522 11138269 10921491 11303151 11251604 11337563 11738546 11865516 11805541 12313813 12595133 12774271
4512 12774271 13165524 13987458 13710548 14949754 14659475 14902516 15855845 16238737 16799399
4503 16799399 16923333 17068790 17236353 18139796 19125562 18787410 19856028 20395652 21272657
4494 21272657 22391781 23075485 24092085 25647442 27445330 28620961 30708965 32701325
4486 32701325 34252778 36858847 39935203 43758884 47439872 51818661 58560246 66503132
4478 66503132 78616761 96234705 121631609 156404313 199555561 244417827 274025758
4471 274025758 278167366 265659309 247512071 223465113 191620716 158783059 130305461
4464 130305461 110038397 97108153 88390163 82296821 78067194 75407935 74219215 74710327
4456 74710327 76797311 78651228 82389847 87660660 94964433 105002557 118366692 138218261
4448 138218261 170711381 218733170 285513441 371784419 463135749 520492066 521050488
4441 521050488 490907315 454549006 404240386 336729701 266304821 208806204 168967765
4434 168967765 140905630 121250975 105678630 94413840 85514887 78876756 74282165
4427 74282165 70575559 68389045 67749931 67709187 69674563 72321752 78326261 86406092 100480256
4418 100480256 121737802 150848067 187603139 225736681 252405463 256026022 242046809
4411 242046809 222728616 198141007 167829337 135038616 106122093 85761564 70546958
4404 70546958 60642749 52358045 45781073 40684253 36366786 33134415 29869488 27321991
4396 27321991 25261787 23377223 22326696 20508828 19569978 18805883 17995740 17197177 16293347
4387 16293347 15861075 14892783 14573276 14637106 13739873 13440555 12897143 12702476 12422891 11755153
4377 11755153 11799083 11375457 10888610 10760564 10831480 10103791 10136163 9712662 9362553 9196687
4367 9196687 9411520 9068595 8558176 8636769 8754879 8788562 7728721 7661406 7726256 7977183
4357 7977183 7546843 7117299 7303942 6848035 7109388 7244597 6614442 6785773 6818654 6302539
4347 6302539 7193103 7108888 7404708 8616410 9280550 9296533 8764059 8335382 7964670 7570414
4337 7570414 6851728 6242273 5780522 5518482 5447022 5335279 5677902 5589206 5553947 5178101
4327 5178101 5301791 5035868 5042753 5514641 5415821 4959508 5268482 6018732 6486639 7111155
4317 7111155 8060180 9254868 11069772 11520794 11092900 10410630 9937820 9388532 8055407
4308 8055407 7379341 6406190 5809409 5992493 5732454 5582846 5502570 5338248 4384119 4628066
4298 4628066 4383193 4349374 4020811 3427319 3565986 3773809 3761087 3635584 4035109 4663956
4288 4663956 5097104 5899224 6825103 6025224 5464808 5310972 4734044 4774723 3857468 3236677
4278 3236677 3263754 3037862 3258843 2879872 2411861 2609484 2498186 2163672 2729638 2295785
4268 2295785 2471964 2286070 2156420 2156019 2233684 2203790 1382161 915715 1809196 2098758
4258 2098758 1897247 1441763 1331826 1769127 1369181 1518996 1371212 1940921 1442508 1612766
4248 1612766 1702143 1790900 945609 1017332 652520 1102458 1158705 1322903 1507197 1337945
4238 1337945 1478248 1769377 1019734 1404785 1321518 1370475 1309065 898074 1236868 679602
4228 679602 1016134 929479 1184430 1540610 994009 1182278 1298373 1422276 1496502 1736809
4218 1736809 1968227 2220745 2499035 2019922 2099888 2054163 1843710 2175217 1254912 1228710
4208 1228710 1196948 1182107 1274555 1060977 1015456 1293459 824532 806932 1172579 1245988 1082608
4197 1082608 850583 1375887 1273078 1074893 1604763 1252516 1919201 1906163 2298948 2859091
4187 2859091 3284456 3427519 3245151 2530003 2713105 1870439 1975463 1267163 1065132 1322787
4177 1322787 1010252 1070288 1192982 769366 357200 493628 723412 529168 299204 910245
4167 910245 321504 819000 474525 1093686 995166 1199708 1453488 1790691 1675235 1587942
4157 1587942 1919583 1991010 1322031 1819335 1193187 1234857 854893 403875 860710 982264
4147 982264 1058769 973940 776572 701784 507908 324785 438644 -58999 325739 27707
4137 27707 616112 605317 180357 59935 1008987 755115 628778 969438 489313 834037
4127 834037 464032 84914 644375 412209 706628 -20654 171548 383732 790229 464123
4117 464123 313598 507767 494270 814841 833026 130065 299905 460428 501662 61115
4107 61115 -30568 566691 123660 117967 266626 246483 -126233 124049 467394 745900 648064
4096 648064 200543 86601 116427 796461 338886 149083 703478 -206037 442438 500295
4086 500295 565834 -23402 -49929 579000 377957 563329 102645 -168496 471026 379247
4076 379247 855928 759294 -16381 148824 499822 556459 399386 582774 -123801 628288
4066 628288 1047728 372577 285655 -118535 521377 665962 593132 217691 370782 580294
4056 580294 419302 732497 671199 -84773 298965 29889 992642 662244 412210 459876
4046 459876 420943 532005 501650 195079 38929 60509 425736 273674 12826 561655
4036 561655 -50691 324472 551707 -387707 429143 -235456 124430 283625 386950 362165
4026 362165 -86548 333357 379570 660419 191041 100536 198211 347513 309160 364535 318926
4015 318926 575235 210303 221313 318902 767383 508953 144205 615448 186318 1027607
4005 1027607 125198 102010 261417 -251595 253464 -218133 246703 179163 242795 319742
3995 319742 444965 415718 621390 496041 -240936 99995 335077 148726 536167 393467
3985 393467 411212 388219 425761 197142 194506 648013 200021 160530 316988 98465 538295
3974 538295 659227 480656 284641 293877 -303037 491923 757358 757134 218889 88970 1081603
3963 1081603 571937 435588 540655 -239739 324984 175747 371737 407429 -56484 437572
3953 437572 55964 178145 218361 24607 -7528 -350345 119853 565588 385153 203771
3943 203771 477158 359893 272296 221615 -368393 219195 402272 561122 352244 47437
3933 47437 -116834 -82355 460896 554777 259537 28641 168385 -115949 31822 28186 135638
3922 135638 396603 440480 434872 250412 721047 -597 46707 444955 472816 307323 -112987
3911 -112987 293241 611303 552763 338003 52913 95089 135377 -491030 172666 457673
3901 457673 749776 431096 136358 -55609 415352 224219 -264871 25141 -447091 156448
3891 156448 217693 -165052 206416 103289 28505 -301299 -221571 -338312 -114739 17954
3881 17954 534145 51493 334257 -54155 79291 -38611 59553 -65001 -287216 -402006
3871 -402006 211547 310973 10956 166166 109466 53238 245257 610129 187940 -39816
3861 -39816 162979 -40381 580699 -6087 21480 272684 252501 264049 171355 -912512
3851 -912512 -23331 -27398 -80273 -3039 805517 105210 120038 51854 -282823 -265964 390026
3840 390026 360465 448775 328206 414079 115783 206960 -193552 95117 671737 461045
3830 461045 317394 208730 534726 1143551 373987 885175 310576 193884 419991 31756
3820 31756 -140461 82584 -125750 -640139 61092 121596 58452 451140 279291 96741
3810 96741 763104 204756 167509 558937 391406 47621 201393 -482791 -256931 286630
3800 286630 36587 232477 25765 74382 290675 263038 660852 339621 562097 -21564
3790 -21564 -272236 3064 97841 597726 117306 -82626 927498 519110 697937 540526
3780 540526 110075 411233 183728 719783 139008 451599 -79826 34076 596098 360389
3770 360389 -148194 43533 166732 222144 -185910 -143856 -132639 11639 -78862 469457
3760 469457 -24910 -194514 756 57142 -167089 375035 625293 -109916 263369 91995
3750 91995 584117 200956 495070 -82403 45876 -340310 333524 330819 81800 141101
3740 141101 20159 502313 73403 -3806 -40115 162546 530772 533205 -33256 -191373
3730 -191373 469369 455497 394660 242407 214556 66794 -45604 236745 -174431 208387
3720 208387 275985 92521 474097 736179 -116674 105544 -17301 -123117 -211806 86165
3710 86165 -317986 318274 -254596 230863 502650 -206777 161243 -38619 -65507 211185
3700 211185 206027 125934 54785 94087 201039 113187 117103 220656 -416489 59997 323344
3689 323344 52621 -106366 92322 318006 -79123 -318741 -211168 -214701 196225 -270075
3679 -270075 15911 -31779 264608 131654 -404772 119092 262504 143010 298356 321379
3669 321379 257569 474928 504337 646907 451794 -396842 303444 30988 128395 375057
3659 375057 185707 33396 400664 162072 -64288 149618 -299695 227815 297960 -53627
3649 -53627 -28264 316682 463271 354711 -37334 252812 318019 -47552 117381 582463
3639 582463 322084 288594 85710 -255882 -178014 350271 60535 410527 144409 269696
3629 269696 -414141 43905 -22488 112870 116870 212219 177346 204055 -55674 102637 -153940
3618 -153940 -89209 877459 -129130 233423 522520 409449 599300 576866 -216806 280809
3608 280809 494274 355339 215180 409397 -350018 -460064 112233 -422982 -272706 -254925
3598 -254925 269150 108845 367753 -184039 -262613 246415 10313 400341 155671 -261381
3588 -261381 327513 18399 65151 239227 286963 -24313 392136 345492 529957 760266
3578 760266 278332 -361707 -34645 16274 319224 -10038 -66388 21562 193430 694919
3568 694919 470464 1023186 106587 289837 755973 285124 281800 241894 352092 101035
3558 101035 235547 385461 -77863 -83526 -237772 91305 287834 -206538 67253 371417
3548 371417 296377 846895 682733 -41531 605136 195246 355235 254145 -268229 -7517
3538 -7517 395639 494434 678714 254743 384301 294129 -97373 18955 404089 327095 493547
3527 493547 542794 128841 112459 -286978 -363132 -341978 -74006 107889 90942 649899 -566578
3516 -566578 -300625 320237 485324 89527 308075 -253840 147407 294995 105208 44184
3506 44184 -431264 168809 192386 227167 174397 252459 307983 86502 229897 738793 102072
3495 102072 342643 420380 293669 810141 407827 -54056 -189670 53491 1026175 748896
3485 748896 557222 277378 468953 403258 284750 174741 410218 291690 300696 651559
3475 651559 460068 -361430 -30791 -249279 369325 115400 287732 -215341 -54338 902817
3465 902817 560303 500632 -72940 369043 258712 190387 361831 544113 387156 667874
3455 667874 337927 775859 -73705 323286 -203971 533381 657057 248378 495053 195084
3445 195084 487015 531332 142799 448304 277283 13855 746537 849892 351659 196883
3435 196883 67465 215780 722362 296306 212368 591079 604908 210763 528115 386415
3425 386415 706140 501688 674366 180636 497700 706548 616850 516551 316776 514753
3415 514753 571892 769974 223911 540136 584330 798275 356428 612590 452508 887139
3405 887139 435578 700955 1013194 170295 709823 629596 465488 1457934 650864 892554
3395 892554 690821 606865 682519 1144555 757073 550405 779437 782549 689037 502598 535570
3384 535570 1030561 760721 727489 889255 1105504 873735 1377066 1565678 1414842 1913676
3374 1913676 1875791 2364406 2952467 3616374 4118880 3752860 3316271 3483671 3551054 2835409
3364 2835409 2595344 2661802 2138545 1514981 2046063 1098791 1698977 1466084 1199317 1240180
3354 1240180 1616325 1090101 1574239 1456487 1592234 1845830 1903955 1592480 2080981 1863658
3344 1863658 1898397 1531215 2424086 1807465 2047020 2209523 2356043 2866681 2284164 2969591
3334 2969591 2945563 2957699 3191166 3784868 3992650 4238593 5382259 5956322 6002948 6600748
3324 6600748 6132611 7215543 7779144 8897414 10376976 12846193 17907372 25309488 34391216
3315 34391216 50117571 63775680 60984205 51220488 49799167 44560659 36724360 26779771
3307 26779771 18795701 14279682 11547719 9801001 8592787 7895912 7165716 6778396 5616287
3298 5616287 5805841 5005457 4592929 3504756 3629787 2955973 2683879 2498733 2790900
3289 2790900 2324764 2552857 2170318 1939295 1470392 1682810 1665141 1251471 1661942 1806538
3279 1806538 2327921 2047600 1613704 1962791 1413816 1228877 1388847 1410267 1021123 1430838
3269 1430838 1444637 1197226 1258753 1145831 1232455 704308 919291 1516140 1726307 1258814
3259 1258814 1175239 501870 1586314 1599660 1043023 931891 711267 285010 813910 838506
3249 838506 641025 374981 970763 923723 833589 1128470 486698 468834 271888 747125
3239 747125 901289 500767 553772 1022995 725707 338662 550266 873220 266581 372439
3229 372439 740749 757254 889135 239265 386026 621591 386155 484842 -304947 34846
3219 34846 397322 302234 128205 260213 747976 447025 726524 105831 423527 24334
3209 24334 163531 504405 322295 490053 580134 -568443 -69309 -63006 578129 181445
3199 181445 212074 -176221 241978 963143 353089 257537 38520 429035 516916 335618
3189 335618 161947 955934 501837 698764 165908 243930 197535 408649 739925 784728
3179 784728 577970 230054 -223504 52079 -47617 323209 225991 566876 381626 349102
3169 349102 365671 205021 343484 164768 145241 363353 243531 459588 -151130 -10470
3159 -10470 362937 671532 681370 739958 720222 546305 196361 520679 324757 163479 257108
3148 257108 36916 374668 136087 270441 -50021 120826 -252844 296756 -11137 -63462
3138 -63462 14187 73309 45063 119158 260877 259320 538899 373888 114318 378941 136145
3127 136145 344547 276899 143485 146399 179745 181482 117792 702335 32785 522753 49001
3116 49001 -376623 -439304 109359 -418345 489348 -167736 823169 81795 280521 -40917
3106 -40917 604555 265902 -72475 395479 -100408 488971 24968 -204747 -447589 -293823
3096 -293823 -48496 4346 129487 764538 509942 677834 -182114 475149 34893 -43326
3086 -43326 359586 238281 430234 1274284 1099196 606574 372674 848544 392889 885006
3076 885006 821730 565587 523184 -29653 -57821 186793 -390475 -17876 -104673 -262146
3066 -262146 -192122 -153698 -146911 -341469 -30095 -56850 230582 -145424 -131256 95339 682569
3055 682569 359116 432449 162790 422649 205423 407199 -246560 10980 -23966 148371
3045 148371 851947 448218 651685 63066 201867 675008 402982 75298 -205373 -243359
3035 -243359 385228 274589 -90738 -84280 -239148 -5152 -78432 -440766 313067 -16030
3025 -16030 281367 -366612 35818 34875 43191 174282 167963 -244464 137015 -183028 -238278
3014 -238278 140432 -371818 537489 203048 464646 483416 535402 430160 828641 493926
3004 493926 301743 4900 -179698 126061 347386 -221094 394641 -216768 362236 52394
2994 52394 212963 -297000 -403052 499384 -67748 36625 164406 -248686 -436503 -191517
2984 -191517 -182881 -108064 314589 -519528 -190823 445423 312017 393436 -75645 166038
2974 166038 73460 -290486 -38524 -52539 210728 748379 -143476 381755 409174 520526
2964 520526 -138399 49774 -14439 -142250 -371259 -85009 304518 332521 222515 -9065
2954 -9065 322317 -486570 -501610 -235945 -278191 46067 -50408 -241887 -421623 152408 247545
2943 247545 -588896 198153 -203683 -175171 -289075 277157 -110005 432714 57456 142072
2933 142072 575019 153524 206228 -682 -21323 -178471 -463026 -44758 -120253 -187500
2923 -187500 410465 -26520 516012 4372 185482 236952 99135 110973 -40483 508305
2913 508305 102390 -293407 -170868 170521 223851 204137 130276 158062 222170 145433 -125134
2902 -125134 143179 -151547 61328 -14186 -563315 -75351 434922 260723 -288915 220579
2892 220579 12891 127703 281413 102196 483741 -19834 245366 216442 494393 145272
2882 145272 -248127 -29600 -309507 112462 -65075 -379184 166630 222867 310709 -291709
2872 -291709 92533 -154087 25031 424670 481378 429755 44039 -122186 -78161 -32156
2862 -32156 -448574 -83578 250915 446941 366729 347574 20544 22014 -240367 289764 388392
2851 388392 193797 -81203 173486 -51221 249921 331315 -73462 -163220 370284 -30251
2841 -30251 -129377 357469 -213012 227805 -11356 -111383 316198 136019 -371370 -288311
2831 -288311 -448552 -117531 -156483 122840 -234659 -208355 -112070 247278 341405 -165237
2821 -165237 -65018 151835 550813 351015 -127545 296643 41481 168800 148383 -330627
2811 -330627 404996 -158347 117461 323558 -34798 187677 -70074 143578 340725 276604
2801 276604 -79157 -379430 66243 190183 99394 -387654 -269571 -474360 -319538 -148555
2791 -148555 -133049 -140317 -271636 -116366 190536 658616 -256212 -272586 251340 -165978
2781 -165978 95699 -182053 -139492 613827 12434 637466 478619 642212 -86043 97645
2771 97645 96522 -170616 415492 98867 -307237 -83765 412281 264812 -151471 -374215
2761 -374215 -560189 -101050 119724 197054 -44067 175460 261868 321121 318298 -85741 18931
2750 18931 61264 187526 360117 385516 -130685 103314 32982 18082 108020 -165994 -168998
2739 -168998 -168781 127220 275840 547757 134580 40435 336681 -147304 569723 -92168
2729 -92168 -509244 91055 -233040 323163 204434 -254430 89420 -196550 115803 72533
2719 72533 5607 -432676 -187843 -168265 161643 472744 156826 -151347 128088 -430374
2709 -430374 21477 205296 137789 -301750 -348292 177731 -99287 -52216 347987 205268
2699 205268 333838 348279 -2014 483529 -215766 -289922 -123055 217418 116231 260110
2689 260110 -117483 86121 158467 -141581 70210 -81272 -275140 -47717 327076 278840
2679 278840 44037 277302 140196 248412 176774 197695 216066 -241609 -344356 -154815
2669 -154815 -105240 405345 360388 -13667 520584 -177709 -104102 -250101 454260 127667
2659 127667 -203060 -19174 -61074 -28421 -739020 -69291 -146311 -159492 -151233 -558093 -360747
2648 -360747 -164166 -352244 168657 135869 191905 -53326 735151 346062 -416457 -36252
2638 -36252 -153032 106499 95497 85400 -208133 148893 206756 -69369 248915 376359
2628 376359 580391 647158 569214 330937 538260 106993 -320243 254015 -419639 178395
2618 178395 -83070 -117761 98436 134267 124027 254324 -337739 345217 -406646 74911
2608 74911 -249625 -90509 -299942 -200342 135767 -256904 -55423 358967 206581 -218448
2598 -218448 196360 228579 -10243 315007 69169 276299 342843 243820 307102 339252 -213599
2587 -213599 461457 103297 23310 -164051 -16743 70499 -37429 -132951 -341631 -194587
2577 -194587 6549 -107101 5684 163516 -202571 -80335 -193366 80433 125229 90927
2567 90927 43532 252145 34439 127219 -315265 -261520 116219 238809 -44050 -126835 23110
2556 23110 -64877 245190 -239043 -171362 416000 610886 -7179 144687 113110 -91473
2546 -91473 297635 80698 -29602 -221598 -71638 61109 159273 115326 555283 167772
2536 167772 22110 -80276 726149 417299 -202298 -103466 56246 36522 267189 -289556
2526 -289556 -181358 -170697 59732 309639 -99525 -144271 248760 192747 5605 411636
2516 411636 142147 -182389 -401527 68462 74175 -147243 -17226 -129830 -67008 -337811
2506 -337811 495508 527503 -537007 -179420 60909 136572 -215345 -733161 -248765 48576
2496 48576 166906 -136295 -385952 -334244 -33962 -91845 -82727 -541548 104348 235140 -261840
2485 -261840 73753 214477 380355 -6972 160673 -45450 96139 296255 528422 -24610
2475 -24610 -242421 -33260 54811 -190356 -225733 55983 241533 63424 -130023 127957
2465 127957 290829 778742 178677 -377667 4554 216845 260884 -128502 -252221 18356
2455 18356 112201 110574 -197971 -304449 386262 -26205 -43107 94819 383040 1112 16940
2444 16940 590175 422705 -46332 116307 -205368 -477688 326 224256 149766 120617
2434 120617 -57222 278203 247426 -16940 -209827 -380628 -44675 -82505 -86144 -225439
2424 -225439 -130270 128811 -285752 -528689 -641648 109697 134883 -148991 72639 531554
2414 531554 -78306 349047 -303132 -267627 199961 -33859 -408481 -139728 -58102 -80188
2404 -80188 -247973 353627 178229 330800 477981 431924 -333267 176788 682810 83451
2394 83451 -346797 130670 358429 -193182 -97493 -70198 -147726 -147305 228677 -264838 579394
2383 579394 462142 727330 163775 -119583 -84157 -63320 40853 -179936 -197588 -237631
2373 -237631 20632 -110930 627733 221139 183866 40880 194008 37819 -7806 -37345
2363 -37345 147619 77050 10842 69458 152593 237547 -60766 285664 409216 -354212 -165057
2352 -165057 126296 -256651 249383 285238 -25686 373100 88862 234239 464824 -73026
2342 -73026 283908 173000 -404556 -103147 30589 206232 -114385 78217 342254 -96034
2332 -96034 239876 99365 -165927 273737 -66325 402715 -29217 88231 50354 522738
2322 522738 -113719 -39342 89126 -166029 387835 -387858 -312946 193457 120345 -76163
2312 -76163 110574 164261 226322 294914 -173514 -92805 209956 -281915 158647 -93390 -222499
2301 -222499 391813 -199071 -111544 224673 55737 415900 125007 367734 285841 263991
2291 263991 337192 130460 580521 53600 -94739 -215163 -426889 -176544 -88296 -151271
2281 -151271 26578 607080 168158 54100 -32596 163081 -493156 -273016 -606522 99396
2271 99396 -537376 -399522 101661 108150 -254497 -305678 117551 354994 -106330 297445
2261 297445 126907 413430 91647 -273709 349607 -12407 45614 199280 -95835 -134817
2251 -134817 91874 359240 386250 315444 426585 -89269 460819 -9375 86871 748128
2241 748128 -9585 307483 292081 -39689 1434 390741 172329 -186403 105467 74788
2231 74788 306747 218276 -121770 102462 256713 -571401 19300 -114211 -254794 173333
2221 173333 -66863 -279148 -205336 410684 135314 29701 -94463 -456919 -393147 -489968
2211 -489968 -186734 38752 -128258 145645 198998 98842 6425 111186 56913 206024
2201 206024 541579 -201576 212741 93104 51785 587987 206897 -3625 -428647 221100
2191 221100 201883 141191 246908 462450 27064 -191569 -76426 -494265 -170009 -86739
2181 -86739 -362821 -479671 112008 -235963 -186506 -527205 -92404 474255 71926 -300676
2171 -300676 -257395 12134 262679 292759 317172 -221433 359155 280040 45658 155609
2161 155609 228013 188876 130048 520541 840177 193646 370522 204025 340958 -103069
2151 -103069 33410 -100039 187668 -132399 -188252 -206708 73547 -523357 -3751 -201156
2141 -201156 -306070 -304170 -33408 -232473 -88901 38372 170395 33091 141559 -292504
2131 -292504 42813 32650 11204 -258390 -99405 -461629 -108599 214411 135154 -458652
2121 -458652 72416 -133548 306792 -2993 385286 438215 128948 91792 133195 318022
2111 318022 86747 -6335 -113890 398519 253425 138704 -151714 253651 -89667 152005
2101 152005 158448 53876 -203911 -255615 49211 87451 -224518 26956 43895 -319236 -196902
2090 -196902 -161622 -149803 201669 23422 377718 127286 -298316 -15355 123369 230092
2080 230092 -227597 249775 334404 -199832 19567 722488 122566 -127076 695288 190627
2070 190627 -65289 369141 -55561 -171451 -140554 22307 19807 -213357 -10604 497089
2060 497089 46668 592225 307068 575902 542458 483356 103113 -221129 41225 -151479
2050 -151479 31910 -139357 -317466 55640 228985 -309181 286717 102090 183519 -13492
2040 -13492 -189801 -744761 53135 -425016 31600 157778 62536 8195 -234085 -162576
2030 -162576 -200315 231985 310461 159589 360319 183274 141368 394710 -115975 122497
2020 122497 379164 333414 449811 618048 248253 551423 390594 31383 343926 -127026
2010 -127026 -365651 -413892 -96690 -216022 17578 253969 -205526 37666 125178 241950
2000 241950 -75404 -107308 -234886 -441107 18440 -17728 -56149 -266522 26719 -37222
1990 -37222 -315225 79095 -133855 52800 -90062 142980 104517 248365 345026 -342287
1980 -342287 566960 151969 -79096 82547 -207917 262621 42845 426299 5593 -150669
1970 -150669 333761 -297105 58314 -395770 -178292 361079 -261588 657549 478096 -24423
1960 -24423 -9554 -13514 -83974 -367098 89681 -61272 382600 177724 239015 109478 111747
1949 111747 -202560 425591 -14329 -212631 471081 -57166 64541 -282907 -128 319154
1939 319154 189975 -123401 -391434 -7429 44329 165364 257312 30649 523869 781882
1929 781882 588705 713383 -164659 178683 -162205 -96877 -3027 -196161 -32343 108097
1919 108097 75055 40052 -22216 -406968 -369636 173950 210881 255422 177218 330852 91422
1908 91422 -1350 340660 -15875 -308458 -246460 -203497 454835 167 -242546 -372
1898 -372 -21074 51643 146995 -92152 -404988 522536 -113063 29104 159132 -8090 -221859
1887 -221859 -235176 -173335 60247 -197192 65412 -432515 478671 442635 507586 150287
1877 150287 -265728 -188106 -51963 -56794 -266895 -127777 40448 -78603 -18952 -51753 348820
1866 348820 290724 248606 145492 -16606 -283944 -249939 5721 -103204 218223 517041
1856 517041 430514 -211540 -48123 251001 152414 -116152 -230739 -80841 -293 -500127
1846 -500127 -230972 -253749 42090 -200359 -328620 177428 187971 425230 462712 135956
1836 135956 164305 136761 -54441 -329337 -140812 284277 824 252020 699038 390570
1826 390570 409021 285916 373810 13658 606498 476374 -371172 553817 710055 193585
1816 193585 173925 -654734 -756 -98813 -418095 -188392 -326944 -393152 32809 -361408
1806 -361408 146631 -163639 82159 597 -256162 -110133 90512 243794 151463 64483
1796 64483 11706 -1464 162586 205081 -446599 125930 287729 -260828 441370 408610 -36337
1785 -36337 673627 385269 328650 -226634 -181413 -262987 -11381 -134442 -41199 240331 461110
1774 461110 -229063 200811 120342 7161 382468 -314920 -81229 -2302 187710 -106718
1764 -106718 -143677 581706 -306829 407043 -289552 86419 -287803 -340607 30291 -333533
1754 -333533 -100957 -112725 196320 313963 -199250 334898 -104914 27953 196525 537470
1744 537470 741873 456316 -62659 363618 -294130 -69267 -154728 -108178 72202 6068
1734 6068 51139 -135435 -35120 46823 213672 -40490 -406736 -366605 227628 25374 -223183
1723 -223183 81716 -370926 117878 -270969 -240408 114564 97328 -221256 318924 88055
1713 88055 -68576 427749 552894 260607 12774 121349 -166640 -147044 517529 -54074
1703 -54074 455851 -63192 -536747 249214 -269550 -64186 -117472 -564855 242662 119230
1693 119230 122027 369647 71737 -10122 358244 448267 -531410 -457258 -269048 99867 199763
1682 199763 459268 232505 298409 360749 613493 418627 237109 -432069 59996 496158
1672 496158 647175 91282 169549 162189 -75662 149535 -431885 -382601 -172585 84936
1662 84936 430306 674645 98791 -86822 -184255 -81007 -46191 -222908 -123906 -149840 -252173
1651 -252173 215306 47056 264588 52803 -107519 -3576 80466 109679 192592 452313
1641 452313 251333 197699 89168 -62189 98552 431565 -388014 315972 29973 78118
1631 78118 139880 -180018 79376 54900 309267 -384513 330533 -562012 99094 454964
1621 454964 104945 -34909 -268249 -180401 -131611 -165105 -206142 -362502 90182 17107 172008
1610 172008 397193 -399103 520181 727024 279392 -57698 103343 76297 232262 204324
1600 204324 -33103 289434 134797 346246 183470 -239241 -66585 352102 116830 264513
1590 264513 511661 -182372 105809 246292 -46759 -179238 -143328 -385429 -298543 -191969
1580 -191969 -325332 -74573 -501297 -542694 119015 -317435 -88371 -371330 251927 -11372
1570 -11372 202697 158041 -377095 -394580 -344524 -288951 139659 -181093 144502 55157 172266
1559 172266 500378 247084 470752 131049 63580 602472 346532 36115 -101351 378400
1549 378400 -127437 -16612 318058 20054 607740 -175415 44712 565662 81884 270599
1539 270599 201171 -16373 -537745 345750 -91083 120257 22630 264643 -185168 37370
1529 37370 4177 -123659 489730 -28060 -333129 16073 221857 545451 410301 214817
1519 214817 207103 540783 433125 154407 236436 212938 36279 112160 -158799 -103322 -186011
1508 -186011 -244713 143120 512 103716 530006 -28672 81027 -36966 -85124 -42913
1498 -42913 -91953 -346947 17896 180642 -176170 -17710 -395647 -452451 -439133 165718
1488 165718 -478689 323526 -12846 226905 403880 67163 -214637 18170 -323821 -510083
1478 -510083 128279 -69331 86591 676477 74530 392777 401797 -116564 -203938 -157442
1468 -157442 -187360 442182 605163 218205 23088 -78553 342533 175811 -482933 -372137
1458 -372137 105429 -215866 92177 224862 372800 634122 765243 -2258 -167377 331140
1448 331140 -228862 645652 347844 -11106 -126880 89375 66628 273119 439765 163304
1438 163304 -250273 -168207 511420 385720 546403 -150542 90954 245323 103618 3034
1428 3034 -177143 -670688 -348196 273305 366395 179839 -136496 112281 344212 -258405
1418 -258405 -201804 -758354 -718097 -327103 318268 377084 -148868 -163235 8451 342992
1408 342992 466027 -680016 -409753 -250671 375215 370906 -156012 418648 1846 -21926
1398 -21926 250170 278456 -107971 -540097 315093 477991 342691 264954 -170040 -152452
1388 -152452 -329641 -182743 217072 -592430 -130309 -245864 314271 349302 -116171 -75571
1378 -75571 -325679 -168239 -51061 -92014 -142862 221841 504696 -27894 766861 372661
1368 372661 548160 228207 -288228 543700 160349 549977 66423 185909 275984 566251
1358 566251 348509 -274861 -230617 -98410 395747 13200 -107134 -84357 381017 301553
1348 301553 65965 -57732 -700962 -351816 -138000 -284160 420180 -134783 -281114 201233
1338 201233 196508 358743 -41393 119810 -528192 -203032 339001 202507 136935 -116927
1328 -116927 102007 410361 17544 -146418 -258131 -265738 -165479 268072 -140629 -310487
1318 -310487 112998 287438 459522 115317 -239546 -157687 -220384 158222 -220482 212046
1308 212046 -204510 480567 -1504 25060 -143925 -319567 -296488 -115751 581683 12605
1298 12605 776704 -85884 41697 216361 482575 -31708 -555787 -247567 -216043 289329
1288 289329 294357 10467 259824 149199 61693 -498936 98172 354711 231861 436240
1278 436240 95091 4196 558547 202598 171202 -77175 -290103 -592977 -414723 -97000
1268 -97000 933257 432712 179439 -55379 318378 130449 364352 -186215 2782 260955
1258 260955 -69348 79356 1121 -8175 -417073 -179118 -98028 212886 -28519 -294949
1248 -294949 -49337 -130669 165939 165713 -108829 -281297 1008 -482576 33487 -304809
1238 -304809 12935 210491 125871 445062 706555 454709 -361923 474311 350692 59453
1228 59453 79467 275067 15224 337314 83634 209563 -404771 -39174 218811 295790
1218 295790 195473 30902 -62732 256142 128462 474160 74006 -104150 89116 70859
1208 70859 -78479 71831 198172 -83634 -86382 491383 159398 -84149 -505291 -79209
1198 -79209 78685 129440 215670 286714 -6337 -72524 11686 102012 -269697 -299795 -30112
1187 -30112 162039 91825 361764 75910 160442 203772 586414 -242414 198850 226406 -156435
1176 -156435 -112738 -272774 -63495 -477463 183755 260061 -69998 57156 -50053 -398561
1166 -398561 -242585 -145597 -127751 18521 -16079 -30657 214381 467337 255634 104086
1156 104086 299075 277348 184578 416828 605755 277920 652966 426599 463418 22229
1146 22229 -196647 -156969 -241670 222069 103466 187622 350587 484748 -81376 -20871 -58456
1135 -58456 156342 -69359 145062 14899 -163679 -184014 78876 -519846 86456 60913
1125 60913 -69790 -198207 -420880 222821 658500 96521 -53025 -5236 410896 -186330
1115 -186330 34309 -188091 160533 -269204 19332 127617 135643 200997 -166261 239429
1105 239429 154576 234471 106689 -384778 255752 135707 -237074 151433 122714 -52625
1095 -52625 -205258 -546097 -319755 254521 158757 167685 309949 28125 74620 189817 144435
1084 144435 -280336 78575 -264930 142227 39720 -283380 373432 -39544 -364513 -1090
1074 -1090 71086 613085 207000 272990 183530 -31294 299161 333402 90630 131168 -349835
1063 -349835 187502 141093 -9096 -258566 167588 232531 583357 -68161 302251 -367138
1053 -367138 127798 180454 -128028 189413 179773 -144286 30603 176086 665891 30009
1043 30009 -373439 -65951 -40401 88286 -518580 -147746 -103506 -454968 -139586 162379
1033 162379 -159552 -150311 163046 -60050 69638 -449995 -148756 1093 -35058 -408966
1023 -408966 134381 179921 428618 37764 410111 714459 824939 152271 251015 -11204
1013 -11204 -37379 -71107 220537 245694 -133263 221717 -44269 -241803 80738 -230869
1003 -230869 462582 -27888 -6935 163396 -102449 -179093 -318358 249740 339206 -70301
993 -70301 522222 -364208 208226 291079 -420164 98006 272045 -442702 -129736 -22996
983 -22996 -70306 -30257 -395212 273896 556468 16151 127072 -257057 -651721 -89869
973 -89869 -151276 120393 -408020 -119153 385977 -500369 142328 98207 -188274 65832
963 65832 -152472 614863 54676 120165 45726 -240373 -167501 -237801 -650504 -187407 131069
952 131069 164071 -286927 -612911 211389 -387714 335359 53629 218398 17550 -236522
942 -236522 144086 -77463 -111257 222368 167165 3113 -185515 201906 -355772 237418
932 237418 -478389 370976 115056 300668 241323 289634 9617 166809 6912 176515
922 176515 -76550 394719 -130683 89969 28429 152615 -29380 -8698 275285 592767
912 592767 586050 104053 236806 -3110 -357941 40581 -410091 -67005 -194611 175216
902 175216 217553 168889 444144 252450 13014 77970 -280280 -272939 -363532 163851 -45649
891 -45649 204871 -138329 72207 -178562 -432015 -33972 -330881 16628 -212748 179317
881 179317 256627 705278 183016 -132114 -447113 -400235 -496412 413113 232351 340770
871 340770 287419 351280 176706 124901 -289165 65127 -906979 332694 144959 -268711
861 -268711 499775 428922 46041 -138428 378890 165798 -84270 263431 77262 -49489
851 -49489 18239 100580 122266 -2477 -152895 -267731 -247833 -167917 226128 249815 285212
840 285212 309375 -384668 -9130 -644199 -272577 418139 103767 475213 339217 147091
830 147091 492906 -6516 303903 -150659 -172799 283575 85312 508106 -141467 179409
820 179409 577019 544752 -40391 188721 -155064 -128040 -217833 -134443 178405 -239443 -463330
809 -463330 139669 106016 -68449 -188135 -472284 -214791 -47685 272670 -375191 490572
799 490572 484888 638605 193058 110655 35545 291043 -163033 334314 443437 42732 208247
788 208247 533186 -139426 -465103 52845 122933 -37238 127927 -76453 136887 626034
778 626034 263123 469757 -155061 -369189 229539 -299188 -357045 -127909 -249018 -94
768 -94 234861 97305 -246146 182613 -630327 -447006 -305193 33014 65185 131685 151471
757 151471 -131279 234333 -178022 -289858 630472 441541 617160 416521 56804 548469
747 548469 230821 266739 379973 -203865 153763 628087 117993 -316337 141329 94827
737 94827 -8132 -273036 -335009 -170398 66945 -208717 -525466 -149661 -425428 -490999
727 -490999 -37627 -80310 227660 -259945 -189708 224730 -302119 435208 -220745 -508766
717 -508766 105700 335098 194333 282157 105395 -31207 527152 335544 220095 126329
707 126329 265464 151482 -137858 755570 -249157 -40123 25500 -33978 677112 174848
697 174848 -162863 261223 96699 -13792 -96726 104820 -342735 183607 214888 -195804
687 -195804 -190866 -336382 -389685 -124596 -288761 -670244 -364250 -263404 -138461 81431
677 81431 -514673 362229 81034 -239664 -8068 178100 486413 95382 -148116 -575639
667 -575639 -67701 -37813 -115567 -32819 166772 91196 498595 374002 344456 516954 258415
656 258415 -43328 335004 315109 469097 -177891 -183395 122877 -62915 -118798 117795 -258642
645 -258642 -130914 49185 146640 -104697 -239843 -11454 101795 91575 321240 -447696
635 -447696 -427265 -474595 -394386 -10942 -293661 -230771 195095 142989 2617 29649 13125
624 13125 -6976 -106089 20847 788891 346841 -213126 293995 112920 -151252 328903
614 328903 -131194 26477 -257110 336383 297436 17130 92367 -280814 211758 185481
604 185481 49745 386740 -132342 -164125 -34246 -10584 245095 -600140 -224761 -432845
594 -432845 -449011 161561 40376 -49079 -209198 511034 346285 260200 -100633 -207388
584 -207388 -88527 392742 90283 -306606 99730 -147712 -92054 216883 -269657 190804
574 190804 151530 171399 -53072 -24827 17104 -650423 -118492 54154 567966 -107658 -102875
563 -102875 -224584 -156813 -47251 190432 81339 -5824 122833 395079 121516 93807
553 93807 -164714 645891 556361 325161 615251 -230583 -10591 181657 81419 204659
543 204659 14297 -286426 -34532 69510 153582 -24938 -46842 59770 -82997 390136
533 390136 135391 63209 -40215 -13747 210818 -303254 111309 -172292 -308989 -272566
523 -272566 84766 -289704 93939 -32309 284696 329938 600271 103083 213880 119452
513 119452 464392 -308239 -70863 219025 -137382 -50093 -310247 -125177 189268 -242988
503 -242988 331419 559991 212638 -221579 167521 -21299 31172 -37470 273309 106683
493 106683 -293869 -600399 -268281 -188093 -337003 -218237 239024 -10413 82370 29248
483 29248 346882 -36473 -34527 -101404 369965 368178 -112804 127081 -93810 -231420 -382201
472 -382201 196706 -144418 -62829 51357 509425 488477 467688 135724 535769 39233
462 39233 173905 106267 69630 -161648 -108265 -327682 -159248 -271263 80106 -110213 91478
451 91478 253466 42937 -5921 -187465 111698 307848 -143866 438401 -341172 158714
441 158714 -74223 -423509 114399 -537042 -285030 152800 134738 210482 819400 255465
431 255465 439881 318550 77219 107304 18640 -11434 117067 -294634 -238233 41635 -377944
420 -377944 -100782 55668 28112 -233392 -46614 208797 63944 106511 262499 85549
410 85549 174665 -23918 -412449 -400061 -439754 142059 -299043 -224222 266597 517533 126993
399 126993 389880 452044 -80417 186862 249788 -145280 129765 76395 125845 184210 92666
388 92666 227064 -298517 -663129 -18273 -142174 -607362 96199 349344 597459 362623
378 362623 135550 -56272 228297 -178139 -185537 -252707 476114 228960 278085 -295859 -259256
367 -259256 -186482 -124798 -18009 -161532 -39508 294800 398175 623530 -44073 -463224
357 -463224 -315242 -150240 495569 268219 -158628 -167952 -262357 536957 -46973 725333
347 725333 80940 957344 327464 12515 44342 158459 -360823 -107647 198815 255642
337 255642 57400 -182744 -305360 -217626 35755 241698 -133229 -172366 212742 166892
327 166892 168461 313692 -472082 -85291 -133494 159527 -61194 398936 204376 440322
317 440322 151865 -90163 -3947 199382 -298853 147648 728939 402819 -55842 286712
307 286712 511680 336117 -79734 -7118 505097 19598 -153789 -84448 176078 198380
297 198380 346300 -91353 235675 -30747 -362009 245010 208863 109988 -25841 87208
287 87208 -428075 -620673 134728 -24296 231670 -50880 22101 -412173 -327166 180324
277 180324 432870 493294 -135545 -389812 282542 130860 103832 -191031 -521845 -16604
267 -16604 167982 -131573 -183516 114717 -364184 191429 193811 -13386 249155 -584 340426
256 340426 -320514 -191289 -81035 -359931 -762280 -703439 347684 -18143 302211 -430958
246 -430958 362869 203808 91505 169925 -18067 106627 -125429 101686 61398 -11313
236 -11313 -661706 174633 -80741 -225786 -349276 -73534 13514 -113226 -333690 229878
226 229878 -85628 89269 350323 -155285 207537 -196927 -259803 2001 60506 61170 146984
215 146984 -423061 125317 -125799 338558 -17894 87764 169772 24783 10880 -474905
205 -474905 -83617 261781 -183480 -188604 -104038 -526625 -411242 -230629 -135041 -154766 118991
194 118991 162563 422575 -123150 8283 13397 233320 64610 392218 376038 96311 -24854
183 -24854 1266 -174168 -379552 -74981 175341 -93540 306851 156971 403489 103445
173 103445 70614 238331 -119724 -190092 59326 72562 -7224 316391 -318202 41680 -100947
162 -100947 -323940 267542 -363507 360435 65966 -249605 117405 137442 187467 -497697
152 -497697 -22494 -208467 250718 -109187 -173922 -182572 -216680 -161401 -105392 -101037 176713
141 176713 175094 441735 -106504 92712 -123265 194730 43305 -332100 158894 17429
131 17429 559980 -62340 9319 -187018 -102342 -73299 -368183 -217888 109469 134864 317240
120 317240 69539 7255 -84465 163675 628298 -75410 -40715 -135782 -290647 27694 -80608
109 -80608 -430096 6529 87932 -187625 423127 356710 -9923 32936 287655 50229 22211
98 22211 -52417 188547 -117617 -304692 -211227 -237350 -525206 -554368 477842 203633 253655
87 253655 -529599 204138 -247066 -290586 -216133 -164044 200545 117598 -7636 588372 -178700
76 -178700 -135406 -304648 -225720 -179783 395415 -191336 297081 34127 142572 452730 61908
65 61908 -61664 -83644 207236 109813 201940 -450049 -289229 -547609 -55690 -229550 -232446
54 -232446 -65678 171920 -237619 -38153 106473 -184175 -469293 -282259 -144358 -157264
44 -157264 -255471 -514308 -241431 -166536 -133792 122717 -25551 -343564 -114034 -11554 225801
33 225801 -286879 -47012 -250233 22980 216157 420493 469147 77171 -295809 -212058
23 -212058 42177 -345223 -343981 30933 -289101 18048 -204096 -348034 -364513 -330186 -417286
12 -417286 63679 -417045 -303427 -319174 -307314 -149528 -210518 -314794 -205492 -435548 -270128
1 -270128 -39813
0 -39813
$$ Imaginary data points
##PAGE= N=2
##DATA TABLE= (X++(I..I)), XYDATA
16383 -642550 -440518 -754319 -653397 -279673 -749058 -752328 -357735 -478191 -615079 -231472
16373 -231472 -311085 -101472 -292624 -61893 68552 -462495 -733029 -434824 -129210 -584152
16363 -584152 -183934 -507040 -308363 -211660 -112878 -193881 -382373 -300906 -126197 98632
16353 98632 170321 -499876 109668 309541 155423 -79828 180263 123262 5671 385120
16343 385120 378470 225500 357162 357835 207182 308672 353721 438254 245482 632999 538540
16332 538540 319581 385893 774927 190763 193046 585609 476232 328322 211575 229886
16322 229886 526740 395947 501077 601986 635676 649754 918003 730701 581815 149543
16312 149543 272732 630989 597522 682331 509409 913986 750269 613268 734893 705737
16302 705737 862556 550502 935311 755016 1016030 1291735 1021356 1040115 517290 1005297
16292 1005297 1174902 637645 858682 1332535 1258133 965335 1247673 1226542 1358025 1611198
16282 1611198 1149032 1449136 1217957 647155 970719 1348531 1154310 1174580 996807 1074730
16272 1074730 1171990 768845 1336893 1215373 1466824 1335251 1441522 1559497 2042079 1513570
16262 1513570 1259482 1575858 1574420 1491886 1611482 1473696 1924098 1586657 1710146 1870086
16252 1870086 1738767 1583943 1986061 1842425 2263974 1964449 1771537 1457264 1303770
16243 1303770 1113088 1646532 1700971 1373498 1439057 1403568 2098516 1901859 2099050 1714053
16233 1714053 1452040 1678037 1781447 1681870 1679363 1413276 1606695 1912037 1373007 2148786
16223 2148786 1874476 1809573 1757453 1726127 1550305 1755460 1982207 2652072 1855741 1837131
16213 1837131 1811671 2234148 1581111 1581930 1943677 2249431 2103471 1862649 1832789 2061903
16203 2061903 2275400 2453234 2420209 2635656 2344770 2340453 2342074 1932810 2282162 2245280
16193 2245280 2271127 2030206 1907692 2210590 1963955 2574570 2598773 2058092 2504997 2270363
16183 2270363 2253980 1841146 2429533 2058409 2153631 2118792 2238417 2434082 1922703 2148347
16173 2148347 2793771 2382689 2166227 2330185 2151021 2076828 2231201 2493653 2686132 2549284
16163 2549284 2733783 2612681 2359146 2199136 2810667 3025760 2855600 3057863 2599100
16154 2599100 2990319 2534342 2633521 2578391 2807774 2571056 2570171 2483976 2468792 2137084 2532389
16143 2532389 2339589 2583555 2424595 2162773 1840216 2526156 2644809 2040312 2343365
16134 2343365 1900142 2379445 2434362 2651465 2691108 2617059 2380695 2790814 2225364 2688047
16124 2688047 2388938 2810243 2700441 2938578 3080656 2415213 3164990 2762923 3220154
16115 3220154 2868654 2421714 2710150 2739400 3414405 3087710 3262121 2784003 2539571 2430867
16105 2430867 2698156 2343105 2575042 2971023 2951378 3161309 2907217 2407309 2806907 2879200
16095 2879200 2798800 2624162 2496441 2750625 2771286 2447900 2612320 3026124 2867075 2595072
16085 2595072 2573784 2536057 3041065 2642373 2626049 3152981 2907191 3119068 3329866 3336325
16075 3336325 3088501 2867408 3285159 2566958 3022144 3012273 3338998 3558786 3236015 3301857
16065 3301857 3213922 2835365 3460084 3603029 3351246 3303734 3300505 2720418 2903590 2980779
16055 2980779 2927920 3335575 3074906 3558627 3212213 3462179 3002682 3906291 3135148 3342387
16045 3342387 3403102 3374559 2991679 3114687 3040342 3289736 3017586 2725935 2787410 3250331
16035 3250331 3323599 3232876 3076424 3480636 2848520 3284895 3663569 3184688 3377993 3519987
16025 3519987 3875518 3918714 3464288 3382548 3378508 3622300 3486365 4202137 3626085 3844232
16015 3844232 3797824 3552910 3946273 3310480 3564060 3829240 3659241 4020400 4028206 3960083
16005 3960083 3793008 3421172 3721225 3467108 3503866 3672919 4011987 4007158 4305226 3526922
15995 3526922 3831478 3849950 3469650 3964029 4455644 4087965 4108117 4088693 4177910 4156606
15985 4156606 4196408 4342962 3826144 4404354 4315001 4779636 3997197 4495426 4241121 4108772
15975 4108772 4416139 4547850 5062442 4821053 4506054 4963966 3979011 4318597 4029270
15966 4029270 4499359 4192496 3987727 4473526 3958071 3785280 3514595 3637067 3574927 2960195
15956 2960195 3010458 2766929 2783996 2886691 2493462 2084365 1831924 1431574 1547041 1247388
15946 1247388 1372297 732075 905467 329723 830050 565327 509350 569504 442737 312914
15936 312914 492847 -164492 -53399 79761 311 -11437 -240089 -178949 -257963 -97876
15926 -97876 -54066 -339345 -91545 -261652 175715 331419 59635 26189 426680 278177
15916 278177 52169 195616 70550 -122725 452134 -81892 124022 -59335 -69403 -56255
15906 -56255 243428 -112815 -355647 228643 285530 505583 11990 -326 -100265 472275
15896 472275 537554 338126 338566 407415 -51350 375114 647469 936651 483392 610295
15886 610295 880497 1164830 986513 1258400 1101184 868830 1139674 1243379 665190 688332
15876 688332 676053 494119 757951 692634 732979 939680 863480 698772 890780 929099
15866 929099 1018868 861192 726056 1546422 1245855 1521022 903397 853621 1567996 843439
15856 843439 757389 821388 1140168 1341534 1242834 1555247 725359 1215818 970331 1295401
15846 1295401 1785223 1395951 1023626 862043 737967 1242247 1160148 1443859 1222859 1199244
15836 1199244 1483935 1280499 2039260 1368991 1534881 1546432 1814404 1658079 1272354 1537751
15826 1537751 1444931 1237348 1129221 1197721 1092961 1058752 1080614 1364187 1941859 875567
15816 875567 1108330 1345398 1267047 975323 791181 1060333 923137 854657 1001100 1358830
15806 1358830 1865549 1558375 1401316 1916513 1326073 1405096 958357 1194369 1486261 1647575
15796 1647575 1382135 1328680 1737973 1917641 2036294 1552245 1366300 1041277 1664340 1817118
15786 1817118 1600880 1622589 2000236 1426776 1823362 1688687 1730868 1841295 1515752 1673897
15776 1673897 1580723 2030867 1882665 1491673 1571228 1574027 1187052 1629399 1281207 1342446
15766 1342446 917225 1152574 1725283 1628935 1748099 1915219 1349681 1499465 1696995 1614639
15756 1614639 2240597 1664122 1642638 2469501 1750119 1759406 1794444 2085367 1686114 1744767
15746 1744767 1717484 1358890 2225024 2017834 1507868 2073665 1645440 1309928 1394541 1545140
15736 1545140 1554446 1272941 1750560 1537877 1569638 1571717 1417172 1516217 1656120 1084633
15726 1084633 1073781 1608943 1828747 2084312 1289136 1949343 2101014 1423404 1612495 1776548
15716 1776548 1415932 1792984 1726672 2132635 1919626 1980004 1754337 1724923 1700064 1334782
15706 1334782 1332659 1417562 1777132 1895859 2236949 2382802 2104919 2428100 2316249 2205183
15696 2205183 1794579 2173303 1855812 1848292 1993871 1681523 1743843 1550735 1595567 1709896
15686 1709896 1498803 1557362 1885319 1891016 1801036 2285710 1917523 1795687 1762622 1695654
15676 1695654 1331990 1337100 1876299 2313114 1611843 2156257 1917237 2084582 1676033 1840745
15666 1840745 2018203 1830374 2592365 2045114 2084703 2021129 2172255 2165295 1829165 1978466
15656 1978466 1940744 1910325 1533125 1673370 2195222 1974879 1677392 1929698 1732050 1997278
15646 1997278 1760282 1889836 1719477 1890366 1739025 1947429 1520577 1635935 1602994 1858091
15636 1858091 2210343 1731496 1896633 1517193 1478317 2002679 2114694 1926634 2129928 1619207
15626 1619207 2283251 2358295 1686814 1831350 1824509 2318162 2242869 2127810 2081303 2086596 2094945
15615 2094945 2317882 2354461 1846980 2156097 2023735 1988414 2089606 2312938 1994070 2248457
15605 2248457 2123609 2073587 2341120 1996837 1527218 1361040 2332292 1989807 2466327 1506405
15595 1506405 1833360 1905364 2002356 1865465 1953633 2065086 2232001 2379896 2102185 1831874
15585 1831874 1705100 1979305 2031275 1762231 1884315 2143612 1844739 2399825 2375372 2260875
15575 2260875 2434617 2350668 2157726 1911973 2276007 1908090 2282103 2190047 2143089 2414080
15565 2414080 2182007 2363598 2217267 1499433 1921892 2101797 1857007 1833819 2123522 2276601
15555 2276601 1467382 1884935 1745527 1434130 1654653 1709064 1528457 1820535 2128133 2178117
15545 2178117 1926931 1518049 2112033 1727094 1998568 2263668 2403911 2187661 2280250 2734830
15535 2734830 2480998 1965115 2517455 1866790 1997428 1732530 1725559 2038136 2160960 1967400
15525 1967400 2750680 2478411 2086783 1640001 2063436 2068337 2267962 1888773 2109638 2014490
15515 2014490 2062347 2758076 2120724 2049767 2107438 1914628 2097607 1978178 2228093 1578984
15505 1578984 2229532 2149856 1842324 2069690 1876323 1900564 2182946 2282446 1854179 2367337
15495 2367337 2227109 2087270 2577753 1679499 2114353 2040284 2405086 2080767 2283477 2434500
15485 2434500 2527094 2758968 1773657 2267968 2530871 1778328 1930293 1975942 2490544 2189705
15475 2189705 1878034 2206717 1908741 1620506 1941541 2089125 2349680 1834521 2193591
15466 2193591 1999842 2049888 2052048 2287883 1498155 1845597 1677799 2203176 2564324 2259932
15456 2259932 2282750 2472128 2590082 2486095 2030790 1973099 1658726 2302267 1778720 2389283
15446 2389283 2615136 1880724 2200970 2385834 2042604 1601782 1905736 2005986 2419645
15437 2419645 2619944 2208432 2490399 2167575 2216367 2353490 2196123 2013879 1919033 2380812
15427 2380812 2591884 2696506 2683781 2081242 2213725 2216458 2620840 2131965 2087572 2233323
15417 2233323 2124853 2280759 2286325 2242006 2006142 1727621 2157232 2127909 2534012 2043609
15407 2043609 2706861 2612861 2315454 2928350 2655231 2281409 2080741 2244645 1896715 1805260
$$ [...]
##END NTUPLES=NMR SPECTRUM
##END=
