##TITLE=abcd
##JCAMPDX= 6.0         $$ Bruker NMR JCAMP-DX V2.0
##DATA TYPE= NMR SPECTRUM
##DATA CLASS= NTUPLES
##ORIGIN= UXNMR, Bruker Analytische Messtechnik GmbH
##OWNER= root
$$ XWIN-NMR		Version 3.5
$$ Thu Aug  6 17:49:27 2026 Russian Standard Time (UT+4h)  servis@DPX200
##.OBSERVE FREQUENCY= 200.131235884673
##.OBSERVE NUCLEUS= ^1H
##.ACQUISITION MODE= SIMULTANEOUS
##.ACQUISITION SCHEME= undefined
##.AVERAGES= 24
##.DIGITISER RES= 18
##SPECTROMETER/DATA SYSTEM= spect
##.PULSE SEQUENCE= zg
##.SOLVENT NAME= DMSO
##.SHIFT REFERENCE= (INTERNAL, DMSO, 0, 16.4885)
##AUDIT TRAIL= $$ (NUMBER, WHEN, WHO, WHERE, WHAT)
$$ ##TITLE= Audit trail, XWIN-NMR		Version 3.5
$$ ##JCAMPDX= 5.01
$$ ##ORIGIN= Bruker BioSpin GmbH
$$ ##OWNER= servis
$$ F:\spectra/data/av/nmr/H1/1/pdata/1/auditp.txt
$$ ##AUDIT TRAIL=  $$ (NUMBER, WHEN, WHO, WHERE, WHAT)
(   1,<2026-08-06 17:48:51.62 +0400>,<servis>,<DPX200>,
      <created by zg, POWCHK disabled, PULCHK disabled
       terminated by command 'halt'
       configuration hash MD5:
       00 E9 B6 7A A2 85 ED C7 34 08 36 98 17 FE 4E 26
       data hash MD5: 32K
       26 4E 4D C5 70 2D CA AA FA 83 F8 A6 A9 CC 40 8E>)
(   2,<2026-08-06 17:48:53.39 +0400>,<servis>,<DPX200>,
      <Start of raw data processing
       efp BC_mod = 2 LB = 0.05 FT_mod = 6 PKNL = 1 PHC0 = -411.9518 PHC1 = 3.101563 SI = 16K 
       data hash MD5: 16K
       09 3A 83 52 E4 0F EC 88 B6 E9 FB 9A 04 5C C1 F9>)
(   3,<2026-08-06 17:49:06.14 +0400>,<servis>,<DPX200>,
      <pk PHC0 = -3.8 PHC1 = 0 
       data hash MD5: 16K
       8D 74 20 AC A0 CB F8 89 2D 27 E0 51 FF 39 94 C7>)
$$ ##END=
$$ 
$$ hash MD5
$$ 4C 5E CB AC 29 76 46 6C 7D BF 48 4D 7E D5 2A 5F
##$RELAX= 
##$RELAX= 
##$RELAX= 
##$RELAX= 
##$RELAX= 
##$RELAX= 
##$RELAX= 
##$RELAX= 
$$ Bruker specific parameters
$$ --------------------------
##$DU= <F:\spectra>
##$EXPNO= 1
##$NAME= <H1>
##$PROCNO= 1
##$TYPE= <nmr>
##$USER= <av>
##$AMP= (0..31)
100 100 100 100 100 100 100 100 100 100 100 100 100 100 100 100 100 100 
100 100 100 100 100 100 100 100 100 100 100 100 100 100 
##$AQSEQ= 0
##$AQ_mod= 1
##$AUNM= <au_zg>
##$AUTOPOS= <>
##$BF1= 200.13
##$BF2= 200.13
##$BF3= 200.13
##$BF4= 200.13
##$BF5= 500.13
##$BF6= 500.13
##$BF7= 500.13
##$BF8= 500.13
##$BYTORDA= 1
##$CFDGTYP= 0
##$CFRGTYP= 5
##$CHEMSTR= <none>
##$CNST= (0..31)
1 1 145 1 1 1 1 1 1 1 1 1 1 1 1 1 1 1 1 1 1 1 1 1 1 1 1 1 1 1 1 1 
##$CPDPRG= <>
##$CPDPRG1= <>
##$CPDPRG2= <>
##$CPDPRG3= <>
##$CPDPRG4= <mlev>
##$CPDPRG5= <mlev>
##$CPDPRG6= <mlev>
##$CPDPRG7= <mlev>
##$CPDPRG8= <mlev>
##$CPDPRGB= <>
##$CPDPRGT= <>
##$D= (0..31)
0 2 0 0 0 0 0 0 0 0.06 0 0 0 0 0 0 0.0002 0 0 0 0 0 0 0 0 0 0 0 0 0 0 
0 
##$DATE= 1786024131
##$DBL= (0..7)
120 120 120 120 120 120 120 120 
##$DBP= (0..7)
150 150 150 150 150 150 150 150 
##$DBP07= 0
##$DBPNAM0= <>
##$DBPNAM1= <>
##$DBPNAM2= <>
##$DBPNAM3= <>
##$DBPNAM4= <>
##$DBPNAM5= <>
##$DBPNAM6= <>
##$DBPNAM7= <>
##$DBPOAL= (0..7)
0.5 0.5 0.5 0.5 0.5 0.5 0.5 0.5 
##$DBPOFFS= (0..7)
0 0 0 0 0 0 0 0 
##$DE= 6
$$ [...]
##$SUBNAM4= <"">
##$SUBNAM5= <"">
##$SUBNAM6= <"">
##$SUBNAM7= <"">
##$SUBNAM8= <"">
##$SUBNAM9= <"">
##$SW= 20.6817932712277
##$SWIBOX= (0..15)
0 0 3 0 0 0 0 0 0 0 0 0 0 0 0 0 
##$SW_h= 4139.07284768212
##$TD= 32768
##$TD0= 1
##$TE= 0
##$TE2= 300
##$TE3= 300
##$TEG= 300
##$TL= (0..7)
0 120 120 120 120 120 120 120 
##$TP= (0..7)
150 150 150 150 150 150 150 150 
##$TP07= 0
##$TPNAME0= <>
##$TPNAME1= <>
##$TPNAME2= <>
##$TPNAME3= <>
##$TPNAME4= <>
##$TPNAME5= <>
##$TPNAME6= <>
##$TPNAME7= <>
##$TPOAL= (0..7)
0.5 0.5 0.5 0.5 0.5 0.5 0.5 0.5 
##$TPOFFS= (0..7)
0 0 0 0 0 0 0 0 
##$TUNHIN= 0
##$TUNHOUT= 0
##$TUNXOUT= 0
##$USERA1= <user>
##$USERA2= <user>
##$USERA3= <user>
##$USERA4= <user>
##$USERA5= <user>
##$V9= 5
##$VALIST= <valist>
##$VCLIST= <CCCCCCCCCCCCCCC>
##$VD= 0
##$VDLIST= <DDDDDDDDDDDDDDD>
##$VPLIST= <PPPPPPPPPPPPPPP>
##$VTLIST= <TTTTTTTTTTTTTTT>
##$WBST= 1024
##$WBSW= 30
##$XGAIN= (0..3)
0 0 0 0 
##$XL= 0
##$YL= 0
##$YMAX_a= 246109
##$YMIN_a= -346170
##$ZGOPTNS= <>
##$ZL1= 120
##$ZL2= 120
##$ZL3= 120
##$ZL4= 120
##$ABSF1= 0
##$ABSF2= 0
##$ABSG= 0
##$ABSL= 0
##$ALPHA= 0
##$AQORDER= 0
##$ASSFAC= 0
##$ASSFACI= 0
##$ASSFACX= 0
##$ASSWID= 0
##$AUNMP= <proc_1d>
##$AZFE= 0.1
##$AZFW= 0.1
##$BCFW= 0
##$BC_mod= 2
##$BYTORDP= 0
##$COROFFS= 0
##$CY= 18.4799938201904
##$DATMOD= 1
##$DC= 0
##$DFILT= <>
##$DTYPP= 0
##$F1P= 9.9274215381318
##$F2P= -0.165520771350173
##$FCOR= 1
##$FTSIZE= 16384
##$FT_mod= 6
##$GAMMA= 0
##$GB= 0
##$INTBC= 1
##$INTSCL= 4.127829e-11
##$ISEN= 128
##$LB= 0.05
##$LEV0= 0
##$LPBIN= 0
##$MAXI= 10000
##$MC2= 0
##$MEAN= 0
##$ME_mod= 0
##$MI= 50
##$NCOEF= 0
##$NC_proc= -8
##$NLEV= 6
##$NOISF1= 3.799351
##$NOISF2= 2.8
##$NSP= 0
##$NTH_PI= 0
##$NZP= 0
##$OFFSET= 16.48848
##$PC= 4
##$PHC0= -415.7518
##$PHC1= 3.101563
##$PH_mod= 1
##$PKNL= yes
##$PPARMOD= 0
##$PSCAL= 4
##$PSIGN= 0
##$REVERSE= no
##$SF= 200.130005582386
##$SI= 16384
##$SIGF1= 3
##$SIGF2= 2
##$SINO= 400
##$SIOLD= 16384
##$SREGLST= <1H.CDCl3>
##$SSB= 0
##$STSI= 16384
##$STSR= 0
##$SW_p= 4139.07284768211
##$SYMM= 0
##$S_DEV= 0
##$TDeff= 32768
##$TDoff= 0
##$TI= <>
##$TILT= no
##$TM1= 0
##$TM2= 0
##$TOPLEV= 0
##$USERP1= <user>
##$USERP2= <user>
##$USERP3= <user>
##$USERP4= <user>
##$USERP5= <user>
##$WDW= 1
##$XDIM= 16384
##$YMAX_p= 462249952
##$YMIN_p= -10000906
$$ End of Bruker specific parameters
$$ ---------------------------------
##NTUPLES= NMR SPECTRUM
##VAR_NAME=  FREQUENCY,     SPECTRUM/REAL,   SPECTRUM/IMAG
##SYMBOL=    X,             R,               I
##VAR_TYPE=  INDEPENDENT,   DEPENDENT,       DEPENDENT
##VAR_FORM=  AFFN,          ASDF,            ASDF
##VAR_DIM=   16384,         16384,           16384
##UNITS=     HZ,            ARBITRARY UNITS, ARBITRARY UNITS
##FACTOR=    0.252644378177508, 1,           1
##FIRST=     3299.83951724647, 0,            0
##LAST=      -839.233330435636, 0,           0
##MIN=       -839.233330435636, -10000906,   0
##MAX=       3299.83951724647, 462249952,    0
$$ Real data points
##PAGE= N=1
##DATA TABLE= (X++(R..R)), XYDATA
$$ [...]
$$ plain form
7404 1024694 1530687 843126 173934 776776 294521 41769 249029 683820 1060050 654251
7394 654251 455429 587811 488012 27948 191624 798651 608186 179029 634813 1064664
7384 1064664 1088030 946136 422776 762459 855395 822489 393899 1056805 677404 825789
7374 825789 957133 -179744 1092925 331466 865738 174508 949301 36393 372824
7365 372824 -1877 94279 1016872 336516 532887 553468 758783 -275894 130641 591638
7355 591638 961262 978864 194584 390473 939573 507430 6328 298664 747890 507782
7345 507782 449943 271463 981643 1009880 784633 302732 688499 1361708 599343 236217
7335 236217 1001217 854284 141798 285921 358822 1038202 -82339 220403 938782 952048
$$ packed form
7404A024694N05993o87561o69192O02842m82255k52752K07260M34791L76230m05799
7394F54251j98822J32382r9799m60064J63676O07027j90465m29157M55784M29851
7384A064664K3366j41894n23360L39683R2936l2906m28590O62906l79401J48385
7374H25789J31344j136877J272669p61459N34272o91230P74793r12908L36431
7365C72824l74701R6156R22593o80356J96371K0581K05315j034677M06535M60997
7355E91638L69624J7602p84280J95889N49100m32143n01102K92336M49226k40108
7345E07782n7839j78480P10180K8237k25247m81901L85767O73209p62365l63126
7335B36217P65000j46933p12486J44123P2901O79380j120541L02742P18379J3266
$$ plain form
7325 952048 542057 11980 1265690 478742 323267 -30888 631635 883162 357087 547073
7315 547073 -99068 147443 -330580 1060705 162979 620595 1145969 435621 -153469 -7017
7305 -7017 966615 883969 96671 490310 896338 641577 621415 303329 242714 531979 1299296
7294 1299296 628510 381528 693377 420939 651087 675894 1160626 40923 556066 980800
7284 980800 289909 571800 702988 1059954 739080 1074651 -40329 835573 783366 779950
7274 779950 1130174 824559 967666 635528 638975 1217191 1098657 1131426 526560 492661
7264 492661 895545 1229609 650300 810531 446444 596311 461586 797680 890947 1005640
7254 1005640 365877 -20779 606327 446351 1033831 964270 645639 929631 535301 272788
$$ packed form
7325I52048m09991n30077J253710p86948j55475l54155O62523K51527n26075J89986
7315E47073o46141K46511m78023J391285q97726M57616N25374p10348n89090J46452
7305g017R73632q2646p87298L93639M06028k54761k0162l18086o0615K89265P67317
7294A299296o70786k46982L11849k72438K30148K4807M84732j119703N15143M24734
7284I80800o90891K81891J31188L56966l20874L35571j114980Q75902n2207l416
7274G79950L50224l05615J43107l32138L447N78216j18534L2769o04866l3899
7264D92661M02884L34064n79309J60231l64087J49867j34725L36094R3267J14693
7254A005640o39763l86656O27106j59976N87480o9561l18631K83992l94330k62513
$$ plain form
7244 272788 -25932 1143768 282868 -187376 779946 573489 367826 850297 831013 384371
7234 384371 1836769 905149 614490 1192290 787013 843037 607504 1050025 367272 842733
7224 842733 941155 723658 479563 1416539 158670 142611 973982 131489 652207 416738
7214 416738 1542301 565351 845109 761069 818009 809326 242678 532939 1325328 609665
7204 609665 751346 706521 1509037 1378805 1463622 340137 1069781 1119650 -92838 -356124
7194 -356124 519687 638974 965709 521267 463885 1234354 864027 484232 986054 515944
7184 515944 345821 853199 313171 490816 580537 499858 488926 1090764 1373918 573169
7174 573169 224388 564233 847464 345959 493487 579937 693035 -57493 363039 789161
$$ packed form
7244B72788k98720J169700q60900m70244R67322k06457k05663M82471j9284m46642
7234C84371J452398r31620k90659N77800m05277N6024k35533M42521o82753M75461
7224H42733R8422k17497k44095R36976j257869j6059Q31371q42493N20718k35469
7214D16738J125563r76950K79758q4040N6940q683n66648K90261P92389p15663
7204F09665J41681m4825Q02516j30232Q4817j123485P29644M9869j212488k63286
7194c56124Q75811J19287L26735m44442n7382P70469l70327l79795N01822m70110
7184E15944j70123N07378n40028J77645Q9721q0679j0932O01838K83154q00749
7174E73169l48781L39845K83231n01505J47528Q6450J13098p50528M20532M26122
$$ plain form
7164 789161 1028308 1639241 727864 4363 758806 865853 817016 1121649 195082 1350629
7154 1350629 1073926 746866 740129 675492 770420 324741 600401 883295 690668 1189268
7144 1189268 278446 377471 993235 399463 825729 1701595 1344906 -75155 437580 703244
7134 703244 325764 646350 96472 813546 457984 1081450 463695 596903 834403 804093
7124 804093 671408 666190 567434 408698 650673 190756 1019484 856848 1634084 668314
7114 668314 635596 785803 942802 998504 297757 1193864 1264394 261276 568723 433551
7104 433551 1555013 670091 674411 1021632 1359196 1095885 304267 832459 526402 741482
7094 741482 555739 763427 1239670 1132003 687323 492730 811403 1200512 1439773 1568815
$$ packed form
7164G89161K39147O10933r11377p23501P54443J07047m8837L04633r26567J155547
7154A350629k76703l27060o737o4637R4928m45679K75660K82894j92627M98600
7144A189268r10822R9025O15764n93772M26266Q75866l56689j420061N12735K65664
7134G03244l77480L20586n49878P17074l55562O23466o17755J33208K37500l0310
7124H04093j32685n218r8756j58736K41975m59917Q28728j62636P77236r65770
7114F68314l2718J50207J56999N5702p00747Q96107P0530j003118L07447j35172
7104D33551J121462q84922M320L47221L37564k63311p91618N28192l06057K15080
7094G41482j85743K07688M76243j07667m44680j94593L18673L89109K39261J29042
$$ plain form
7084 1568815 587357 1190435 786664 755053 820760 667612 1070042 577371 493742 189749
7074 189749 1063415 678850 896085 989023 761440 404503 1136447 856944 1186617 1314251
7064 1314251 1017860 539916 1351867 1130023 894346 754763 787619 731615 607490 537525
7054 537525 1423931 1828993 1161880 609777 668619 947762 1079107 1121779 1490855 1067557
7044 1067557 1078131 1160350 503367 1032928 1567384 310408 966906 1375394 2104377 876536
7034 876536 998564 1238607 1496601 1088020 118531 1197261 653660 1412105 926986 835992
7024 835992 1460495 959159 833097 1483660 2173486 1405536 1354711 1156130 851226 1525739
7014 1525739 1472942 993998 1318863 759969 945991 1231643 1840941 1666495 930629 1007642
$$ packed form
7084A568815r81458O03078m03771l1611O5707j53148M02430m92671q3629l03993
7074A89749Q73666l84565K17235R2938k27583l56937P31944k79503L29673J27634
7064A314251k96391m77944Q11951k21844k35677j39583L2856n6004j24125o9965
7054E37525Q86406M05062o67113n52103N8842K79143J31345M2672L69076m23298
7044A067557J0574Q2219o56983N29561N34456j256976O56498M08488P28983j227841
7034H76536J22028K40043K57994m08581r69489J078730n43601P58445m85119r0994
7024H35992O24503n01336j26062O50563O89826p67950n0825j98581l04904O74513
7014A525739n2797m78944L24865n58894J86022K85652O09298j74446p35866P7013
$$ plain form
7004 1007642 675052 1234474 1352020 1342798 1815461 1174590 515596 885699 1084982 957214
6994 957214 1443013 819075 1049431 1352894 909177 987829 652391 1106589 813574 1213621
6984 1213621 297461 1372502 1139747 1606196 905473 1859738 1363245 1398449 1337299 1105828
6974 1105828 1332627 1947154 527641 1164078 1290732 1639117 1407149 1549204 2196182
6965 2196182 693149 1048968 1332084 1456525 1348967 1327748 1235724 1650478 1188470 1200438
6955 1200438 1638359 1038497 1602119 1376193 1875897 1360282 1494606 999313 1035342 1259529
6945 1259529 1356099 917530 1108852 2177694 1364957 1081066 1234787 739353 1234399 1137450
6935 1137450 1291751 890287 1366875 1162535 1580978 1250131 1727110 1751080 1142241 1423976
$$ packed form
7004A007642l32590N59422J17546r222M72663o40871o58994L70103J99283j27768
6994I57214M85799o23938K30356L03463m43717P8652l35438M54198k93015M00047
6984A213621r16160J075041k32755M66449p00723R54265m96493L5204o1150k31471
6974A105828K26799O14527j419513O36437J26654L48385k31968J42055O46978
6965B196182j503033L55819K83116J24441j07558k1219r2024M14754m62008J1968
6955A200438M37921n99862N63622k25926M99704n15615J34324m95293L6029K24187
6945A259529R6570m38569J91322J068842q12737k83891J53721m95434M95046r6949
6935A137450J54301m01464M76588k04340M18443l30847M76979K3970o08839K81735
$$ plain form
6925 1423976 1200024 1467771 1514736 708183 1297753 1822447 1589947 1027760 494984 1265868
6915 1265868 1639753 1844164 1710484 1722940 1245529 1296899 1055682 868180 1076896 1362156
6905 1362156 1340549 930943 1304922 634933 1007596 1329996 668841 1177761 1248296 1631652
6895 1631652 2045482 1200058 1544844 839259 1503187 2006679 830240 1524622 1128833
6886 1128833 1853917 379037 1706537 1393711 1990245 1592592 620939 1144861 1191785
6877 1191785 1775708 1166643 835510 1438978 1847114 1365948 1081943 1256713 1438179 1165506
6867 1165506 1096497 1237124 2206265 1705281 1765696 1581752 857998 1045461 1877796 870830
6857 870830 1631172 1384385 1034971 2134165 1710793 1223648 1154967 2020628 925881 2178314
$$ packed form
6925A423976k23952K67747M6965q06553N89570N24694k32500n62187n32776P70884
6915A265868L73885K04411j33680J2456m77411N1370k41217j87502K08716K85260
6905A362156k1607m09606L73979o69989L72663L22400o61155N08920P0535L83356
6895A631652M13830q45424L44786p05585O63928N03492j176439O94382l95789
6886A128833P25084j474880J327500l12826N96534l97653r71653N23922M6924
6877A191785N83923o09065l31133O03468M08136m81166k84005J74770J81466k72673
6867A165506o9009J40627R69141n00984O0415j83944p23754J87463Q32335j006966
6857H70830P60342k46787l49414J099194m23372m87145o8681Q65661j094747J252433
$$ plain form
6847 2178314 1353681 2354934 1963781 1536749 1524101 1962525 2114123 1616138 2462860 1413865
6837 1413865 2119263 1303279 1205677 1305602 1024525 1573514 1231995 1731585 1397251 2305420
6827 2305420 1948430 1781509 1502902 2009156 2005005 1538576 2838675 1540294 2185536 1993092
6817 1993092 1264016 1860532 1626326 1619859 2330540 2683399 1833119 2377913 2377671 2015238
6807 2015238 1696661 1879219 1261749 876774 2081705 1479623 1459956 1166603 1716536 1722637
6797 1722637 1777271 1676168 1663644 2351036 1670167 2302653 1801077 2400907 2172276 1469905
6787 1469905 1955687 2294655 2988791 2207048 2311438 2368270 2143714 2394408 1337659 1722312
6777 1722312 2193310 2632507 1772223 1966159 2027139 2279793 2003519 1794578 2631257 1853313
$$ packed form
6847B178314q24633J001253l91153m27032j2648M38424J51598m97985Q46722j048995
6837A413865P05398q15984r7602R9925k81077N48989l41519M99590l34334R08169
6827B305420l56990j66921k78607N06254m151m66429J300099j298381O45242j92444
6817A993092p29076N96516k34206o467P10681L52859q50280N44794k42l62433
6807B015238l18577J82558o17470l84975J204931o02082j9667k93353N49933O101
6797A722637N4634j01103j2524O87392o80869O32486n01576N99830k28631p02371
6787A469905M85782L38968O94136p81743J04390N6832k24556K50694j056749L84653
6777A722312M70998M39197q60284J93936O0980K52654k76274k08941Q36679p77944
$$ plain form
6767 1853313 1785835 2322201 2079051 2338988 1568567 2803666 1934010 2988819 2352607
6758 2352607 1741298 2198818 2188492 2423917 2443597 2384352 1590736 1263734 1680825 2766580
6748 2766580 2822238 2370146 2744547 2206171 3303838 2552151 1962925 1569161 1790707 1872456
6738 1872456 2747595 2136597 2385065 2291728 2416212 2708523 1445296 2144032 1998023 2734740
6728 2734740 1885330 2235400 2712762 2196571 2051900 2199673 2342794 1995501 2004140 2321550
6718 2321550 1520570 2648140 2576934 2495545 2385547 1935467 2635197 2266725 3761166 2618838
6708 2618838 3139624 2546387 2347564 2279351 2445769 2864508 2345875 2423714 2549723 3469637
6698 3469637 2906153 3503397 2910870 2282028 2378870 2634000 3089721 3021870 2978754 2943845
$$ packed form
6767A853313o7478N36366k43150K59937p70421J235099q69656J054809o36212
6758B352607o11309M57520j0326K35425J9680n9245p93616l27002M17091J085755
6748B766580N5658m52092L74401n38376J097667p51687n89226l93764K21546Q1749
6738A872456Q75139o10998K48468r3337J24484K92311j263227O98736j46009P36717
6728B734740q49410L50070M77362n16191j44671J47773J43121l47293Q639L17410
6718B321550q00980J127570p1206q1389j09998m50080O99730l68472J494441j142328
6708B618838N20786n93237j98823o8213J66418M18739n18633P7839J26009R19914
6698C469637n63484N97244n92527o28842R6842K55130M55721o7851m3116l4909
$$ plain form
6688 2943845 2502471 2510692 3153018 2400489 2710454 3340208 3217404 3310243 2486776 3368044
6678 3368044 2482568 3529365 3174868 4016856 3625675 3728652 3878393 3426519 4343152
6669 4343152 2864934 3958918 4176451 4326319 4581182 5323781 5276205 5284669 5487184 5259935
6659 5259935 5708483 5294009 5309937 5723537 5138514 5512057 4839311 4936828 4546501 4982987
6649 4982987 5163289 5039943 5151767 4765582 4321365 4737506 5665417 5492993 5507633 5817019
6639 5817019 6113191 6280409 7347594 7873877 9003159 9108862 10298263 10758956 10944480
6630 10944480 10606205 10128283 9822654 9196175 8218201 7817639 7243286 7201367 6423504 6818419
6620 6818419 6466197 7040516 6276262 6277745 7457462 7018256 6806630 6304239 7143968 6989346
$$ packed form
6688B943845m41374Q221O42326p52529L09965O29754j22804R2839q23467Q81268
6678C368044q85476J046797l54497Q41988l91181J02977J49741m51874R16633
6669D343152j478218J093984K17533J49868K54863P42599m7576Q464K02515k27249
6659E259935M48548m14474J5928M13600n85023L73543o72746R7517l90327M36486
6649D982987J80302j23346J11824l86185m44217M16141R27911j72424J4640L09386
6639E817019K96172J67218J067185N26283J129282J05703J189401M60693J85524
6630A0944480l38275m77922l05629o26479r77974m00562n74353m1919p77863L94915
6620F818419l52222N74319p64254J483J179717m39206k11626n02391Q39729j54622
$$ plain form
6610 6989346 7837669 8885095 8589101 10144241 10737484 12170485 11479995 13025564 13089105
6601 13089105 11507113 10087314 10078609 9903773 9022057 8252802 7633463 8548435 7417907
6592 7417907 7530489 7342551 7057856 8012377 6989045 7275712 7503182 7761966 7222855
6583 7222855 7615387 7397698 7940151 8256536 8184766 8597101 9474059 9131754 7870878 8844011
6573 8844011 9084491 8654877 7963543 8251005 8472643 7678541 7792005 7631899 8809405
6564 8809405 8148575 8728991 8662913 8740717 8456909 9028213 10117558 10776015 12802717 14055186
6554 14055186 15887520 17175872 17263234 17736581 16180166 14690992 12907772 12221304 10372928
6545 10372928 10840382 10545379 9321143 9127908 8984688 9235868 9360694 9905226 10181574
$$ packed form
6610F989346Q48323J047426k95994J555140N93243J433001o90490J545569O3541
6601A3089105j581992j419799q705j74836q81716p69255o19339R14972j130528
6592G417907J12582j87938k84695R54521j023332K86667K27470K58784n39111
6583G222855L92532k17689N42453L16385p1770M12335Q76958l42305j260876R73133
6573H844011K40480m29614o91334K87462K21638p94102J13464j60106J177506
6564H809405o60830N80416o6078P7804k83808N71304J089345O58457K026702J252469
6554A4055186J832334J288352Q7362M73347j556415j489174j783220o86468j848376
6545A0372928M67454k95003j224236j93235j43220K51180J24826N44532K76348
$$ plain form
6536 10181574 9940278 10257608 10591278 11217637 11321972 13077491 14170321 17556286 21039471
6527 21039471 26547407 31883832 36165287 38125784 36500758 33895168 29475439 24587675
6519 24587675 20639144 18277156 15721076 13572328 13233459 12082857 11012404 10451410
6511 10451410 10820499 10087650 11164242 10926337 11069877 10948239 12074815 12431829 13023051
6502 13023051 15051397 16506472 21096413 26168117 32087236 36513440 38447450 37115106
6494 37115106 35416648 31102082 26262570 21366188 18067373 15220286 13709468 12333359
6486 12333359 11881547 11120627 9686618 9023222 9354105 8847349 9299867 8917385 8366615
6477 8366615 8310785 8288323 9454061 9329699 10486901 11299473 13178913 14939890 16791022
$$ packed form
6536A0181574k41296L17330L33670O26359J04335J755519J092830L385965L483185
6527B1039471N507936N336425M281455J960497j625026k605590m419729m887764
6519B4587675l948531k361988k556080k148748l38869j150602j070453n60994
6511A0451410L69089p32849J076592k37905J43540j21638J126576L57014N91222
6502A3023051K028346J455075M589941N071704N919119M426204J934010j332344
6494C7115106j698458m314566m839512m896382l298815k847087j510818j376109
6486A2333359m51812p60920j434009o63396L30883n06756M52518l82482n50770
6477H366615n5830k2462J165738j24362J157202Q12572J879440J760977J851132
$$ plain form
6468 16791022 17572546 18039478 16359065 15316551 13298418 11752365 10586551 8874200
6460 8874200 8485977 8102318 7177813 7356767 7082611 6595045 6196876 6831833 6015051 6171304
6450 6171304 6769453 5749323 5896937 5708349 5613887 5703407 5491594 5852838 5759971 5831753
6440 5831753 5878120 5724515 5188579 5107492 5301264 5233837 5216811 4978650 5649573 5169623
6430 5169623 5282568 5194543 5330544 5178682 5453922 5345330 5646565 5109926 5323289 4896439
6420 4896439 5578227 4746923 5047375 4864830 4843275 5108394 4942642 5138054 4895842 5407008
6410 5407008 5135166 4463600 4816301 5101105 5805488 4927503 5216092 4878954 4249314 4531904
6400 4531904 5165916 5517660 5437228 5064723 4407632 4144525 4849627 4577004 5199249 4694163
$$ packed form
6468A6791022P81524M66932j680413j042514k018133j546053j165814j712351
6460H874200l88223l83659r24505J78954k74156m87566l98169O34957q16782J56253
6450F171304N98149j020130J47614j88588r4462Q9520k11813L61244r2867P1782
6440E831753M6367j53605n35936q1087J93772o7427j7026k38161O70923m79950
6430E169623J12945q8025J36001j51862K75240j08592L01235n36639K13363m26850
6420D896439O81788q31304L00452j82545k1555K65119j65752J95412k42212N11166
6410E407008k71842o71566L52701K84804P04383q77985K88589l37138o29640K82590
6400D531904O34012L51744q0432l72505o57091k63107P05102k72623O22245n05086
$$ plain form
6390 4694163 4939503 4696756 4629191 4950024 4385867 5741904 5195185 5090800 4900700 4757598
6380 4757598 4227319 4812178 5201800 5173423 4791576 4759767 4859442 5193880 5260156 5372974
6370 5372974 4453583 5277546 5240697 4623276 5048130 4572435 5584414 4551272 4956238
6361 4956238 4873169 4971855 4750324 4824548 4859772 5521005 4706533 5412383 5432455 5585539
6351 5585539 4935851 4943238 5373345 5379556 5428272 4929389 5800973 5131937 4672406 5501347
6341 5501347 5218297 4979639 5426981 5183476 5285199 5343596 5937915 4517304 5721260
6332 5721260 4935217 5410465 4970120 5414255 5597127 5302640 5073122 5507661 5437964 5048353
6322 5048353 5633200 5477548 5572235 5896792 5764233 5968455 5250137 5944063 5688645 6285793
$$ packed form
6390D694163K45340k42747o7565L20833n64157J356037n46719j04385j90100j43102
6380D757598n30279N84859L89622k8377l81847l1809R9675L34438O6276J12818
6370E372974r19391Q23963l6849o17421M24854m75695J011979j033142M04966
6361D956238q3069R8686k21531P4224L5224O61233q14472P05850K0072J53084
6351E585539o49688P387M30107O211M8716m98883Q71584o69036m59531Q28941
6341E501347k83050k38658M47342k43505J01723N8397N94319j420611J203956
6332E721260p86043M75248m40345M44135J82872k94487k29518M34539o9697l89611
6322E048353N84847j55652R4687L24557j32559K04222p18318O93926k55418N97148
$$ plain form
6312 6285793 5890452 5105543 6199613 5500332 6051474 5361442 5624725 5661458 6055342 5331751
6302 5331751 6122120 6386149 6014985 5739335 6256565 6169790 5759601 6656889 6079567 5720534
6292 5720534 5873769 6100097 5427429 6129332 6231510 7023093 5759956 6186900 6319980
6283 6319980 5938905 6477899 6507905 6810853 6647020 5977888 6480460 6020723 6604796 6631451
6273 6631451 5554390 6271874 6491358 6827482 6561919 6680278 6201007 6221888 6287005 6355616
6263 6355616 6909286 6484869 6869926 6991832 6583517 6729072 7015105 6734035 6529284 7141953
6253 7141953 6932951 7224298 6716730 7051052 7527760 7376928 6692778 6750051 7293304 7718584
6243 7718584 7406380 7076584 7448637 7041447 7087590 7564880 7199943 7338039 7206364 7445634
$$ packed form
6312F285793l95341p84909J094070o99281N51142o90032K63283L6733L93884p23591
6302E331751P90369K64029l71164k75650N17230q6775m10189Q97288n77322l59033
6292E720534J53235K26328o72668P01903J02178P91583j263137M26944J33080
6283F319980l81075N38994L0006L02948j63833o69132N02572m59737N84073K6655
6273F631451j077061P17484K19484L36124k65563J18359m79271K0881O5117O8611
6263F355616N53670m24417L85057J21906m08315J45555K86033k81070k04751O12669
6253G141953k09002K91347n07568L34322M76708j50832o84150N7273N43253M25280
6243G718584l12204l29796L72053m07190M6143M77290l64937J38096j31675K39270
$$ plain form
6233 7445634 7511711 7410863 7088177 7435672 7797320 7856247 7601359 7084902 8150137 7538449
6223 7538449 7921865 7049465 7850489 7857391 7709251 8010201 7947175 7535949 7650820 7913340
6213 7913340 7487787 7750355 7880321 8013141 7624094 7429240 8649507 8059601 8562371
6204 8562371 7952110 9027054 9154691 9379145 8175544 8454621 8722255 8456914 7964242
6195 7964242 8305655 8297565 8341738 8621296 8914135 9554426 8812132 8260761 9010107 9540031
6185 9540031 8234091 8292570 8972939 9143782 9528317 8843600 9765486 9356087 9749282 9466693
6175 9466693 9475879 9858397 9628338 9310885 9283758 9569005 9646229 9384957 9539288 9970346
6165 9970346 10229546 9993645 10067655 10242459 10695158 10339850 10335520 10559324 10570404 10008955
$$ packed form
6233G445634O6077j00848l22686L47495L61648N8927k54888n16457J065235o11688
6223G538449L83416q72400Q01024O902j48140L00950o3026m11226J14871K62520
6213G913340m25553K62568J29966J32820l89047j94854J220267n89906N02770
6204H562371o10261J074944J27637K24454j203601K79077K67634k65341m92672
6195G964242L41413q090M4173K79558K92839O40291p42294n51371P49346N29924
6185I540031j305940N8479O80369J70843L84535o84717R21886m09399L93195k82589
6175I466693R186L82518k30059l17453k7127K85247P7224k61272J54331M31058
6165I970346K59200k35901P4010J74804M52699l55308m330K23804J1080n61449
$$ plain form
6155 10008955 10141138 10435712 10821350 10682032 11168348 10535838 11526901 11766591 10939236
6146 10939236 10874608 10846519 11238882 12020571 11515424 11202244 11495609 11632532 12222452 12173762
6136 12173762 11687752 11841042 11812512 11253838 12426461 12261372 12503770 11433963 12163489
6127 12163489 12708402 12021579 12423845 11723086 12020470 12415723 12958407 12595970 12600107 12680825
6117 12680825 12970507 12319084 13171526 13084436 13024853 13186480 13200724 13444434 13611194 14067350
6107 14067350 14233840 13960358 14595275 13783669 13982982 14664649 14622665 14628288 15109452 13997538
6097 13997538 14367798 15047781 14723106 14829904 15397691 14789456 15163422 15425170 15962780
6088 15962780 16038130 16034172 16000564 16024423 16733989 16889192 16880480 17358768 16832667 16711752 17487992
$$ packed form
6155A0008955J32183K94574L85638j39318M86316o32510R91063K39690q27355
6146A0939236o4628k8089L92363P81689n05147l13180K93365J36923N89920m8690
6136A2173762m86010J53290k8530n58674J172623j65089K42398j069807P29526
6127A2163489N44913o86823M02266p00759K97384L95253N42684l62437M137Q0718
6117A2680825K89682o51423Q52442q7090n9583J61627J4244K43710J66760M56156
6107A4067350J66490k73482O34917q11606J99313O81667m1984N623M81164j111914
6097A3997538L70260O79983l24675J06798N67787o08235L73966K61748N37610
6088A5962780P5350l958l3608K3859P09566J55203q712M78288n26101j20915P76240
$$ plain form
6077 17487992 17578904 17217755 17775336 18033303 17517349 17892592 18177344 17633359 17928002 18434632
6067 18434632 18703822 18208211 18877444 18771477 18525303 19146151 19548400 19490326 20158559 20389902
6057 20389902 20552597 21083723 20894650 20969716 21252426 20939161 20962465 21489805 21037677 21878031
6047 21878031 21599621 21659931 21762480 22815003 21918550 21988804 22033432 21984295 22884939 22864228
6037 22864228 23028499 23212033 23509263 23511251 24181819 24410174 24661352 24838572 25720090 25425120
6027 25425120 26362640 25089664 26585127 26051002 25972603 26212210 26449541 26313968 26546709
6018 26546709 27405320 26803165 26364883 27506894 27720776 28159205 28526363 28641494 29125757
6009 29125757 29289010 29872551 29296091 31247068 30864524 31128578 31433892 31928762 32213687
$$ packed form
6077A7487992R0912l61149N57581K57967n15954L75243K84752n43985K94643N06630
6067A8434632K69190m95611O69233j05967k46174O20848M02249n8074O68233K31343
6057B0389902J62695N31126j89073P5066K82710l13265K3304N27340m52128Q40354
6047B1878031k78410O0310J02549J052523q96453P0254M4628m9137R00644k0711
6037B2864228J64271J83534K97230J988O70568K28355K51178J77220Q81518k94970
6027B5425120R37520j272976J495463n34125p8399K39607K37331j35573K32741
6018B6546709Q58611o02155m38282J142011K13882M38429L67158J15131M84263
6009B9125757J63253N83541n76460J950977l82544K64054L05314M94870K84925
$$ plain form
6000 32213687 32343453 33026260 32251935 33104790 32766106 33353177 34375736 33779458 33571677
5991 33571677 34861270 34803024 35270640 35277649 35007450 36313973 37076252 36319262 36737207 37246511
5981 37246511 38097277 38377502 38261304 39313931 39339552 40275400 40500681 40803598 41753695
5972 41753695 42764669 42625478 42829423 42869234 43173249 44373520 43727382 44749273 44987095
5963 44987095 46349725 45747251 46206787 46292749 48239194 48153407 47958666 49181288 49616022
5954 49616022 50113832 50392462 51263244 52103154 51885584 52248008 53030534 54479854 55213667
5945 55213667 55384288 55966399 56959498 57462852 58479904 59310890 59555099 61008472 61225945
5936 61225945 61561173 61820274 63510468 63704441 64356362 64821125 66364291 67862895 67052737
$$ packed form
6000C2213687J29766O82807p74325Q52855l38684N87071J022559n96278k07781
5991C3571677J289593n8246M67616P009k70199J306523P62279p56990M17945N09304
5981C7246511Q50766K80225j16198J052627K5621R35848K25281L02917R50097
5972D1753695J010974j39191K03945L9811L04015J200271o46138J021891K37822
5963D4987095J362630o02474M59536Q5962J946445q5787j94741J222622M34734
5954D9616022M97810K78630Q70782Q39910k17570L62424P82526J449320P33813
5945E5213667J70621N82111R93099N03354J017052Q30986K44209J453373K17473
5936F1225945L35228K59101J690194J93973O51921M64763J543166J498604q10158
$$ plain form
5927 67052737 68313680 69854026 70309456 71870925 72001709 73906394 73532981 75602810 76237723
5918 76237723 77419722 78182055 79443614 80249492 81226149 83110627 84049292 85066925 85573011
5909 85573011 88063988 89555218 89890032 91447846 93324252 94415717 95529074 98573731
5901 98573731 99005864 101096922 102534211 103665594 105577659 107333299 109385136 110327158
5893 110327158 112863576 114293706 116162241 117293056 119252128 121544836 122346594 123252054
5885 123252054 124769453 126554000 128000968 129225538 131234170 133377672 134593959 136097899
5877 136097899 137475719 140021457 141104076 143828781 145113459 147217331 149928285 151667977
5869 151667977 152954934 155975091 157924499 160477352 162034330 164852328 167525821 168836080
$$ packed form
5927F7052737J260943J540346M55430J561469J30784J904685l73413K069829O34913
5918G6237723J181999P62333J261559Q05878R76657J884478R38665J017633N06086
5909H5573011K490977J491230L34814J557814J876406J091465J113357L044657
5901I8573731M32133K091058J437289J131383J912065J755640K051837R42022
5893A10327158K536418J430130J868535J130815J959072K292708Q01758R05460
5885A23252054J517399J784547J446968J224570K008632K143502J216287J503940
5877A36097899J377820K545738J082619K724705J284678K103872K710954J739692
5869A51667977J286957L020157J949408K552853J556978K817998K673493J310259
$$ plain form
5861 168836080 170611317 173061502 175374780 174893768 177055818 177185013 178250208 179030692
5853 179030692 178649494 180813344 180910664 180900739 181225559 181391174 182287575 182677136 183930296
5844 183930296 184003278 185238833 185291109 185776111 186822354 187871518 188393455 188712275 189338685
5835 189338685 189739518 190536281 191336314 190520061 191987253 191355152 191192234 190177524 190184065
5826 190184065 190124270 189266992 188343313 187511626 186538464 184724504 184380036 182518698 181455737
5817 181455737 180210559 178504495 177338824 176481583 174954888 173664742 172057946 170765976
5809 170765976 169642306 168874512 167525914 165549225 165091046 163680269 161611704 160977920
5801 160977920 160257384 159324521 158201234 157348989 156122797 155120871 154153623 152820018 151818008
$$ packed form
5861A68836080J775237K450185K313278m81012K162050J29195J065195P80484
5853A79030692l81198K163850R7320r925L24820J65615Q96401L89561J253160
5844A83930296P2982J235555N2276M85002J046243J049164N21937L18820O26410
5835A89338685M00833P96763Q00033q16253J467192o32101j62918j014710O541
5826A90184065n9795q57278r23679q31687r73162j813960l44468j861338j062961
5817A81455737j245178j706064j165671q57241j526695j290146j606796j291970
5809A70765976j123670p67794j348598j976689m58179j410777k068565o33784
5801A60977920p20536r32863j123287q52245j226192j001926r67248j333605j002010
$$ plain form
5792 151818008 150738901 148679231 147696645 147357348 145287957 144974302 143531453 143229726 142347528
5783 142347528 141094651 140125520 139617064 139177006 138005391 138113364 136364876 136572292 136161169
5774 136161169 136163583 136064120 136440070 135330130 135188650 135324895 134634158 136262576 136600117
5765 136600117 135865289 136397272 137268646 137992739 138364438 139409656 140500958 141608246 142462554
5756 142462554 144420523 146545790 148163877 151128249 153794424 157163175 162004947 166216856
5748 166216856 171401598 177827876 184955972 192055676 199936918 206205470 212707551 218559378
5740 218559378 221994126 224170015 224256066 222266400 219100807 215038988 209842798 205392492
5732 205392492 200255664 195128517 191421539 188003450 185899293 185020062 184084917 183624960
$$ packed form
5792A51818008j079107k059670r82586l39297k069391l13655j442849l01727q82198
5783A42347528j252877r69131n08456m40058j171615J07973j748488K07416m11123
5774A36161169K414r9463L75950j109940j41480J36245o90737J628418L37541
5765A36600117p34828N31983Q71374P24093L71699J045218J091302J107288Q54308
5756A42462554J957969K125267J618087K964372K666175L368751M841772M211909
5748A66216856N184742O426278P128096P099704P881242O268552O502081N851827
5740B18559378L434748K175889Q6051j989666l165593m061819n196190m450306
5732B05392492n136828n127147l706978l418089k104157q79231r35145m59957
$$ plain form
5724 183624960 184791649 187451364 190604842 195303824 200760348 207955687 217133849 228458768
5716 228458768 240833264 253991755 268473514 281727494 294367521 304225240 310834725
5709 310834725 313992393 313365542 308799467 301747751 291345736 278906906 265224248 251885526
5701 251885526 237310060 224739029 213595039 202686433 194504769 187483871 182620566
5694 182620566 178882566 175704964 175121893 174758954 175404378 177450048 180432533 183790644
5686 183790644 188668375 194435155 199819957 206204873 212417673 217451861 220866092 222036025
5678 222036025 221394256 218410883 212619197 204482240 196802962 186715137 177319317 166671773
5670 166671773 158286349 149925447 142400198 136339930 130301456 125816244 122238829 117546482
$$ packed form
5724A83624960J166689K659715L153478M698982N456524P195339R178162J1324919
5716B28458768J2374496J3158491J4481759J3253980J2640027R857719O609485
5709C10834725L157668o26851m566075p051716j0402015j2438830j3682658j3338722
5701B51885526j4575466j2571031j1143990j0908606q181664p020898m863305
5694A82620566l738000l177602n83071l62939O45424K045670K982485L358111
5686A83790644M877731N766780N384802O384916O212800N034188L414231J169933
5678B22036025o41769k983373n791686q136957p679278j0087825r395820j0647544
5670A66671773q385424q360902p525249o060268o038474m485212l577415m692347
$$ plain form
5662 117546482 114467111 112286305 110334705 108277167 105624027 104274826 102920524 101641960
5654 101641960 100625924 99887548 98486494 97588728 97083152 95621848 95018068 94931051 93978162
5645 93978162 93523253 93385774 92386958 90866543 91020986 90462816 90022466 89348659 89625900
5636 89625900 89228405 89416582 89691055 88914966 89566558 90830282 90539788 90717890 90506886
5627 90506886 91208441 91786065 91196216 92481895 93855551 93693961 93863705 95163359 96247093
5618 96247093 96618508 97369059 98334329 99723751 100761213 101687947 102426193 104641753 105633988
5609 105633988 106586998 107775486 109596265 110625551 112289434 113658369 114360622 116436364
5601 116436364 118005914 119792131 122325760 124990015 127848229 131411864 134277367 138548344
$$ packed form
5662A17546482l079371k180806j951600k057538k653140j349201j354302j278564
5654A01641960j016036p38376j401054q97766n05576j461304o03780q7017r52889
5645I3978162m54909j37479r98816j520415J54443n58170m40350o73807K77241
5636H9625900l97495J88177K74473p76089O51592J263724k90494J78102k11004
5627I0506886P01555N77624n89849J285679J373656j61590J69744J299654J083734
5618I6247093L71415P50551R65270J389422J037462R26734P38246K215560R92235
5609A05633988R53010J188488J820779J029286J663883J368935P02253K075742
5601A16436364J569550J786217K533629K664255K858214L563635K865503M270977
$$ plain form
5593 138548344 141999227 146838960 150372702 154943866 159196622 163735412 167164529 170767807
5585 170767807 174656972 178226755 181158803 185129417 189431227 191862080 194799121 198841752
5577 198841752 203119149 206812081 212001399 215710411 221163490 225609581 231360830 236092668
5569 236092668 241983833 248265602 254326549 259616291 265116872 270210037 274390486 276615693
5561 276615693 278267797 277655827 277022702 274775836 271714417 268597454 265391372 259808502
5553 259808502 255994148 252468525 248552202 245015721 242725585 241311036 237908140 236639883
5545 236639883 235544153 235046166 233327819 233315129 232294913 232656305 233733587 234432684 236216848
5536 236216848 236782628 238751237 239413157 239504829 238592002 235654178 232291820 227983493 221541295
$$ packed form
5593A38548344L450883M839733L533742M571164M252756M538790L429117L603278
5585A70767807L889165L569783K932048L970614M301810K430853K937041M042631
5577A98841752M277397L692932N189318L709012N453079M446091N751249M731838
5569B36092668N891165O281769O060947N289742N500581N093165M180449K225207
5561B76615693J652104o11970o33125k246866l061419l116963l206082n582870
5553B59808502l814354l525623l916323l536481k290136j414549l402896j268257
5545B36639883j095730m97987j718347j2690j020216L61392J077282O99097J784164
5536B36216848N65780J968609O61920R1672r12827k937824l362358m308327o442198
$$ plain form
5527 221541295 214780718 207773960 200262214 194673989 189241742 183138126 179768403 175995364
5519 175995364 174708173 172479058 172599316 173268882 175806377 178542151 183290429 188476190
5511 188476190 195933466 205121181 214274980 225395188 235483651 246973612 256403389 263800093
5503 263800093 268747434 271573670 271193287 265670289 259013169 249755733 239626082 227914942
5495 227914942 216365755 205669226 195358464 184758688 176524344 169916126 163644336
5488 163644336 159670592 156525801 154030768 153389163 152189427 153492849 154670155 157932268
5480 157932268 161393171 165686034 169795594 175331051 179662734 182806055 185256493 185714626
5472 185714626 184726160 180779261 175254145 168794185 160190121 151168394 142142597 133524028
$$ packed form
5527B21541295o760577p006758p511746n588225n432247o103616l369723l773039
5519A75995364j287191k229115J20258O69566K537495K735774M748278N185761
5511A88476190P457276R187715R153799J1120208J0088463J1489961R429777P396704
5503B63800093M947341K826236l80383n522998o657120r257436j0129651j1711140
5495B27914942j1549187j0696529j0310762j0599776q234344o608218o271790
5488A63644336l973744l144791k495033o41605j199736J303422J177306L262113
5480A57932268L460903M292863M109560N535457M331683L143321K450438M58133
5472A85714626r88466l946899n525116o459960q604064r021727r025797q618569
$$ plain form
5464 133524028 124620010 116632074 110214696 103879758 99009764 93916901 89630529 85322525
5456 85322525 83018996 79537024 77312956 74890574 72939708 71291704 69337431 67253377
5448 67253377 66567540 64564267 62098005 61470974 60765517 59136520 58276113 57194136 56215610
5439 56215610 55320278 54365074 52885142 52126157 52489950 51093400 50141653 49106667 49226269
5430 49226269 47852177 47723784 46770644 47155751 45980766 45153958 44726179 44095338 44183450
5421 44183450 42835322 42767088 41972918 42659251 42052092 41101046 40216912 40455321 39468613
5412 39468613 39775651 38993086 39090001 38327304 38364987 38048396 37557788 38260022 37158179 37120213
5402 37120213 36530954 36857906 36248744 36220018 35908660 36101845 35750234 35770320 35260097 34889112
$$ packed form
5464A33524028q904018p987936o417378o334938m869994n092863m286372m308004
5456H5322525k303529l481972k224068k422382j950866j648004j954273k084054
5448F7253377o85837k003273k466262o27031p05457j628997q60407j081977r78526
5439E6215610q95332r55204j479932p58985L63793j396550r51747j034986J19602
5430D9226269j374092j28393r53140L85107j174985q26808m27779o30841Q8112
5421D4183450j348128o8234p94170O86333o07159r51046q84134K38409r86708
5412C9468613L07038p82565R6915p62697L7683l16591m90608P02234j101843l7966
5402C7120213n89259L26952o09162k8726l11358J93185l51611K0086n10223l70985
$$ plain form
5392 34889112 35484182 34315152 34002786 34524872 34375623 34044855 33771981 34191455 34272908
5383 34272908 33175114 33440463 32986335 33471882 33196164 33286196 32663628 33233818 33171875 32777074
5373 32777074 32716033 32333312 31902154 32275212 31953353 32358752 32600163 31957922 32367237 32265099
5363 32265099 32696572 32515366 31994600 32347003 32295154 32888616 32470682 32624986 32499271 33432560
5353 33432560 33499377 33609687 33330721 33304246 33918734 33730708 34211033 34268603 33891774 34479439
5343 34479439 34468779 34975019 34979424 35100291 34834553 35415059 35646213 37055039 36667717 36708311
5333 36708311 36965633 37744323 38228012 38749902 39263668 39969685 40684621 40997097 41841640
5324 41841640 44069545 45275849 46061909 48395070 51476575 54897881 57947602 61778413
$$ packed form
5392C4889112N95070j169030l12366N22086j49249l30768k72874M19474Q1453
5383C4272908j097794K65349m54128M85547k75718R0032o22568N70190o1943l94801
5373C2777074o1041l82721m31158L73058l21859M05399K41411o42241M09315j02138
5363C2265099M31473j81206n20766L52403n1849N93462m17934J54304j25715R33289
5353C3432560O6817J10310k78966k6475O14488j88026M80325N7570l76829N87665
5343C4479439j0660N06240M405J20867k65738N80506K31154J408826l87322M0594
5333C6708311K57322P78690M83689N21890N13766P06017P14936L12476Q44543
5324D1841640K227905J206304P86060K333161L081505L421306L049721L830811
$$ plain form
5316 61778413 65808841 69113351 71359602 74977793 79156522 84347834 88757791 93208120
5308 93208120 96462697 99506245 101084964 102970768 106376318 110581036 115004409 115702855
5300 115702855 115498642 113974137 111198700 108633878 106494016 106225049 104545163 101525190
5292 101525190 97753316 94288928 90549811 86103426 83382771 81021670 79036438 75603286
5284 75603286 72807203 70304761 67358904 64980451 62365129 62087981 61763454 61248175 60483603
5275 60483603 60605657 61909612 61644633 62443656 63208949 65314236 66715885 67484305 68885807
5266 68885807 70797151 72942300 75175795 77174442 80260918 83955323 86560248 90567760
5258 90567760 94373549 97947798 102226960 106577802 111900566 116724363 121239193 126507809
$$ packed form
5316F1778413M030428L304510K246251L618191M178729N191312M409957M450329
5308I3208120L254577L043548J578719J885804L405550M204718M423373O98446
5300A15702855k04213j524505k775437k564822k139862k68967j679886l019973
5292A01525190l771874l464388l739117m446385k720655k361101j985232l433152
5284G5603286k796083k502442k945857k378453k615322k77148l24527n15279p64572
5275F0483603J22054J303955k64979P99023P65293K105287J401649P68420J401502
5266F8885807J911344K145149K233495J998647L086476L694405K604925M007512
5258I0567760L805789L574249M279162M350842N322764M823797M514830N268616
$$ plain form
5250 126507809 130343473 135807184 140542085 144808737 148033521 152452574 157071639 160887932
5242 160887932 164060476 169425704 173229225 177432278 181789193 185674505 190702527 196225025
5234 196225025 201996065 206771315 211594999 217925672 222328027 225374158 229337008 231155832
5226 231155832 231286217 230222224 228116588 224932170 220224001 214455720 209660336 203086280
5218 203086280 197360136 191808300 185822052 180237830 175601745 170159161 164691225 160482028
5210 160482028 157502485 154128100 150667984 147932664 145048990 142273318 139783305 136016297
5202 136016297 132137086 128176155 124098324 119817105 114804139 110191913 104535751 100628827
5194 100628827 94949029 91490114 86892547 83050491 78921458 75422735 72195469 69334122
$$ packed form
5250A26507809L835664N463711M734901M266652L224784M419053M619065L816293
5242A60887932L172544N365228L803521M203053M356915L885312N028022N522498
5234A96225025N771040M775250M823684O330673M402355L046131L962850J818824
5226B31155832J30385j063993k105636l184418m708169n768281m795384o574056
5218B03086280n726144n551836n986248n584222m636085n442584n467936m209197
5210A60482028k979543l374385l460116k735320k883674k775672k490013l767008
5202A36016297l879211l960931m077831m281219n012966m612226n656162l906924
5194A00628827n679798l458915m597567l842056m129033l498723l227266k861347
$$ plain form
5186 69334122 67366509 64562148 62330317 59794400 57719810 55511547 54098561 52306807
5178 52306807 51142397 49500252 48158955 47579810 46862967 46648105 45616715 44111491 43268574
5169 43268574 41935182 41813051 41135202 40673182 39486683 39277776 37062618 37779841 37845041
5160 37845041 36503672 36294669 36455981 35769456 35319001 34693703 34415380 33819316 33609377
5151 33609377 33437647 33496078 33022318 32895497 32873260 32333006 32547433 32353573 32368529 32557831
5141 32557831 32638416 32476456 32439195 32534440 31976584 32034460 31345008 32769095 31761428 31798062
5131 31798062 31662044 31834107 31474868 32050152 31637751 31808190 32272799 32371165 32297487 33278182
5121 33278182 33102011 33014135 34186900 34494497 34864740 34169591 35377864 36052358 36641475
$$ packed form
5186F9334122j967613k804361k231831k535917k074590k208263j412986j791754
5178E2306807j164410j642145j341297n79145p16843k14862j031390j505224q42917
5169D3268574j333392j22131o77849m62020j186499k08907k215158P17223O5200
5160C7845041j341369k09003J61312o86525m50455o25298k78323n96064k09939
5151C3609377j71730N8431m73760j26821k2237n40254K14427j93860J4956J89302
5141C2557831Q0585j61960l7261R5245n57856N7876o89452J424087j007667L6634
5131C1798062j36018J72063l59239N75284m12401J70439M64609R8366p3678R80695
5121C3278182j76171q7876J172765L07597L70243o95149J208273O74494N89117
$$ plain form
5112 36641475 36569717 37642123 37787282 38594354 38703032 39404252 40710046 41687339 41793795
5103 41793795 43843107 44345094 45229471 46651275 47033970 49249425 51405389 53339281 55300885
5094 55300885 58395514 61865349 64140627 67017761 70519659 73983090 76016551 79000798
5086 79000798 79919521 81565219 82325059 82382030 81743245 81244605 82056847 81295786 81446284
5077 81446284 81932530 82541160 83755342 84478604 85257139 87380907 89001021 91376040 94409455
5068 94409455 99258085 103340865 108893256 114686466 121505749 129257926 137003327 143481513
5060 143481513 151362107 157371141 162190130 166697837 167927038 168679242 168055642 163735270
5052 163735270 159793143 156157124 151641525 145934021 142578447 139345299 136110651 133728339
$$ packed form
5112C6641475p1758J072406J45159Q07072J08678P01220J305794R77293J06456
5103D1793795K049312N01987Q84377J421804L82695K215455K155964J933892J961604
5094E5300885L094629L469835K275278K877134L501898L463431K033461K984247
5086G9000798R18723J645698P59840N6971o38785m98640Q12242p61061J50498
5077H1446284M86246O08630J214182P23262P78535K123768J620114K375019L033415
5068I4409455M848630M082780N552391N793210O819283P752177P745401O478186
5060A43481513P880594O009034M818989M507707J229201P52204o23600m320372
5052A63735270l942127l636019m515599n707504l355574l233148l234648k382312
$$ plain form
5044 133728339 132670180 131446266 130878771 131850675 133483197 136132295 140507538 145158080
5036 145158080 150308232 157925427 164714137 173155760 180562573 187693480 193742088 199048015
5028 199048015 203073057 204285732 205019591 201574603 196180162 189389909 181443744 172859132
5020 172859132 163722071 155231560 147932152 141710215 135796943 130911462 127224063 125237944
5012 125237944 122891281 121384095 120100563 120476282 120501716 121286740 122847080 126501178 129461004
5003 129461004 132201065 136509979 140382594 144043428 145524109 145553854 143768574 141157708
4995 141157708 136538101 130363032 124735150 118501076 111565933 104777170 99336024 94417091
4987 94417091 90571889 86604684 82552291 79770599 77393891 75626854 73163479 71694306
$$ packed form
5044A33728339j058159j223914n67495R71904J632522K649098M375243M650542
5036A45158080N150152P617195O788710Q441623P406813P130907O048608N305927
5028A99048015M025042J212675P33859l444988n394441o790253p946165q584612
5020A72859132r137061q490511p299408o221937n913272m885481l687399j986119
5012A25237944k346663j507186j283532L75719K5434P85024J560340L654098K959826
5003A29461004K740061M308914L872615L660834J480681K9745j785280k610866
4995A41157708m619607o175069n627882o234074o935143o788763n441146m918933
4987I4417091l845202l967205m052393k781692k376708j767037k463375j469173
$$ plain form
4979 71694306 70614845 69985393 68942099 68167601 67811293 66849720 66424224 66514083 67234046
4970 67234046 67033885 67095293 65816306 65765098 64831924 62867039 61065355 58754575 56513542
4961 56513542 53965721 52458156 50054570 49141291 47646940 45871368 44829919 43434027
4953 43434027 42109906 41790975 40815436 40082095 39420302 39145252 37691788 38724046 37256020
4944 37256020 36851406 37690314 36744591 36584001 36636618 36124057 35363259 35429609 34881641 35168714
4934 35168714 34923074 34020792 34432175 33753262 33926692 34644263 34417707 34070403 34281233
4925 34281233 33990380 33519563 34074282 33798351 34309621 33564179 34503142 34079878 33915615
4916 33915615 34625009 34266724 34701592 34456319 35463432 35352365 35351144 35675124 36055908 36806757
$$ packed form
4979G1694306j079461o29452j043294p74498l56308r61573m25496Q9859P19963
4970F7234046k00161O1408j278987n1208r33174j964885j801684k310780k241033
4961E6513542k547821j507565k403586r13279j494351j775572j041449j395892
4953D3434027j324121l18931r75539p33341o61793k75050j453464J032258j468026
4944C7256020m04614Q38908r45723j60590N2617n12561p60798O6350n47968K87073
4934C5168714k45640r02282M11383o78913J73430P17571k26556l47304K10830
4925C4281233k90853m70817N54719k75931N11270p45442R38963m23264j64263
4916C3915615P09394l58285M34868k45273J007113j11067j221L23980L80784P50849
$$ plain form
4906 36806757 37463566 37274696 37681362 38481800 39234582 40314728 42167534 41500458 43621125
4897 43621125 45209531 46192273 47360020 49696190 52313214 55811386 61589553 72085419
4889 72085419 88470763 110911151 136434221 158301531 170482857 165542266 154542757
4882 154542757 140313966 117408453 98084241 83354323 72286600 65155333 60190907
4875 60190907 56489412 53643114 52257165 51559129 50686889 49693167 49289451 49118389 48708489
4866 48708489 48462849 48319181 48348708 49456082 49698067 49297742 49542177 50347885 50871414
4857 50871414 50947460 52146558 52460844 53853125 53924574 54810232 55965747 56957730 58305318
4848 58305318 58861748 60888412 61798016 62886661 64231021 65936795 67965647 69539553
$$ packed form
4906C6806757O56809j88870M06666Q00438P52782J080146J852806o67076K120667
4897D3621125J588406R82742J167747K336170K617024L498172N778167J0495866
4889G2085419J6385344K2440388K5523070K1867310J2181326m940591j0999509
4882A54542757j4228791k2905513j9324212j4729918j1067723p131267m964426
4875F0190907l701495k846298j385949o98036q72240r93722m03716j71062m09900
4866D8708489k45640j43668K9527J107374K41985m00325K44435Q05708N23529
4857E0871414P6046J199098L14286J392281P1449Q85658J155515R91983J347588
4848E8305318N56430K026664R09604J088645J344360J705774K028852J573906
$$ plain form
4840 69539553 70793839 72012308 74549300 75309593 76731180 78341543 80541113 82309573
4832 82309573 83973047 86233140 87788231 89757336 91035562 93186936 95605371 98447927
4824 98447927 100198965 102732853 104768572 106308816 108955568 109888738 112109251 113839000
4816 113839000 115359016 116524990 118355030 119218118 120023491 122138488 122482381 124831431
4808 124831431 126286617 127390321 128570636 131195105 132018506 133641283 135276383 136696366
4800 136696366 138241824 139825289 142254537 144317377 146615732 149644534 152393217 157476783
4792 157476783 161852344 166667014 172297849 179156219 186176805 194205370 202614769 210805495
4784 210805495 220727153 230060581 239201088 248144290 257440675 266654753 273179345 281664470
$$ packed form
4840F9539553J254286J218469K536992P60293J421587J610363K199570J768460
4832H2309573J663474K260093J555091J969105J278226K151374K418435K842556
4824I8447927J751038K533888K035719J540244K646752R33170K220513J729749
4816A13839000J520016J165974J830040Q63088Q05373K114997L43893K349050
4808A24831431J455186J103704J180315K624469Q23401J622777J635100J419983
4800A36696366J545458J583465K429248K062840K298355L028802K748683N083566
4792A57476783M375561M814670N630835O858370P020586Q028565Q409399Q190726
4784B10805495R921658R333428R140507Q943202R296385R214078O524592Q485125
$$ plain form
4776 281664470 289340896 298894051 307720728 317561863 327266770 337778425 347914019 356785474
4768 356785474 365791061 373726257 380257945 386554369 394344823 401346210 410161062 419927993
4760 419927993 430040778 440016909 450133031 456965318 460736108 462249952 459043664 454041663
4752 454041663 444822754 434102944 422642704 411473219 400213627 389288847 379595153
4745 379595153 370846732 362081005 352423345 341733236 331292922 321000112 310357447
4738 310357447 299094292 289163348 279228707 269594803 260824801 252827821 245025763 237458562
4730 237458562 228230204 219550352 210334526 200762899 192279747 181746314 172959831 164550844
4722 164550844 156755537 148624589 141100114 134764112 129164239 123835263 119361852 114284101
$$ packed form
4776B81664470P676426R553155Q826677R841135R704907J0511655J0135594Q871455
4768C56785474R005587P935196O531688O296424P790454P001387Q814852R766931
4760D19927993J0112785R976131J0116122O832287L770790J513844l206288n002001
4752D54041663r218909j0719810j1460240j1169485j1259592j0924780r693694
4745C79595153q748421q765727r657660j0690109j0440314j0292810j0642665
4738C10357447j1263155r930944r934641r633904q770002p996980p802058p567201
4730B37458562r228358q679852r215826r571627q483152j0533433q786483q408987
4722A64550844p795307q130948p524475o336002n599873n328976m473411n077751
$$ plain form
4714 114284101 110450360 107048109 103422964 101312866 99053245 96646727 94251384 91844364
4706 91844364 89911554 87440387 85052839 82658126 80548814 78933742 76910839 74211449
4698 74211449 71658669 69461647 67573752 65950709 64027692 62232025 61225662 58635990
4690 58635990 57029527 56298501 54593589 53543496 51639891 51190405 49496837 49429836 46144900
4681 46144900 45445362 44601407 44152653 42935566 42616071 41812281 41151728 40021733 39075814
4672 39075814 39233840 37653928 37408393 37182948 35855697 35502788 34809548 34209414 33463005
4663 33463005 33016363 32396381 32024443 31714072 31831262 30653117 30294663 29809612 29514266
4654 29514266 29455684 27991805 27794905 27758834 27151907 27384107 27230071 27207306 26073926 25984098
$$ packed form
4714A14284101l833741l402251l625145k110098k259621k406518k395343k407020
4706I1844364j932810k471167k387548k394713k109312j615072k022903k699390
4698G4211449k552780k197022j887895j623043j923017j795667j006363k589672
4690E8635990j606463p31026j704912j050093j903605m49486j693568o7001l284936
4681D6144900o99538q43955m48754j217087l19495q03790o60553j129995r45919
4672C9075814J58026j579912k45535k25445j327251l52909o93240o00134p46409
4663C3463005m46642o19982l71938l10371J17190j178145l58454m85051k95346
4654B9514266n8582j463879j96900l6071o06927K32200j54036k2765j133380q9828
$$ plain form
4644 25984098 24938963 24830430 24937145 24433937 24494031 23686440 24652845 23725711 23827254
4635 23827254 22923458 23206600 22765306 22440609 22506222 22476613 22790707 21315810 21583479 20686978
4625 20686978 20965034 20514476 20053410 19956653 20761260 19940990 19679974 18657136 19166958
4616 19166958 18673574 18393801 18912271 18067797 18899413 17794068 17239267 17279808 17177437
4607 17177437 17148244 16699266 17435037 17365308 16739551 15859974 16257354 16476159 16535945 15648789
4597 15648789 15797577 16034701 15680540 15259491 15431483 15257455 14948699 15182348 13914139
4588 13914139 14432159 13921458 14729671 13787641 14079414 14063035 14144119 13191796 13346546 13550415
4578 13550415 13485009 12840085 13132355 13634540 13299615 12750687 12926079 13151147 12899114 12612760
$$ packed form
4644B5984098j045135j08533J06715n03208O0094q07591R66405r27134J01543
4635B3827254r03796K83142m41294l24697O5613k9609L14094j474897K67669q96501
4625B0686978K78056m50558m61066r6757Q04607q20270k61016j022838N09822
4616A9166958m93384k79773N18470q44474Q31616j105345n54801M0541j02371
4607A7177437k9193m48978P35771o9729o25757q79577L97380K18805N9786q87156
4597A5648789J48788K37124l54161m21049J71992j74028l08756K33649j268209
4588A3914139N18020n10701Q08213r42030K91773j6379Q1084r52323J54750K03869
4578A3550415o5406o44924K92270N02185l34925n48928J75392K25068k52033k86354
$$ plain form
4568 12612760 12779706 12694691 12655388 12556078 11974444 12985569 12248695 12593825 11954322 11866346
4558 11866346 11639784 11919724 11639311 11279066 11838042 11911553 11740038 11606695 11226248 11673226
4548 11673226 10543558 12296808 10817175 11186535 11919201 11637637 10636689 11106607 10636266
4539 10636266 11029120 11785039 11083378 12493148 11469163 11540923 11366500 11025822 11556780
4530 11556780 10483818 11285314 10159332 10642255 10733841 11003365 10538824 10783680 10234565
4521 10234565 10717597 10720771 10856611 10564588 10265544 10962083 10155376 10425035 10610688 10246399
4511 10246399 10906101 10202140 10697420 10198474 10811509 9829927 10381320 10593597 10560344 10209248
4501 10209248 10159056 9922840 9595042 10028849 9694662 10025015 9834102 9055634 9603505 10202161
$$ packed form
4568A2612760J66946q5015l9303r9310n81634J011125p36874L45130o39503q7976
4558A1866346k26562K79940k80413l60245N58976P3511j71515j33343l80447M46978
4548A1673226j129668J753250j479633L69360P32666k81564j000948M69918m70341
4539A0636266L92854P55919p01661J409770j023985P1760j74423l40678N30958
4530A1556780j072962Q01496j125982M82923R1586K69524m64541K44856n49115
4521A0234565M83032L174J35840k92023k99044O96539q06707K69659J85653l64289
4511A0246399O59702p03961M95280m98946O13035r81582N51393K12277l3253l51096
4501A0209248n0192k36216l27798M33807l34187L30353j90913p78468N47871N98656
$$ plain form
4491 10202161 9927265 8753051 9394644 9598880 9635984 9606460 9550206 9198509 9561180 9655117
4481 9655117 9076686 9096495 9815865 9341245 8685089 8638747 8918997 9372012 9069788 8750181
4471 8750181 8863285 8807735 8672797 8498994 8838446 9522251 8677486 8600783 8485478 8459080
4461 8459080 8981720 9087219 8475203 8320566 8540403 8816670 8729006 8736969 8785808 7802802
4451 7802802 8647540 8941193 9062417 9028988 8648599 8557052 8333439 9228557 7750475 8898656
4441 8898656 8372256 8660145 9221918 8438995 8817763 8441343 8993086 9019008 9075605 8306674
4431 8306674 8323383 8676516 8566196 8488724 8247515 8735986 8648187 8552126 8723032 8872231
4421 8872231 8460853 8762826 9231185 9329006 9435304 9375411 9519236 9582188 9074741 9201369
$$ packed form
4491A0202161k74896j174214O41593K04236L7104k9524n6254l51697L62671R3937
4481I655117n78431J9809P19370m74620o56156m6342K80250M53015l02224l19607
4471H750181J13104n5550j34938j73803L39452O83805q44765p6703j15305k6398
4461H459080N22640J05499o12016j54637K19837K76267q7664P963M8839r83006
4451G802802Q44738K93653J21224l3429l80389r1547k23613Q95118j478082J148181
4441H898656n26400K87889N61773p82923L78768l76420N51743K5922N6597p68931
4431H306674J6709L53133j10320p7472k41209M88471q7799r6061J70906J49199
4421H872231m11378L01973M68359R7821J06298n9893J43825O2952n07447J26628
$$ plain form
4411 9201369 9523044 8750070 9472965 9358371 9687374 9405325 9939623 10574983 10508203 10170337
4401 10170337 10847477 10915157 11468794 11648681 11841817 12327465 13232529 12832959 13583267 16017905
4391 16017905 16835026 16522258 17225231 17748703 17333066 16709802 15840651 15149092 15296476
4382 15296476 15209377 14377417 14704440 14455241 14821282 15020668 15732209 15806750 15834053 16423295
4372 16423295 17710544 18518641 18630965 18944443 19613244 19899750 21101386 22571894 24707875
4363 24707875 27087006 28819279 28916182 27206004 27101660 25588895 23918728 21753355 20711974
4354 20711974 20127376 19669480 19306496 19630569 19166044 19558262 19798604 19755905 21046043
4345 21046043 21387639 22999194 22726687 24365548 24393039 23830319 24507923 24288303 25651199
$$ packed form
4411I201369L21675p72974P22895j14594L29003k82049N34298O35360o6780l37866
4401A0170337O77140O7680N53637J79887J93136M85648R05064l99570P50308K434638
4391A6017905Q17121l12768P02973N23472m15637o23264q69151o91559J47384
4382A5296476q7099q31960L27023k49199L66041J99386P11541P4541K7303N89242
4372A6423295J287249Q08097J12324L13478O68801K86506J201636J470508K135981
4363B4707875K379131J732273R6903j710178j04344j512765j670167k165373j041381
4354B0711974n84598m57896l62984L24073m64525L92218K40342m2699J290138
4345B1046043L41596J611555k72507J638861K7491n62720O77604k19620J362896
$$ plain form
4336 25651199 24571638 25311835 26279633 26789108 26488666 25061703 25930074 24488762 24776622
4327 24776622 22923843 23269917 24035620 23748401 24017357 25342650 27024459 28494742 31671797
4318 31671797 36661461 44335651 51687346 58141653 61140645 59225190 56663440 52286131
4310 52286131 44273397 39390500 36266304 33562573 30748523 30428762 29803352 30175891 29544659
4301 29544659 29789731 30441322 30591222 31463074 32870344 33853585 35737370 36951500 39409807
4292 39409807 42109947 46446381 55984153 65792215 80224398 91926474 97066294 94182293
4284 94182293 86172286 78471859 64057216 52237008 44226668 38472602 33927614 29941573
4276 29941573 27831395 26548265 25758558 24290952 23072777 22823750 23147749 22108738 22117996
$$ packed form
4336B5651199j079561P40197R67798N09475l00442j426963Q68371j441312K87860
4327B4776622j852779L46074P65703k87219K68956J325293J681809J470283L177055
4318C1671797M989664P674190P351695O454307K998992j915455k561750m377309
4310E2286131q012734m882897l124196k703731k814050l19761o25410L72539o31232
4301B9544659K45072O51591J49900Q71852J407270R83241J883785J214130K458307
4292C9409807K700140M336434R537772R808062J4432183J1702076N139820k884001
4284I4182293q010007p700427j4414643j1820208q010340n754066m544988l986041
4276B9941573k110178j283130p89707j467606j218175k49027L23999j039011R258
$$ plain form
4267 22117996 23218291 23378349 23067120 24230391 27173306 30474956 35177640 41920290
4259 41920290 48288923 52278949 51595338 48022262 44869581 37388952 31704882 27207617
4251 27207617 24185163 21731778 20416385 18267408 16555996 16590218 15318319 15027228 14996915
4242 14996915 14527426 13481038 13261820 13437984 13094009 12451651 11707277 12513989 11890889
4233 11890889 12521377 11337757 10651753 11062669 11057585 11135926 10480850 10110308 10340900 9481433
4223 9481433 9532672 9306601 9861075 9256653 8690603 9459979 9178301 8152363 8980206 8100380
4213 8100380 8409291 8816826 8047698 7501989 8399116 7581123 7984014 8232250 7905903 7741833
4203 7741833 6722681 7492017 7404977 7665058 7619149 7870538 7261339 7977446 8364454 7278313
$$ packed form
4267B2117996J100295J60058l11229J163271K942915L301650M702684O742650
4259D1920290O368633L990026o83611l573076l152681p480629n684070m497265
4251B7207617l022454k453385j315393k148977j711412L4222j271899k91091l0313
4242A4996915m69489j046388k19218J76164l43975o42358p44374Q06712o23100
4233A1890889O30488j183620o86004M10916n084P8341o55076l70542K30592q59467
4223I481433N1239k26071N54474o04422n66050P69376k81678j025938Q27843q79826
4213H100380L08911M07535p69128n45709Q97127q17993M02891K48236l26347j64070
4203G741833j019152P69336q7040K60081m5909K51389o09199P16107L87008j086141
$$ plain form
4193 7278313 7870024 7633935 7035878 6524159 5842428 6957695 6130640 6251293 5895637
4184 5895637 6556134 6608700 5958353 6518140 6039012 6841606 5656212 5888294 6110123 5812361
4174 5812361 6606897 5321881 6449404 6948471 7550355 6416498 7300986 7047211 7066841
4165 7066841 6328386 5836493 6883715 6746712 5321697 4422349 5644908 5893527 5372406
4156 5372406 5143738 5653112 6015535 5392302 5087513 4924116 5703148 4523395 4910889
4147 4910889 4064095 5669934 4814655 4459662 4685322 4839555 5790116 4917957 5698563
4138 5698563 5205641 5615468 4712989 4217211 5395300 4613986 4176952 3660851 5205133
4129 5205133 4848658 4677255 3647410 3634557 4230464 4411934 3969629 3344846 3725361 3701153
$$ packed form
4193G278313N91711k36089n98057n11719o81731J115267q27055J20653l55656
4184E895637O60497N2566o50347N59787m79128Q02594j185394K32082K21829k97762
4174E812361P94536j285016J127523M99067O01884j133857Q84488k53775J9630
4165G066841p38455m91893J047222j37003j425015q99348J222559K48619n21121
4156E372406k28668N09374L62423o23233l04789j63397P79032j179753L87494
4147D910889q46794J605839q55279l54993K25660J54233R50561q72159P80606
4138E698563m92922M09827r02479m95778J178089p81314m37034n16101J544282
4129E205133l56475j71403j029845j2853N95907J81470m42305o24783L80515k4208
$$ plain form
4119 3701153 3212937 3567030 3586741 4158352 4088790 2676857 3888016 3582470 3227226 3602941
4109 3602941 3316353 3416552 2999326 3382070 3030484 3357596 3877239 2893934 2706010 3235769
4099 3235769 2890507 3171417 3105764 3754556 2945976 3215479 2690769 2818538 3076712 2947542
4089 2947542 3674224 2714234 3029118 2576165 2742370 2683257 3336640 2135814 2296648 2676994
4079 2676994 2536626 3066883 2319061 3484120 2810514 2979650 2357605 2761514 3316552
4070 3316552 3092344 2635196 2372815 3566709 2629123 2572979 3186907 3178341 3193637 3281680
4060 3281680 2917137 3020852 3118366 1888720 2509700 2374050 2572240 2406189 2642308 2851568
4050 2851568 3316450 3137188 2666142 3042826 3292889 3086655 2631241 2922335 3436528 2498552
$$ packed form
4119C701153m88216L54093J9711N71611o9562j411933J211159l05546l55244L75715
4109C602941k86588J00199m17226L82744l51586L27112N19643r83305j87924N29759
4099C235769l45262K80910o5653O48792q08580K69503n24710J27769K58174j29170
4089B947542P26682r59990L14884m52953J66205n9113O53383j200826J60834L80346
4079B676994j40368N30257p47822J165059o73606J69136o22045M03909N55038
4070C316552k24208m57148k62381J193894r37586n6144O13928q566J5296Q8043
4060C281680l64543J03715R7514j229646O20980j35650J98190j66051K36119K09260
4050B851568M64882j79262m71046L76684K50063k06234m55414K91094N14193r37976
$$ plain form
4040 2498552 2402134 3298052 3434231 3461198 2868952 3471310 3227872 3486823 2990388 2920318
4030 2920318 2614934 4019657 2991718 2715791 2494653 3238888 2627523 2487498 3275579
4021 3275579 3208586 3423807 2474964 2667903 3680596 3284657 2601716 3348648 3827412 3916055
4011 3916055 3430350 3555888 3602028 4035849 3556578 4273955 4430530 4035207 3812933 3175846
4001 3175846 2800064 3298782 3320533 2401519 2812005 2962439 2550984 1813297 3134689 3040169
3991 3040169 3176918 1893035 2127776 3307998 3773200 3267544 2326310 3355823 3276409
3982 3276409 3553298 3725944 2912367 3858527 3319719 3371035 2217267 3250811 2645808
3973 2645808 2565910 2411191 2292920 3081225 1695311 1760959 2505938 2339749 2539399 2148052
$$ packed form
4040B498552r6418Q95918J36179K6967n92246O02358k43438K58951m96435p0070
4030B920318l05384J404723j027939k75927k21138P44235o11365j40025P88081
4021C275579o6993K15221r48843J92939J012693l95939o82941P46932M78764Q8643
4011C916055m85705J25538M6140M33821m79271P17377J56575l95323k22274o37087
4001C175846l75782M98718K1751r19014M10486J50434m11455p37687J321392r4520
3991C040169J36749j283883K34741J180222M65202n05656r41234J029513p9414
3982C276409K76889J72646q13577R46160n38808N1316j153768J033544o05003
3973B645808p9898j54719j18271P88305j385914O5648P44979j66189J99650l91347
$$ plain form
3963 2148052 2420146 2319914 2268005 1614434 2869862 2426284 2084800 1457225 2201113 1910661
3953 1910661 1920979 2383401 1966157 2096128 1842418 1830617 1691601 1748096 1418502 1381660
3943 1381660 1618731 1125614 1832448 2247290 1768001 1443941 1465084 1625244 1539309 976616
3933 976616 1071660 2104751 985111 1959033 1448664 1484307 809562 1764164 1382037 1190336
3923 1190336 1804104 1237436 1326193 1105359 1138046 889058 1463392 1677104 1163967 516964
3913 516964 1411087 741871 850595 1394189 1289727 1414121 1398123 1008532 1070713 1153212
3903 1153212 889282 623652 1175196 1777437 1143045 1442997 530189 560621 838183 1650333
3893 1650333 1237661 986852 1231543 1153719 1042151 742135 690543 1154747 822408 989785
$$ packed form
3963B148052K72094j00232n1909o53571J255428m43578l41484o27575P43888k90452
3953A910661J0318M62422m17244J29971k53710j1801j39016N6495l29594l6842
3943A381660K37071m93117P06834M14842m79289l24060K1143J60160q5935n62693
3933I76616R5044J033091j119640R73922n10369L5643o74745R54602l82127j91701
3923A190336O13768n66668Q8757k20834L2687k48988N74334K13712n13137o47003
3913E16964Q94123o69216J08724N43594j04462J24394j5998l89591O2181Q2499
3903A153212k63930k65630N51544O02241o34392K99952r12808L0432K77562Q12150
3893A650333m12672k50809K44691p7824j11568l00016n1592M64204l32339J67377
$$ plain form
3883 989785 588544 1236255 1087623 436303 450733 639491 1236112 845241 1121005 605523
3873 605523 732064 441105 900380 1089112 1192030 611903 198287 1020262 755189 1439898
3863 1439898 462204 296550 1397751 777164 696425 585214 481005 935508 853430 389895
3853 389895 869681 311196 670097 -200985 808395 564202 1092192 973675 562261 993488
3843 993488 381025 634030 64495 242738 971883 1013037 1286579 295692 352402 522569
3833 522569 713695 717551 852084 803048 567696 600837 743028 792362 797670 913952 876967
3822 876967 307425 1390129 690261 619054 123970 1070609 637407 430826 369076 655479
3812 655479 991324 309104 340926 957021 808943 66723 1043619 968122 302754 1309550
$$ packed form
3883I89785m01241O47711j48632o51320J4430J88758N96621l90871K75764n15482
3873F05523J26541k90959M59275J88732J02918n80127m13616Q21975k65073O84709
3863A439898r77694j65654J101201o20587q0739j11211j04209M54503q2078m63535
3853C89895M79786n58485L58901q71082J009380k44193N27990j18517m11414M31227
3843I93488o12463K53005n69535J78243P29145M1154K73542r90887N6710J70167
3833E22569J91126L856J34533m9036k35352L3141J42191M9334N308J16282l6985
3822H76967n69542J082704o99868p1207m95084R46639m33202k06581o1750K86403
3812F55479L35845o82220L1822O16095j48078p42220R76896p5497o65368J006796
$$ plain form
3802 1309550 869327 648357 230118 735746 98025 363185 443475 651933 678912 272141
3792 272141 525782 466669 489217 969807 63428 -112163 382850 153147 464901 564823
3782 564823 757 520451 234093 869338 720752 -465507 473830 -506470 221057 -183136
3772 -183136 152462 432495 -49468 509082 -40709 828915 -38734 1093315 101839 996087
3762 996087 109631 263060 365450 -29481 706505 -78957 648211 231308 29912 28469
3752 28469 639828 1156467 143556 356598 -369970 665258 -893083 -177848 -42969
3743 -42969 -334102 602389 397492 433534 196316 568005 -561611 72966 344087 308714
3733 308714 366947 -71729 350730 32587 294507 -441643 148339 53005 377425 -176041
$$ packed form
3802A309550m40223k20970m18239N05628o37721K65160Q0290K08458K6979m06771
3792B72141K53641n9113K2548M80590r06379j75591M95013k29703L11754R9922
3782E64823n64066N19694k86358O35245j48586j186259R39337r80300P27527m04193
3772a83136L35598K80033m81963N58550n49791Q69624q67649J132049r91476Q94248
3762I96087q86456J53429J02390l94931P35986p85462P27168m16903k01396j443
3752B8469O11359N16639j012911K13042p26568J035228j558341P15235J34879
3743d2969k91133R36491k04897L6042k37218L71689j129616O34577K71121l5373
3733C08714N8233m38676M22459l18143K61920p36150N89982r5334L24420n53466
$$ plain form
3723 -176041 -434927 -132599 48480 203145 140376 -211456 376171 330459 9869 324770
3713 324770 428861 131381 243573 -258505 -116036 133167 -33750 -476100 206412 -131425
3703 -131425 -14702 -432826 415573 717343 -437795 246400 365922 199513 96120 169468
3693 169468 254405 -133574 -230152 -221111 474412 261756 -669957 -592934 231958 -159549 13360
3682 13360 340036 329002 753637 -31501 -359007 25940 350543 626843 -249942 657736
3672 657736 258424 48147 -398062 -324857 216952 317869 848888 184738 248265 -18402
3662 -18402 -611208 178148 75753 375685 383658 -402394 449789 118519 35424 -969274
3652 -969274 95356 371806 156131 79330 -172620 264834 789316 -121326 129696 230524
$$ packed form
3723a76041k58886L02328J81079J54665o2769l51832N87627m5712l20590L14901
3713C24770J04091k97480J12192n02078J42469K49203j66917m42350O82512l37837
3703a31425J16723m18124Q48399L01770j155138O84195J19522j66409j03393P3348
3693A69468Q4937l87979r6578R041O95523k12656r31713P7023Q24892l91507J72909
3682A3360L26676j1034M24635p85138l27506L84947L24603K76300q76785R07678
3672F57736l99312k10277m46209P3205N41809J00917N31019o64150O3527k66667
3662a8402n92806P89356j02395K99932P973p86052Q52183l31270q3095j004698
3652i69274J064630K76450k15675p6801k51950M37454N24482r10642K51022J00828
$$ plain form
3642 230524 -142184 -220135 160207 357430 -186705 -392297 358359 64186 1080048 -33792
3632 -33792 305615 -314923 163120 93656 761452 82134 58336 208308 255921 -502616
3622 -502616 -210560 303237 -32818 -95640 364431 -286500 70262 254738 562591 -347873
3612 -347873 514030 -640822 746675 284132 -62720 158921 -264386 438807 115893
3603 115893 378405 -425440 -204724 346591 116702 146620 -617384 50161 -611365 89143
3593 89143 257993 208574 667877 562148 370001 379129 433964 -120481 -489662 499635 -32661
3582 -32661 17338 291241 453808 328017 593158 343691 337074 380121 -251064 158086 417587
3571 417587 964292 317188 371849 501871 672314 455487 -108685 -77714 300745 684808
$$ packed form
3642B30524l72708p7951L80342J97223n44135k05592P50656k94173J015862j113840
3632c3792L39407o20538M78043o9464O67796o79318k3798J49972M7613p58537
3622e02616K92056N13797l36055o2822M60071o50931L56762J84476L07853r10464
3612c47873Q61903j154852J387497m62543l46852K21641m23307P03193l22914
3603A15893K62512q03845K20716N51315k29889K9918p64004O67545o61526P00508
3593H9143J68850m9419M59303j05729j92147R128N4835n54445l69181R89297n32296
3582c2661M9999K73903J62567j25791K65141k49467o617M3047o31185M09150K59501
3571D17587N46705o47104N4661J30022J70443k16827n64172L0971L78459L84063
$$ plain form
3561 684808 28360 256078 21 977602 -237454 753197 456396 965123 475488 404792
3551 404792 548477 327658 676233 732432 757216 1157960 1708435 1495465 697364 2245586
3541 2245586 997815 1063697 -31537 444747 265692 483262 1061147 304752 390508 743364
3531 743364 344659 753246 616166 654960 746960 955884 472129 -190460 499645 538598
3521 538598 444333 -587838 100267 -489014 451101 107031 1405914 280836 84828
3512 84828 846484 -142131 679490 350869 306310 858559 157787 444863 366575 561002
3502 561002 -156321 1003569 919071 471994 560391 959141 489022 483952 210057 -64419
3492 -64419 -152611 689849 129277 458859 36904 574479 889324 427934 64868 973361
$$ packed form
3561F84808o56448K27718k56057R77581j215056R90651k96801N08727m89635p0696
3551D04792J43685k20819L48575N6199K4784M00744N50475k12970p98101J548222
3541B245586j247771O5882j095234M76284j79055K17570N77885p56395Q5756L52856
3531G43364l98705M08587j37080L8794R2000K08924m83755o62589O90105L8953
3521E38598r4265j032171O88105n89281R40115l44070J298883j125078j96008
3512H4828P61656r88615Q21621l28621m4559N52249p00772K87076p8288J94427
3502E61002p17323J159890q4498m47077Q8397L98750m70119n070k73895k74476
3492f4419q8192Q42460n60572L29582m21955N37575L14845m61390l63066R08493
$$ plain form
3482 973361 404430 52462 353104 744724 234609 681746 910935 -35251 767342 308827
3472 308827 206240 164757 373669 710085 565883 1159960 220146 620189 375012 1054263
3462 1054263 139478 745750 314682 286599 981540 42363 828333 509732 530916 654712
3452 654712 184991 1091563 365121 1294613 118146 361854 263229 1079885 690538 530444
3442 530444 958657 234793 941948 511738 997038 301442 792136 1217559 1309530 1437096
3432 1437096 1188399 1527143 1117220 1159571 1216491 1422748 1484505 1121694 1561704 1677454
3422 1677454 1187573 1052746 2070739 1394675 1285428 2002331 829733 1766723 1498716
3413 1498716 1511584 809594 1417296 1521015 2107905 1825400 1196536 2035579 1668725 1430165
$$ packed form
3482I73361n68931l51968L00642L91620n10115M47137K29189r46186Q02593m58515
3472C08827j02587m1483K08912L36416j44202N94077r39814M00043k45177O79251
3462A054263r14785O06272m31068k8083O94941r39177P85970l18601K1184J23796
3452F54712m69721R06572p26442R29492j176467K43708r8625Q16656l89347j60094
3442E30444M28213p23864P07155m30210M85300o95596M90694M25423R1971J27566
3432A437096k48697L38744m09923M2351N6920K06257O1757l62811M40010J15750
3422A677454m89881j34827J017993o76064j09247P16903j172598R36990k68007
3413A498716J2868p01990O07702J03719N86890k82505o28864Q39043l66854k38560
$$ plain form
3403 1430165 1703880 2651286 1343350 2522564 1525214 2127687 2720378 1491320 2515725
3394 2515725 2013648 1593822 2697636 2659767 1985473 2384988 2903069 2596628 2514595 2389301
3384 2389301 2798095 2379444 2769202 2746352 2743106 3861238 2807416 2884697 3099855 3183146
3374 3183146 3321412 3633500 3546123 3696382 3702349 4593770 4074875 4255858 4574111 3909792
3364 3909792 4376617 4843716 4776194 4722693 4554528 4858585 4602060 5435266 5896449 5785285
3354 5785285 6611117 6122390 5883608 6022395 7380247 7155617 7781183 6826576 7928148
3345 7928148 7682866 7569147 8339427 8363383 8636484 9314179 10078673 9712141 10205354 10947349
3335 10947349 11409258 12190755 12905246 13814886 14560751 16110453 18008562 19797118 22319313
$$ packed form
3403A430165K73715R47406j307936J179214r97350O02473N92691j229058J024405
3394B515725n02077m19826J103814l7869o74294L99515N18081l06441q2033j25294
3384B389301M08794m18651L89758k2850l246J118132j053822P7281K15158Q3291
3374C183146J38266L12088q7377J50259N967Q91421n18895J80983L18253o64319
3364C909792M66825M67099o7522n3501j68165L04057k56525Q33206M61183j11164
3354E785285Q25832m88727k38782J38787J357852k24630O25566r54607J101572
3345G928148k45282j13719P70280K3956K73101O77695P64494l66532M93213P41995
3335A0947349M61909P81497P14491R09640P45865J549702J898109J788556K522195
$$ plain form
3326 22319313 24523208 26560964 27757205 28814538 31904693 33713189 38954264 43773408
3318 43773408 54067760 72120015 101695155 138029090 178272547 208782381 216942007
3311 216942007 198510000 185067865 156641326 117002353 91899748 72699544 57584674
3304 57584674 47356494 39460167 34958572 31913533 28594002 27742312 25130721 23011832
3296 23011832 21149763 18861179 16963120 15371051 15226631 13422367 13240539 12048711
3288 12048711 12310939 11485426 11031630 10976061 10716422 9587537 9573608 9253094 7915207
3279 7915207 8499268 8229949 8212371 7443853 7711000 7251546 6293508 6146604 6008471 7124675
3269 7124675 7120300 6148984 5818304 6322616 6621872 5162256 4559642 5058293 5688264 4336369
$$ packed form
3326B2319313K203895K037756J196241J057333L090155J808496N241075M819144
3318D3773408J0294352J8052255K9575140L6333935M0243457L0509834Q159626
3311B16942007j8432007j3442135k8426539l9638973k5102605j9200204j5114870
3304E7584674j0228180p896327m501595l045039l319531q51690k611591k118889
3296B3011832j862069k288584j898059j592069j44420j804264j81828j191828
3288A2048711K62228q25513m53796n5569k59639j128885j3929l20514j337887
3279G915207N84061k69319j7578p68518K67147m59454r58038j46904j38133J116204
3269G124675m375r71316l30680N04312K99256j459616o02614M98651O29971j351895
$$ plain form
3259 4336369 4663011 4100527 4095745 3809731 4296850 4208639 4395120 4035874 3630510 3904028
3249 3904028 4092506 3851475 3615544 3529053 3582432 3721468 2981707 2746585 2814214 2993887
3239 2993887 3190732 2102021 2917895 2857625 2633008 3006146 2469464 2025369 1913384 2246303
3229 2246303 2421824 2321716 2085731 1887898 2214737 1341154 1570587 2035083 2084458 1266888
3219 1266888 842588 1939638 1062400 1500213 2127689 1575967 1863652 1435695 1236527
3210 1236527 1577212 2153304 1566299 1312213 320169 1412904 331742 2020791 670931
3201 670931 985700 1643188 1542478 975654 1160639 913240 1063004 1073332 718504 1090001
3191 1090001 288775 577706 678879 852461 1083211 1065980 856983 437498 1050740 684976
$$ packed form
3259D336369L26642n62484m782k86014M87119q8211J86481l59246m05364K73518
3249C904028J88478k41031k35931q6491N3379J39036p39761k35122O7629J79673
3239B993887J96845j088711Q15874o0270k24617L73138n36682m44095j11985L32919
3229B246303J75521j00108k35985j97833L26839q73583K29433M64496M9375q17570
3219A266888m24300J097050q77238M37813O27476n51722K87685m27957j99168
3210A236527L40685N76092n87005k54086r92044J092735j081162J689049j349860
3201F70931L14769O57488j00710n66824J84985k47399J49764J0328l54828L71497
3191A090001q01226K88931J01173J73582K30750j7231k08997m19485O13242l65764
$$ plain form
3181 684976 255433 58136 1636775 283600 101939 1288335 378826 1022342 -191106
3172 -191106 969603 -265408 774520 353460 156763 300664 198752 466320 856453
3163 856453 302114 768903 592523 674003 387254 777667 378635 563015 300485 350852
3153 350852 -105116 394116 466368 756323 158120 -133727 414747 412761 -199554 244708
3143 244708 -683124 83124 -1002891 441429 -396631 -87989 -317975 17804 1439 98426
3133 98426 -183784 369348 165311 213579 411547 -170971 -250776 90542 345288 -162483
3123 -162483 484273 -77816 -382418 136884 -296094 -133499 -139281 -250717 -1298250 -2842
3113 -2842 180827 -165935 -4360 -377699 -80220 -177901 101838 -224317 -88814 152465
$$ packed form
3181F84976m29543j97297J578639j353175j81661J186396r09509O43516j213448
3172a91106J160709j235011J039928m21060j96697J43901j01912K67568L90133
3163H56453n54339M66789j76380Q1480k86749L90413l99032J84380k62530N0367
3153C50852m55968M99232P2252K89955n98203k91847N48474j986o12315M44262
3143B44708r27832P66248j086015J444320q38060L08642k29986L35779j6365R6987
3133I8426k82210N53132k04037M8268J97968n82518p9805L41318K54746n07771
3123a62483O46756n62089l04602N19302m32978J62595n782j11436j047533J295408
3113b842J83669l46762J61575l73339K97479r7681K79739l26155J35503K41279
$$ plain form
3103 152465 -480964 -145831 -15507 231848 -761966 565788 -551209 -49947 -128903 -1069188
3093 -1069188 396828 -112981 74729 -109364 971255 227139 24328 396736 247931
3084 247931 719445 -112920 151275 620070 794967 833137 1006098 579903 1513040 1071666
3074 1071666 418634 634713 492927 418156 -679528 221655 408383 -575393 -43268 -327397
3064 -327397 -8850 -425184 10472 -271983 1061419 -3029 -475540 -97797 -215774
3055 -215774 548657 -917501 447312 -870170 267760 -723428 -673402 170665 -144123
3046 -144123 360870 -649369 283358 -750208 -253999 -956138 130759 -19833 119961
3037 119961 120505 -935530 107235 -421945 -236279 -28986 -44881 -185963 -1141839 -216602
$$ packed form
3103A52465o33429L35133J30324K47355r93814J327754j116997N01262p8956r40285
3093a069188J466016n09809J87710j84093J080619p44116k02811L72408j48805
3084B47931M71514q32365K64195M68795J74897L8170J72961m26195R33137m41374
3074A071666o53032K16079j41786p4771j097684R01183J86728r83776N32125k84129
3064c27397L18547m16334M35656k82455J333402j064448m72511L77743j17977
3055b15774P64431j466158J364813j317482J137930r91188N0026Q44067l14788
3046a44123N04993j010239R32727j033566M96209p02139J086897j50592J39794
3037A19961N44j056035J042765n29180J85666K07293j5895j41082r55876R25237
$$ plain form
3027 -216602 -992796 278775 -408250 -194398 -413445 96748 -398659 -735317 114478 -1060556
3017 -1060556 42542 -234394 -254907 109025 54821 -448021 -804457 340375 -371600 -152628
3007 -152628 -458479 -553717 74217 -506602 226243 -368418 -184997 -471796 8542 -589162
2997 -589162 151492 -819126 25066 251416 -915886 -130505 -266881 136003 -875539
2988 -875539 96417 117933 -483865 -500778 -690649 420400 -344960 -302260 -747045 233029
2978 233029 -84704 -283912 299236 -745333 -60540 -867180 312181 -921500 -432870
2969 -432870 726043 310226 -827002 -55391 -137449 6188 -569673 -427556 -264681 -491168
2959 -491168 -474523 -215926 -853505 -706649 -700619 -103057 -1042670 -875111 -124040 -109036
$$ packed form
3027b16602p76194J271571o87025K13852k19047N10193m95407l36658Q49795j175034
3017a060556J103098k76936k0513L63932n4204n02842l56436J144832p11975K18972
3007a52628l05851r5238O27934n80819P32845n94661J83421k86799M80338n97704
2997e89162P40654r70618Q44192K26350j167302P85381j36376M02884j011542
2988h75539R71956K1516o01798j6913j89871J111049p65360M2700m44785R80074
2978B33029l17733j99208N83148j044569O84793q06640J179361j233681M88630
2969d32870J158913m15817j137228P71611q2058J43637n75861J42117J62875k26487
2959d91168J6645K58597o37579J46856O030N97562r39613J67559P51071J5004
$$ plain form
2949 -109036 -400794 -1085680 -796569 -790524 -1131968 -602245 -882604 -446957 -609955 63160
2939 63160 -736038 -417243 -1188320 -350062 -1252320 -852678 -52994 -954117 -278640 -1264759
2929 -1264759 -48021 -460653 -673814 -165259 -644542 -89316 238926 -105405 -543580
2920 -543580 346708 -749593 -470701 183641 -55902 -124398 -348520 -756369 -490174 -508611
2910 -508611 -671610 -885226 -155272 75236 -468016 -778201 -733286 -681720 -583466 -593367 -579492
2899 -579492 -725767 -643397 -596345 -1199575 128304 -255719 -35692 -669533 -640791 -199962
2889 -199962 6405 -263666 -720161 -523393 -865655 -259494 -586886 46479 347452 -688417
2879 -688417 -371785 79236 -82460 -919390 -733661 -353225 -236890 49765 -121335 -403700
$$ packed form
2949a09036k91758o84886K89111O045l41444N29723k80359M35647j62998O73115
2939F3160p99198L18795p71077Q38258r02258L99642P99684r01123O75477r86119
2929a264759J216738m12632k13161N08555m79283N55226L28242l44331m38175
2920e43580Q90288j096301K78892O54342k39543o8496k24122m07849K66195j8437
2910e08611j62999k13616P29954K30508n43252l10185M4915N1566R8254r901J3875
2899e79492j46275Q2370M7052o03230J327879l84023K20027o33841K8742M40829
2889a99962K06367k70071m56495J96768l42262O06161l27392O33365L00973j035869
2879f88417L16632M51021j61696q36930J85729L80436J16335K86655j71100k82365
$$ plain form
2869 -403700 -550780 9569 -851950 -1139259 -202214 -127576 -858989 -331789 -306017 133008
2859 133008 -398600 -578547 -204179 -321824 -599005 -1025473 -345045 -362907 -220874 -221580
2849 -221580 -52453 -1034211 -405205 -692423 -973456 -800644 -387035 -829919 -121692 -712156
2839 -712156 -618901 -446624 -1049939 -586910 -51034 -364027 -811684 -404546 -457666 446954
2829 446954 -1352154 -204542 -675340 561995 -581236 -960861 -92224 -761958 -233322
2820 -233322 -579244 -130346 -590389 -1085892 -506587 -289080 -212164 -409716 -596922 -643391
2810 -643391 76926 -778399 -738205 -937726 -696260 189036 -255850 564440 -36573 513391
2800 513391 -707834 -1795967 302813 -114871 -989131 -370057 -432033 -134977 -735245
$$ packed form
2869d03700j47080N60349q61519k87309R37045P4638p31413N27200K5772M39025
2859A33008n31608j79947L74368j17645k77181m26468O80428j7862J42033p06
2849b21580J69127r81758O29006k87218k81033J72812M13609m42884P08227n90464
2839g12156R3255J72277o03315M63029N35876l12993m47657M07138n3120R04620
2829D46954j799108J147612m70798J237335j143231l79625Q68637o69734N28636
2820b33322l45922M48898m60043m95503N79305K17507P6916j97552j87206m6469
2810f43391P20317q55325M0194j99521K41466Q85296m44886Q20290o01013N49964
2800E13391j221225j088133K098780m17684q74260O19074o1976K97056o00268
$$ plain form
2791 -735245 -639317 273604 -302746 -60372 335868 81756 372719 -461029 -398030 -707298
2781 -707298 -174953 -436557 -232235 -488091 -893673 -39082 -397146 -322069 -624373 -402740
2771 -402740 -1260118 -547826 -736429 -497673 -94792 -1357113 -332613 -130425 -551274
2762 -551274 -745139 -430036 -65781 -552663 -4734 -923906 118145 -300254 -156643 -410701
2752 -410701 -288942 956047 -785366 511863 -840683 -173261 -393290 -471459 -665476
2743 -665476 -275285 651737 -419796 -374674 -767593 26533 -1066916 -178561 -614535 2871
2733 2871 -610497 -301525 179010 -629509 -718236 -1424021 -798582 -607282 -784839 422157
2723 422157 -1265237 -174537 -223405 -456304 -814516 62133 -527149 -673477 -906571 -583226
$$ packed form
2791g35245R5928R12921n76350K42374L96240k54112K90963q33748O2999l09268
2781g07298N32345k61604K04322k55856m05582Q54591l58064P5077l02304K21633
2771d02740q57378P12292j88603K38756M02881j262321J024500K02188m20849
2762e51274j93865L15103L64255m86882N47929r19172J042051m18399J43611k54058
2752d10701J21759J244989j741413J297229j352546O67422k20029p8169j94017
2743f65476L90191R27022j071533M5122l92919P94126j093449Q88355m35974O17406
2733B871o13368L08972M80535q08519q8727p05785O25439J91300j77557J206996
2723D22157j687394J090700m8868k32899l58212Q76649n89282j46328k33094L23345
$$ plain form
2713 -583226 -257925 -608646 291486 -1155484 -631155 -798494 -1373819 -669455 -1041502 -167888
2703 -167888 -1012140 -375545 -1241113 -702924 -1157321 -621162 -794369 -782609 -217126 -991224
2693 -991224 216481 -489775 -371515 -1126359 -778799 -703918 -656731 -916668 -958783 -697381
2683 -697381 -697569 -237953 -707285 -465795 -289158 -379716 -648811 -351673 -697420 -778669 -817583
2672 -817583 -842716 -207893 54899 -269712 -348900 -642114 51890 -1137678 -26879 -1169070
2662 -1169070 -568156 -1049732 -1164012 -144854 -705950 -179097 -969759 -83073 -403540
2653 -403540 -490128 -704365 -930627 737526 -703150 -559841 -1008961 245725 -789508
2644 -789508 -1124282 -1154071 -548886 -464842 -1146781 -493393 -375032 -795186 -1447574 -1044948
$$ packed form
2713e83226L25301l50721R00132j446970N24329j67339n75325P04364l72047Q73614
2703a67888q44252O36595q65568N38189m54397N36159j73207J1760N65483p74098
2693i91224J207705p06256J18260p54844L47560P4881M7187k59937m2115K61402
2683f97381j88M59616m69332K41490J76637r0558k69095K97138l45747q1249l8914
2672h17583k5133O34823K62792l24611p9188k93214O94004j189568J110799j142191
2662a169070O00914m81576j14280J019158n61096N26853p90662Q86686l20467
2653d03540q6588k14237k26262J668153j440676J43309m49120J254686j035233
2644g89508l34774k9789O05185Q4044o81939O53388J18361m20154o52388M02626
$$ plain form
2634 -1044948 -618946 -291068 -30332 -764090 -918820 -203468 -362926 -1275794 -708264 -17995
2624 -17995 -1275843 -346143 222785 274924 37301 -533000 -810467 -134551 -273438 -787536
2614 -787536 -542929 -404739 380604 -1129930 -214940 -381206 -653569 -860121 -499764 -416631
2604 -416631 -148239 -228571 -993948 -223346 71717 -381239 -201782 -685718 -78848 79142
2594 79142 -187370 -414196 -283950 -302208 -1114018 -785152 301713 17861 -692187 -252806
2584 -252806 -266449 -556579 148086 -289501 -104473 -316704 -556510 -669021 -679125 -46935
2574 -46935 -670180 -622237 494199 288099 -896409 -417318 255250 -628526 -907948 -636299
2564 -636299 -825712 -271626 31225 -712693 -1144750 -373758 123396 -807948 -1005911 6889
$$ packed form
2634a044948M26002L27878K60736p33758j54730P15352j59458r12868N67530O90269
2624a7995j257848R29700N68928N2139k37623n70301k77467O75916j38887n14098
2614g87536K44607J38190P85343j510534R14990j66266k72363k06552L60357Q3133
2604d16631K68392q0332p65377P70602K95063m52956J79457m83936O06870J57990
2594G9142k66512k26826J30246j8258q11810L28866J086865k83852p10048M39381
2584b52806j3643k90130P04665m37587J85028k12231k39806j12511j0104O32190
2574d6935o23245M7943J116436k06100j184508M79091O72568q83776k79422K71649
2564f36299j89413N54086L02851p43918m32057P70992M97154r31344j97963J012800
$$ plain form
2554 6889 -182527 57905 -1031331 -1047071 -709202 -263529 -891303 -427765 -69753 304804
2544 304804 152568 431562 -233455 -249673 -434677 -655785 -267598 -34182 -147937 -496976
2534 -496976 -316935 -149335 -519680 -736637 -620450 426716 -291883 -405925 -1044281 -435594
2524 -435594 -152280 -475903 -87880 -421911 -813986 -848576 -473267 220151 -1324669 -217563
2514 -217563 -613697 305971 -678851 -158189 -1079040 -326207 -286147 -657353 -932503 -493469
2504 -493469 -494636 -769212 -482377 -801505 -22471 -674065 147318 -577682 -306072 -545019
2494 -545019 -1474610 -325820 -707346 -964757 -918372 -472233 -1160367 10965 -771573 -417230
2484 -417230 -157768 -87556 -743912 -415700 26366 303125 -524433 -572143 -1036597 -424537
$$ packed form
2554F889j89416K40432j089236j5740L37869M45673o27774M63538L58012L74557
2544C04804j52236K78994o65017j6218j85004k21108L88187K33416j13755l49039
2534d96976J80041J67600l70345k16957J16187J047166p18599j14042o38356O08687
2524d35594K83314l23623L88023l34031l92075l4590L75309O93418j544820J107106
2514b17563l96134R19668r84822N20662r20851P52833M0060l71206k75150M39034
2504d93469j167k74576K86835l19128P79034o51594Q21383p25000K71610k38947
2494e45019r29591J148790l81526k57411M6385M46139o88134J171332p82538L54343
2484d17230K59462P0212o56356L28212M42066K76759q27558m7710m64454O12060
$$ plain form
2474 -424537 -735596 -426872 -241469 -263213 -462205 -347154 -433244 -508579 -59635 -462561
2464 -462561 -278208 -254576 -585518 -766740 -1055696 -823880 -847563 -114218 -568941 -1011950
2454 -1011950 -280046 -421902 347512 -876739 -512432 -907025 -640688 -1131998 -829226
2445 -829226 -1120775 158433 -758634 -325060 -443413 -455947 -416672 -142608 -259036 -65829
2435 -65829 -1028052 -846583 -782625 -115061 -710504 -611719 -503904 -331805 -318978 -575608
2425 -575608 34446 -534355 -244270 -81880 -994813 -158018 -504777 -99465 -862595 -521743
2415 -521743 -152195 -552648 -650381 -134766 -518013 -658294 22892 -354077 -175071 -936895
2405 -936895 -710700 -514964 -670547 -431518 -385684 -48717 -876203 -692107 -1000240 -569178
$$ packed form
2474d24537l11059L08724J85403k1744j98992J15051q6090p5335M48944m02926
2464d62561J84353K3632l30942j81222k88956K31816k3683P33345m54723m43009
2454a011950P31904j41856P69414j224251L64307l94593K66337m91310L02772
2445h29226k91549J279208r17067M33574j18353j2534L9275K74064j16428J93207
2435f5829r62223J81469O3958O67564n95443R8785J07815J72099J2827k56630
2425e75608O10054n68801K90085J62390r12933Q36795l46759M05312p63130L40852
2415e21743L69548m00453r7733N15615l83247j40281O81186l76969J79006p61824
2405i36895K26195J95736j55583K39029M5834L36967q27486J84096l08133M31062
$$ plain form
2395 -569178 -486894 -703056 -928225 -80561 -335441 -695246 -13620 -27504 258848 -890628
2385 -890628 -226727 -654214 -525583 -329774 -145471 -300240 -732552 -345503 -345844 -213376
2375 -213376 -70350 -418086 -61642 -873395 -109314 69061 -546167 -61355 -541026 -370946
2365 -370946 -1584813 168600 -599619 -735762 -644107 -216845 -169734 -972872 -509504 -1102381
2355 -1102381 171664 -592348 -602197 -289683 -650353 -591519 -920418 -429641 -828881 390635
2345 390635 -383478 176324 -690214 -477519 -611422 -996730 -744188 -931624 -170016 -609646
2335 -609646 -280373 -441917 -617143 -258877 -771546 -235266 -1077029 -366720 -367289 -128121
2325 -128121 -1316306 -1157242 -834096 -657999 -435492 -1125804 -135700 60587 176585 -881405
$$ packed form
2395e69178Q2284k16162k25169Q47664k54880l59805O81626j3884K86352j149476
2385h90628O63901m27487J28631J95809J84303j54769m32312L87049l41J32468
2375b13376J43026l47736L56444q11753P64081J78375o15228M84812m79671J70080
2365c70946j213867J753413p68219j36143R1655M27262M7111q03138M63368n92877
2355a102381J274045p64012r849L12514l60670N8834l28899M90777l99240J219516
2345C90635p74113N59802q66538K12695j33903l85308K52542j87436P61608m39630
2335f09646L29273j61544j75226L58266n12669N36280q41763P10309n69K39168
2325a28121j188185J59064L23146J76097K22507o90312R90104J96287J15998j057990
$$ plain form
2315 -881405 -739476 -811800 -723954 -281399 74765 -371462 -582608 -271507 -121509 -194337
2305 -194337 -257344 -690115 -716287 -390781 -390302 -379660 -275601 -486253 -1065743 322888 -861435
2294 -861435 600444 -549899 12691 -1145834 -426658 -1047236 -1034968 -712258 -561502
2285 -561502 230694 -725592 -742172 -153082 -311422 -705996 -270331 20049 -521487 -551491
2275 -551491 -296597 -759713 -264130 -721501 -1028564 -728040 -385385 976189 136570 -773183
2265 -773183 -643864 -422516 -613764 -448099 -521567 -1675 -734684 -678142 -704516 4100
2255 4100 230591 -983006 -348134 93020 180647 -722652 -165514 -873584 30655 -776379
2245 -776379 -876807 -411095 -444146 -614989 -703063 -826316 -601991 -272082 -537271 -725148
$$ packed form
2315h81405J41929p2324Q7846M42555L56164m46227k11146L11101J49998p2828
2305a94337o3007m32771k6172L25506M79J0642J04059k10652n79490J388631j184323
2294h61435J461879j150343N62590j158525P19176o20578J2268L22710J50756
2285e61502P92196r56286j6580N89090j58340l94574M35665K90380n41536l0004
2275e51491K54894m63116M95583m57371l07063L00524L42655J361574q39619r09753
2265g73183J29319K21348j91248J65665p3468N19892p33009N6542k6374P08616
2255D100K26491j213597O34872M41154Q7627r03299N57138p08070R04239q07034
2245g76379j00428M65712l3051j70843q8074j23253K24325L29909k65189j87877
$$ plain form
2235 -725148 -217138 26818 -589153 -641757 127079 -401244 -65157 -785596 -595472 -845545
2225 -845545 -285015 -866187 328655 266703 -936251 -365887 -438867 468092 -595453 -1094893
2215 -1094893 -1372842 -164347 -637884 -965251 -966137 -264490 60989 -1016503 -940080 -938338
2205 -938338 337622 -385771 -840449 -942287 101283 -560598 -263709 -454165 106471
2196 106471 -724495 -424220 -150069 -514944 -720830 -941678 2594 -255186 -483406 -1169999
2186 -1169999 -1311887 -1464780 -427952 -584828 -750403 441342 -123147 2835 -954459
2177 -954459 -854797 -472557 -708855 -1051225 -470907 15809 -479628 -882464 -523478 -808300
2167 -808300 -413913 -351995 22931 -405856 -533644 -835399 -688836 -861831 -712247 -286984
$$ packed form
2235g25148N08010K43956o15971n2604P68836n28323L36087p20439J90124k50073
2225h45545N60530n81172J194842o1952j202954N70364p2980R06959j063545m99440
2215a094893k77949J208495m73537l27367q86P01647L25479j077492P6423J742
2205i38338J275960p23393m54678j01838J043570o61881K96889j90456N60636
2196A06471q30966L00275K74151l64875k05886k20848R44272k57780k28220o86593
2186a169999j41888j52893J036828j56876j65575J191745n64489J25982r57294
2177i54459R9662L82240k36298l42370N80318M86716m95437m02836L58986k84822
2167h08300L94387O1918L74926m28787j27788l01755J46563j72995J49584M25263
$$ plain form
2157 -286984 -533145 -681803 -372861 -846061 -867418 -710917 -532351 -801386 -764891 -587444
2147 -587444 -136931 1140 -686332 -448470 -20584 -48439 -491799 -642416 -190317 -840793
2137 -840793 -862137 -441026 -739579 186389 -715545 -396213 -316825 518682 -248335 -491220
2127 -491220 -771431 -522329 -547189 -461533 -858025 -233519 -658606 -778658 -1332873 25086
2117 25086 -1058877 -231708 -691512 -1055909 -209001 -448238 -419739 -1010158 -932689 -330394
2107 -330394 -621451 -232121 -623652 -488690 -1179292 -105380 -672678 -1154605 -1258319 -628653
2097 -628653 -219330 -362722 -600209 -528279 -680893 -562858 -797183 -620787 407795 -290558
2087 -290558 -924740 -359255 -316901 -643454 -1407767 -615896 -92375 331899 -396660 -879543
$$ packed form
2157b86984k46161j48658L08942m73200k1357J56501J78566k69035L6495J77447
2147e87444M50513J38071o87472K37862M27886k7855m43360j50617M52099o50476
2137h40793k1344M21111k98553R25968r01934L19332P9388Q35507p67017k42885
2127d91220k80211K49102k4860Q5656l96492O24506m25087j20052n54215J357959
2117B5086j083963Q27169m59804l64397Q46908k39237K8499n90419P7469O02295
2107c30394k91057L89330l91531J34962o90602J073912n67298m81927j03714O29666
2097f28653M09323j43392k37487P1930j52614J18035k34325J76396J028582o98353
2087b90558o34182N65485M2354l26553p64313P91871N23521M24274p28559m82883
$$ plain form
2077 -879543 -508097 -1145913 84179 -823903 -658025 -763531 -56973 -1349595 -571764
2068 -571764 -867082 -1055345 -45456 -456490 -337601 -847432 -626559 -206427 -359358 -379171
2058 -379171 -354956 -487043 -294999 -938833 -515341 -885946 -344999 -467248 -579490 -323717
2048 -323717 -356827 -422441 -439914 -736117 189654 -224293 -615264 -652816 -247380 345059
2038 345059 -980722 -1245009 -489474 -1255538 -109674 -716537 -783756 -578408 -202219 -609962
2028 -609962 -140874 -710382 -593700 234520 -43388 290968 -603984 -554977 -427225 120512
2018 120512 -85373 -725442 -73866 -972192 247099 -801026 -726675 -261200 -606212 -330773
2008 -330773 -905844 -366566 -92926 -450739 -707501 -562926 111191 -281813 -762174 -908872
$$ packed form
2077h79543L71446o37816J230092r08082J65878j05506P06558j292622P77831
2068e71764k95318j88263J009889m11034J18889n09831K20873M20132j52931j9813
2058c79171K4215j32087J92044o43834M23492l70605N40947j22249j12242K55773
2048c23717l3110o5614j7473k96203R25771m13947l90971l7552M05436N92439
2038C45059j325781k64287P55535p66064J145864o06863o7219K05348L76189m07743
2028f09962M69088n69508J16682Q28220k77908L34356q94952M9007J27752N47737
2018A20512k05885o40069O51576q98326J219291j048125P4351M65475l45012K75439
2008c30773n75071N39278K73640l57813k56762J44575O74117l93004m80361j46698
$$ plain form
1998 -908872 -310481 71365 -589083 -977470 -459057 -39602 -319145 -713932 -659252 -471126
1988 -471126 -107030 78745 -130781 -117367 395734 -117687 -623247 -463369 -324316 -662608
1978 -662608 -591510 131376 850740 -600640 -267096 -347772 -208745 -971607 -852681 -223059
1968 -223059 -609979 -445047 -914686 -185788 -442563 -84678 -1220827 -864918 -346205 -29800
1958 -29800 -869013 -1307912 -265775 -12700 -456457 -63703 -851523 226695 -215773 -739287
1948 -739287 -271723 -139003 19003 -751488 -231622 -44913 -578457 -410932 -260802 -527064
1938 -527064 -350310 -731628 -637060 -50970 74223 -583798 -1082284 -999971 -402260 -646858
1928 -646858 -1168940 -686387 -74453 -155733 -678050 -1099138 -178360 -227558 -1144878 -818219
$$ packed form
1998i08872N98391L81846o60448l88387N18413M19455k79543l94787N4680J88126
1988d71126L64096J85775k09526J3414N13101n13421n05560J59878J39053l38292
1978f62608P1098P22886P19364j451380L33544q0676J39027p62862J18926O29622
1968b23059l86920J64932m69639P28898k56775L57885j136149L55909N18713L16405
1958b9800q39213m38899J042137K53075m43757L92754p87820J078218m42468n23514
1948g39287M67564J32720J58006p70491N19866J86709n33544J67525J50130k66262
1938e27064J76754l81318R4568N86090J25193o58021m98486Q2313N97711k44598
1928f46858n22082M82553O11934q1280n22317m21088R20778m9198r17320L26659
$$ [...]
##END NTUPLES=NMR SPECTRUM
##END=
