##TITLE=abcd
##JCAMPDX= 6.0         $$ Bruker NMR JCAMP-DX V2.0
##DATA TYPE= NMR SPECTRUM
##DATA CLASS= NTUPLES
##ORIGIN= UXNMR, Bruker Analytische Messtechnik GmbH
##OWNER= root
$$ XWIN-NMR		Version 3.5
$$ Sat Aug  1 15:44:29 2026 Russian Standard Time (UT+4h)  servis@DPX200
##.OBSERVE FREQUENCY= 200.131235884673
##.OBSERVE NUCLEUS= ^1H
##.ACQUISITION MODE= SIMULTANEOUS
##.ACQUISITION SCHEME= undefined
##.AVERAGES= 32
##.DIGITISER RES= 18
##SPECTROMETER/DATA SYSTEM= spect
##.PULSE SEQUENCE= zg
##.SOLVENT NAME= DMSO
##.SHIFT REFERENCE= (INTERNAL, DMSO, 0, 16.4885)
##AUDIT TRAIL= $$ (NUMBER, WHEN, WHO, WHERE, WHAT)
$$ ##TITLE= Audit trail, XWIN-NMR		Version 3.5
$$ ##JCAMPDX= 5.01
$$ ##ORIGIN= Bruker BioSpin GmbH
$$ ##OWNER= servis
$$ F:\spectra/data/av/nmr/H1/1/pdata/1/auditp.txt
$$ ##AUDIT TRAIL=  $$ (NUMBER, WHEN, WHO, WHERE, WHAT)
(   1,<2026-08-01 15:43:11.68 +0400>,<servis>,<DPX200>,
      <created by zg, POWCHK disabled, PULCHK disabled
       configuration hash MD5:
       00 E9 B6 7A A2 85 ED C7 34 08 36 98 17 FE 4E 26
       data hash MD5: 32K
       88 73 34 A0 16 DF 0F E9 87 E4 F9 44 DE 9B 6C BE>)
(   2,<2026-08-01 15:44:08.25 +0400>,<servis>,<DPX200>,
      <Start of raw data processing
       efp BC_mod = 2 LB = 0.05 FT_mod = 6 PKNL = 1 PHC0 = -413.9518 PHC1 = 3.101563 SI = 16K 
       data hash MD5: 16K
       8D B5 B0 98 B5 84 11 E3 C8 7C 9A A1 BE 71 23 6A>)
$$ ##END=
$$ 
$$ hash MD5
$$ D5 A7 37 02 D4 14 DA 99 4D 20 32 DF 2F B6 F4 D8
##$RELAX= 
##$RELAX= 
##$RELAX= 
##$RELAX= 
##$RELAX= 
##$RELAX= 
##$RELAX= 
##$RELAX= 
$$ Bruker specific parameters
$$ --------------------------
##$DU= <F:\spectra>
##$EXPNO= 1
##$NAME= <H1>
##$PROCNO= 1
##$TYPE= <nmr>
##$USER= <av>
##$AMP= (0..31)
100 100 100 100 100 100 100 100 100 100 100 100 100 100 100 100 100 100 
100 100 100 100 100 100 100 100 100 100 100 100 100 100 
##$AQSEQ= 0
##$AQ_mod= 1
##$AUNM= <au_zg>
##$AUTOPOS= <>
##$BF1= 200.13
##$BF2= 200.13
##$BF3= 200.13
##$BF4= 200.13
##$BF5= 500.13
##$BF6= 500.13
##$BF7= 500.13
##$BF8= 500.13
##$BYTORDA= 1
##$CFDGTYP= 0
##$CFRGTYP= 5
##$CHEMSTR= <none>
##$CNST= (0..31)
1 1 145 1 1 1 1 1 1 1 1 1 1 1 1 1 1 1 1 1 1 1 1 1 1 1 1 1 1 1 1 1 
##$CPDPRG= <>
##$CPDPRG1= <>
##$CPDPRG2= <>
##$CPDPRG3= <>
##$CPDPRG4= <mlev>
##$CPDPRG5= <mlev>
##$CPDPRG6= <mlev>
##$CPDPRG7= <mlev>
##$CPDPRG8= <mlev>
##$CPDPRGB= <>
##$CPDPRGT= <>
##$D= (0..31)
0 2 0 0 0 0 0 0 0 0.06 0 0 0 0 0 0 0.0002 0 0 0 0 0 0 0 0 0 0 0 0 0 0 
0 
##$DATE= 1785584591
##$DBL= (0..7)
120 120 120 120 120 120 120 120 
##$DBP= (0..7)
150 150 150 150 150 150 150 150 
##$DBP07= 0
##$DBPNAM0= <>
##$DBPNAM1= <>
##$DBPNAM2= <>
##$DBPNAM3= <>
##$DBPNAM4= <>
##$DBPNAM5= <>
##$DBPNAM6= <>
##$DBPNAM7= <>
##$DBPOAL= (0..7)
0.5 0.5 0.5 0.5 0.5 0.5 0.5 0.5 
##$DBPOFFS= (0..7)
0 0 0 0 0 0 0 0 
##$DE= 6
##$DECBNUC= <off>
##$DECIM= 32
##$DECNUC= <off>
##$DECSTAT= 4
##$DIGMOD= 1
##$DIGTYP= 9
##$DL= (0..7)
0 120 120 120 120 120 120 120 
##$DP= (0..7)
150 150 150 150 150 150 150 150 
##$DP07= 0
##$DPNAME0= <>
$$ [...]
##$SUBNAM4= <"">
##$SUBNAM5= <"">
##$SUBNAM6= <"">
##$SUBNAM7= <"">
##$SUBNAM8= <"">
##$SUBNAM9= <"">
##$SW= 20.6817932712277
##$SWIBOX= (0..15)
0 0 3 0 0 0 0 0 0 0 0 0 0 0 0 0 
##$SW_h= 4139.07284768212
##$TD= 32768
##$TD0= 1
##$TE= 0
##$TE2= 300
##$TE3= 300
##$TEG= 300
##$TL= (0..7)
0 120 120 120 120 120 120 120 
##$TP= (0..7)
150 150 150 150 150 150 150 150 
##$TP07= 0
##$TPNAME0= <>
##$TPNAME1= <>
##$TPNAME2= <>
##$TPNAME3= <>
##$TPNAME4= <>
##$TPNAME5= <>
##$TPNAME6= <>
##$TPNAME7= <>
##$TPOAL= (0..7)
0.5 0.5 0.5 0.5 0.5 0.5 0.5 0.5 
##$TPOFFS= (0..7)
0 0 0 0 0 0 0 0 
##$TUNHIN= 0
##$TUNHOUT= 0
##$TUNXOUT= 0
##$USERA1= <user>
##$USERA2= <user>
##$USERA3= <user>
##$USERA4= <user>
##$USERA5= <user>
##$V9= 5
##$VALIST= <valist>
##$VCLIST= <CCCCCCCCCCCCCCC>
##$VD= 0
##$VDLIST= <DDDDDDDDDDDDDDD>
##$VPLIST= <PPPPPPPPPPPPPPP>
##$VTLIST= <TTTTTTTTTTTTTTT>
##$WBST= 1024
##$WBSW= 30
##$XGAIN= (0..3)
0 0 0 0 
##$XL= 0
##$YL= 0
##$YMAX_a= 517733
##$YMIN_a= -662083
##$ZGOPTNS= <>
##$ZL1= 120
##$ZL2= 120
##$ZL3= 120
##$ZL4= 120
##$ABSF1= 0
##$ABSF2= 0
##$ABSG= 0
##$ABSL= 0
##$ALPHA= 0
##$AQORDER= 0
##$ASSFAC= 0
##$ASSFACI= 0
##$ASSFACX= 0
##$ASSWID= 0
##$AUNMP= <proc_1d>
##$AZFE= 0.1
##$AZFW= 0.1
##$BCFW= 0
##$BC_mod= 2
##$BYTORDP= 0
##$COROFFS= 0
##$CY= 18.4799938201904
##$DATMOD= 1
##$DC= 0
##$DFILT= <>
##$DTYPP= 0
##$F1P= 9.9274215381318
##$F2P= -0.165520771350173
##$FCOR= 1
##$FTSIZE= 16384
##$FT_mod= 6
##$GAMMA= 0
##$GB= 0
##$INTBC= 1
##$INTSCL= 4.127829e-11
##$ISEN= 128
##$LB= 0.05
##$LEV0= 0
##$LPBIN= 0
##$MAXI= 10000
##$MC2= 0
##$MEAN= 0
##$ME_mod= 0
##$MI= 50
##$NCOEF= 0
##$NC_proc= -7
##$NLEV= 6
##$NOISF1= 3.799351
##$NOISF2= 2.8
##$NSP= 0
##$NTH_PI= 0
##$NZP= 0
##$OFFSET= 16.48848
##$PC= 4
##$PHC0= -413.9518
##$PHC1= 3.101563
##$PH_mod= 1
##$PKNL= yes
##$PPARMOD= 0
##$PSCAL= 4
##$PSIGN= 0
##$REVERSE= no
##$SF= 200.130005582386
##$SI= 16384
##$SIGF1= 3
##$SIGF2= 2
##$SINO= 400
##$SIOLD= 16384
##$SREGLST= <1H.CDCl3>
##$SSB= 0
##$STSI= 16384
##$STSR= 0
##$SW_p= 4139.07284768211
##$SYMM= 0
##$S_DEV= 0
##$TDeff= 32768
##$TDoff= 0
##$TI= <>
##$TILT= no
##$TM1= 0
##$TM2= 0
##$TOPLEV= 0
##$USERP1= <user>
##$USERP2= <user>
##$USERP3= <user>
##$USERP4= <user>
##$USERP5= <user>
##$WDW= 1
##$XDIM= 16384
##$YMAX_p= 527904620
##$YMIN_p= -1910787
$$ End of Bruker specific parameters
$$ ---------------------------------
##NTUPLES= NMR SPECTRUM
##VAR_NAME=  FREQUENCY,     SPECTRUM/REAL,   SPECTRUM/IMAG
##SYMBOL=    X,             R,               I
##VAR_TYPE=  INDEPENDENT,   DEPENDENT,       DEPENDENT
##VAR_FORM=  AFFN,          ASDF,            ASDF
##VAR_DIM=   16384,         16384,           16384
##UNITS=     HZ,            ARBITRARY UNITS, ARBITRARY UNITS
##FACTOR=    0.252644378177508, 1,           1
##FIRST=     3299.83951724647, 0,            0
##LAST=      -839.233330435636, 0,           0
##MIN=       -839.233330435636, -1910787,    0
##MAX=       3299.83951724647, 527904620,    0
$$ Real data points
##PAGE= N=1
##DATA TABLE= (X++(R..R)), XYDATA
$$ [...]
$$ plain form
7447 -1039875 -1101018 -1669491 -939277 -1270929 -1226143 -727601 -852736 -1141637 -915484 -1165825
7437 -1165825 -1224867 -846677 -831542 -893967 -961972 -1247489 -1052415 -863454 -1081029 -1079493 -1139372
7426 -1139372 -1212166 -733064 -1234778 -1274235 -1038635 -1059129 -1066034 -1005947 -1273899 -1340243 -1230905
7415 -1230905 -979802 -832547 -1236791 -697099 -788218 -649585 -653942 -910800 -1296281 -569555
7405 -569555 -648761 -960699 -588366 -1152427 -649803 -1361714 -1245116 -998421 -1351362 -1366467
7395 -1366467 -950262 -888748 -1159075 -1376511 -1282361 -1315096 -924130 -1084527 -1167686 -727970
7385 -727970 -1010127 -1456878 -905897 -946682 -710451 -1126317 -1053906 -1026025 -1502784 -886339
7375 -886339 -1222750 -1296834 -1681007 -1137322 -1221540 -1219943 -1114475 -1331834 -774222 -1262330
$$ packed form
7447a039875o1143n68473P30214l31652M4786M98542j25135k88901K26153k50341
7437a165825n9042L78190J5135o2425o8005k85517J95074J88961k17575J536n9879
7426a139372p2794M79102n01714l9457K35600k0494o905O0087k67952o6344J09338
7415a230905K51103J47255m04244N39692r1119J38633m357k56858l85481P26726
7405e69555p9206l11938L72333n64061N02624p11911J16598K46695l52941j5105
7395a366467M16205O1514k70327k17436R4150l2735L90966j60397q3159M39716
7385g27970k82157m46751N50981m0785K36231m15866P2411K7881m76759O16445
7375h86339l36411p4084l84173N43685q4218J597J05468k17359N57612m88108
$$ plain form
7365 -1262330 -1518559 -1086977 -1476138 -1070567 -1117333 -1609949 -834712 -1531604 -1100816 -805170
7355 -805170 -1057018 -1351820 -935765 -1506548 -1379798 -1353088 -1230732 -1062910 -1513457 -1496307
7345 -1496307 -1425031 -1327432 -1149048 -1168300 -1600682 -1252559 -1200523 -1135120 -1108446 -1131910 -965659
7334 -965659 -1429538 -1078713 -1129924 -1603621 -1440152 -1271910 -917554 -1106207 -1154184 -1024036
7324 -1024036 -1283447 -1297152 -1387504 -1208151 -1006187 -1441108 -1333435 -1336854 -1470596 -1226160
7314 -1226160 -1180131 -1502494 -1447534 -1367136 -1176949 -1663469 -1412136 -1121114 -1280286 -1540190
7304 -1540190 -1214238 -1001690 -878780 -1199615 -1446837 -1398878 -1389435 -1310338 -1165301 -1185825
7294 -1185825 -1308335 -1522885 -1202758 -1392629 -1046596 -1309822 -1029087 -1339360 -1073648 -868578
$$ packed form
7365a262330k56229M31582l89161M05571m6766m92616P75237o96892M30788K95646
7355h05170k51848k94802M16055n70783J26750K6710J22356J67822m50547J7150
7345a496307P1276R7599J78384j9252m32382L48123N2036O5403K6674k3464J66251
7334i65659m63879L50825n1211m73697J63469J68242L54356j88653m7977J30148
7324a024036k59411j3705r0352J79353K01964m34921J07673l419j33742K44436
7314a226160M6029l22363N4960Q0398J90187m86520K51333K91022j59172k59904
7304a540190L25952K12548J22910l20835k47222M7959R443P9097J45037k0524
7294a185825j22510k14550L20127j89871L46033k63226K80735l10273K65712K05070
$$ plain form
7284 -868578 -884115 -1402542 -948163 -1312786 -1256531 -1475646 -1109797 -981040 -944386 -1290328
7274 -1290328 -1215375 -1283550 -1738164 -1622904 -1426843 -1207877 -1099423 -1050060 -1202352 -1428126
7264 -1428126 -1275331 -882624 -919888 -957811 -1316858 -1133602 -967738 -780559 -1285863 -1314163
7254 -1314163 -1647191 -1322498 -1058182 -911234 -1368376 -1217455 -1174963 -1190577 -1284305 -1442373
7244 -1442373 -1821420 -1625026 -1577736 -1482048 -1253985 -1270104 -1534810 -1497544 -1437521 -1224567
7234 -1224567 -1090030 -1265132 -1179282 -1203831 -1256341 -912352 -1425911 -1313634 -1263608 -1238667
7224 -1238667 -1148984 -982256 -1417204 -1196190 -1299095 -1244333 -936145 -1619712 -1357049 -1264958
7214 -1264958 -1206328 -1335903 -1074263 -1365088 -1471176 -996931 -1246667 -1093479 -1043489 -1169564
$$ packed form
7284h68578j5537n18427M54379l64623N6255k19115L65849J28757L6654l45942
7274a290328P4953o8175m54614J15260J96061K18966J08454M9363j52292k25774
7264a428126J52795L92707l7264l7923l59047J83256J65864J87179n05304k8300
7254a314163l33028L24693K64316J46948m57142J50921M2492j5614r3728j58068
7244a442373l79047J96394M7290R5688K28063j6119k64706L7266O0023K12954
7234a224567J34537j75102Q5850k4549n2510L43989n13559J12277N0026K4941
7224a238667Q9683J66728m34948K21014j02905N4762L08188o83567K62663R2091
7214a264958N8630j29575K61640k90825j06088M74245k49736J53188M9990j26075
$$ plain form
7204 -1169564 -1207379 -1285842 -1259177 -1108227 -1167490 -1266492 -1243681 -1296072 -1328494 -1386551 -1276024
7193 -1276024 -1163438 -1183446 -1159830 -1378561 -903510 -973893 -1019537 -1370777 -1489300 -961890
7183 -961890 -1288034 -1044127 -1090790 -1110680 -1910787 -1059819 -1054744 -1458580 -1089546 -1119742 -1187307
7172 -1187307 -1338367 -1070084 -949176 -1314541 -1411664 -1506617 -1184531 -1323162 -1240490 -879329
7162 -879329 -1012845 -1152189 -1170148 -1121911 -1358839 -1738200 -1265439 -1239430 -833807 -1082963
7152 -1082963 -1372259 -881351 -1303821 -1114040 -939800 -807604 -1639912 -955737 -1163557 -1033674
7142 -1033674 -797230 -1311264 -1417381 -1572946 -1078531 -1242693 -1148600 -991995 -882952 -1341185
7132 -1341185 -1050012 -835125 -1085056 -1224960 -1268307 -1462688 -1309472 -1150081 -1256311 -1053301
$$ packed form
7204a169564l7815p8463K6665J50950n9263r9002K2811n2391l2422n8057J10527
7193a276024J12586k0008K3616k18731M75051p0383m5644l51240j18523N27410
7183i61890l26144K43907m6663j9890q00107Q50968N075m03836L69034l0196o7565
7172a187307j51060K68283J20908l65365r7123r4953L22086j38631Q2672L61161
7162h79329j33516j39344j7959M8237k36928l79361M72761K6009M05623k49156
7152a082963k89296M90908m22470J89781J74240J32196q32308O84175k07820J29883
7142a033674K36444n14034j06117j55565M94415j64162R4093J56605J09043m58233
7132a341185K91173K14887k49931j39904m3347j94381J53216J59391j06230K03010
$$ plain form
7122 -1053301 -1372966 -1343842 -1446658 -1634385 -1460924 -1565607 -1184209 -1241184 -1298991 -1067047
7112 -1067047 -1577782 -1211640 -1081510 -1125019 -1118149 -1522859 -1388061 -1064332 -810245 -1387129
7102 -1387129 -1170375 -1343649 -1122546 -1145699 -869636 -1110858 -1290302 -1007750 -1018882 -1223581
7092 -1223581 -964843 -1240781 -1024671 -1205164 -1375680 -1051158 -820108 -990660 -1262799 -1059338
7082 -1059338 -1329680 -1302317 -1278534 -934229 -1351120 -1471103 -1297223 -1208261 -1705561 -1284572
7072 -1284572 -1348753 -1054545 -964223 -1231028 -1012177 -1045756 -1158360 -1157392 -1126147 -1509660 -1167537
7061 -1167537 -1373390 -1475193 -1221582 -1096589 -1228883 -1318218 -1273605 -1021390 -1749839 -1133255
7051 -1133255 -1090658 -1535313 -1162994 -1378453 -1392429 -727124 -1198173 -909779 -952962 -1292575
$$ packed form
7122a053301l19665K9124j02816j87727J73461j04683L81398n6975n7807K31944
7112a067047n10735L66142J30130m3509O870m04710J34798L23729K54087n76884
7102a387129K16754j73274K21103k3153K76063k41222j79444K82552j1132k04699
7092a223581K58738k75938K16110j80493j70516L24522K31050j70552k72139K03461
7082a059338k70342K7363K3783L44305m16891j19983J73880Q8962m97300M20989
7072a284572o4181K94208R0322k66805K18851l3579j12604R68L1245l83513L42123
7061a167537k05853j01803K53611J24993j32294q9335M4613K52215p28449O16584
7051a133255M2597m44655L72319k15459j3976O65305m71049K88394m3183l39613
$$ plain form
7041 -1292575 -1403446 -1168476 -1410193 -958667 -1006849 -823137 -1038232 -726061 -948173 -1424308
7031 -1424308 -944422 -1068240 -1328829 -1053925 -1205719 -1019585 -791776 -1046761 -1541759 -1049407
7021 -1049407 -979908 -1367861 -1169963 -1491526 -1071256 -972094 -1186964 -1027346 -1113901 -1069651
7011 -1069651 -1318323 -1712472 -1083306 -1221650 -864030 -1220405 -1067511 -1161123 -1279923 -1345430
7001 -1345430 -1384051 -1232016 -1297271 -1347233 -895407 -1074209 -842217 -1194948 -1043115 -1051785
6991 -1051785 -1276278 -1246249 -1332188 -921689 -631145 -1019030 -1109329 -1273075 -1438977 -982644
6981 -982644 -1338745 -1206744 -961638 -922591 -842612 -1415691 -1023128 -1417554 -886779 -1096621
6971 -1096621 -1333918 -1305741 -890173 -962480 -1198336 -1562277 -1154241 -1141292 -1358861 -983595
$$ packed form
7041a292575j10871K34970k41717M51526m8182J83712k15095L12171k22112m76135
7031a424308M79886j23818k60589K74904j51794J86134K27809k54985m94998M92352
7021a049407O9499l87953J97898l21563M20270R9162k14870J59618q6555M4250
7011a069651k48672l94149O29166j38344L57620l56375J52894r3612j18800o5507
7001a345430l8621J52035o5255m9962M51826j78802K31992l52731J51833q670
6991a051785k24493L0029q5939M10499K90544l87885r0299j63746j65902M56333
6981i82644l56101J32001K45106L9047P9979n73079L92563l94426N30775k09842
6971a096621k37297K8177M15568p2307k35856l63941M08036J2949k17569L75266
$$ plain form
6961 -983595 -855857 -1030166 -1169177 -1173762 -1151341 -1280694 -1270273 -1098656 -1389268 -954902
6951 -954902 -656479 -931981 -1661000 -854531 -962928 -1271403 -1175097 -1748663 -850855 -1168777
6941 -1168777 -1325285 -1299752 -1285518 -800796 -1567009 -1251283 -1404416 -1225343 -907401 -751373
6931 -751373 -787887 -955154 -960302 -980088 -1415936 -1164242 -1448409 -1173906 -1330801 -1121807
6921 -1121807 -1154008 -1014996 -1423559 -977956 -1202015 -1085303 -1233196 -1217717 -1333607 -1159055
6911 -1159055 -1316501 -1205430 -912923 -1177943 -1118826 -1036973 -1307566 -1436276 -851160 -1177562
6901 -1177562 -1471880 -1298474 -1266958 -758174 -1424347 -1303962 -1401927 -863733 -1373754 -1134966
6891 -1134966 -1166035 -1218916 -805033 -1129036 -975528 -681382 -1213458 -862257 -1079203 -1104884
$$ packed form
6961i83595J27738j74309j39011m585K2421j29353J0421J71617k90612M34366
6951i54902K98423k75502p29019Q06469j08397l08475R6306n73566Q97808l17922
6941a168777j56508K5533J4234M84722p66213L15726j53133J79073L17942J56028
6931g51373l6514j67267n148j9786m35848K51694k84167K74503j56895K08994
6921a121807l2201J39012m08563M45603k24059J16712j47893J5479j15890J74552
6911a159055j57446J11071K92507k65020N9117Q1853k70593j28710N85116l26402
6901a177562k94318J73406L1516N08784o66173J20385r7965N38194n10021K38788
6891a134966l1069n2881M13883l24003J53508K94146n32076L51201k16946k5681
$$ plain form
6881 -1104884 -745115 -1069954 -869430 -861100 -785988 -707451 -736469 -515301 -763193 -782593 -726588
6870 -726588 -494670 -853453 -494726 -710339 -1008866 -1006452 -1287119 -1352846 -1129464 -1252393
6860 -1252393 -1045792 -976058 -1280251 -1103112 -1206595 -868312 -1257778 -1169374 -1214622 -1171063
6850 -1171063 -911340 -1058350 -1439756 -1042707 -1163345 -1375208 -1384623 -1446869 -902193 -1155845
6840 -1155845 -746458 -1436136 -810276 -1292801 -1054824 -1005671 -1265137 -1539132 -673353 -1162619
6830 -1162619 -985818 -774927 -1066044 -811402 -897292 -679287 -1044667 -1041120 -1009452 -1198414
6820 -1198414 -1018256 -990737 -1127199 -928891 -845585 -1053460 -1009289 -1068425 -922939 -1163919
6810 -1163919 -1330882 -1215376 -985174 -1201057 -1274454 -1355119 -906269 -760554 -1165433 -955190
$$ packed form
6881a104884L59769l24839K00524Q330P5112P8537k9018K21168k47892j9400N6005
6870g26588K31918l58783L58727k15613k98527K414k80667o5727K23382j22929
6860a252393K06601O9734l04193J77139j03483L38283l89466Q8404m5248M3559
6850a171063K59723j47010l81406L97049j20638k11863r415o2246N44676k53652
6840a155845M09387o89678O25860m82525K37977M9153k59466k73995Q65779m89266
6830a162619J76801K10891k91117K54642q5890K18005l65380L547L1668j88962
6820a198414J80158K7519j36462J98308Q3306k07875M4171n9136J45486k40980
6810a163919j66963J15506K30202k15883p3397q0665M48850J45715m04879K10243
$$ plain form
6800 -955190 -1085681 -1299799 -1245441 -951871 -1162852 -799005 -1516037 -1220940 -1315494 -981167
6790 -981167 -1026297 -935522 -1117544 -1433250 -1023492 -1283492 -1409919 -1443914 -1019383 -1206216
6780 -1206216 -1084359 -672250 -1316528 -1197820 -1116116 -989005 -901157 -1147928 -997106 -1283923
6770 -1283923 -1129484 -1522813 -1124088 -1010873 -975461 -950166 -710505 -1043010 -1135567 -1089691
6760 -1089691 -775807 -535803 -1062665 -1279005 -1245834 -755627 -1142482 -1064569 -1176164 -1516655
6750 -1516655 -1215670 -1036180 -1299861 -935675 -939949 -1356371 -1238173 -1060480 -1330909 -1372046
6740 -1372046 -1155712 -1624137 -1317904 -1078051 -1048168 -933530 -1366891 -1241402 -1401938 -1070586
6730 -1070586 -1041409 -547890 -1018309 -984537 -1071348 -1056710 -1472097 -890665 -913809 -1011113 -1012617
$$ packed form
6800i55190j30491k14118N4358K93570k10981L63847p17032K95097r4554L34327
6790i81167m5130R0775j82022l15706M09758k60000j26427l3995M24531j86833
6780a206216J21857M12109o44278J18708Q1704J27111Q7848k46771J50822k86817
6770a283923J54439l93329L98725J13215L5412K5295K39661l32505r2557M5876
6760a089691L13884K40004n26862k16340L3171M90207l86855P7913j11595l40491
6750a516655L00985J79490k63681L64186m274m16422J18198J77693k70429m1137
6740a372046K16334m68425L06233K39853K9883J14638m33361J25489j60536L31352
6730a070586K9177M93519m70419L3772q6811J4638m15387N81432k3144r7304j504
$$ plain form
6719 -1012617 -1131174 -1191289 -763579 -958816 -1198542 -1004423 -1114511 -1036446 -968045 -954914
6709 -954914 -1142278 -1147647 -1113375 -1046212 -1065168 -1476608 -1197483 -985709 -1269148 -912358 -976015
6698 -976015 -1155261 -1369878 -1185653 -854980 -612524 -604550 -1319107 -827766 -1060110 -1118254
6688 -1118254 -1051364 -1355953 -850937 -545004 -764167 -1083416 -647105 -919099 -1076736 -1206032
6678 -1206032 -1115012 -1549488 -1258563 -980932 -1427564 -1096540 -1188581 -517972 -951573 -1192309
6668 -1192309 -1104180 -955788 -835616 -1366567 -1130954 -804102 -813385 -636669 -1012860 -1249205
6658 -1249205 -941209 -947358 -1130321 -1022093 -1190663 -1079914 -962026 -1364980 -1166726 -873233
6648 -873233 -1289807 -838353 -1223198 -1190161 -948852 -1097060 -741053 -901664 -1008650 -1210169
$$ packed form
6719a012617j18557o0115M27710j95237k39726J94119j10088P8065O8401J3131
6709i54914j87364n369L4272O7163j8956m11440K79125K11774k83439L56790o3657
6698i76015j79246k14617J84225L30673K42456P974p14557M91341k32344n8144
6688a118254O6890l04589N05016L05933k19163l19249M36311k71994j57637j29296
6678a206032R1020m34476K90925K77631m46632L31024r2041O70609m33601k40736
6668a192309Q8129J48392J20172n30951K35613L26852r283J76716l76191k36345
6658a249205L07996o149j82963J08228j68570J10749J17888m02954J98254K93493
6648h73233m16574M51454l84845L3037K41309j48208L56007j60611j06986k01519
$$ plain form
6638 -1210169 -1122773 -971244 -1066470 -1274150 -817186 -518977 -996087 -928491 -1044960 -923686
6628 -923686 -1469382 -911838 -1015861 -996694 -859104 -1190296 -727709 -1024595 -1212920 -985962
6618 -985962 -952085 -1126012 -1204884 -1467994 -1188041 -766210 -1070273 -572616 -812957 -762707
6608 -762707 -1318439 -1393526 -841541 -660939 -1116020 -850148 -899669 -1092168 -751967 -1157744
6598 -1157744 -917953 -1134530 -803699 -591504 -498766 -659458 -468926 -851100 -797565 -1010939
6588 -1010939 -438385 -799453 -736549 -745462 -730298 -410659 -899437 -921912 -854297 -1097015 -666278
6577 -666278 -1298030 -607351 -434423 -971551 -714638 -523308 -745561 -1324643 -810930 -437879
6567 -437879 -831099 -741921 -596315 -832869 -413459 -875050 -1070763 -420838 -907312 -583572
$$ packed form
6638a210169Q7396J51529r5226k07680M56964K98209m77110O7596j16469J21274
6628i23686n45696N57544j04023J9167J37590l31192M62587k96886j88325K26958
6618i85962L3877j73927p8872k63110K79953M21831l04063M97657k40341N0250
6608g62707n55732p5087N51985J80602m55081K65872m9521j92499L40201m05777
6598a157744K39791k16577L30831K12195R2738j60692J90532l82174N3535k13374
6588a010939N72554l61068O2904q913J5164L19639m88778k2475O7615k42718M30737
6577f66278o31752O90679J72928n37128K56913J91330k22253n79082N13713L73051
6567d37879l93220Q9178J45606k36554M19410m61591j95713O49925m86474L23740
$$ plain form
6557 -583572 -887659 -616255 -437627 -1042015 -1040036 -985626 -925238 -933413 -1083260 -839579 -1191346
6546 -1191346 -828722 -649473 -491238 -788558 -931264 -1371629 -1321549 -858759 -1015785 -699409
6536 -699409 -662049 -706264 -936865 -417326 -1129790 -1012542 -648429 -773643 -943114 -904958
6526 -904958 -1024799 -857978 -871035 -1293275 -545479 -512539 -644997 -851133 -994803 -885487
6516 -885487 -917518 -866716 -716057 -852096 -1104402 -909924 -918573 -1026473 -785704 -723387 -794672
6505 -794672 -662219 -1075981 -918143 -974518 -734974 -823352 -1122150 -1237751 -869986 -1003624
6495 -1003624 -641269 -809524 -691959 -962835 -701177 -1064097 -1074766 -1102256 -1149406 -791427
6485 -791427 -946744 -708234 -978202 -867441 -672753 -766928 -942457 -986585 -687075 -840691
$$ packed form
6557e83572l04087K71404J78628o04388J979N4410O0388q175j49847K43681l51767
6546a191346L62624J79249J58235k97320j42706m40365N0080M62790j57026L16376
6536f99409L7360m4215k30601N19539p12464J17248L64113j25214j69471L8156
6526i04958j19841J66821j3057m22240P47796L2940j32458k06136j43670J09316
6516h85487l2031N0802J50659j36039k52306J94478q649j07900K40769O2317p1285
6505g94672J32453m13762J57838n6375K39544q8378k98798j15601L67765j33638
6495a003624L62355j68255J17565k70876K61658l62920j0669k7490m7150L57979
6485g91427j55317K38510k69968J10761J94688r4175j75529m4128K99510j53616
$$ plain form
6475 -840691 -899424 -1257585 -564155 -808972 -870793 -626340 -823296 -868452 -842125 -683660
6465 -683660 -548039 -839974 -617736 -846917 -474359 -785609 -808784 -602688 -597339 -669788
6455 -669788 -392309 -759129 -712460 -408053 -652576 -853375 -745691 -579203 -861712 -760714
6445 -760714 -270591 -555503 -448243 -861535 -596378 -668417 -853163 -304447 -514191 -351254
6435 -351254 -203189 -313313 -497726 -454736 -757466 -588076 -227040 -323750 -567472 -398448
6425 -398448 -444282 -772444 -379693 -868167 -573928 -591355 -55951 -400013 -338104 -323123
6415 -323123 -452324 -211918 -209348 -388664 -834356 -248569 -743627 -305368 -754257 -120933
6405 -120933 -430691 -358179 -718884 1548 -390771 -495789 -644904 -165686 -306011 -608880
$$ packed form
6475h40691n8733l58161O93430k44817o1821K44453j96956m5156K6327J58465
6465f83660J35621k91935K22238k29181L72558l11250k3175K06096N349p2449
6455f69788K77479l66820M6669L04407k44523k00799J07684J66488k82509J00998
6445g60714M90123k84912J07260m13292K65157p2039j84746N48716k09744J62937
6435c51254J48065j10124j84413M2990l02730J69390L61036r6710k43722J69024
6425c98448m5834l28162L92751m88474K94239j7427N35404l44062O1909J4981
6415c23123j29201K40406K570j79316m45692N85787m95058M38259m48889O33324
6405a20933l09758P2512l60705P20432l92319j05018j49115M79218j40325l02869
$$ plain form
6395 -608880 -422582 -210034 -442995 -365539 125654 -350966 -198678 -321655 -386573 -580104
6385 -580104 -287928 -483258 -395260 -493685 -247341 -428520 -278096 -265839 -385260 -261456
6375 -261456 -414524 -77887 -88166 -343768 -411304 86675 -164392 -428131 -309435 -640470
6365 -640470 -203526 -155055 -248411 -39414 -251568 -89185 -33910 -727519 -284761 -221367
6355 -221367 -342595 -80609 105960 -204811 41352 -15206 -515898 -304186 42133 -297049
6345 -297049 -256719 -132208 -18982 -157449 161919 -62492 -646659 -305245 -357538 -274810
6335 -274810 -134657 -246656 -149308 -20483 -398663 -432474 359725 121515 72562 -109428
6325 -109428 -105767 -183326 -129384 146312 -249685 -99838 -150670 259775 184172 -59333 293070
$$ packed form
6395f08880J86298K12548k32961P7456M91193m76620J52288j22977o4918j93531
6385e80104K92176j95330Q7998r8425K46344j81179J50424J2257j19421J23804
6375b61456j53068L36637j0279k55602o7536M97979k51067k63739J18696l31035
6365f40470M36944M8471r3356K08997k12154J62383N5275o93609M42758O3394
6355b21367j21228K61986J86569l10771K46163n6558n00692K11712L46319l39182
6345b97049M0330J24511J13226j38467L19368k24411n84167L41414n2293Q2728
6335b74810J40153j11999R7348J28825l78180l3811P92199k38210m8953j81990
6325a09428L661p7559N3942K75696l95997J49847n0832M10445p5603k43505L52403
$$ plain form
6314 293070 -42042 261156 567216 40837 218296 280149 -378165 26377 162893 219507
6304 219507 467483 387233 173878 541476 -24601 71312 525083 1229 136751 45029
6294 45029 430801 226743 425049 406858 434470 381655 348170 577622 549145 412832 455763
6283 455763 506960 529417 453488 226212 385339 368660 331342 483692 248041 555511 311248
6272 311248 -2012 278664 97682 -33725 81787 398722 317352 -26620 437795 266864
6262 266864 63004 218810 549551 172994 -120201 -110453 -35761 406946 478425 375249
6252 375249 301913 479316 36711 206842 189150 301911 -44361 265284 -1347 -94004
6242 -94004 204942 368264 558214 269192 187388 466556 844522 87171 401618 145267
$$ packed form
6314B93070l35112L03198L06060n26379J77459O1853o58314M04542J36516N6614
6304B19507K47976q0250k13355L67598n66077R5913M53771n23854J35522r1722
6294D5029L85772k04058J98306j8191K7612n2815l3485K29452k8477j36313M2931
6283D55763N1197K2457p5929k27276J59127j6679l7318J52350k35651L07470k44263
6272C11248l13260K80676j80982j31407J15512L16935q1370l43972M64415j70931
6262B66864k03860J55806L30741l76557k93195R748P4692M42707P1479j03176
6252C75249p3336J77403m42605J70131j7692J12761l46272L09645k66631r2657
6242i4004K98946J63322J89950k89022q1804K79168L77966p57351L14447k56351
$$ plain form
6232 145267 391948 211175 268182 271742 244243 434271 -65666 526045 281730 376176 -177802
6221 -177802 208075 593683 616705 337645 293865 152747 560493 637842 702750 416803
6211 416803 630551 801618 896664 1212445 1042208 943663 547455 924812 332474 847601
6201 847601 829218 932127 675161 568353 737113 486389 617800 709019 923679 1120057
6191 1120057 1024577 770607 952462 654619 1537597 969901 1563264 1323082 1293453 1297548
6181 1297548 1857983 1680931 1460981 1390436 1390420 1518718 1558908 1051339 1188795 1817391 1479481
6170 1479481 1223558 1291664 1232587 1484202 1103698 1108434 1558636 1579287 1549511 1562009 1447244
6159 1447244 1827949 1500269 1652168 1730514 1761590 2001775 2259014 1793365 1519562 1928862
$$ packed form
6232A45267K46681j80773N7007L560k7499J90028m99937N91711k44315R4446n53978
6221a77802L85877L85608K3022k79060m3780j41118M07746P7349O4908k85947
6211D16803K13748J71067R5046L15781j70237r8545l96208L77357n92338N15127
6201H47601j8383J02909k56966j06808J68760k50724J31411R1219K14660J96378
6191A120057r5480k53970J81855k97843Q82978n67696N93363k40182k9629M095
6181A297548N60435j77052k19950p0545j6J28298M0190n07569J37456O28596l37910
6170A479481k55923O8106n9077K51615l80504M736M50202K0651k9776J2498j14765
6159A447244L80705l27680J51899P8346L1076K40185K57239m65649k73803M09300
$$ plain form
6149 1928862 2161075 2164756 1878491 1441780 1868492 1496133 1700283 1786440 1404249 1873536
6139 1873536 2048220 1776959 1847849 1827561 1857619 2115357 1773519 1436856 1404835 1833829
6129 1833829 2227662 1985357 1949721 2217933 2209256 2423186 2581006 2338369 2413373 2100971
6119 2100971 2381542 2692092 2448193 2093640 2520340 2318495 2644766 2399237 2561475 2057157
6109 2057157 2689841 2744184 2786434 2815482 2987714 2476493 2539720 2959181 2540601 2945637
6099 2945637 2741692 2640328 2909789 2820016 2548210 3134046 3189934 2926195 2754580 2932172
6089 2932172 2737621 3455220 3292022 3464603 3603445 3516892 4055798 4157505 4194036 3989599
6079 3989599 3615485 3939735 3754066 3615667 3672917 3824780 3789518 3293090 3523971 3275979
$$ packed form
6149A928862K32213L681k86265m36711M26712l72359K04150Q6157l82191M69287
6139A873536J74684k71261P0890k0288L0058K57738l41838l36663l2021M28994
6129A833829L93833k42305l5636K68212q677K13930J57820k42637P5004l12402
6119B100971K80571L10550k43899l54553M26700k01845L26271k45529J62238n04318
6109B057157O32684N4343M2250K9048J72232n11221O3227M19461m18580M05036
6099B945637k03945j01364K69461q9773k71806N85836N5888k63739j71615J77592
6089B932172j94551P17599j63198J72581J38842q6553N38906J01707L6531k04437
6079C989599l74114L24250j85669j38399N7250J51863l5262m96428K30881k47992
$$ plain form
6069 3275979 3119988 3130083 2745847 3343993 3504074 2922746 3241682 3206797 3181180 3803332
6059 3803332 3541997 3745974 3548473 3920150 3964335 4322229 4625176 4696055 4545948 4583170
6049 4583170 4643971 4575111 3957896 3794892 4161169 4047263 4054037 3733761 4287736 3672851
6039 3672851 3668394 3981518 3859938 3911009 3810553 4339504 4075816 3781863 4398131 3917533
6029 3917533 4434752 4145544 4165106 3794891 4386309 4403685 4428089 4455513 4122574 4914624
6019 4914624 4447572 4598166 4367157 4236851 4410575 4713291 4440448 4707443 4503822 4492958
6009 4492958 4604806 5145069 5070896 4745832 5469961 5335072 5462234 5507133 5576720 5721356
5999 5721356 6040676 5475056 5525840 5328687 5345299 5476138 5692829 5047914 4854103 5185778
$$ packed form
6069C275979j55991J0095l84236N98146J60081n81328L18936l4885k5617O22152
6059C803332k61335K03977j97501L71677M4185L57894L02947P0879j50107L7222
6049D583170O0801o8860o17215j63004L66277j13906O774l20276N53975o14885
6039C672851m457L13124j21580N1071j00456N28951k63688k93953O16268m80598
6029C917533N17219k89208J9562l70215N91418J7376K4404K7424l32939P92050
6019D914624m67052J50594k31009j30306J73724L02716k72843K66995k03621j0864
6009D492958J11848N40263p4173l25064P24129j34889J27162M4899O9587J44636
5999E721356L19320n65620N0784j97153J6612J30839K16691o44915j93811L31675
$$ plain form
5989 5185778 5101578 5254479 5107485 5355732 5357967 5136697 5036993 5213002 5133534 5898665
5979 5898665 5773827 6176371 6410473 6385567 6613781 6388491 6536086 7046436 6930972 6998538
5969 6998538 6778639 6871354 6525457 6699084 6338554 6502318 6497476 6055867 6701299 6627780
5959 6627780 6044580 6008177 6341168 6815863 6931723 6332837 6644404 6488478 6553644 7082141
5949 7082141 7075821 7288610 7792058 7733181 7683902 7914050 7800380 8421192 8331449 8742490
5939 8742490 8290310 8575288 8674482 8867593 8728854 9346516 9239986 9173163 9426739 10240555
5929 10240555 10449016 10342336 10815898 10691800 11536958 11602014 12432392 12911000 13413867 13925718
5919 13925718 13926142 14440190 15044721 15620760 16158984 17062205 17568623 18673936 19397659 20417422
$$ packed form
5989E185778q4200J52901j46994K48247K235k21270r9704J76009p9468P65131
5979E898665j24838M02544K34102k4906K28214k25290J47595N10350j15464O7566
5969F998538k19899R2715l45897J73627l60530J63764m842m41609O45432p3519
5959F627780n83200l6403L32991M74695J15860n98886L11567j55926O5166N28497
5949G082141o320K12789N03448n8877m9279K30148j13670O20812q9743M11041
5939H742490m52180K84978R9194J93111j38739O17662j06530o6823K53576Q13816
5929A0240555K08461j06680M73562j24098Q45158O5056Q30378M78608N02867N11851
5919A3925718M24N14048O04531N76039N38224R03221N06418J105313P23723J019763
$$ plain form
5909 20417422 21049848 22332276 23371577 25359808 26339540 27738486 29189592 29984130 31647003
5900 31647003 32704373 34014785 34450652 35564067 35950987 36500052 36311994 36732674 37228910
5891 37228910 37510370 37447090 37813641 37733118 37977484 38516520 38816092 39297329 40271453 40996304
5881 40996304 41830936 43209733 44490482 46455551 48000961 50135244 52457234 54161628
5873 54161628 56753303 58417758 60374779 62156878 62867614 63801136 64034001 63667714 63409652
5864 63409652 62471018 61856586 60779492 59080358 57616113 55531646 54437112 53062814
5856 53062814 51529284 50349717 49355955 48920660 47865360 48062790 47810389 47794427 47917622
5847 47917622 47955281 48461832 48342624 49000448 49669845 50107141 50606774 50800772 50322568 50932991
$$ packed form
5909B0417422O32426J282428J039301J988231R79732J398946J451106P94538J662873
5900C1647003J057370J310412M35867J113415L86920N49065j88058M20680M96236
5891C7228910K81460o3280L66551q0523K44366N39036K99572M81237R74124P24851
5881D0996304Q34632J378797J280749J965069J545410K134283K321990J704394
5873E4161628K591675J664455J957021J782099P10736R33522K32865l66287k58062
5864F3409652r38634o14432j077094j699134j464245k084467j094534j374298
5856E3062814j533530j179567r93762m35295j055300J97430k52401j5962J23195
5847D7917622L7659N06551j19208O57824O69397M37296M99633J93998m78204O10423
$$ plain form
5837 50932991 50058578 49684414 48908651 48134085 47565390 46767872 45566142 44443015 43526421
5828 43526421 42325363 41740537 40717225 39945535 39546712 38517403 37716155 37267053 36871858
5819 36871858 36855413 36330491 36102648 35874737 35494872 34984680 35989923 35655470 36461748
5810 36461748 36023668 36553197 37108558 37484175 38202384 38874035 38962365 38952435 40108462 39808228
5800 39808228 39931659 40510752 40942924 41628062 42386172 43185450 43584745 44440652 46000369
5791 46000369 46764094 47984004 49336041 50651538 51784983 53974412 54890899 56685986
5783 56685986 58544158 60089452 62142101 64661087 66516523 68826119 70589457 72722877
5775 72722877 73754654 75688869 77385138 78463300 79724336 80450814 82401064 84003724
$$ packed form
5837E0932991q74413l74164p75763p74566n68695p97518j201730j123127r16594
5828D3526421j201058n84826j023312p71690l98823j029309q01248m49102l95195
5819C6871858j6445n24922k27843k27911l79865n10192J005243l34453Q06278
5810C6461748m38080N29529N55361L75617P18209O71651Q8330r930J156027l00234
5800C9808228J23431N79093M32172O85138P58110P99278L99295Q55907J559717
5791D6000369P63725J219910J352037J315497J133445K189429R16487J795087
5783E6685986J858172J545294K052649K518986J855436K309596J763338K133420
5775G2722877J031777J934215J696269J078162J261036P26478J950250J602660
$$ plain form
5767 84003724 85557568 87226241 89600966 92151674 94944442 97708280 100437395 104121215
5759 104121215 106671586 109532947 112464824 115219152 118303054 120909425 124335365 126913151
5751 126913151 130217033 134097030 137994806 141438910 144946331 148297559 151485141 153975729
5743 153975729 155554281 156687599 157561245 157380048 156415749 155298449 153938260 152199437
5735 152199437 150897640 149219465 148345449 147400709 147326613 146793686 146619184 146894000 147734557
5726 147734557 148779462 150507498 152430404 155747347 158470751 163013423 167737124 173251355
5718 173251355 179249062 185807770 191849599 197425430 202709367 207080401 209773491 211356461
5710 211356461 210999104 210336262 207900221 203944778 199427516 194167168 189556894 184822420
$$ packed form
5767H4003724J553844J668673K374725K550708K792768K763838K729115L683820
5759A04121215K550371K861361K931877K754328L083902K606371L425940K577786
5751A26913151L303882L879997L897776L444104L507421L351228L187582K490588
5743A53975729J578552J133318Q73646j81197r64299j117300j360189j738823
5735A52199437j301797j678175q74016r44740p4096n32927j74502K74816Q40557
5726A47734557J044905J728036J922906L316943K723404M542672M723701N514231
5718A73251355N997707O558708O041829N575831N283937M371034K693090J582970
5710B11356461l57357o62842k436041l955443m517262n260348m610274m734474
$$ plain form
5702 184822420 180123131 175763978 172668534 169622165 168028846 167092541 166989500 167171957
5694 167171957 168291679 169141362 170947412 172942300 175669358 177927523 180466217 182560852
5686 182560852 185160360 186676544 188704904 189948890 191088395 191206192 190891522 189278312
5678 189278312 187430309 185261146 183348096 181761091 179919205 178749822 179135402 179500054
5670 179500054 181158087 184004030 187210495 190830918 195291095 198567223 200616914 202875536
5662 202875536 204094302 204446030 203449822 202881885 201873913 200612982 199678463 199210383 199934889
5653 199934889 201226311 204135264 207287512 211221544 215342537 220042481 224907187 229229269
5645 229229269 233822373 238605655 242579335 246842331 251277243 256835323 262427133 269205678
$$ packed form
5702A84822420m699289m359153l095444l046369j593319r36305j03041J82457
5694A67171957J119722Q49683J806050J994888K727058K258165K538694K094635
5686A82560852K599508J516184K028360J243986J139505J17797l14670j613210
5678A89278312j848003k169163j913050j587005j841886j169383L85580L64652
5670A79500054J658033K845943L206465L620423M460177L276128K049691K258622
5662B02875536J218766L51728r96208n67937j007972j260931r34519m68080P24506
5653A99934889J291422K908953L152248L934032M120993M699944M864706M322082
5645B29229269M593104M783282L973680M262996M434912N558080N591810O778545
$$ plain form
5637 269205678 276292960 282908322 289209788 295324669 299528160 303578444 304713686 305763400
5629 305763400 305532342 304585596 303863719 303966895 303444720 305074966 307366482 311181834 314772998
5620 314772998 319155570 323581671 327280236 329686796 330302902 330376807 327632520 324389417
5612 324389417 319737027 314630371 308882267 303861922 299274587 295061188 292689903 289916398
5604 289916398 287748044 285270109 283331030 280540036 277820472 275044567 272495600 269646572
5596 269646572 268021888 266745533 266035304 266255483 266637731 267783214 269252529 270532308
5588 270532308 271331773 270876573 269637498 267181263 263699245 259436875 254069516 248718486
5580 248718486 243528826 237810096 232634017 228224541 224736649 221742826 220628405 219583206
$$ packed form
5637B69205678P087282O615362O301466O114881M203491M050284J135242J049714
5629C05763400k31058r46746p21877J03176n22175J630246K291516L815352L591164
5620C14772998M382572M426101L698565K406560O16106P3905k744287l243103
5612C24389417m652390n106656n748104n020345m587335m213399k371285k773505
5604B89916398k168354k477935j939079k790994k719564k775905k548967k849028
5596B69646572j624684j276355p10229K20179L82248J145483J469315J279779
5588B70532308P99465m55200j239075k456235l482018m262370n367359n351030
5580B48718486n189660n718730n176079m409476l487892k993823j114421j045199
$$ plain form
5572 219583206 219060852 219425772 220584046 221637665 223339153 225025771 226388684 227117793
5564 227117793 228179795 228701021 229504981 229682409 229475429 229516818 229389621 228976368 228859382
5555 228859382 228606635 229131690 230348590 231139327 231409964 233033577 234602873 236100865 237682176
5546 237682176 239780933 241764310 244322242 246882434 249264990 252385139 255365481 258555839
5538 258555839 261108980 263717429 266455163 268645596 270759820 272322446 273443283 273359250
5530 273359250 272985674 272500480 271578624 270286904 268161458 266452494 263881271 261059595
5522 261059595 258595481 255769931 253434879 250624151 248572483 247311613 246480812 246786674
5514 246786674 246687717 247918782 249321486 251600673 253787448 256080001 258303732 258991820
$$ packed form
5572B19583206n22354L64920J158274J053619J701488J686618J362913P29109
5564B27117793J062002N21226Q03960J77428k06980M1389j27197m13253j16986
5555B28859382k52747N25055J216900P90737K70637J623613J569296J497992J581311
5546B37682176K098757J983377K557932K560192K382556L120149K980342L190358
5538B58555839K553141K608449K737734K190433K114224J562626J120837q4033
5530B73359250l73576m85194r21856j291720k125446j708964k571223k821676
5522B61059595k464114k825550k335052k810728k051668j260870q30801L05862
5514B46786674r8957J231065J402704K279187K186775K292553K223731O88088
$$ plain form
5506 258991820 258641636 257376500 254632859 251206700 246676272 240227559 233223869 225469702
5498 225469702 217291894 209163662 200191023 192243317 184716366 177644910 171621488 165581920
5490 165581920 160324670 156532452 153283118 150201407 148440573 146702435 146602907 145872668
5482 145872668 146231189 146561928 147290599 148223380 148323361 148319156 147422128 145354304 143181207
5473 143181207 140847841 136946308 132727242 127959285 123469994 118835263 114487052 110225241
5465 110225241 106293069 102973479 100531681 97092943 95076069 92944195 91545710 90179056
5457 90179056 89054382 88076214 87672547 86932772 86925882 87132496 87248044 87731787 88620272 90122222
5447 90122222 91338395 92930173 95164679 97287972 99975549 102033408 104850958 106858516
$$ packed form
5506B58991820l50184j265136k743641l426159m530428o448713p003690p754167
5498B25469702q177808q128232q972639p947706p526951p071456o023422o039568
5490A65581920n257250l792218l249334l081711j760834j738138r9528p30239
5482A45872668L58521L30739P28671R32781R9981m205q97028k067824k173097
5473A43181207k333366l901533m219066m767957m489291m634731m348211m261811
5465A10225241l932172l319590k441798l438738k016874k131874j398485j366654
5457I0179056j124674r78168m03667p39775o890K06614J15548M83743Q88485J501950
5447I0122222J216173J591778K234506K123293K687577K057859K817550K007558
$$ plain form
5439 106858516 109299617 111480530 113498555 115422161 117408781 119731762 121422257 122828761
5431 122828761 125234521 127121892 129269351 130897855 134132238 136162883 138616631 141243015
5423 141243015 144993922 147723227 152326371 155801565 159511005 163343066 166559570 169750118
5415 169750118 172189738 173623360 174786403 174811113 173929831 172011077 169870469 166766286
5407 166766286 163736533 161114599 157421378 153626136 150012586 146896338 143827829 140501524
5399 140501524 137773298 134199070 131769105 128255518 125439451 122413002 119578849 116111039
5391 116111039 113092963 109832832 106407013 102878360 99747914 95744300 92229400 88806780
5383 88806780 85621529 82346306 79233395 76093847 73432654 70960423 68209705 66070873
$$ packed form
5439A06858516K441101K180913K018025J923606J986620K322981J690495J406504
5431A22828761K405760J887371K147459J628504L234383K030645K453748K626384
5423A41243015L750907K729305M603144L475194L709440L832061L216504L190548
5415A69750118K439620J433622J163043K4710q81282j918754k140608l104183
5407A66766286l029753k621934l693221l795242l613550l116248l068509l326305
5399A40501524k728226l574228k429965l513587k816067l026449k834153l467810
5391A16111039l018076l260131l425819l528653l130446m003614l514900l422620
5383H8806780l185251l275223l112911l139548k661193k472231k750718k138832
$$ plain form
5375 66070873 63817423 61973231 60201543 58328552 56883518 54867083 53851512 52757187
5367 52757187 51538180 50600252 49316844 49060932 47909715 46941051 46546842 45770264 44839991
5358 44839991 44759135 44019087 43784903 43708497 42830471 42684694 42447821 42360509 41801820 41692738
5348 41692738 41160166 40450996 40633842 40943929 40456574 40412970 40260265 40437792 40175656 40159671
5338 40159671 40208484 40314866 40029157 40316467 40234449 40515143 40480427 40948502 40989270 41596387
5328 41596387 42388496 42544300 42846100 43673873 44368650 45688434 46995833 48668175 50745584
5319 50745584 52704010 54946658 57665103 59976616 62170138 64515112 67623648 70961824
5311 70961824 74065350 76867390 79582946 81860639 84404232 86967347 89573497 91921249
$$ packed form
5375F6070873k253450j844192j771688j872991j445034k016435j015571j094325
5367E2757187j219007r37928j283408k55912j151217r68664l94209p76578r30273
5358D4839991q0856p40048k34184p6406q78026j45777k36873q7312n58689j09082
5348D1692738n32572p09170J82846L10087m87355m3604j52705J77527k62136j5985
5338D0159671M8813J06382k85709K87310q2018K80694l4716M68075M0768O07117
5328D1596387P92109J55804L01800Q27773O94777J319784J307399J672342K077409
5319E0745584J958426K242648K718445K311513K193522K344974L108536L338176
5311G0961824L103526K802040K715556K277693K543593K563115K606150K347752
$$ plain form
5303 91921249 93485622 94776340 94767282 95234810 94900891 94224084 93260888 92031389 89563052
5294 89563052 87717866 85201181 82233687 79790131 77638855 74734558 71794889 69003171
5286 69003171 66179006 63230915 60810514 58766317 56818722 54682823 52557726 51251794
5278 51251794 49973399 48768632 48349223 48138603 48105908 48333649 48194284 48732153 49115856
5269 49115856 49927421 50719233 51791860 52751479 53985313 55368355 57743231 59124184 61363772
5260 61363772 63234778 65301594 67516405 70199909 72048367 75204332 77587467 80120217
5252 80120217 81464372 84358585 86908162 89381538 90938564 94090040 95617457 98127778
5244 98127778 100442381 102666695 104856902 107622952 110303638 112722522 115803442 118260051
$$ packed form
5303I1921249J564373J290718r058M67528l33919o76807r63196j229499k468337
5294H9563052j845186k516685k967494k443556k151276k904297k939669k791718
5286F9003171k824165k948091k420401k044197j947595k135899k125097j305932
5278E1251794j278395j204767m19409k10620l2695K27741j39365N37869L83703
5269D9115856Q11565P91812J072627R59619J233834J383042K374876J380953K239588
5260F1363772J871006K066816K214811K683504J848458L155965K383135K532750
5252H0120217J344155K894213K549577K473376J557026L151476J527417K510321
5244I8127778K314603K224314K190207K766050K680686K418884L080920K456609
$$ plain form
5236 118260051 120738819 123629408 125614606 128364086 130108165 131169983 131489707 131259481
5228 131259481 131280738 129748799 128588557 126211815 123704505 120926630 117949288 115048689
5220 115048689 112197819 108468836 106212827 103576910 101147418 98241084 95942786 94066673
5212 94066673 91570789 90057656 87894956 86257674 84181988 82290304 80556015 78395710
5204 78395710 76385821 73883124 71218453 69359772 66385513 64212229 61569195 58702801
5196 58702801 56462474 53999979 52073841 50204489 47605489 46067988 44697721 42769102
5188 42769102 41642176 40187466 38752382 37401194 36824360 35932159 35129494 34400285 33189109
5179 33189109 32835760 31933428 31757774 31190401 30748651 30096262 29304971 29420988 29128647
$$ packed form
5236A18260051K478768K890589J985198K749480J744079J061818L19724k30226
5228A31259481K1257j531939j160242k376742k507310k777875k977342k900599
5220A15048689k850870l728983k256009k635917k429492k906334k298298j876113
5212I4066673k495884j513133k162700j637282k075686j891684j734289k160305
5204G8395710k009889k502697k664671j858681k974259k173284k643034k866394
5196E8702801k240327k462495j926138j869352k599000j537501j370267j928619
5188D2769102j126926j454710j435084j351188n76834q92201q02665p29209j211176
5179C3189109l53349r02332j75654n67373m41750o52389p91291J16017k92341
$$ plain form
5170 29128647 28362969 28214747 27763923 27957486 27430023 26826849 26941219 26293034 26032182
5161 26032182 25982764 26004269 25718733 25714008 25392153 24991887 24883856 24851021 24743738 24733710
5151 24733710 24241858 25032292 24548821 24422667 24507269 24149598 24259080 24518661 24810804 24735781
5141 24735781 24367231 25020667 25329006 25249502 24811189 25427482 25552213 25755509 25598176 26054372
5131 26054372 26394150 26752262 27047220 27406087 27724750 27987608 28088468 28758371 29206060
5122 29206060 30233176 30521927 30976685 31839604 33243858 33347403 34634098 34921235 35600710
5113 35600710 36669492 37813961 38086338 38992314 39811758 40646913 41445895 42205532 43210786
5104 43210786 44563029 45725660 46804636 48304620 49979878 51767156 53741247 56045745
$$ packed form
5170B9128647p65678j48222m50824J93563n27463o03174J14370o48185k60852
5161B6032182m9418K1505k85536m725l21855m00266j08031l2835j07283j0028
5151B4733710m91852P90434m83471j26154Q4602l57671J09482K59581K92143p5023
5141B4735781l68550O53436L08339p9504m38313O16293J24731K03296j57333M56196
5131B6054372L39778L58112K94958L58867L18663K62858J00860O69903M47689
5122B9206060J027116K88751M54758Q62919J404254J03545J286695K87137O79475
5113C5600710J068782J144469K72377R05976Q19444Q35155P98982P59637J005254
5104D3210786J352243J162631J078976J499984J675258J787278J974091K304498
$$ plain form
5096 56045745 58205803 60837198 63376859 66002338 68325114 70396407 72547459 74909153
5088 74909153 76314260 77703243 79061360 79627715 80959751 81824605 82665540 83249491 84533390
5079 84533390 85251985 86305443 87142729 88679985 89895976 91729858 93709004 96540897
5071 96540897 99923433 103193261 107810489 112640754 118149671 123772510 129816055 136789097
5063 136789097 142889828 149500998 155484022 160113097 163598213 164982237 165160192 164046924
5055 164046924 162353828 159954206 155889275 152740174 149697126 146657414 144532065 142610278
5047 142610278 141175047 140823828 140598531 141481307 142676096 145256694 148581716 152762271
5039 152762271 158286144 164303482 171552604 180350766 188954970 199267971 208923208 218448903
$$ packed form
5096E6045745K160058K631395K539661K625479K322776K071293K151052K361694
5088G4909153J405107J388983J358117N66355J332036Q64854Q40935N83951J283899
5079H4533390P18595J053458Q37286J537256J215991J833882J979146K831893
5071I6540897L382536L269828M617228M830265N508917N622839O043545O973042
5063A36789097O100731O611170N983024M629075L485116J384024J77955j113268
5055A64046924j693096k399622m064931l149101l043048l039712k125349j921787
5047A42610278j435231l51219k25297Q82776J194789K580598L325022M180555
5039A52762271N523873O017338P249122Q798162Q604204J0313001R655237R525695
$$ plain form
5031 218448903 226958182 234169899 238748645 239736288 237755468 232527394 224996049 216034875
5023 216034875 206337007 196824580 186764396 178230602 170080623 162898903 158549708 154468742
5015 154468742 151469033 149121829 147525374 146796013 148183050 149412248 152369967 156969726
5007 156969726 163045195 169814245 177530527 185897456 195308641 203787632 212566429 219658218
4999 219658218 222629779 223011145 219957474 213701142 204543829 193910598 182563599 170491601
4991 170491601 159261043 147956664 138901710 130964282 124499730 119343879 115425885 111428708
4983 111428708 109808020 107203411 105412972 104212517 103744317 103635471 104644382 106822531
4975 106822531 110194813 115054228 119917533 124739769 130394822 133248122 134798177 134114852
$$ packed form
5031B18448903Q509279P211717M578746R87643j980820n228074p531345q961174
5023B16034875r697868r512427j0060184q533794q149979p181720m349195m080966
5015A54468742k999709k347204j596455p29361J387037J229198K957719M599759
5007A56969726O075469O769050P716282Q366929R411185Q478991Q778797P091789
4999B19658218K971561L81366l053671o256332r157313j0633231j1346999j2071998
4991A70491601j1230558j1304379r054954p937428o464552n155851l917994l997177
4983A11428708j620688k604609j790439j200455m68200j08846J008911K178149
4975A06822531L372282M859415M863305M822236N655053K853300J550055o83325
$$ plain form
4967 134114852 131703095 126998116 121242819 114154343 107106877 99679808 92812992 86118593
4959 86118593 81088004 76054503 72370907 68843746 66681959 64385357 62318375 60527254
4951 60527254 59160713 58228043 56566598 55925261 55003291 54929483 54456575 55125893 55717681
4942 55717681 56731832 57051260 57441783 57218997 57352187 56497774 55372248 53339938 51705694
4933 51705694 49570165 47567754 45754632 43748615 42104122 41292350 40836393 39404001
4925 39404001 38510157 37527175 36811028 36755223 35990248 35337446 35188710 34645960 34349073 34286283
4915 34286283 34292090 33681136 33642972 33271020 32836960 32562692 32977648 32870188 32615335 33035504
4905 33035504 32978127 32494560 32511438 32691579 32554106 32801847 32917288 33199170 33102296 33509819
$$ packed form
4967A34114852k411757m704979n755297p088476p047466p427069o866816o694399
4959H6118593n030589n033501l683596l527161k161787k296602k066982j791121
4951F0527254j366541r32670j661445o41337r21970p3808m72908O69318N91788
4942E5717681J014151L19428L90523k22786J33190q54413j125526k032310j634244
4933E1705694k135529k002411j813122k006017j644493q11772m55957j432392
4925C9404001q93844r82982p16147n5805p64975o52802j48736n42750k96887o2790
4915C4286283N807o10954l8164l71952m34060k74268M14956j07460k54853M20169
4905C3035504n7377m83567J6878J80141j37473K47741J15441K81882r6874M07523
$$ plain form
4895 33509819 33472825 33509223 33931775 34326586 34710096 34952574 35042525 35489163 35684679 36225190
4885 36225190 36549654 37155301 37182443 37562985 38633179 39175625 39590548 40657424 41457629
4876 41457629 42188899 42950550 43730838 44434170 45382454 46313359 47400670 48597984 49574774
4867 49574774 50849493 52080983 53740536 54459911 56324633 57671181 59621411 61200440
4859 61200440 63168477 65164853 67414540 69795248 72153211 75015529 78085799 80696744
4851 80696744 84020316 87274726 90496829 94193610 97862374 100664272 104012495 107768679
4843 107768679 111300356 115473248 118957339 122258475 126026473 129956425 133495044 137021672
4835 137021672 140371330 144396363 147969288 151992574 155577187 159494247 162842806 166512773
$$ packed form
4895C3509819l6994L6398M22552L94811L83510K42478Q9951M46638J95516N40511
4885C6225190L24464O05647K7142L80542J070194N42446M14923J066876Q00205
4876D1457629P31270P61651P80288P03332R48284R30905J087311J197314R76790
4867D9574774J274719J231490J659553P19375J864722J346548J950230J579029
4859F1200440J968037J996376K249687K380708K357963K862318L070270K610945
4851H0696744L323572L254410L222103L696781L668764K801898L348223L756184
4843A07768679L531677M172892L484091L301136L767998L929952L538619L526628
4835A37021672L349658M025033L572925M023286L584613L917060L348559L669967
$$ plain form
4827 166512773 169614492 172642620 175369419 177635809 179223129 180048441 180942601 181336751
4819 181336751 181742775 181498281 182138884 181969045 182024349 182325624 182304306 182704485 182748300 182611551
4809 182611551 183259691 182935491 183376488 183388725 183850307 184306257 185053851 185718252 185975927
4800 185975927 187357305 188591758 190297563 192051396 194501504 196843073 200113799 203817941
4792 203817941 207803342 211754051 216203803 220815383 225702119 232120671 237341862 243375233
4784 243375233 250357723 257568398 265978643 275563081 286453038 297966587 309917776 322572961
4776 322572961 335335312 346750899 357563135 368908879 379035826 388814158 398619741
4769 398619741 408915138 420402455 432147202 445133855 458299285 471162072 482978427
$$ packed form
4827A66512773L101719L028128K726799K266390J587320Q25312Q94160L94150
4819A81336751M06024k44494O40603j69839N5304L01275k1318M00179M3815j36749
4809A82611551O48140l24200M40997J2237M61582M55950P47594O64401K57675
4800A85975927J381378J234453J705805J753833K450108K341569L270726L704142
4792B03817941L985401L950709M449752M611580M886736O418552N221191O033371
4784B43375233O982490P210675Q410245R584438J0889957J1513549J1951189J2655185
4776C22572961J2762351J1415587J0812236J1345744J0126947R778332R805583
4769C98619741J0295397J1487317J1744747J2986653J3165430J2862787J1816355
$$ plain form
4762 482978427 492087851 500140046 505424348 508397122 508517065 507993915 507191309 506938328 509212935
4753 509212935 513372904 518972288 524376599 527904620 527819196 523924432 516218468 504923662
4745 504923662 491278494 475614265 459196449 443834934 430294983 418511528 408597044
4738 408597044 400580006 392617701 384891630 375963359 365613541 353640064 340117166 326239091
4730 326239091 312311476 298455411 284540928 271777790 260793271 250383596 239677706
4723 239677706 230479620 220663521 210904278 200816008 191257841 181562370 171756780 162788991
4715 162788991 154545471 146954807 140623543 134593957 129953085 125345891 121610749 117948603
4707 117948603 113975628 111209105 108053098 104910742 101928568 98373583 95757898 92980993
$$ packed form
4762D82978427R109424Q052195N284302K972774J19943n23150q02606k52981K274607
4753E09212935M159969N599384N404311L528021q5424l894764p705964j1294806
4745E04923662j3645168j5664229j6417816j5361515j3539951j1783455r914484
4738D08597044q017038p962305p726071q928271j0349818j1973477j3522898j3878075
4730C26239091j3927615j3856065j3914483j2763138j0984519j0409675j0705890
4723B39677706r198086r816099r759243j0088270r558167r695471r805590q967789
4715A62788991q243520p590664o331264o029586m640872m607194l735142l662146
4707A17948603l972975k766523l156007l142356k982174l554985k615685k776905
$$ plain form
4699 92980993 90737354 87150916 84991964 82715530 80562276 78408213 76013097 74120972
4691 74120972 72167929 69866918 68551751 66249902 64466853 63159860 61841252 59740657
4683 59740657 58377208 56445467 55586296 54163070 52900942 51633623 50617338 50075222
4675 50075222 48748014 47148417 46793796 45543264 44816289 43868009 43038495 42593443 41974926
4666 41974926 40747109 40000240 39627550 38964924 38318839 37810550 37026802 36533937 36126677
4657 36126677 35530402 34916921 34391226 33532076 33299682 32763724 32403021 32030335 31465995
4648 31465995 30905818 30404967 30086858 29672386 29392642 29242867 28533993 28035057 27785135
4639 27785135 27167209 26982392 26799297 26477325 26326591 26029689 25428688 25212308 25287731 24648202
$$ packed form
4699I2980993k243639l586438k158952k276434k153254k154063k395116j892125
4691G4120972j953043k301011j315167k301849j783049j306993j318608k100595
4683E9740657j363449j931741q59171j423226j262128j267319j016285n42116
4675E0075222j327208j599597l54621j250532p26975r48280q29514m45052o18517
4666D1974926j227817p46869l72690o62626o46085n08289p83748m92865m07260
4657C6126677n96275o13481n25695q59150k32394n35958l60703l72686n64340
4648C1465995n60177n00851l18109m14472k79744j49775p08874m98936k49922
4639B7785135o17926j84817j83095l21972j50734k96902o01001k16380P5423o39529
$$ plain form
4629 24648202 24398384 23693281 23790648 23799959 23347049 22780413 22505733 22270300 22126508 22167831
4619 22167831 21675675 21396163 21233409 20744767 20488965 20194990 20457584 20608905 20139808
4610 20139808 19570717 19502607 19377949 19142537 19057407 18673384 18582093 18870079 18351002 17891739
4600 17891739 17694846 17724858 17852358 17620793 16934112 16857795 16730115 16701962 16739299 16691604
4590 16691604 15827657 16288543 15665313 15198812 15629068 15321261 14908555 15106997 14893252
4581 14893252 15074009 14554684 14626534 14697751 14806175 14251841 14210273 14508179 14135086 13912363
4571 13912363 13907667 13699469 14283141 13955481 13726512 13708013 13210900 13268388 13456439 13028805
4561 13028805 13223860 13228315 12969056 12929785 12838988 12616253 12476944 12753064 12419148 12356130
$$ packed form
4629B4648202k49818p05103R7367R311m52910n66636k74680k35433j43792M1323
4619B2167831m92156k79512j62754m88642k55802k93975K62594J51321m69097
4610B0139808n69091o8110j24658k35412q5130l84023r1291K87986n19077m59263
4600A7891739j96893L0012J27500k31565o86681p6317j27680k8153L7337m7695
4590A6691604q63947M60886o23230m66501M30256l07807m12706J98442k13745
4581A4893252J80757n19325P1850P1217J08424n54334m1568K97906l73093k22723
4571A3912363m696k08198N83672l27660k28969j8499m97113N7488J88051m27634
4561A3028805J95055M455k59259l9271r0797k22735j39309K76120l33916o3018
$$ plain form
4551 12356130 12309918 12248324 11807331 12202530 12153687 11994285 12169888 11920925 12273736 12150658
4541 12150658 11763002 12038740 12051403 11774960 11683556 11614198 11312890 11937032 11558445 11959649
4531 11959649 11244204 11655646 11300919 11220222 11027798 11178494 11209964 11421197 11099881 11241941
4521 11241941 10651615 11274741 11186820 11373556 11191924 10931402 11179563 10900482 10881710 10884591
4511 10884591 10708858 11149133 10905774 11054636 11057393 10382570 10671464 10378729 10825568 10515991
4501 10515991 10900773 10369559 10311693 10393186 10391069 9958477 10623525 10429088 10286549 10213087
4491 10213087 10368694 10128277 10335467 10300415 9970874 10194294 9753116 10371191 9739222 9974415
4481 9974415 9942033 9858264 9456284 9699980 9539875 9363645 9492204 9634504 9730623 9477078
$$ packed form
4551A2356130m6212o1594m40993L95199m8843j59402J75603k48963L52811j23078
4541A2150658l87656K75738J2663k76443r1404o9358l01308O24142l78587M01204
4531A1959649p15445M11442l54727q0697j92424J50696L1470K11233l21316J42060
4521A1241941n90326O23126q7921J86736j81632k60522K48161k79081j8772K881
4511A0884591j75733M40275k43359J48862K757o74823K88894k92735M46839l09577
4501A0515991L84782n31214n7866Q1493k117m32592O65048j94437j42539p3462
4491A0213087J55607k40417K07190l5052l29541K23420m41178O18075o31969K35193
4481I974415l2382q3769m01980K43696j60105j76230J28559J42300R6119k53545
$$ plain form
4471 9477078 9421789 9422618 9442065 9005353 8802017 9664950 9044138 8867604 9577511 8834968
4461 8834968 9023546 8736915 8934879 9043296 8701195 9436254 8905230 9186293 9347322 9142295
4451 9142295 9255691 9242111 8850365 8528666 8965947 9044760 8787462 8536356 8662238 8851686
4441 8851686 8957744 8424279 8306885 8600347 8903418 8896924 8631279 8809285 8634806 8629497
4431 8629497 8866006 8521001 8787134 8640231 8397150 8628325 8906843 9068142 8776597 9125106
4421 9125106 8998858 8906758 8760515 8635032 9193203 8704188 8979461 8955043 9301494 9244350
4411 9244350 9112776 9260346 9153007 9623846 10017992 9839145 9854706 9969942 10140238 10882605
4401 10882605 10763248 10691866 10562761 11286764 11411979 11380881 11232621 11411404 11818889 12161291
$$ packed form
4471I477078n5289Q29J9447m36712k03336Q62933o20812j76534P09907p42543
4461H834968J88578k86631J97964J08417l42101P35059n31024K81063J61029k05027
4451I142295J13396j3580l91746l21699M37281P8813k57298k51106J25882J89448
4441H851686J06058n33465j17394K93462L03071o494k65645J78006j74479n309
4431H629497K36509l45005K66133j46903k43081K31175K78518J61299k91545L48509
4421I125106j26248r2100j46243j25483N58171m89015K75273k4418L46451n7144
4411I244350j31574J47570j07339M70839L94146j78847J5561J15236J70296P42367
4401A0882605j19357p1382j29105P24003J25215l1098j48260J78783M07485L42402
$$ plain form
4391 12161291 12703119 12766015 13022769 13594383 14639005 15431466 16200287 17823242 19765843
4382 19765843 21877262 24571243 27180997 29213804 31317730 31934923 32499019 32071408 31342069
4373 31342069 30030551 27739828 26283498 24783217 23171152 22013377 21490850 20633305
4365 20633305 20248896 20205094 20237372 20141374 20517804 21195111 21938521 22889585 24408740 26222661
4355 26222661 28427591 32246196 36309236 41299527 46441895 50529584 53470845 54896949
4347 54896949 55467693 54146486 51944978 48330107 44299307 40807011 37440746 34453479
4339 34453479 31565371 29125469 27622325 26540386 25749873 24751045 24366411 23958257 23288821
4330 23288821 23799032 23782769 24360652 25177245 26075003 27949518 30054399 31745604 34157170
$$ packed form
4391A2161291N41828O2896K56754N71614J044622P92461P68821J622955J942601
4382A9765843K111419K693981K609754K032807K103926O17193N64096m27611p29339
4373C1342069j311518k290723j456330j500281j612065j157775n22527q57545
4365B0633305l84409m3802L2278r5998L76430O77307P43410R51064J519155J813921
4355B6222661K204930L818605M063040M990291N142368M087689K941261J426104
4347E4896949N70744j321207k201508l614871m030800l492296l366265k987267
4339C4453479k888108k439902j503144j081939p90513r98828l84634m08154o69436
4330B3288821N10211j6263N77883Q16593Q97758J874515K104881J691205K411566
$$ plain form
4321 34157170 36178011 37358387 38313061 38224336 38310134 37475055 36255139 35028076 33059788
4312 33059788 31770829 30327347 29232498 28303913 27680796 26703535 26600608 25805795 25601987
4303 25601987 24945766 24880038 25331066 25279038 24998327 25215068 24966174 24863500 24701829 24199683
4293 24199683 23276512 23214918 22794522 21941422 21268620 20877681 20830101 20620241 20890565 20512295
4283 20512295 20809159 20916056 20716929 20520267 20302905 20532338 20097058 19531511 19464415 19082939
4273 19082939 18360460 18005677 17741417 17348099 16837918 16581659 16217950 15862572 15724071
4264 15724071 15412320 15070408 15085451 15024386 14755580 14848143 14443751 14331370 14573779 15242078
4254 15242078 14707797 14857918 14936968 15224687 15295504 15573208 15509015 15798771 15822966 15523696
$$ packed form
4321C4157170K020841J180376R54674q8725Q5798q35079j219916j227063j968288
4312C3059788j288959j443482j094849r28585o23117r77261j02927p94813k03808
4303B5601987o56221o5728M51028n2028k80711K16741k48894j02674j61671n02146
4293B4199683r23171o1594m20396q53100o72802l90939m7580k09860K70324l78270
4283B0512295K96864J06897j99127j96662k17362K29433m35280n65547o7096l81476
4273A9082939p22479l54783k64260l93318n10181k56259l63709l55378j38501
4264A5724071l11751l41912J5043o1065k68806R2563m04392j12381K42409O68299
4254A5242078n34281J50121P9050K87719P0817K77704o4193K89756K4195k99270
$$ plain form
4244 15523696 15317188 15242132 14631768 14696276 14600748 14047805 13597258 13131871 12945752 12162982
4234 12162982 12116011 11659610 10863722 11217257 11334408 10422344 10572705 10205093 10485313 10002718
4224 10002718 10062067 10220722 10134222 9839740 10226263 10367037 10713677 10327650 10194819 9880831
4214 9880831 9686752 10168436 9740277 9724166 9286867 9155349 8754195 8837836 8569742 8254739
4204 8254739 7960788 7767314 7846537 7665185 7452144 7775092 7649096 7286458 7017663 6818115
4194 6818115 7029584 6708606 6796159 6971059 7252455 7385226 6941064 6810319 6808694 6293876
4184 6293876 6770877 6509474 6860009 6913415 6248232 6124148 5469852 6015343 5653367 6068000
4174 6068000 5976968 5915475 5715139 5799760 5616149 5898417 5371101 5709775 5467349 5490315
$$ packed form
4244A5523696k06508p5056o10364O4508r5528n52943m50547m65387j86119p82770
4234A2162982m6971m56401p95888L53535J17151r12064J50361l67612K80220m82595
4224A0002718N9349J58655q6500k94482L86523J40774L46640l86027j32831l13988
4214I880831j94079M81684m28159j6111m37299j31518m01154Q3641k68094l15003
4204H254739k93951j93474P9223j81352k13041L22948j25996l62638k68795j99548
4194F818115K11469l20978Q7553J74900K81396J32771m44162j30745j625n14818
4184F293876M77001k61403L50535N3406o65183j24084o54296N45491l61976M14633
4174F068000r1032o1493k00336Q4621j83611K82268n27316L38674k42426K2966
$$ plain form
4164 5490315 5338365 5428777 5558704 5188407 5366684 5421049 5135042 5059847 4987136 4886126
4154 4886126 4992463 4821934 4771379 5056610 4878227 4878738 4535442 4430866 4503704 4992421
4144 4992421 4650924 4495686 4293297 4003262 4062058 4565929 4222628 4130852 4281226 3897044
4134 3897044 4378113 4252951 4232262 4033379 3876325 4174996 4118577 4082097 3744238 4080194
4124 4080194 4180290 4498375 4259909 4108440 3843874 3426827 4226740 4056028 3560420 3699681
4114 3699681 4040838 4152878 3868626 4070719 3639169 3166491 3774930 3644723 3809456 3601450
4104 3601450 3658790 3676170 3572398 3694795 3409495 3558565 2993905 3799571 3807323 3903538
4094 3903538 3646064 3448194 3238267 3628045 3543281 3533810 3661759 3473432 3796232 3252064
$$ packed form
4164E490315j51950R0412J29927l70297J78277N4365k86007p5195p2711j01010
4154D886126J06337j70529n0555K85231j78383N11l43296j04576P2838M88717
4144D992421l41497j55238k02389k90035N8796N03871l43301r1776J50374l84182
4134C897044M81069j25162k0689j98883j57054K98671n6419l6480l37859L35956
4124D080194J00096L18085k38466j51469k64566m17047P99913j70712m95608J39261
4114C699681L41157J12040k84252K02093m31550m72678O08439j30207J64733k08006
4104C601450N7340J7380j03772J22397k85300J49070n64660Q05666P752R6215
4094C903538k57474j97870k09927L89778q4764r471J27949j88327L22800n44168
$$ plain form
4084 3252064 3092847 3734248 3338521 3427710 3415398 3194630 3048504 3137091 3226930 3313695
4074 3313695 3687584 2929306 3589958 3565367 3219531 3248947 3207575 3271912 3570434 3497775
4064 3497775 2824705 3064268 3692558 3402960 3231163 3460960 2981370 3298512 3487244 2656774
4054 2656774 3035812 3512157 3051233 3428540 3914139 3465596 3363067 3509787 3138140 3706504
4044 3706504 3493878 3498369 3141121 3167479 3295714 3253335 3903001 3260385 3268609 3551023 3235856
4033 3235856 3241875 3390987 3688435 3490071 3572603 3783832 3553938 3148026 3679602 3610706
4023 3610706 3591078 4029321 3825330 3640996 3541936 3885853 4056312 4283430 4233006 4371949
4013 4371949 4171587 4345265 4192666 3826344 3863883 4051709 3913753 3484588 3657255 3476645
$$ packed form
4084C252064j59217O41401l95727Q9189j2312k20768j46126Q8587Q9839Q6765
4074C313695L73889p58278O60652k4591l45836K9416m1372O4337K98522p2659
4064C497775o73070K39563O28290k89598j71797K29797m79590L17142J88732q30470
4054B656774L79038M76345m60924L77307M85599m48543j02529J46720l71647N68364
4044C706504k12626M491l57248K6358J28235m2379O49666o42616Q224K82414l15167
4033C235856O019J49112K97448j98364Q2532K11229k29894m05912N31576o8896
4023C610706j9628M38243k03991j84334r9060L43917J70459K27118n0424J38943
4013D371949k00362J73678j52599l66322L7539J87826j37956m29165J72667j80610
$$ plain form
4003 3476645 3828078 3996704 3702617 3567540 3536171 3269304 3158647 3497209 3459047 3344543
3993 3344543 3400565 3787753 3287034 3460044 3938550 3878461 3550223 3730350 3921164 3752780
3983 3752780 3354009 3440021 3364953 3481106 3222889 3470032 3187343 3082504 3022988 2916929
3973 2916929 3071990 2939119 2632226 2917347 2738928 2877596 2736651 2651949 3072416 2934134
3963 2934134 3082346 2790507 2562850 2947205 3277547 2787569 2874336 2579241 2709360 3151744
3953 3151744 2744094 3078788 2641711 2614179 2771032 2091620 2414709 2418533 2642675 2573571
3943 2573571 2390471 2343478 2199550 2358308 1998540 2250633 2471149 2652780 2507897 2300469
3933 2300469 2371136 2233009 1668953 2116268 1988248 2077964 1836897 1964763 1960434 1797601
$$ packed form
4003C476645L51433J68626k94087j35077l1369k66867j10657L38562l8162j14504
3993C344543N6022L87188n00719J73010M78506o0089l28238J80127J90814j68384
3983C752780l98771Q6012p5068J16153k58217K47143k82689j04839n9516j06059
3973B916929J55061j32871l06893K85121j78419J38668j40945q4702M20467j38282
3963B934134J48212k91839k27657L84355L30342m89978Q6767k95095J30119M42384
3953C151744m07650L34694m37077k7532J56853o79412L23089L824K24142o9104
3943B573571j83100m6993j43928J58758l59768K52093K20516J81631j44883k07428
3933B300469P0667j38127n64056M47315j28020Q9716k41067J27866m329j62833
$$ plain form
3923 1797601 1928667 2188940 1832332 2022483 2059696 1885448 1842986 1981924 2237760 2036250
3913 2036250 1823726 2040286 1585151 1743454 1615686 1904525 1649337 1648890 1829060 2028782
3903 2028782 1630883 1870410 1566196 1665984 1963611 1734402 1916205 1900912 1698723 1698001
3893 1698001 1753041 1838817 1898091 1575453 1319038 1575873 1708108 1877593 1717283 1115912
3883 1115912 1844033 1696503 1968369 1884337 1480898 2044354 1522888 1736417 1785171 1658893
3873 1658893 1750715 1949673 1502242 1807820 1408236 1450462 1574108 1605025 1544797 1315665
3863 1315665 1753475 1893353 1626647 1781502 1591113 1565243 1251703 1112526 1161633 1490950
3853 1490950 1202716 1750509 1367772 1477871 1372060 1330968 1262617 976870 1551144 974354
$$ packed form
3923A797601J31066K60273l56608J90151L7213j74248m2462J38938K55836k01510
3913B036250k12524K16560m55135J58303j27768K88839k55188m47J80170J99722
3903B028782l97899K39527l04214R9788K97627k29209J81803j5293k02189p22
3893A698001N5040Q5776N9274l22638k56415K56835J32235J69485j60310o01371
3883A115912P28121j47530K71866q4032m03439N63456n21466K13529M8754j26278
3873A658893R1822J98958m47431L05578l99584M2226J23646L0917o0228k29132
3863A315665M37810J39878k66706J54855j90389k5870l13540j39177M9107L29317
3853A490950k88234N47793l82737J10099j05811m1092o8351k85747N74274n76790
$$ plain form
3843 974354 1059234 1565257 1078373 965286 1326983 1450726 1590304 1807875 1437732 1089487
3833 1089487 923836 1492144 1395817 1518534 1646357 1509659 1309703 1682260 1046425 1191697
3823 1191697 1263660 1401265 1002563 894686 1168552 1178055 1303106 1200622 1170394 1312465
3813 1312465 1069304 975235 1174288 882435 1227356 855381 1613058 932038 1057408 603720
3803 603720 1266424 1040711 1453286 1353389 1756920 1165080 900060 363634 941602 938393
3793 938393 857929 1088381 1007275 657741 1042278 1059347 1490555 1286248 1144451 1048909
3783 1048909 980014 1173448 1134123 1214731 1251251 1061956 1491310 1327995 1009184 894425
3773 894425 890438 1011272 1406946 1153854 1041774 1176529 1041338 1210989 1385021 1363227
$$ packed form
3843I74354Q4880N06023m86884j13087L61697J23743J39578K17571l70143l48245
3833A089487j65651N68308r6327J22717J27823j36698j99956L72557o35835J45272
3823A191697P1963J37605l98702j07877K73866R503J25051j02484l0228J42071
3813A312465k43161r4069J99053k91853L44921l71975P57677o81020J25370m53688
3803F03720O62704k25713M12575r9897M03531n91840k65020n36426N77968l209
3793I38393q0464K30452q1106l49534L84537J7069M31208k04307j41797r5542
3783A048909o8895J93434l9325Q0608L6520j89295M29354j63315l18811j14759
3773H94425l987J20834L95674k53092j12080J34755j35191J69651J74032k1794
$$ plain form
3763 1363227 1172263 1272298 738031 1004332 938634 1305179 1307680 1243027 1148144 939102
3753 939102 1027082 1153945 974328 1022600 1003863 851055 737807 1157200 1051485 1243075
3743 1243075 1323000 1321934 1231952 846940 555220 691440 795199 677697 959343 390535
3733 390535 1008984 851875 960255 442719 952565 1470788 1322239 652915 966438 963329
3723 963329 1011458 1052598 846016 1035386 1360951 1293304 624791 666685 1074164 1200848
3713 1200848 1209376 1069517 934763 553663 774681 741027 947601 886334 898983 550260
3703 550260 642557 507854 830889 578994 1050712 898612 897911 674290 588162 944981 1058683
3692 1058683 1091348 588566 652337 895492 1017557 805199 991493 973429 684220 819845
$$ packed form
3763A363227j90964J00035n34267K66301o5698L66545K501o4653r4883k09042
3753I39102Q7980J26863j79617M8272j8737j52808j13248M19393j05715J91590
3743A243075P9925j066q9982l85012k91720J36220J03759j17502K81646n68808
3733C90535O18449j57109J08380n17536N09846N18223j48549o69324L13523l109
3723I63329M8129M1140k06582J89370L25565o7647o68513M1894M07479J26684
3713A200848Q528j39859j34754l81100K21018l3654K06574o1267J2649l48723
3703E50260R2297j34703L23035k51895M71718j52100p01k23621q6128L56819J13702
3692A058683L2665n02782O3771K43155J22065k12358J86294j8064k89209J35625
$$ plain form
3682 819845 1071141 872925 662926 564834 754426 881979 870125 617709 707471 546945
3672 546945 1006540 707430 572728 979194 478709 392482 823827 1147214 969907 673993
3662 673993 862469 688132 642071 839719 1221830 1219680 397632 394208 756411 199575 640057
3651 640057 535481 675336 1094824 1312522 1119700 325526 867458 847016 916167 881194
3641 881194 802444 792421 962451 881224 450432 794227 917903 967162 1101690 517274
3631 517274 930424 1145213 1155707 822806 771754 871264 1081735 361626 525852 611363
3621 611363 610507 996746 886852 541499 503412 423002 299810 893040 348106 805016 478900
3610 478900 805540 747671 808341 1070990 865604 867446 1170246 779975 283346 731009
$$ packed form
3682H19845K51296j98216k09999r8092J89592J27553j1854k52416Q9762j60526
3672E46945M59595k99110j34702M06466n00485q6227M31345L23387j77307k95914
3662F73993J88476j74337m6061J97648L82111k150q22048l424L62203n56836M40482
3651F40057j04576J39855M19488K17698j92822p94174N41932k0442O9151l4973
3641H81194p8750j0023J70030q1227m30792L43795J23676M9259J34528n84416
3631E17274M13150K14789J0494l32901n1052R9510K10471p20109J64226Q5511
3621F11363q56L86239j09894l45353l8087q0410j23192N93230n44934M56910l26116
3610D78900L26640n7869O0670K62649k05386J842L02800l90271m96629M47663
$$ plain form
3600 731009 585427 912959 766677 790249 702663 392536 576574 766393 846460 723962
3590 723962 429152 286853 337434 379764 1252212 748242 1058196 878199 645279 931433
3580 931433 598701 384883 331634 923124 792683 560185 790020 782281 565328 973373
3570 973373 1072987 731086 353184 715540 871384 744988 1081117 1145837 781197 821114
3560 821114 652489 880761 550810 1374923 1096382 1182297 1173960 1564947 1339565 1446034
3550 1446034 1505546 1758316 1781598 1410533 1399055 1402220 706426 929671 945420 839693 972903
3539 972903 774046 719656 643952 760691 1018176 902937 1039300 1163249 870641 1135844
3529 1135844 895000 733047 635189 856054 1292938 851511 699048 912764 651619 1154442
$$ packed form
3600G31009j45582L27532j46282K3572q7586l10127J84038J89819Q0067j22498
3590G23962k94810j42299N0581M2330Q72448n03970L09954j79997k32920K86154
3580I31433l32732k13818n3249N91490j30441k32498K29835p739k16953M08045
3570I73373R9614l41901l77902L62356J55844j26396L36129O4720l64640L9917
3560H21114j68625K28272l29951Q24113k78541Q5915q337L90987k25382J06469
3550A446034N9512K52770K3282l71065j1478L165o95794K23245J5749j05727J33210
3539I72903j98857n4390p5704J16739K57485j15239J36363J23949k92608K65203
3529A135844k40844j61953r7858K20865M36884m41427j52463K13716k61145N02823
$$ plain form
3519 1154442 350369 559556 841356 990345 1137949 1013190 864852 654576 462773 770502
3509 770502 795463 850817 785984 286627 808409 782139 810926 593583 760307 489047 447118
3498 447118 737755 964969 775709 567626 510709 1255638 1105391 1008619 803778 863000
3488 863000 340305 769676 825617 790104 642434 1022733 971371 684850 579229 834824
3478 834824 809784 1036334 678933 1059478 690139 536461 611860 542531 634378 1074022
3468 1074022 1083814 767112 874063 995284 488136 757914 827843 721563 861511 1246429
3458 1246429 1381742 509106 965046 1072978 886188 680268 1230407 1236058 979012 1025826
3448 1025826 1204717 1052870 841399 906389 604222 1004956 1129045 892573 882417 703992
$$ packed form
3519A154442q04073K09187K81800J48989J47604j24759j48338k10276j91803L07729
3509G70502K4961N5354o4833m99357N21782k6270K8787k17343J66724k71260m1929
3498D47118K90637K27214j89260k08083n6917P44929j50247r6772k04841N9222
3488H63000n22695M29371N5941l5513j47670L80299n1362k86521j05621K55595
3478H34824k5040K26550l57401L80545l69339j53678P5399o9329R1847M39644
3468A074022R792l16702J06951J21221n07148K69778O9929j06280J39948L84918
3458A246429J35313q72636M55940J07932j86790k05920N50139N651k57046M6814
3448A025826J78891j51847k11471O4990l02167M00734J24089k36472j0156j78425
$$ plain form
3438 703992 857215 1097531 1235800 995780 1202701 1203490 1262093 1479693 921559 1289667
3428 1289667 1549267 1824079 1648998 1520828 1287832 1405874 1428212 1250567 1044716 1609430
3418 1609430 1413477 1172263 1491060 1547974 1678223 1755262 1565067 1744822 1592503 1510071
3408 1510071 1543791 1475276 1247507 1838162 1866522 1870746 1977615 2047694 1805779 1927300 2170285
3397 2170285 2301112 2198570 2087124 1647213 2095576 1790575 1975131 2367955 1865131 1947279
3387 1947279 1805932 2040143 2048000 2212831 2409241 2081818 2244662 2944550 2727544 2984556
3377 2984556 2947389 2737233 2940954 2989412 3017203 3086673 3180612 3304635 3349737 3464818 3215084
3366 3215084 3155282 4140382 3658715 4513660 4066733 4271199 4545329 4628480 4840087 4870142
$$ packed form
3438G03992J53223K40316J38269k40020K06921P89N8603K17600n58134L68108
3428A289667K59600K74812j75081j28170k32996J18042K2338j77645k05851N64714
3418A609430j95953k41214L18797N6914J30249P7039j90195J79755j52319q2432
3408A510071L3720o8515k27769N90655K8360M224J06869P0079k41915J21521K42985
3397B170285J30827j02542j11446m39911M48363l05001J84556L92824n02824Q2148
3387A947279j41347K34211P857J64831J96410l27423J62844O99888k17006K57012
3377B984556l7167k10156K03721M8458K7791O9470R3939J24023M5102J15081k49734
3366C215084n9802R85100m81667Q54945m46927K04466K74130Q3151K11607L0055
$$ plain form
3356 4870142 5051202 5659049 5265327 4972888 5756160 5954300 6345832 6169501 6555144 6810309
3346 6810309 7166675 7538707 7814320 8004764 9402537 9443080 9901090 11223719 11871506
3337 11871506 13485622 14339766 15766992 17556297 19730763 21833086 23933545 25501048
3329 25501048 29054750 32433860 36666530 41840393 48164416 58582808 72732043 92503301
3321 92503301 116289718 141697623 163669577 178780473 184415182 184200348 179269265 167193594
3313 167193594 147544135 126166840 109002939 90138968 74454967 60961037 53050774
3306 53050774 47661192 43249052 39032336 35015616 31625655 27787943 25621969 23213962
3298 23213962 21634354 20126557 18904845 17516785 15940808 15246522 14641350 14271543 13071496
$$ packed form
3356D870142J81060O07847l93722k92439P83272J98140L91532j76331L85643K55165
3346F810309L56366L72032K75613J90444J397773M0543M58010J322629O47787
3337A1871506J614116Q54144J427226J789305K174466K102323K100459J567503
3329B5501048L553702L379110M232670N173863O324023J0418392J4149235J9771258
3321I2503301K3786417K5407905K1971954J5110896N634709k14834m931083j2075671
3313A67193594j9649459k1377295j7163901j8863971j5684001j3493930p910263
3306E3050774n389582m412140m216716m016720l389961l837712k165974k408007
3298B3213962j579608j507797j221712j388060j575977o94286o05172l69807j200047
$$ plain form
3289 13071496 12656330 12122031 11603724 11289828 11342280 10863901 10178769 9371731 9692575 9293741
3279 9293741 9314549 8684138 8592982 8557210 8200327 8074745 7476373 7148486 7503909 7125353
3269 7125353 7237499 7121845 6395965 6104971 6026379 5677371 6150021 5944118 5574656 5545226
3259 5545226 5147680 4932951 5249167 4823750 4755114 4504117 4643455 4492170 4312936 4728977
3249 4728977 4067328 4125632 3959230 3959173 3874755 3788953 3986904 3794605 3957536 3651686 3565827
3238 3565827 3156519 3467321 3542916 3380948 3625299 2828675 3312578 2824783 3147503 3240055
3228 3240055 3108424 2894157 2969113 3078551 2953109 2814717 2922273 2813258 2729528 2727273
3218 2727273 3193879 2287182 2196076 2209847 2323857 2505161 2698410 2378444 2260273 2014712
$$ packed form
3289A3071496m15166n34299n18307l13896N2452m78379o85132q07038L20844l98834
3279I293741K0808o30411r1156l5772l56883j25582n98372l27887L55423l78556
3269G125353J12146j15654p25880k90994p8592l49008M72650k05903l69462k9430
3259E545226l97546k14729L16216m25417o8636k50997J39338j51285j79234M16041
3249D728977o61649N8304j66402n7q4418q5802J97951j92299J62931l05850q5859
3238C565827m09308L10802P5595j61968K44351p96624M83903m87795L22720R2552
3228C240055j31631k14267P4956J09438j25442j38392J07556j09015q3730k255
3218B727273M66606r06697r1106J3771J14010J81304J93249l19966j18171k45561
$$ plain form
3208 2014712 2045309 1914389 2109612 2253708 1982189 2056492 2089299 1662100 2309696 1916734
3198 1916734 1802782 2117392 2135407 1876355 1246296 1317141 1590858 1848716 1309145 1579149
3188 1579149 1208814 1492873 1445573 1647989 1278228 1316837 1242998 1548113 1348482 1452402
3178 1452402 1483475 1501461 1497231 1701704 1302779 1421878 1719629 1105753 1044210 1483090
3168 1483090 1681958 1088622 1272710 702463 1237540 1214069 1419873 1252844 1206712 1399158
3158 1399158 1307968 1018606 902653 1147407 1243111 1213969 939230 786770 363068 813957
3148 813957 654971 904473 703881 1071761 1073349 885714 972254 784629 1017190 858329
3138 858329 971822 843722 964922 712027 1235078 793738 1054007 807478 870594 582722
$$ packed form
3208B014712L0597j30920J95223J44096k71519P4303L2807m27199O47596l92962
3198A916734j13952L14610J8015k59052o30059P0845K73717K57858n39571K70004
3188A579149l70335K84059m7300K02416l69761L8609p3839L05115j99631J03920
3178A452402L1073J7986m230K04473l98925J19099K97751o13876o1543M38880
3168A483090J98868n93336J84088n70247N35077k3471K05804j67029m6132J92446
3158A399158r1190k89362j15953K44754R5704k9142k74739j52460m23702M50889
3148H13957j58986K49502k00592L67880J588j87635Q6540j87625K32561j58861
3138H58329J13493j28100J21200k52895N23051m41340K60269k46529O3116k87872
$$ plain form
3128 582722 629924 889036 673665 397361 540741 626860 400796 442779 963371 904589
3118 904589 898430 509188 796150 600585 515499 280816 620437 697435 207898 845645
3108 845645 476577 396667 588974 932477 679734 1322279 724800 1233481 711218 491614
3098 491614 823602 499647 743698 764308 466636 730516 783108 563076 995662 1056300
3088 1056300 781880 821143 951787 1170881 1795745 1509208 1865465 1629606 1528199 1517583
3078 1517583 1234934 1112175 896536 787976 1279827 726492 469899 759186 887387 1080816
3068 1080816 860723 700716 571068 647428 355648 587296 466256 341067 627055 532873
3058 532873 236670 278742 532596 938979 574544 612935 474581 465179 401497 417495 404748
$$ packed form
3128E82722M7202K59112k15371k76304J43380Q6119k26064M1983N20592n8782
3118I04589o159l89242K86962j95565q5086k34683L39621P6998m89537O37747
3108H45645l69068p9910J92307L43503k52743O42545n97479N08681n22263k19604
3098D91614L31988l23955K44051K0610k97672K63880N2592k20032M32586O0638
3088A056300k74420L9263J30644K19094O24864k86537L56257k35859j01407j0616
3078A517583k82649j22759k15639j08560M91851n53335k56593K89287J28201J93429
3068A080816k20093j60007j29648P6360k91780K31648j21040j25189K85988r4182
3058E32873k96203M2072K53854M06383l64435L8391j38354r402o3682J5998j2747
$$ plain form
3047 404748 434598 318536 568916 681725 336397 185356 -80496 433008 359992 567895
3037 567895 175638 298285 718496 241466 504789 398181 525230 557526 493547 113159
3027 113159 407303 301817 340446 437631 492298 320545 -43194 147340 525116 123258
3017 123258 329508 593449 60579 83638 278298 391553 345938 886319 294832 244280
3007 244280 552890 527654 940304 874824 -65904 404503 556174 376190 141082 367469
2997 367469 373597 454032 178577 288800 325704 55839 363310 455294 433561 147526 375980
2986 375980 413862 335595 525956 -228498 374087 -39210 293373 199376 300400 -92336
2976 -92336 154431 146938 543414 473331 388778 302044 465341 131487 -55982 540709 454117
$$ packed form
3047D04748K9850j16062K50380J12809l45328j51041k65852N13504p3016K07903
3037E67895l92257J22647M20211m77030K63323j06608J27049L2296o3979l80388
3027A13159K94144j05486L8629R7185N4667j71753l63739J90534L77776m01858
3017A23258K06250K63941n32870K3059J94660J13255m5615N40381n91487n0552
3007B44280L08610k5236M12650o5480r40728M70407J51671j79984k35108K26387
2997C67469O128Q0435k75455J10223L6904k69865L07471R1984k1733k86035K28454
2986C75980L7882p8267J90361p54454O02585m13297L32583r3997J01024l92736
2976i2336K46767p493L96476p0083q4553q6734J63297l33854j87469N96691q6592
$$ plain form
2965 454117 212126 441159 40049 283976 238336 229799 414768 44904 -193661 742950
2955 742950 647736 379557 493914 357113 237520 591451 383306 202351 511384 364319
2945 364319 178748 340434 146356 610233 548767 370181 309531 378254 134739 155461
2935 155461 -66165 411459 127821 599215 101967 223073 384157 369480 -34525 101497
2925 101497 -6655 458777 -98838 -50299 508988 469390 -64006 591945 71730 29137
2915 29137 -138513 -35379 289193 140575 203159 613064 372449 236017 617128 55485
2905 55485 180397 134106 361479 176961 200887 182054 126867 136472 65554 312343 366812
2894 366812 114234 107160 375900 162177 -142973 208992 227437 393896 288434 347278
$$ packed form
2965D54117k41991K29033m01110K43927m5640q537J84969l69864k38565R36611
2955G42950r5214k68179J14357j36801j19593L53931k08145j80955L09033j47065
2945C64319j85571J61686j94078M63877o1466j78586o0650O8723k43515K0722
2935A55461k21626M77624k83638M71394m97248J21106J61084j4677m04005J36022
2925A01497j08152M65432n57615M8539N59287l9598n33396O55951n20215m2593
2915B9137j67650J03134L24572j48618O2584M09905k40615j36432L81111n61643
2905E5485J24912m6291K27373j84518K3926j8833n5187R605p0918K46789N4469
2894C66812k52578p074K68740k13723l05150L51965J8445J66459j05462N8844
$$ plain form
2884 347278 57975 164983 365451 231385 -75682 -323320 210430 113700 323070 673615
2874 673615 428367 438973 67884 72449 165302 -14769 66413 278886 698917 159154 131718
2863 131718 377571 595018 -23543 470040 237978 549945 15062 388408 356075 461067
2853 461067 153257 363179 190404 -64070 156242 -41993 53678 409980 -224952 283187
2843 283187 35046 -214605 52081 249279 284295 342718 106985 272287 339865 340599 470536
2832 470536 342492 928546 175101 -164653 -30908 187892 39619 -103638 19173 519759
2822 519759 130831 138345 -50481 -19348 411145 232885 120993 261185 -257400 20334
2812 20334 100250 514291 246520 449950 53361 158183 111099 196711 -36172 207350
$$ packed form
2884C47278k89303J07008K00468j34066l07067k47638N33750r6730K09370L50545
2874F73615k45248J0606l71089M565R2853j80071Q1182K12473M20031n39763k7436
2863A31718K45853K17447o18561M93583k32062L11967n34883L73346l2333J04992
2853D61067l07810K09922j72775k54474K20312j98235R5671L56302o34932N08139
2843B83187k48141k49651K66686J97198L5016N8423k35733J65302O7578P34J29937
2832D70536j28044N86054p53445l39754J33745K18800j48273j43257J22811N00586
2822E19759l88928P514j88826L1133M30493j78260j11892J40192n18585K77734
2812B0334P9916M14041k67771K03430l96589J04822m7084Q5612k32883K43522
$$ plain form
2802 207350 405766 522594 247125 31209 171414 310681 150690 -64217 298335 193335
2792 193335 384267 440291 104207 -114358 347820 -139426 144332 -313970 -168098 565644
2782 565644 156417 226627 136104 42933 297139 191528 -3705 -170719 237343 124621
2772 124621 395930 34629 -122919 125073 -175588 177547 21583 499725 506926 137748
2762 137748 78933 154564 276470 382542 321845 522764 104222 480350 84782 240945
2752 240945 -24001 179221 39805 223782 -9346 89435 242745 -203692 580562 150840
2742 150840 -8207 261234 657800 99708 283195 654505 432475 263730 43900 439526
2732 439526 29695 231465 77252 337673 -766 38582 -21628 -97462 31222 98266
$$ packed form
2802B07350J98416J16828k75469k15916J40205J39267j59991k14907L62552j05000
2792A93335J90932N6024l36084k18565M62178m87246K83758m58302J45872P33742
2782E65644m09227P0210r0523r3171K54206j05611j95233j67014M08062j12722
2772A24621K71309l61301j57548K47992l00661L53135j55964M78142P201l69178
2762A37748n8815P5631J21906J06072o0697K00919m18542L76128l95568J56163
2752B40945k64946K03222j39416J83977k33128R8781J53310m46437P84254m29722
2742A50840j59047K69441L96566n58092J83487L71310k22030j68745k19830L95626
2732D39526m09831K01770j54213K60421l38439L9348o0210p5834J28684O7044
$$ plain form
2722 98266 325078 -6587 245430 -326308 311548 -287064 338043 553155 133282 132804
2712 132804 -90001 107975 104533 17940 107611 23098 -202178 -62360 21084 274522 296382
2701 296382 -227901 39998 -4167 -180938 -113828 384709 -241626 -438164 335598 156624
2691 156624 284866 2829 -5788 231052 474332 132678 51049 399992 288274 102797
2681 102797 363784 53339 -340236 -29296 391828 311535 365330 100353 339966 117554
2671 117554 76496 -404874 248332 -32744 -146279 1514 -143014 -112503 123533 -46974
2661 -46974 -25540 205442 546801 383178 190929 175315 271095 -272166 64190 185940
2651 185940 230102 648956 186212 88257 186899 316352 196110 167202 191582 334045 -114208
$$ packed form
2722I8266K26812l31665K52017n71738O37856n98612O25107K15112m19873m78
2712A32804k22805J97976l442q6593Q9671q4513k25276J39818Q3444K53438K1860
2701B96382n24283K67899m4165j76771O7110M98537o26335j96538P73762j78974
2691A56624J28242k82037q617K36840K43280l41654q1629L48943j11718j85477
2681A02797K60987l10445l93575L10940M21124q0293N3795k64977K39613k22412
2671A17554m1058m81370O53206k81076j13535J47793j44528L0511K36036j70507
2661d6974K1434K30982L41359j63623j92249j5614R5780n43261L36356J21750
2651A85940M4162M18854m62744r7955R8642J29453j20242k8908K4380J42463m48253
$$ plain form
2640 -114208 -218766 -3864 95126 -90357 -79521 80342 96132 -56578 -270414 266897
2630 266897 274500 334273 223863 -57080 -140494 153802 -60790 387747 -4553 110678
2620 110678 -35164 447363 -163813 226452 -39242 258458 -248515 294594 144350 -149545
2610 -149545 164175 408922 207637 173845 -215721 -211791 -291029 -216823 190811 -34466 -21739
2599 -21739 48082 313823 -234738 3527 453389 -123730 -92784 -182449 -345606 34024
2589 34024 -5513 -83061 150052 134643 -159304 35710 435546 -297981 350169 -232487
2579 -232487 425113 -41769 -252238 246748 -353653 -255633 -71510 26047 -130126 97514
2569 97514 -82210 371761 -46397 -138917 -315515 -20040 -342189 305316 -337677 -263477
$$ packed form
2640a14208j04558K14902R8990j85483J0836J59863J5790j52710k13836N37311
2630B66897P603N9773j10410k80943q3414K94296k14592M48537l92300J15231
2620A10678j45842M82527o11176L90265k65694K97700n06973N43109j50244k93895
2610a49545L13720K44747k01285l3792l89566L930p9238P4206M07634k25277J2727
2599b1739O9821K65741n48561K38265M49862n77119L0946q9665j63157L79630
2589C4024l9537p7548K33113j5409k93947J95014L99836p33527O48150n82656
2579b32487O57600m66882k10469M98986o00401R8020J84123R7557j56173K27640
2569I7514j79724M53971m18158r2520j76598K95475l22149O47505o42993P4200
$$ plain form
2559 -263477 -326283 264996 -105546 211339 -6840 80258 -20781 293848 -316250 215875
2549 215875 -298369 309047 -155242 158555 119265 14919 204600 122623 -153254 250716
2539 250716 -135363 158008 107123 312531 189379 439483 362863 83293 -69597 169313
2529 169313 -11699 162444 319308 -194042 296236 -312841 98564 -114930 -59782 414705
2519 414705 -123166 -264920 -363542 -420047 172642 344583 -18029 240738 402629 79265
2509 79265 66938 -149894 26467 -10019 324600 -157676 52706 -74430 53748 -17402
2499 -17402 226605 -186807 -99349 -55802 -317415 17061 101583 68669 -263865 361772 619858
2488 619858 339992 91192 -221430 27881 388810 -54645 226054 -224719 262809 117600
$$ packed form
2559b63477o2806N91279l70542L16885k18179Q7098j01039L14629o10098N32125
2549B15875n14244O07416m64289L13797l9290j04346J89681q1977k75877M03970
2539B50716l86079K93371n0885K05408j23152K50104p6620k79570j52890K38910
2529A69313j81012J74143J56864n13350M90278o09077M11405k13494N5148M74487
2519D14705n37871j41754r8622n6505N92689J71941l62612K58767J61891l23364
2509G9265j2327k16832J76361l6486L34619m82276K10382j27136J28178p1150
2499a7402K44007m13412Q7458M3547k61613L34476Q4522l2914l32534O25637K58086
2488F19858k79866k48800l12622K49311L60929m43455K80699m50773M87528j45209
$$ plain form
2478 117600 16508 227156 326635 -11857 -287124 -2523 91572 495036 -179290 -64411
2468 -64411 151144 114731 -102747 34345 -1469 -249482 201545 -111941 -54983 -16095 138481
2457 138481 -121658 -52161 -189614 -237159 -127394 -180323 -59665 -163516 -20136 244533
2447 244533 -70959 467418 -27316 -128926 330302 -158579 -76471 -315578 118262 36175
2437 36175 278077 234176 -77360 -79917 -433663 -759 167082 268550 372960 138140
2427 138140 -47670 -621403 131692 39829 -492496 237363 -24715 337936 122336 -21394
2417 -21394 389915 563069 302514 198717 -74797 -11817 394376 251116 111199 373058
2407 373058 15782 -187921 -96639 -208934 42620 -144857 -299194 -210395 -270091 -9817
$$ packed form
2478A17600j01092K10648R9479l38492k75267K84601R4095M03464o74326J14879
2468f4411K15555l6413k17478J37092l5814k48013M51027l13486N6958L8888J54576
2457A38481k60139O9497j37453m7545J09765n2929J20658j03851J43380K64669
2447B44533l15492N38377m94734j01610M59228m88881Q2108k39107M33840q2087
2437C6175K41902m3901l11536k557l53746M32904J67841J01468J04410k34820
2427A38140j85810n73733P53095r1863n32325P29859k62078L62651k15600j43730
2417b1394M11309J73154k60555j03797k73514O2980M06193j43260j39917K61859
2407C73058l57276k03703R1282j12295K51554j87477j54337Q8799n9696K60274
$$ plain form
2397 -9817 322235 51757 -68337 122120 175105 -193472 176234 -224015 -214263 99308 -254868
2386 -254868 122034 222676 83413 -1785 -146869 -247402 -149357 69823 360207 22274
2376 22274 -428505 -286696 -162828 -155035 13792 -178858 8528 -202384 -363607 161123
2366 161123 -82774 -213293 157975 117451 -98834 -198536 -271077 60413 122102 238305
2356 238305 499899 378631 -370002 -181437 170986 95600 -229122 -106093 180742 -309522
2346 -309522 -232675 -266468 37761 101257 148214 134264 590005 408378 -215822 628146 -148910
2335 -148910 159718 146053 124956 -204426 -227822 -83256 265300 48600 -220188 -299736
2325 -299736 -785778 -158275 14208 -306175 -49568 -242416 -182205 -258313 88058 -26607
$$ packed form
2397i817L32052k70478j20094J90457N2985l68577L69706m00249R752L13571l54176
2386b54868L76902J00642j39263q5198j45084j00533R8045K19180K90384l37933
2376B2274m50779J41809J23868P793J68827j92650J87386k10912j61223N24730
2366A61123k43897j30519L71268m0524k16285r9702p2541L31490O1689J16203
2356B38305K61594j21268p48633J88565L52423p5386l24722J23029K86835m90264
2346c09522P6847l3793L04229O3496M6957j3950M55741j81627o24200Q43968p77056
2335a48910L08628j3665k1097l29382k3396J44566L48556k16700k68788p9548
2325b99736m86042O27503J72483l20383K56607j92848O0211p6108L46371j14665
$$ plain form
2315 -26607 33808 -106752 321156 -57612 221622 203048 -109306 32857 149497 119920
2305 119920 54884 46201 333870 -88820 -13132 114286 79440 153593 349532 158199 -15592
2294 -15592 -62471 -231748 10995 -42960 -1640 -116989 -172552 77069 -300071 -487809 -206700
2283 -206700 365218 241892 -264896 218806 43558 266534 -280788 -29788 -133987 403105
2273 403105 -30249 -110059 66520 63788 18534 -176987 -37768 -349376 209857 -158016
2263 -158016 -171564 -103584 -43216 308143 126674 -402365 -76582 -364849 299644 -128465
2253 -128465 -105854 155876 -412016 -399896 -119804 -295880 94140 58794 555418 2440
2243 2440 -216324 243189 -449573 -58121 24619 -156998 626376 428913 -325827 -156492
$$ packed form
2315b6607O0415j40560M27908l78768K79234j8574l12354J42163J16640k9577
2305A19920o5036q683K87669m22690P5688J27418l4846P4153J95939j91333j73791
2294a5592m6879j69277K42743n3955M1320j15349n5563K49621l77140j87738K81109
2283b06700N71918j23326n06788M83702j75248K22976n47322K51000j04199N37092
2273D03105m33354p9810J76579k732m5254j95521J39219l11608N59233l67873
2263a58016j3548O7980O0368L51359j81469n29039L25783k88267O64493m28109
2253a28465K2611K61730n67892J2120K80092j76076L90020l5346M96624n52978
2243B440k18764M59513o92762L91452Q2740j81617P83374j97463p54740J69335
$$ plain form
2233 -156492 -334839 -221647 -280976 86804 236772 258247 11551 -51121 -310009 13051
2223 13051 -198644 -132248 -181467 223889 -42650 -148635 -433317 109713 -93861 -95064 183009
2212 183009 -359296 -301238 -211575 -506659 -19491 155426 368660 206881 78641 -394770
2202 -394770 81159 12854 -258443 177144 -94997 262371 388421 -49318 -119909 -111612
2192 -111612 665 55931 269200 -207649 -153400 -47045 -5950 -141326 -251534 266870
2182 266870 -235264 -89152 -288896 -256403 -95710 34775 99853 159397 -227036 347979
2172 347979 -227365 180187 117168 -35390 -45139 306085 -234269 -221424 21789 290074
2162 290074 75983 475371 -277383 99370 -100230 -231861 -222363 -13446 -58728 -243822
$$ packed form
2233a56492j78347J13192n9329L67780J49968K1475k46696o2672k58888L23060
2223A3051k11695O6396m9219M05356k66539j05985k84682N43030k03574j203K78073
2212A83009n42305N8058Q9663k95084M87168J74917K13234j61779j28240m73411
2202c94770M75929o8305k71297M35587k72141L57368J26050m37739p0591Q297
2192a11612J12277N5266K13269m76849N4249J06355M1095j35376j10208N18404
2182B66870n02134J46112j99744L2493J60693J30485O5078N9544l86433N75015
2172C47979n75344M07552o3019j52558r749L51224n40354J2845K43213K68285
2162B90074k14091L99388p52754L76753j99600j31631R498K08917m5282j85094
$$ plain form
2152 -243822 320098 -560053 -50182 60752 -43099 -171884 -275265 -238255 -200204 268709
2142 268709 79394 -195697 88786 -93348 -112301 -36799 30446 -295373 -163598 -331530
2132 -331530 -186742 -251839 -674495 -161520 -202573 -156194 -355853 -176494 -290871 -379406
2122 -379406 -178217 85508 325257 -189864 232669 79877 -79521 -510288 283132 -227860
2112 -227860 -586821 79075 35286 -169415 71914 55586 -14165 -25953 -308064 76329
2102 76329 -194769 -161130 -129352 -208350 -216458 -16396 128299 -53011 30065 -118920 -254070
2091 -254070 -317710 243846 -252647 -53237 101138 -106800 -292452 -152601 357542 31802
2081 31802 -4854 -178413 83015 -25569 18845 -183974 85702 -19104 -326101 -298426
$$ packed form
2152b43822N63920q80151N09871J10934j03851j28785j03381L7010L8051M68913
2142B68709j89315k75091K84483j82134j8953P5502O7245l25819J31775j67932
2132c31530J44788o5097m22656N12975m1053M6379j99659J79359j14377q8535
2122c79406K01189K63725K39749n15121M22533j52792j59398m30767P93420n10992
2112b27860l58961O65896m3789k04701K41329j6328o9751j1788k82111L84393
2102G6329k71098L3639L1778p8998q108K00062J44695j81310Q3076j48985j35150
2091b54070o3640N61556m96493J99410J54375k07938j85652J39851N10143l25740
2081C1802l6656j73559K61428j08584M4414k02819K69676j04806l06997K7675
$$ plain form
2071 -298426 -363696 160082 -613105 -144962 149672 -300628 -193300 170745 399993 -170737
2061 -170737 -22107 -420368 41400 -125999 -389412 -92151 1106 9295 -26141 67252 -191256
2050 -191256 -50178 -158366 129445 74065 480887 -120384 46097 -121186 123149 26894
2040 26894 89791 -286193 -373594 17702 -370002 -168670 138421 64103 -340228 -200649
2030 -200649 -239615 -271183 -39416 -328279 -168606 -36004 -209743 -225976 -164017 -5949
2020 -5949 -23019 106537 76731 211431 30598 146562 -154134 214815 -149700 147721
2010 147721 51642 -34543 -287458 62811 -348415 -16175 36931 -33783 -8668 -256597 76877
1999 76877 -419475 -58593 75865 -508366 -535415 -198575 -152644 -336026 -124823 -80843
$$ packed form
2071b98426o5270N23778p73187M68143K94634m50300J07328L64045K29248n70730
2061a70737J48630l98261M61768j67399k63413K97261R3257Q189l5436R3393k58508
2050a91256J41078j08188K87811n5380M06822o01271J66481j67283K44335r6255
2040B6894O2897l75984q7401L91296l87704K01332L07091p4318m04331J39579
2030b00649l8966l1568K31767k88863J59673J32602j73739j6233O1959J58068
2020e949j7070J29556k9806J34700j80833J15964l00696L68949l64515K97421
2010A47721r6079q6185k52915L50269m11226L32240N3106p0714K5115k47929L33474
1999G6877m96352L60882J34458n84231k7049L36840M5931j83382K11203M3980
$$ plain form
1989 -80843 -317369 -172991 -247222 -211990 -471151 -184307 159657 104965 -120961 75002
1979 75002 -309179 -133769 -150551 -186849 -234579 -15632 -100575 -237392 -18011 -54461 123465
1968 123465 -95564 381337 180586 -41531 -34336 371206 -254733 -538349 10999 -128618
1958 -128618 -383380 -169723 -71825 -31875 26681 -2267 -97666 -90419 -385631 -119020 -100826
1947 -100826 173151 -74363 -234838 -279811 -403421 -229019 214820 59591 13794 -104289
1937 -104289 -588555 -157165 -139390 83369 93036 -281097 -169466 -341139 -173514 -138882
1927 -138882 -112454 -306872 -344433 -144845 -523500 -443534 -70414 196831 236894 -10722
1917 -10722 -190623 210215 -125036 -688356 299249 -37542 -90330 -49041 -352866 88416
$$ packed form
1989h0843k36526J44378p4231L5232k59161K86844L43964n4692k25926J95963
1979G5002l84181J75410j6782l6298m7730K18947q4943j36817K19381l6450J77926
1968A23465k19029M76901k00751k22117P195M05542o25939k83616N49348j39617
1958a28618k54762K13657R7898L9950N8556k8948r5399P247k95212K66611J8194
1947a00826K73977k47514j60475m4973j23610J74402M43839j55229m5797j18083
1937a04289m84266M31390J7775K22759R667l74133J11631j71673J67625L4632
1927a38882K6428j94418l7561J99588l78655P9966L73120K67245M0063k47616
1917a0722j79901M00838l35251n63320R87605l36791n2788M1289l03825M41282
$$ plain form
1907 88416 -181681 -294844 211496 172611 -406703 93029 -492018 -308401 273182 -308126
1897 -308126 -93039 -31999 124598 -72148 -270713 110036 -224547 370209 -131353 -454
1887 -454 -96355 -176126 -218923 -677062 -49384 -384845 -335447 -144300 -361975 -351891 -165868
1876 -165868 188567 230075 -419642 -355302 -181457 -222487 -157633 354863 -78078 -42089 -475905
$$ packed form
1907H8416k70097j13163N06340l8885n79314M99732n85047J83617N81583n81308
1897c08126K15087O1040J56597j96746j98565L80749l34583N94756n01562J30899
1887d54r5901p9771m2797m58139O27678l35461M9398J91147k17675J0084J86023
1876a65868L54435M1508o49717O4340J73845m1030O4854N12496m32941L5989m33816
$$ [...]
##END NTUPLES=NMR SPECTRUM
##END=
