##TITLE=abcd
##JCAMPDX= 6.0         $$ Bruker NMR JCAMP-DX V2.0
##DATA TYPE= NMR SPECTRUM
##DATA CLASS= NTUPLES
##ORIGIN= UXNMR, Bruker Analytische Messtechnik GmbH
##OWNER= root
$$ XWIN-NMR		Version 3.5
$$ Fri Jul 17 17:06:26 2026 Russian Standard Time (UT+4h)  servis@DPX200
##.OBSERVE FREQUENCY= 200.131235884673
##.OBSERVE NUCLEUS= ^1H
##.ACQUISITION MODE= SIMULTANEOUS
##.ACQUISITION SCHEME= undefined
##.AVERAGES= 32
##.DIGITISER RES= 18
##SPECTROMETER/DATA SYSTEM= spect
##.PULSE SEQUENCE= zg
##.SOLVENT NAME= CDCl3
##.SHIFT REFERENCE= (INTERNAL, CDCl3, 0, 16.4885)
##AUDIT TRAIL= $$ (NUMBER, WHEN, WHO, WHERE, WHAT)
$$ ##TITLE= Audit trail, XWIN-NMR		Version 3.5
$$ ##JCAMPDX= 5.01
$$ ##ORIGIN= Bruker BioSpin GmbH
$$ ##OWNER= servis
$$ F:\spectra/data/av/nmr/H1/1/pdata/1/auditp.txt
$$ ##AUDIT TRAIL=  $$ (NUMBER, WHEN, WHO, WHERE, WHAT)
(   1,<2026-07-17 17:05:28.15 +0400>,<servis>,<DPX200>,
      <created by zg, POWCHK disabled, PULCHK disabled
       configuration hash MD5:
       00 E9 B6 7A A2 85 ED C7 34 08 36 98 17 FE 4E 26
       data hash MD5: 32K
       4B ED 5C 6E 5E 67 0C 72 03 B9 0A FE 42 32 5A 84>)
(   2,<2026-07-17 17:05:46.59 +0400>,<servis>,<DPX200>,
      <Start of raw data processing
       efp BC_mod = 2 LB = 0.05 FT_mod = 6 PKNL = 1 PHC0 = -416.59 PHC1 = 3.101563 SI = 16K 
       data hash MD5: 16K
       45 09 1A B0 C3 08 82 6A C3 4F 83 63 E6 03 02 B6>)
$$ ##END=
$$ 
$$ hash MD5
$$ 07 E0 5D 5F 45 76 B0 BC 3A 86 29 82 E6 D8 D5 C3
##$RELAX= 
##$RELAX= 
##$RELAX= 
##$RELAX= 
##$RELAX= 
##$RELAX= 
##$RELAX= 
##$RELAX= 
$$ Bruker specific parameters
$$ --------------------------
##$DU= <F:\spectra>
##$EXPNO= 1
##$NAME= <H1>
##$PROCNO= 1
##$TYPE= <nmr>
##$USER= <av>
##$AMP= (0..31)
100 100 100 100 100 100 100 100 100 100 100 100 100 100 100 100 100 100 
100 100 100 100 100 100 100 100 100 100 100 100 100 100 
##$AQSEQ= 0
##$AQ_mod= 1
##$AUNM= <au_zg>
##$AUTOPOS= <>
##$BF1= 200.13
##$BF2= 200.13
##$BF3= 200.13
##$BF4= 200.13
##$BF5= 500.13
##$BF6= 500.13
##$BF7= 500.13
##$BF8= 500.13
##$BYTORDA= 1
##$CFDGTYP= 0
##$CFRGTYP= 5
##$CHEMSTR= <none>
##$CNST= (0..31)
1 1 145 1 1 1 1 1 1 1 1 1 1 1 1 1 1 1 1 1 1 1 1 1 1 1 1 1 1 1 1 1 
##$CPDPRG= <>
##$CPDPRG1= <>
##$CPDPRG2= <>
##$CPDPRG3= <>
##$CPDPRG4= <mlev>
##$CPDPRG5= <mlev>
##$CPDPRG6= <mlev>
##$CPDPRG7= <mlev>
##$CPDPRG8= <mlev>
##$CPDPRGB= <>
##$CPDPRGT= <>
##$D= (0..31)
0 2 0 0 0 0 0 0 0 0.06 0 0 0 0 0 0 0.0002 0 0 0 0 0 0 0 0 0 0 0 0 0 0 
0 
##$DATE= 1784293527
##$DBL= (0..7)
120 120 120 120 120 120 120 120 
##$DBP= (0..7)
150 150 150 150 150 150 150 150 
##$DBP07= 0
##$DBPNAM0= <>
##$DBPNAM1= <>
##$DBPNAM2= <>
##$DBPNAM3= <>
##$DBPNAM4= <>
##$DBPNAM5= <>
##$DBPNAM6= <>
##$DBPNAM7= <>
##$DBPOAL= (0..7)
0.5 0.5 0.5 0.5 0.5 0.5 0.5 0.5 
##$DBPOFFS= (0..7)
0 0 0 0 0 0 0 0 
##$DE= 6
##$DECBNUC= <off>
##$DECIM= 32
##$DECNUC= <off>
##$DECSTAT= 4
##$DIGMOD= 1
##$DIGTYP= 9
##$DL= (0..7)
0 120 120 120 120 120 120 120 
##$DP= (0..7)
150 150 150 150 150 150 150 150 
##$DP07= 0
##$DPNAME0= <>
$$ [...]
##$SUBNAM4= <"">
##$SUBNAM5= <"">
##$SUBNAM6= <"">
##$SUBNAM7= <"">
##$SUBNAM8= <"">
##$SUBNAM9= <"">
##$SW= 20.6817932712277
##$SWIBOX= (0..15)
0 0 3 0 0 0 0 0 0 0 0 0 0 0 0 0 
##$SW_h= 4139.07284768212
##$TD= 32768
##$TD0= 1
##$TE= 0
##$TE2= 300
##$TE3= 300
##$TEG= 300
##$TL= (0..7)
0 120 120 120 120 120 120 120 
##$TP= (0..7)
150 150 150 150 150 150 150 150 
##$TP07= 0
##$TPNAME0= <>
##$TPNAME1= <>
##$TPNAME2= <>
##$TPNAME3= <>
##$TPNAME4= <>
##$TPNAME5= <>
##$TPNAME6= <>
##$TPNAME7= <>
##$TPOAL= (0..7)
0.5 0.5 0.5 0.5 0.5 0.5 0.5 0.5 
##$TPOFFS= (0..7)
0 0 0 0 0 0 0 0 
##$TUNHIN= 0
##$TUNHOUT= 0
##$TUNXOUT= 0
##$USERA1= <user>
##$USERA2= <user>
##$USERA3= <user>
##$USERA4= <user>
##$USERA5= <user>
##$V9= 5
##$VALIST= <valist>
##$VCLIST= <CCCCCCCCCCCCCCC>
##$VD= 0
##$VDLIST= <DDDDDDDDDDDDDDD>
##$VPLIST= <PPPPPPPPPPPPPPP>
##$VTLIST= <TTTTTTTTTTTTTTT>
##$WBST= 1024
##$WBSW= 30
##$XGAIN= (0..3)
0 0 0 0 
##$XL= 0
##$YL= 0
##$YMAX_a= 161947
##$YMIN_a= -282701
##$ZGOPTNS= <>
##$ZL1= 120
##$ZL2= 120
##$ZL3= 120
##$ZL4= 120
##$ABSF1= 0
##$ABSF2= 0
##$ABSG= 0
##$ABSL= 0
##$ALPHA= 0
##$AQORDER= 0
##$ASSFAC= 0
##$ASSFACI= 0
##$ASSFACX= 0
##$ASSWID= 0
##$AUNMP= <proc_1d>
##$AZFE= 0.1
##$AZFW= 0.1
##$BCFW= 0
##$BC_mod= 2
##$BYTORDP= 0
##$COROFFS= 0
##$CY= 18.4799938201904
##$DATMOD= 1
##$DC= 0
##$DFILT= <>
##$DTYPP= 0
##$F1P= 9.9274215381318
##$F2P= -0.165520771350173
##$FCOR= 1
##$FTSIZE= 16384
##$FT_mod= 6
##$GAMMA= 0
##$GB= 0
##$INTBC= 1
##$INTSCL= 4.127829e-11
##$ISEN= 128
##$LB= 0.05
##$LEV0= 0
##$LPBIN= 0
##$MAXI= 10000
##$MC2= 0
##$MEAN= 0
##$ME_mod= 0
##$MI= 50
##$NCOEF= 0
##$NC_proc= -6
##$NLEV= 6
##$NOISF1= 3.799351
##$NOISF2= 2.8
##$NSP= 0
##$NTH_PI= 0
##$NZP= 0
##$OFFSET= 16.48848
##$PC= 4
##$PHC0= -416.59
##$PHC1= 3.101563
##$PH_mod= 1
##$PKNL= yes
##$PPARMOD= 0
##$PSCAL= 4
##$PSIGN= 0
##$REVERSE= no
##$SF= 200.130005582386
##$SI= 16384
##$SIGF1= 3
##$SIGF2= 2
##$SINO= 400
##$SIOLD= 16384
##$SREGLST= <1H.CDCl3>
##$SSB= 0
##$STSI= 16384
##$STSR= 0
##$SW_p= 4139.07284768211
##$SYMM= 0
##$S_DEV= 0
##$TDeff= 32768
##$TDoff= 0
##$TI= <>
##$TILT= no
##$TM1= 0
##$TM2= 0
##$TOPLEV= 0
##$USERP1= <user>
##$USERP2= <user>
##$USERP3= <user>
##$USERP4= <user>
##$USERP5= <user>
##$WDW= 1
##$XDIM= 16384
##$YMAX_p= 463385158
##$YMIN_p= -576905
$$ End of Bruker specific parameters
$$ ---------------------------------
##NTUPLES= NMR SPECTRUM
##VAR_NAME=  FREQUENCY,     SPECTRUM/REAL,   SPECTRUM/IMAG
##SYMBOL=    X,             R,               I
##VAR_TYPE=  INDEPENDENT,   DEPENDENT,       DEPENDENT
##VAR_FORM=  AFFN,          ASDF,            ASDF
##VAR_DIM=   16384,         16384,           16384
##UNITS=     HZ,            ARBITRARY UNITS, ARBITRARY UNITS
##FACTOR=    0.252644378177508, 1,           1
##FIRST=     3299.83951724647, 0,            0
##LAST=      -839.233330435636, 0,           0
##MIN=       -839.233330435636, -576905,     0
##MAX=       3299.83951724647, 463385158,    0
$$ Real data points
##PAGE= N=1
##DATA TABLE= (X++(R..R)), XYDATA
$$ [...]
##PAGE= N=2
##DATA TABLE= (X++(I..I)), XYDATA
8307D286651J97781j42716k85485Q0646K84837q4408K9760K4971m3870O712j26918
$$ 4286651 4484432 4341716 4056231 4136877 4421714 4337306 4367066 4392037 4348167 4354879 4227961
8296D227961N7784M5631Q5016K24580l13015l1608R8720J14682j87266p2214L68926
$$ 4227961 4285745 4331376 4416392 4640972 4327957 4296349 4395069 4509751 4322485 4250271 4619197
8285D619197j47007J9048j38660P725N3358N933N120o6172Q460J93916l14622
$$ 4619197 4472190 4491238 4352578 4360303 4413661 4419594 4424714 4358542 4367002 4560918 4246296
8274D246296M6335l0780L5712l2769K46362J6167j2740P1259j86991N0553r4245
$$ 4246296 4292631 4261851 4297563 4264794 4511156 4527323 4514583 4585842 4398851 4449404 4355159
8263D355159r4095J12551Q4600m2921o6605j87632j23092M59545j43713l8648
$$ 4355159 4261064 4373615 4458215 4415294 4348689 4161057 4037965 4497510 4353797 4315149
8253D315149R9430m1639M9837j08121Q4446J55066l726j50904R0446p3799K30299
$$ 4315149 4414579 4372940 4422777 4314656 4399102 4554168 4550442 4399538 4489984 4416185 4646484
8242D646484l84300L25110k74315J15390m4102J35735R2651k85137O7903J51724
$$ 4646484 4262184 4587294 4312979 4428369 4384267 4520002 4612653 4327516 4395419 4547143
8232D547143O7673k82031N8422j32288J52364q6069K85677j91027L8837K7691
$$ 4547143 4614816 4332785 4391207 4258919 4411283 4325214 4610891 4419864 4458701 4486392
8222D486392O6919l5751R4588j07864j60365J91402n9245Q8890M6380j81809R9344
$$ 4486392 4553311 4517560 4612148 4504284 4343919 4535321 4476076 4564966 4611346 4429537 4528881
8211D528881K1430k1989j45930K39684r0784o4342J30847k86177K75091j79496
$$ 4528881 4550311 4528322 4382392 4622076 4531292 4466950 4597797 4311620 4586711 4407215
8201D407215J19930K0887j57886J7041J08615q7605K20527J06744j93896R68826
$$ 4407215 4527145 4548032 4390146 4407187 4515802 4428197 4648724 4755468 4561572 5530398
8191E530398j032571r9498q5237J00596k70666L80492j87684J48378k48825K16192
$$ 5530398 4497827 4398329 4313092 4413688 4143022 4523514 4335830 4484208 4235383 4451575
8181D451575k3883J36133l66407M38940k31475J57625j65633N5925R8626j1604
$$ 4451575 4427692 4563825 4197418 4636358 4404883 4562508 4396875 4452800 4551426 4539822
8171D539822k7975o0575R3650j28258J65400k8957M5988j01121k4558J11212j49675
$$ 4539822 4511847 4451272 4544922 4416664 4582064 4553107 4599095 4497974 4473416 4584628 4434953
8160D434953J74340J13413j49598k3058L2316l0936O4j85645K25812J07512r5686
$$ 4434953 4609293 4722706 4573108 4550050 4582366 4551430 4551494 4365849 4591661 4699173 4603487
8149D603487o2984K12629j38668j6118j5244J83593j98081K15436k92809J06792
$$ 4603487 4540503 4753132 4614464 4598346 4583102 4766695 4568614 4784050 4491241 4598033
8139D598033Q0519o8392j74844J56871l1940o6890k4002o086K14042q0141j58485
$$ 4598033 4678552 4610160 4435316 4592187 4560247 4493357 4469355 4463269 4677311 4597170 4438685
8128D438685K80652j56988k6144j31154K23520J27802p8249j87665Q5305M5528
$$ 4438685 4719337 4562349 4536205 4405051 4628571 4756373 4678124 4490459 4575764 4621292
8118D621292R9712Q1157k98208K18382J06290l08136J43528m11j63426K03932
$$ 4621292 4721004 4802161 4503953 4722335 4828625 4520489 4664017 4663606 4500180 4704112
8108D704112n7483k19628K34535o5532n8510N9627M36147m64187K41748k87431
$$ 4704112 4646629 4427001 4661536 4596004 4537494 4597121 5033268 4569081 4810829 4523398
8098D523398K91824l12654K01448K8160M7765j31422j3971O2249M1738l4390k46910
$$ 4523398 4815222 4502568 4704016 4732176 4779941 4648519 4634548 4696797 4738535 4704145 4457235
8087D457235K51304J60471j69540J04101r1548P5875k52775K1142J14227M5575
$$ 4457235 4708539 4869010 4699470 4803571 4712023 4787898 4535123 4556265 4670492 4716067
8077D716067l9232j49695K30106j38940P2603J69473J7760o9031j15413J72138
$$ 4716067 4676835 4527140 4757246 4618306 4690909 4860382 4878142 4809111 4693698 4865836
8067D865836j31514J63527k20198J44193K7288j41856K7027J94825k30483r967
$$ 4865836 4734322 4897849 4677651 4821844 4849132 4707276 4734303 4929128 4698645 4688678
8057D688678o2032J79373J03149r1055k21319K31639j85637J93368O669j04281
$$ 4688678 4626646 4806019 4909168 4818113 4596794 4828433 4642796 4836164 4842833 4738552
8047D738552Q1938p317P100K7069j92670J05197r7686J88376k58829K26090j62400
$$ 4738552 4820490 4813173 4820273 4847342 4654672 4759869 4662183 4850559 4591730 4817820 4655420
8036D655420J55276K6715n4925R7980J45011j6839j70214q6913J04540l6257J12112
$$ 4655420 4810696 4837411 4782486 4880466 5025477 5008638 4838424 4751511 4856051 4819794 4931906
8025D931906j19969q8339J70568j27330J59200n9738j42800K23921k41004K34640
$$ 4931906 4811937 4723598 4894166 4766836 4926036 4866298 4723498 4947419 4706415 4941055
8015D941055j61010N5624j800l045J7499m1768n7860l5937J53058N3436j23173
$$ 4941055 4780045 4835669 4833869 4830824 4848323 4806555 4748695 4712758 4865816 4919252 4796079
8004D796079j3246l9768j2J5838O2803J09251J39180k33057L2365P2006P4614
$$ 4796079 4782833 4743065 4743053 4758891 4821694 4930945 5070125 4837068 4869433 4941439 5016053
7993E016053j08836Q1535j55921m5831J24562j40084K59653j49482P3143m2849
$$ 5016053 4907217 4988752 4832831 4787000 4911562 4771478 5031131 4881649 4954792 4911943
7983D911943j17891J38633o4746o1709M2165n716j8000K5829K274l9571J47244
$$ 4911943 4794052 4932685 4867939 4806230 4848395 4842679 4824679 4850508 4852782 4813211 4960455
7972D960455n2091K66510j26407k54641K11337o6361J59119j16856j54067Q6937
$$ 4960455 4908364 5174874 5048467 4793826 5005163 4938802 5097921 4981065 4826998 4913935
7962D913935J17604n4109R9704o783j05903j56832J44373l0812K41415k08006
$$ 4913935 5031539 4977430 5077134 5070351 4964448 4807616 4951989 4921177 5162592 4954586
7952D954586J15709p3527K6635M8011j64205O7011J85345j79629J39889j83200
$$ 4954586 5070295 4996768 5023403 5071414 4907209 4974220 5159565 4979936 5119825 4936625
7942D936625J97133q8279k05108J46483m2518J63209l2513L3920o6266J58507
$$ 4936625 5133758 5045479 4840371 4986854 4944336 5107545 5075032 5108952 5042686 5201193
7932E201193L7938k44063K96045j08292L8650k3277k9146j14799j87000L60046
$$ 5201193 5239131 4995068 5291113 5182821 5221471 5198194 5169048 5054249 4867249 5227295
7922E227295j94111O3902l8270K7926j61328K99961J1482j43358N7950J2389l6876
$$ 5227295 5033184 5097086 5058816 5086742 4925414 5225375 5236857 5093499 5151449 5163838 5126962
7911E126962m1669J32990q2412r8043O1153M0327j7859J38787J0696j53467K03148
$$ 5126962 5085293 5218283 5135871 5037828 5098981 5139308 5121449 5260236 5270932 5117465 5320613
7900E320613j68377J16668p9132j75877J70660n0620J675j02012K14806j12330
$$ 5320613 5152236 5268904 5189772 5013895 5184555 5133935 5135610 5033598 5248404 5136074
7890E136074L30811k01063j4163N9354n5196k1311J48429j37257j3001j45966
$$ 5136074 5466885 5265822 5251659 5311013 5255817 5234506 5382935 5245678 5232677 5086711
7880E086711J66608l4997r2682J12789J4638o9464J56542k69333K60851k3051
$$ 5086711 5253319 5218322 5125640 5238429 5253067 5183603 5340145 5070812 5331663 5308612
7870E308612j03311K64981j4810j87082N4174m9714M6971K17964j07122M3975
$$ 5308612 5205301 5470282 5455472 5268390 5322564 5272850 5319821 5537785 5430663 5474638
7860E474638k36078J35577k81422J73284J41556L5163M32745j255564M57059J70632
$$ 5474638 5238560 5374137 5092715 5265999 5407555 5442718 5875463 4619899 5076958 5247590
7850E247590M8652L9223j45988J77054Q0462o9420R8050p9821O521l7294K785
$$ 5247590 5296242 5335465 5189477 5366531 5446993 5377573 5475623 5395802 5402323 5365029 5367814
7839E367814j988j06642K29852n8341j11990j3328K16066k08207J2449K4351N1326
$$ 5367814 5365826 5259184 5489036 5430695 5318705 5305377 5521443 5313236 5325685 5350036 5401362
7828E401362r3412J10043k7597L2795j15418J61713q1941J29929k57330K31058
$$ 5401362 5307950 5417993 5390396 5423191 5307773 5469486 5387545 5517474 5260144 5491202
7818E491202o2929l6899k7314j4841J10326n9312j36541L21662l15217P2756n9965
$$ 5491202 5428273 5391374 5364060 5349219 5459545 5400233 5263692 5585354 5270137 5342893 5282928
7807E282928J30675N6822K21288k22251M499j9163J00125n4173O0765j7150J06366
$$ 5282928 5413603 5470425 5691713 5469462 5473961 5454798 5554923 5500750 5561515 5544365 5650731
7796E650731j48859r4976J700J68171l7522k29579J50014k72286L28404p7333
$$ 5650731 5501872 5406896 5408596 5576767 5539245 5309666 5459680 5187394 5515798 5438465
7786E438465J58343o6849J72314j46523j82818J90021L3922j67332J98563j07397
$$ 5438465 5596808 5529959 5702273 5555750 5372932 5562953 5596875 5429543 5628106 5520709
7776E520709j52285J21350J80153o7262J10871O8925j10299p7129J11555k344
$$ 5520709 5368424 5489774 5669927 5602665 5713536 5782461 5672162 5595033 5706588 5704244
7766E704244k3269q6417K35698l7427j41164P796K15475j36780J00605l2701n3771
$$ 5704244 5680975 5594558 5830256 5792829 5651665 5659461 5874936 5738156 5838761 5806060 5752289
7755E752289q3195N9388n8664J6992q716q0580m5929K74175j80734Q0665o3697
$$ 5752289 5669094 5728482 5669818 5686810 5678094 5597514 5551585 5825760 5645026 5725691 5661994
7744E661994M2467J15085r5837j17978J61782j42688K50587J6239k5315q9061
$$ 5661994 5704461 5819546 5723709 5605731 5767513 5624825 5875412 5891651 5866336 5777275
7734E777275o7718N5622p2673Q7634J87042k06824R0733k19821K60077P5417j69787
$$ 5777275 5709557 5765179 5692506 5780140 5967182 5760358 5851091 5631270 5891347 5966764 5796977
7723E796977L7064r1693J91357l2875M0002j61497J2132J17042L4307J26630j59840
$$ 5796977 5834041 5742348 5933705 5900830 5940832 5779335 5791467 5908509 5942816 6069446 5909606
7712E909606L1988n3554R5290n0228J30417j28203J43667l13567R4339J71377
$$ 5909606 5941594 5888040 5983330 5933102 6063519 5935316 6078983 5765416 5859755 6031132
7702F031132m3516r8453q6392J90548n6731P4524J65817j22274N1532P8758k66538
$$ 6031132 5987616 5889163 5802771 5993319 5936588 6011112 6176929 6054655 6106187 6184945 5918407
7691E918407K92532j97189O2142j41539R3887J0527P9865m4923O21k00396R1936
$$ 5918407 6210939 6013750 6075892 5934353 6028240 6038767 6118632 6073709 6074330 5873934 5965870
7680E965870q8559J58957O6782j44620N1974r0838J56453O7050n3298J3644L0123
$$ 5965870 5877311 6036268 6103050 5958430 6010404 5919566 6076019 6143069 6089771 6103415 6133538
7669F133538O2263m682m7513L3388j59681M6322M4191K3742R5035K7544K9575
$$ 6133538 6195801 6191119 6143606 6176994 6017313 6063635 6107826 6131568 6226603 6254147 6283722
7658F283722J442k2247l17226M60529l01422J27257r219n7448k1029Q6877K3220
$$ 6283722 6285164 6262917 5945691 6406220 6104798 6232055 6222836 6165388 6144359 6231236 6254456
7647F254456L7608n8533J61471j2339j56394j6251O7402K4427J27814R513k81445
$$ 6254456 6292064 6233531 6395002 6382663 6226269 6210018 6277420 6301847 6429661 6439174 6157729
7636F157729J77590k6960J2150P0070J75354j89629r7280J08491M6999O2013j50913
$$ 6157729 6335319 6308359 6320509 6390579 6565933 6376304 6279024 6387515 6434514 6496527 6345614
7625F345614N4436J0089R5041j01766o3704j98122K96737R5917l7161l7116O8012
$$ 6345614 6400050 6410139 6505180 6403414 6339710 6141588 6438325 6534242 6497081 6459965 6527977
7614F527977K3k83561K68374k01057Q443P0933l6389J76064l8704L4193O0877
$$ 6527977 6528000 6244439 6512813 6311756 6320199 6391132 6354743 6530807 6492103 6526296 6587173
7603F587173j4047J83080j11476j84750P9033L15689m18990j01395L32115j04949
$$ 6587173 6573126 6756206 6644730 6459980 6539013 6854702 6435712 6334317 6666432 6561483
7593F561483J08619q0086O908J15905j02887L1242J4262K5003l1865m5296L3888
$$ 6561483 6670102 6590016 6596924 6712829 6609942 6641184 6655446 6680449 6648584 6603288 6637176
7582F637176q5970K71582k82135L89324j75450q3303J67261l0180j97837K06412
$$ 6637176 6551206 6822788 6540653 6929977 6754527 6671224 6838485 6808305 6610468 6816880
7572F816880n5899p0319j63703J50761K6126q0R9205m5662M6127N4109p5287j0401
$$ 6816880 6760981 6690662 6526959 6677720 6703846 6703766 6802971 6757309 6803436 6857545 6782258 6771857
7560F771857J84077k52302O3062L65570k04880m0716j6861O7836j57476K5206
$$ 6771857 6955934 6703632 6766694 7132264 6927384 6886668 6869807 6937643 6780167 6805373
7550F805373J32501j82883K59275j76981j70899L06777j16967J47108m8481m7395
$$ 6805373 6937874 6754991 7014266 6837285 6666386 6973163 6856196 7003304 6954823 6907428
7540F907428K96116j55812p9702k08357K08130p5431N5243L1954j10567L07828
$$ 6907428 7203544 7047732 6968030 6759673 6967803 6892372 6947615 6979569 6869002 7176830
7530G176830j92998M9893p2520J49408r7770O3169n7024O3035N2101M4291j94605
$$ 7176830 6983832 7033725 6961205 7110613 7012843 7076012 7018988 7082023 7134124 7178415 6983810
7519F983810K37208J83612j46202k5715j27455J17702j72822K73321l1440p0510
$$ 6983810 7221018 7404630 7258428 7232713 7105258 7222960 7050138 7323459 7292019 7221509
7509G221509L7862O4715l2001j13615J00566L01M62k52362M13549j93826J53649
$$ 7221509 7259371 7324086 7292085 7178470 7279036 7279337 7279799 7027437 7440986 7247160 7400809
7498G400809O9240j7505k18029J66662l6687K63287k45578r6019K04575j54126
$$ 7400809 7470049 7452544 7234515 7401177 7364490 7627777 7382199 7286180 7490755 7336629
7488G336629J09409q5528j10069L96134k99742J29374n3850j49272K7209L22921
$$ 7336629 7446038 7360510 7250441 7646575 7346833 7476207 7422357 7273085 7300294 7623215
7478G623215k50368K75729o6032O4545j71490J20825j22445K04945k74746K37329
$$ 7623215 7372847 7648576 7582544 7647089 7475599 7596424 7473979 7678924 7404178 7641507
7468G641507r9492j8864J7443N0521K06516n4017O9272l29173J51279M2224j70617
$$ 7641507 7542015 7523151 7540594 7591115 7797631 7743614 7812886 7483713 7634992 7677216 7506599
7457G506599K13507k99007M18924j27468J65295n0692n8708K35991l14764Q2920
$$ 7506599 7720106 7421099 7840023 7712555 7877850 7827158 7768450 8004441 7689677 7772597
7447G772597J32841j31802l5610N5907K43004m15667M05957j95498j3208M7299
$$ 7772597 7905438 7773636 7738026 7793933 8036937 7621270 8027227 7831729 7818521 7865820
7437G865820O5712o8000k2817J05130J6780l6998J60030k71277J67737J06461
$$ 7865820 7931532 7863532 7840715 7945845 7962625 7925627 8085657 7814380 7982117 8088578
7427H088578l2469j6458j30805J77722K8418M7068o0478J74575j45628l3819j58430
$$ 8088578 8056109 8039651 7908846 8086568 8114986 8162054 8101576 8276151 8130523 8096704 7938274
7416G938274q7513J63877j52900J39059P3710J7057l3075j8582M8137L1956J12804
$$ 7938274 7850761 8014638 7861738 8000797 8074507 8091564 8058489 8039907 8088044 8120000 8232804
7405H232804j5080j70370J49176j49440K45103n7392P599J65818k27628J4948
$$ 8232804 8217724 8047354 8196530 8047090 8292193 8234801 8242400 8408218 8180590 8195538
7395H195538Q97K60426j23336Q365k0618P2163N657O5015L8972j05912J79509
$$ 8195538 8196435 8456861 8333525 8341890 8321272 8393435 8399092 8464107 8503079 8397167 8576676
7384H576676j7338j12214k9428o0925K73464n9005j18930J14979J31234j9840
$$ 8576676 8559338 8447124 8417696 8356771 8630235 8571230 8452300 8567279 8698513 8678673
7374H678673j8112P4215r0370J69236j64369K23200k75664M15K16002j0005j85928
$$ 8678673 8660561 8734776 8644406 8813642 8649273 8872473 8596809 8597224 8813226 8803221 8617293
7363H617293K64184k43464J40617R189K30783j38987P2959j68552P9474K20214
$$ 8617293 8881477 8638013 8778630 8787819 9018602 8879615 8952574 8784022 8863496 9083710
7353I083710n1712j32134J23580j81014L46088P4675j11461J12553Q3801j36045
$$ 9083710 9031998 8899864 9023444 8842430 9188518 9263193 9151732 9264285 9348086 9212041
7343I212041o7028k26263J83047N9245j69921J54799J41916j96759P1485n0218
$$ 9212041 9145013 8918750 9101797 9161042 8991121 9145920 9287836 9091077 9162562 9112344
7333I112344L49955r6759j29301J12085R0311L3655r7654N1739j72179r1604M66422
$$ 9112344 9462299 9365540 9236239 9348324 9438635 9472290 9374636 9426375 9254196 9162592 9629014
7322I629014R6642r3825n4222k58040K45344K769J51480q0147K02048j90184K09069
$$ 9629014 9725656 9631831 9577609 9319569 9564913 9567682 9719162 9639015 9841063 9650879 9859948
7311I859948k68246J89971k8069K18275j11170q2515J27942j04967P7378j7760
$$ 9859948 9591702 9781673 9753604 9971879 9860709 9778194 9906136 9801169 9878547 9860787
7301I860787P6323J63359k20230K02758o886N8296l0802j59012k6259M45001j33784
$$ 9860787 9937110 10100469 9880239 10082997 10076111 10134407 10103605 9944593 9918334 10363335 10229551
7290A0229551J25231l3773L2574o373j4979K33034j53210Q6863l7464K0696J43219
$$ 10229551 10354782 10321009 10353583 10347210 10332231 10565265 10412055 10498918 10461454 10482150 10625369
7279A0625369l1274L1427k12225J46279M6839J84409j97665N7138K66242l2153
$$ 10625369 10594095 10625522 10413297 10559576 10606415 10790824 10593159 10650297 10916539 10884386
7269A0884386J56528P5762k26081R172j6174M3839o7216J22545K28253j63141
$$ 10884386 11040914 11116676 10890595 10899767 10883593 10927432 10860216 10982761 11211014 11047873
7259A1047873K30473j82747J51059L1710L8710Q9859o2112j22272J87717j65907
$$ 11047873 11278346 11095599 11246658 11278368 11317078 11406937 11344825 11222553 11410270 11244363
7249A1244363J48884P4922m5518l9957L32001r1139K5023P4349j42992L56341
$$ 11244363 11393247 11468169 11422651 11382694 11714695 11623556 11648579 11722928 11579936 11936277
7239A1936277q5061k7057J29808l563O5121N939J50666J59542j88678J57995j82289
$$ 11936277 11851216 11824159 11953967 11950404 12015525 12021464 12172130 12331672 12142994 12300989 12118700
7228A2118700J27842j07323K09067M4694p1792N9245J03033K84333k49260J36859
$$ 12118700 12246542 12139219 12348286 12392980 12321188 12380433 12483466 12767799 12518539 12655398
7218A2655398J71516k64916M42869j96746J37698R8464j25591K49657P1903j09533
$$ 12655398 12826914 12561998 13004867 12808121 12945819 13044283 12918692 13168349 13240252 13130719
7208A3130719J21122p5094R7807P1726K0843j28088K19533N5951J46151M528j1672
$$ 13130719 13251841 13176747 13274554 13346280 13367123 13239035 13458568 13514519 13660670 13665198 13653526
7197A3653526k416J10782J81595m252P0262K2267M2221K55860k13022Q3001K27417
$$ 13653526 13651110 13761892 13943487 13939235 14009497 14031764 14073985 14329845 14116823 14199824 14427241
7186A4427241R5121P8924J02440J54997o0933L36634J37719K41589J37171J72273
$$ 14427241 14522362 14601286 14703726 14858723 14797790 15134424 15272143 15513732 15650903 15823176
7176A5823176R8412M27806K16872L22055M57280J54165K20813k13432m52861q90477
$$ 15823176 15921588 16349394 16566266 16888321 17345601 17499766 17720579 17507147 17054286 16163809
7166A6163809q93956r23216o67511o23553k45605n6459Q2396M72406L52178j6448
$$ 16163809 15269853 14346637 13679126 13055573 12809968 12753509 12835905 13308311 13660489 13644041
7156A3644041N54590M0208L6148k17314k29237q6770K6280p16386k99807q20095
$$ 13644041 14198631 14238839 14274987 14057673 13828436 13741666 13767946 13051560 12751753 11931658
7146A1931658o11086p63297n91397m87271k43066m53678l43671l88390k32050
$$ 11931658 11320572 10557275 9965878 9478607 9235541 8781863 8438192 8049802 7817752
7137G817752n13117j2042R6003K0346K82492M47731L41110L18226j95028m47468
$$ 7817752 7304635 7292593 7388596 7408942 7691434 8139165 8480275 8798501 8603473 8156005
7127H156005r51359j018582r26005j171407l46255n61234j95748Q0312J20167
$$ 8156005 7204646 6186064 5260059 4088652 3742397 3181163 2985415 3065727 3185894
7118C185894K89434Q5984L88976L7686M48250R909K00680K55352J94765J62824
$$ 3185894 3475328 3561312 3950288 3987974 4436224 4446133 4646813 4902165 5096930 5259754
7108E259754M23067l2625L53517m3960N70809m32997K53001o9142q3756o9787
$$ 5259754 5682821 5650196 6003713 5959753 6530562 6097565 6350566 6281424 6197668 6127881
7098F127881p8416j78570L74421k01299K48797Q4358J10554K80934K73596m252
$$ 6127881 6049465 5870895 6245316 6044017 6292814 6377172 6487726 6768660 7042256 7038004
7088G038004J92844R0917l3705N32759j80520J86908K00648l07198L54274p0949
$$ 7038004 7230848 7321765 7288060 7820819 7640299 7827207 8027855 7720657 8074931 8003982
7078H003982J92700K24196M8245n5122L29402M7377L08076n8714J53344m875K88610
$$ 8003982 8196682 8420878 8469123 8414001 8743403 8790780 9098856 9040142 9193486 9188611 9477221
7067I477221Q1376O6619J00431L58049j74773J8267K71140J36336q6079K88474
$$ 9477221 9558597 9625216 9725647 10083696 9908923 9927190 10198330 10334666 10248587 10537061
7057A0537061j58208J17480m2655K47756N0149J4871l4601n8965J96620k00665
$$ 10537061 10378853 10496333 10453678 10701434 10751583 10766454 10731853 10672888 10869508 10668843
7047A0668843J71515P7541q8530K76625R1473R1256J12584r5392J55944M20822
$$ 10668843 10840358 10917899 10829369 11105994 11197467 11288723 11401307 11305915 11461859 11882681
7037A1882681j62626r570J26248m6886R9989K24635O8810L08802l43335K58335
$$ 11882681 11720055 11710485 11836733 11789847 11889836 12114471 12183281 12492083 12148748 12407083
7027A2407083J86236J99338K9496J54771K6040Q2138P6098J81155j71899J52712
$$ 12407083 12593319 12792657 12822153 12976924 13002964 13085102 13161200 13342355 13170456 13323168
7017A3323168k07579J68448l8881J79013J60617P2883J80934j21340L14471j46696
$$ 13323168 13115589 13284037 13245156 13424169 13584786 13657669 13838603 13717263 14031734 13885038
7007A3885038n6869J57178J77322K12533o1571M26980J60112j19186M02440r3027
$$ 13885038 13828169 13985347 14162669 14375202 14313631 14740611 14900723 14781537 15183977 15090950
6997A5090950K00312K06863J51390k3722J21332J91864J75042L13486o2824J77223
$$ 15090950 15291262 15498125 15649515 15625793 15747125 15938989 16114031 16427517 16364693 16541916
6987A6541916q6910Q6287J82987L01104N9761M84838m0380K58731K286N67105
$$ 16541916 16455006 16541293 16724280 17025384 17085145 17569983 17529603 17788334 17790620 18357725
6977A8357725p2322J79194J79995J02919K03868L05719M61711M95027J22097N54156
$$ 18357725 18285403 18464597 18644592 18747511 18951379 19257098 19718809 20213836 20335933 20890089
6967B0890089K62815N08226M29571P01607R03224O85459J042859Q49853P70111
$$ 20890089 21152904 21661130 22090701 22792308 23695532 24380991 25423850 26273703 27043814
6958B7043814K1547p11625j833420k757066k705885k529601k137933j061693l54415
$$ 27043814 27065361 26353736 24520316 21763250 19057365 16527764 14389831 13328138 12973723
6949A2973723J45010L09365R22548N81838R21827J437321J205510J331539J679343
$$ 12973723 13118733 13428098 14350646 14932484 15854311 17291632 18497142 19828681 21508024
6940B1508024J269615J969178J224544Q8816j558171k971742m564394n003512
$$ 21508024 22777639 24746817 25971361 26060177 24502006 21530264 16965870 11962358
6932A1962358n370717m005270k975300j504195o72185M38953O18642J376155J256382
$$ 11962358 6591641 2586371 -388929 -1893124 -2565309 -2126356 -1507714 -131559 1124823
6923A124823J646847J416635J146579J209838J078091J170478P71865P81770r0296
$$ 1124823 2771670 4188305 5334884 6544722 7622813 8793291 9565156 10346926 10256630
6914A0256630j250908k014844k769056k584018k396752j609417o60722l2427K86786
$$ 10256630 9005722 6990878 4221822 1637804 -758948 -2368365 -3029087 -3061514 -2774728
6905b774728L90291P56369Q34852Q07003Q35482N38955Q85374K82405N91460M43920
$$ -2774728 -2384437 -1628068 -793216 13787 849269 1388224 2273598 2556003 3147463 3591383
6895C591383M81015M27460M77723J09551L69447N53435M7022J46809L40672K89217
$$ 3591383 4072398 4499858 4977581 5087132 5456579 6010014 6057036 6203845 6544517 6833734
6885F833734M30117L01803K04199J16994K15141L41073J31840J77220K42382K34712
$$ 6833734 7263851 7565654 7769853 7886847 8101988 8443061 8574901 8752121 8994503 9229215
6875I229215L38954J13454K07957J07865L60581J21099K23677L9199K63348L07830
$$ 9229215 9568169 9681623 9889580 9997445 10358026 10479125 10702802 10742001 11005349 11313179
6865A1313179J86669R6184K78908N2324J25471L04650p4844L55451K08085K52723
$$ 11313179 11499848 11596032 11874940 11927264 12052735 12357385 12282541 12637992 12846077 13098800
6855A3098800P980L02006J48883l7627L39005K74394K65054R5496J60649J70125
$$ 13098800 13106780 13408786 13557669 13520042 13859047 14133441 14398495 14493991 14654640 14824765
6845A4824765K80683K64841J24794J19795L59915K85606m7621M02545O5061R4190
$$ 14824765 15105448 15370289 15495083 15614878 15974793 16260399 16212778 16615323 16680384 16774574
6835A6774574L49226K18752L18496L36548L36955K3222R3901M38048K79208K23979
$$ 16774574 17123800 17342552 17661048 17997596 18334551 18357773 18451674 18889722 19168930 19392909
6825A9392909J43709L14018K92247K69009J55110M83623K96992K07478L75307
$$ 19392909 19536618 19850636 20142883 20411892 20567002 21050625 21347617 21555095 21930402
6816B1930402K67012M05377K73038L37290N29123L42796M88519M27688O22840
$$ 21930402 22197414 22602791 22875829 23213119 23742242 24085038 24573557 25001245 25624085
6807B5624085M33893O51000L39151M35229R76340P17972P15191O01862Q53288
$$ 25624085 26057978 26708978 27048129 27483358 28459698 29177670 29892861 30494723 31348011
6798C1348011P94547Q69615J098412R89506J372259J325178J539427J702548K016227
$$ 31348011 32142558 33012173 34110585 35100091 36472350 37797528 39336955 41039503 43055730
6789D3055730K495264L175263L813513N724598N003549J502170n848004j2065332
$$ 43055730 45550994 48726257 52539770 58264368 63267917 64770087 58922083 46856751
6781D6856751j5584177j4838803j1761849p321385k956533K44155J811858L098913
$$ 46856751 31272574 16433771 4671922 -2649463 -5605996 -5361841 -3549983 -451070
6773d51070L259054L764220L545345L172684K974007K865839L003114K671777
$$ -451070 2807984 6572204 10117549 13290233 16264240 19130079 22133193 24804970
6765B4804970K781167K548598L100537L298432L461260M340469N333114O476060
$$ 24804970 27586137 30134735 33235272 36533704 39994964 44335433 49668547 56144607
6757E6144607O982797M623221O95660k685163p124093j4544926k0050698j8636519
$$ 56144607 63127404 67750625 68446285 65761122 58637029 44092103 24041405 5404886
6749E404886j4375698q745727l718394j759204m172154o110104n253138l809924
$$ 5404886 -8970812 -17716539 -21434933 -23194137 -27366291 -33476395 -38729533 -42539457
6741d2539457j572026J295869L103982L589892L883331M264570M061746L984184
$$ -42539457 -44111483 -42815614 -39711632 -36121740 -32238409 -27973839 -23912093 -19927909
6733a9927909L572545L102604L052355L027146K984892K867709L149508L588510
$$ -19927909 -16355364 -13252760 -10200405 -7173259 -4188367 -1320658 1828850 5417360
6725E417360M130387M919442O146316P052580M396813l449563j2967180j9048104
$$ 5417360 9547747 14467189 20613505 27666085 32062898 28613335 15646155 -3401949
6717c401949j9394102j6662307j1179976n742417r45694J736889K762748L433352
$$ -3401949 -22796051 -39458358 -50638334 -56380751 -57326445 -55589556 -52826808 -49393456
6709d9393456L988154L624206L227024K416274K541414K195888J491770J713744
$$ -49393456 -45405302 -41781096 -38554072 -36137798 -33596384 -31400496 -29908726 -28194982
6701b8194982J360340J460474J037683R36512R00121O88424R74468R31625P68545
$$ -28194982 -26834642 -25374168 -24336485 -23399973 -22499852 -21811428 -20836960 -19905335 -19136790
6692a9136790N35834O10096O08457L71495O65748O13896L72934L95113K98080
$$ -19136790 -18600956 -17990860 -17382403 -17010908 -16345160 -15731264 -15358330 -14963217 -14665137
6683a4665137L41830L92028J83360M79000K65519L85582L10533M74262o5724O37538
$$ -14665137 -14323307 -13931279 -13747919 -13268919 -13003400 -12617818 -12307285 -11833023 -11898747 -11261209
6673a1261209K95070K35972M82113J05140M57312O7782K97349K60274L67664O1979
$$ -11261209 -10966139 -10730167 -10248054 -10142914 -9685602 -9617820 -9320471 -9060197 -8692533 -8630554
6663h630554K99661K67262K49712J23952K41068J78651J01807J7055K23883J59826
$$ -8630554 -8330893 -8063631 -7813919 -7689967 -7448899 -7270248 -7168441 -7151386 -6927503 -6767677
6653f767677K47552J90558K11728n4888M19782J49900J74495L3824L72443K7904
$$ -6767677 -6520125 -6329567 -6117839 -6172727 -5752945 -5603045 -5428550 -5394726 -5022283 -4994379
6643d994379L14068M8560K24631m5994L83163J19615Q5046J15533J97730J08690
$$ -4994379 -4680311 -4631751 -4407120 -4453114 -4069951 -3950336 -3865290 -3749757 -3552027 -3443337
6633c443337K55786q8358O5699L8043L074J08277J11533K82679j04415L22494
$$ -3443337 -3187551 -3275909 -3210210 -3172167 -3169093 -3060816 -2949283 -2666604 -2771019 -2448525
6623b448525j95781J35245J62262K85786J3641O408L56983J77697J07016Q0625
$$ -2448525 -2644306 -2509061 -2346799 -2061013 -2047372 -2040964 -1683981 -1506284 -1399268 -1318643
6613a318643K00573k16432M35810o6102P1035K28878J48894j00389J81884Q7024
$$ -1318643 -1118070 -1334502 -898692 -964794 -893759 -664881 -515987 -616376 -434492 -347468
6603c47468J94546j18878l1918K21686J33463k3985K31076r2374K26238J89475
$$ -347468 -152922 -271800 -303718 -82032 51431 27446 258522 166148 392386 581861
6593E81861j2035p9178K31100K09407l9748K08971P9834p0216K79597l0962K3868
$$ 581861 569826 490648 721748 931155 891407 1100378 1180212 1109996 1389593 1358631 1382499
6582A382499J25287J42586m3695P0875K12551P6777N2064j27124K13721J76982
$$ 1382499 1507786 1650372 1606677 1677552 1890103 1966880 2018944 1891820 2105541 2282523
6572B282523L8380J78205N79J70399j20160N450K77918N1699J2781M2926J12214
$$ 2282523 2320903 2499108 2499687 2670086 2549926 2555376 2833294 2884993 2897774 2940700 3052914
6561C052914P7216J90206Q9006q6278J19024K07858k1091J09016M4841M4762k7762
$$ 3052914 3130130 3320336 3409342 3323064 3442088 3649946 3628855 3737871 3782712 3827474 3799712
6550C799712r55Q4340K44225K0624J79999L0632M2693K43671j03795J2215J40376
$$ 3799712 3798757 3883097 4127322 4147946 4327945 4358577 4401270 4644941 4541146 4553361 4693737
6539D693737J47454J0534p5574P7460J95873K1454J54874j62555O9448M52449
$$ 4693737 4841191 4851725 4776151 4853611 5049484 5070938 5225812 5063257 5132705 5585154
6529E585154o7502R6134r5599N1671K80689m8834K50532k10164J76588R784J73002
$$ 5585154 5517652 5613786 5518187 5569858 5850547 5801713 6052245 5842081 6018669 6028453 6201455
6518F201455L31882r614J11508l6232K12834K37K08259J33819J58573q5041L9147
$$ 6201455 6533337 6523723 6635231 6598999 6811833 6812070 7020329 7154148 7312721 7227680 7266827
6507G266827R7052J12349J34184Q9168J78576J02679J3152n3140K08943J60123
$$ 7266827 7363879 7476228 7610412 7699580 7878156 7980835 7993987 7940847 8149790 8309913
6497H309913J32342J07574J37063n8884M88358L6353j93987K70780j68343K01198
$$ 8309913 8442255 8549829 8686892 8628008 9116366 9152719 8958732 9229512 9061169 9262367
6487I262367l5406O4626J22114J7052M44847N5388p1146N14421n582J68206J24827
$$ 9262367 9226961 9291587 9413701 9430753 9875600 9930988 9859842 10374263 10368681 10536887 10661714
6476A0661714L93771o2873N51803J80451K49812J87948l5392J49394L06200J16727
$$ 10661714 11055485 10992612 11544415 11724866 11974678 12162626 12127234 12276628 12582828 12699555
6466A2699555L78430K44723O09479m8729O94940M69144K71777M60580K03756j62662
$$ 12699555 13077985 13322708 13932187 13883458 14578398 15047542 15319319 15779899 15983655 15820993
6456A5820993o45663j256057j963647k643083k656289k677234j852310j124534
$$ 15820993 15175330 13919273 11955626 9312543 6656254 3979020 2126710 1002176
6448A002176j196670n78135p15516m73726k69872K49376K72373N31096M33136
$$ 1002176 -194494 -772629 -1488145 -1961871 -2231743 -1982367 -1709994 -1178898 -745762
6439g45762L35810K51156O2482L10755N55731J26498M66834K66187N48321K80119
$$ -745762 -409952 -158796 -96314 214441 770172 896670 1363504 1629691 2178012 2458131
6429B458131K49006L35848Q8261L11112j0358L30449k630K73938K67506l7168
$$ 2458131 2707137 3042985 3131246 3442358 3432000 3762449 3759819 4033757 4301263 4264095
6419D264095K61563L21726J96216J00710K5033J40078K166J70085J5380j21483
$$ 4264095 4525658 4847384 5043600 5144310 5169343 5309421 5311587 5481672 5497052 5375569
6409E375569Q6000j0667J17552k6990R9253M6743J00524K39431K01651K2319J55961
$$ 5375569 5461569 5450902 5568454 5541464 5640717 5687460 5787984 6027415 6229066 6251385 6407346
6398F407346K64815n0550n7491l1930K32919K73106j44424K89040K63611k75926
$$ 6407346 6672161 6621611 6564120 6532190 6765109 7038215 6893791 7182831 7446442 7170516
6388G170516K36780J87358j99606K94976j77301K03189o8655K24195K09673J52923
$$ 7170516 7407296 7594654 7395048 7690024 7512723 7715912 7647257 7871452 8081125 8234048
6378H234048j2942j36834J72977K87838L3247n4549J52522N1253o6788K33937
$$ 8234048 8221106 8084272 8257249 8545087 8578334 8523785 8676307 8727560 8660772 8894709
6368H894709K32701j5031N1149J54406o2571J44191N7402Q5039N5690J25701J09599
$$ 8894709 9127410 9112379 9163528 9317934 9255363 9399554 9456956 9541995 9597685 9723386 9832985
6357I832985R9090k4488K5572L92488k59335P0926J94403l8222K69815j18460
$$ 9832985 9932075 9907587 9933159 10325647 10066312 10137238 10331641 10293419 10563234 10444774
6347A0444774J11442J15984M8323J50183J83443J11611J04289n8687P929K40350
$$ 10444774 10556216 10672200 10720523 10870706 11054149 11165760 11270049 11211362 11219291 11459641
6337A1459641Q4633Q149P9872m2270J26580J27376n6914K75481L6150N3034K29317
$$ 11459641 11544274 11552423 11632295 11590025 11716605 11843981 11787067 12062548 12098698 12151732 12381049
6326A2381049Q3125k9734j04658K75869q3045P8638R9139K08587O9860p148K63483
$$ 12381049 12464174 12434440 12329782 12605651 12522606 12601244 12700383 12908970 12978830 12971682 13235165
6315A3235165R5261j20023M09374j17480L49189n4851J35709J12522m0978J98044
$$ 13235165 13330426 13210403 13619777 13502297 13851486 13796635 13932344 14044866 14003888 14201932
6305A4201932K2160k9495J42849K25781j45000J51420J09331O0279K25993l3461
$$ 14201932 14224092 14194597 14337446 14563227 14418227 14569647 14678978 14739257 14965250 14931789
6295A4931789L41268m0043J98918J48064J19427J19015J18002P212M42687l67807
$$ 14931789 15273057 15233014 15431932 15579996 15699423 15818438 15936440 15943652 16386339 16018532
6285A6018532L70267j8769J18223L1174J43266M17356j1266L0660K84766P9587
$$ 16018532 16388799 16370030 16488253 16519427 16662693 17080049 17068783 17099443 17384209 17463796
6275A7463796J24277J82766K90067j12082J45067J03678K65154P8047J91229K57672
$$ 17463796 17588073 17770839 18060906 17948824 18093891 18197569 18462723 18540770 18731999 18989671
6265A8989671p4213J25409J48277J34761K63257K72320L53089k32553K38105R7984
$$ 18989671 18915458 19040867 19189144 19323905 19587162 19859482 20212571 19980018 20218123 20316107
6255B0316107m7098J30934L23375K34214K24862J56292J39383K81366J86168L05120
$$ 20316107 20269009 20399943 20723318 20957532 21182394 21338686 21478069 21759435 21945603 22250723
6245B2250723K82978K46230K87356J89203L27389L79428J98246K90525N5041J88062
$$ 22250723 22533701 22779931 23067287 23256490 23583879 23963307 24161553 24452078 24507119 24695181
6235B4695181q1008M27345K84560K03892R8183J91678M46463K95248M68142N40425
$$ 24695181 24614173 25041518 25326078 25529970 25628153 25819831 26266294 26561542 27029684 27570109
6225B7570109L06485M29165K28150N43652K39933M36445M34822M99026K01805
$$ 27570109 27876594 28305759 28533909 29077561 29317494 29753939 30188761 30687787 30889592
6216C0889592P38182K59489N01035N47925P61234O97070N27765R98404P15349
$$ 30889592 31627774 31887263 32388298 32936223 33697457 34394527 34922292 35920696 36636045
6207C6636045P90438J209894J278754J089123J100672J341529J478776J647010
$$ 36636045 37426483 38636377 39915131 41004254 42104926 43446455 44925231 46572241
6199D6572241K133168K133278K755885L220102M225841N289293O894009N890569
$$ 46572241 48705409 50838687 53594572 56814674 61040515 66329808 73223817 79114386
6191G9114386j125650j0901138j7886392j9902786j7761613j2840818p629119
$$ 79114386 77988736 67087598 49201206 29298420 11536807 -1304011 -8933130
6184h933130j696681J108217K733496L821433M288229M324376L938912L701927
$$ -8933130 -10629811 -9521594 -6788098 -2966665 1321564 5645940 9584852 13286779
6176A3286779L273381L025315L342921L091074L161743L388256L464578L886249
$$ 13286779 16560160 19585475 22928396 26019470 29181213 32569469 36034047 39920296
6168C9920296M730592N726106N701388K152650k694750n614977m402760j734242
$$ 39920296 44650888 50376994 56078382 58231032 55536282 49921305 45518545 43784303
6160D3784303J414353J673908l247504r925098j3726595j6191845j8807110j6857881
$$ 43784303 45198656 46872564 43625060 33699962 19973367 3781522 -15025588 -31883469
6152c1883469j1441668p095435k967538R04932L786416M856674N277100M769055
$$ -31883469 -43325137 -50420572 -53388110 -52483178 -48696762 -43840088 -38562988 -33793933
6144c3793933M552564M449790L936704L407576L212381K963333K940885K592739
$$ -33793933 -29241369 -24791579 -20854875 -17447299 -14234918 -11271585 -8330700 -5737961
6136e737961K815041K562906L221999L148437L754451M707979N701857N583814
$$ -5737961 -2922920 -360014 2861985 6010422 9764873 14472852 20174709 25758523
6128B5758523J321671n639683j2101368j5466803j4785210j1609363p283461k876830
$$ 25758523 27080194 21440511 9339143 -6127660 -20912870 -32522233 -39805694 -42682524
6120d2682524N82053J720708K956439L376787L574884L054050K722913K558946
$$ -42682524 -42100471 -40379763 -37423324 -34046537 -30471653 -27417603 -24694690 -22135744
6112b2135744K283928K146176J775814J506891J781590P94384Q71318j28501o07727
$$ -22135744 -19851816 -17705640 -15929826 -14422935 -12641345 -11846961 -10975643 -11104144 -11711871
6103a1711871j251444j583929j574776j410342r09828n61991k67004M7910N47135
$$ -11711871 -12963315 -14547244 -16122020 -17532362 -18442190 -19004181 -19271185 -19223275 -18676140
6094a8676140P62652Q15461P60446J090930Q24778R90179O30990R22045O63136
$$ -18676140 -17913488 -17098027 -16337581 -15246651 -14421873 -13431694 -12800704 -11878659 -11215523
6085a1215523R51264N83314O57041Q55101P34113O87383O48526O66602O61335
$$ -11215523 -10264259 -9680945 -9023904 -8168803 -7434690 -6747307 -6098781 -5432179 -4770844
6076d770844N28711N68901N54912J92450k17489m66036p46273r23961m86477m48543
$$ -4770844 -4242133 -3673232 -3118320 -2925870 -3143359 -3609395 -4355668 -5279629 -5766106 -6214649
6066f214649L8447J70063M48285N67632N98768M93228O51267K12936o5278O2015
$$ -6214649 -6176202 -6006139 -5557854 -4990222 -4391454 -3898226 -3246959 -3034023 -3099301 -3037286
6056c037286N1407J30345q3614j53694l07971k89692o98530q20243k49976m33082
$$ -3037286 -2985879 -2855534 -2939148 -3092842 -3400813 -3690505 -4389035 -5209278 -5459254 -5892336
6046e892336m12009k42915M251r7371r9226J36701L48206K57980L95992L70149
$$ -5892336 -6304345 -6547260 -6543009 -6640380 -6739606 -6602905 -6254699 -5996719 -5600727 -5230578
6036e230578O13776N37255L41092J6023j02403p99306q68696o26572p03520o06872
$$ -5230578 -4616802 -4079547 -3738455 -3722432 -3824835 -4624141 -5492837 -6119409 -6822929 -7429801
6026g429801P6949j08865K93816M17006L41286O76990L95404L61088M23305M94115
$$ -7429801 -7352852 -7461717 -7167901 -6750895 -6409609 -5732619 -5337215 -4976127 -4552822 -4058707
6016d058707J84883O72489J49811K87481K23860R9828N21246K69506J31953J68560
$$ -4058707 -3873824 -3201335 -3051524 -2764043 -2540183 -2440355 -1919109 -1649603 -1517650 -1349090
6006a349090L39984L06533R7530M01945o536J47772L81059k5151k4528M16539
$$ -1349090 -1009106 -702573 -605043 -203098 -209634 -61862 319197 294046 269518 686057
5996F86057R6823J81309P8805N0774K29392L03807K41275k73045O14646J36954
$$ 686057 782880 964189 1042994 1093768 1323160 1626967 1868242 1595197 2209843 2346797
5986B346797M03209j05275P6948m66704k70058m91138j16718O9974J17643M4609
$$ 2346797 2750006 2644731 2721679 2254975 1984917 1493779 1377061 1447035 1564678 1609287
5976A609287M43365M97516n8643Q5320J87164L06169J15387J47215K8107r599
$$ 1609287 2052652 2550168 2491525 2576845 2764009 3070178 3185565 3332780 3360887 3351288
5966C351288R2600J99214l63465L13452n9740K29844P9745J35096J84792J86672
$$ 3351288 3443888 3643102 3279637 3593089 3533349 3763193 3842938 3978034 4162826 4349498
5956D349498J42459N6556K26772K6475J49167K94752K03935J29344J60494M6701
$$ 4349498 4491957 4548513 4775285 4801760 4950927 5245679 5449614 5578958 5739452 5786153
5946E786153K86231J75567J62216k66004J57535J4994L25890J42123r339R3001
$$ 5786153 6072384 6247951 6410167 6144163 6301698 6316692 6642582 6784705 6775366 6868367
5936F868367K53107J45885J67508J09340J81558O9437J17203P5669K08113Q4574
$$ 6868367 7121474 7267359 7434867 7544207 7725765 7795202 7912405 7988074 8196187 8280761
5926H280761J44345J42873K04195J39010K63558J05805K18918N1541J64280R5889
$$ 8280761 8425106 8567979 8772174 8911184 9174742 9280547 9499465 9551006 9715286 9811175
5916I811175K37016q8524K12278Q9802L38236R5464J04509K06567q8032M36432
$$ 9811175 10048191 9959667 10171945 10261747 10599983 10695447 10799956 11006523 10918491 11354923
5906A1354923m693L52124K22919J4095L36492m4861L33628L07364J40522N35315
$$ 11354923 11350230 11702354 11925273 11939368 12275860 12230999 12564627 12871991 13012513 13547828
5896A3547828K92468M72699P3291n11598m32726l51398n25834o36864m83750N4859
$$ 13547828 13840296 14312995 14386286 13874688 13441962 13090564 12564730 11927866 11444116 11498975
5886A1498975j27371j07094P3500l0361L99779J18474K03323K04975L04626K69973
$$ 11498975 11371604 11264510 11338010 11307649 11707428 11825902 12029225 12234200 12538826 12808799
5876A2808799M05805P3583O5924M27471J04160L22826l2343L1395K07082l5515
$$ 12808799 13214604 13288187 13354111 13781582 13885742 14208568 14176225 14207620 14414702 14379187
5866A4379187J77011K65158J61478R6495J05606L94202K9074M90093J13700K26419
$$ 14379187 14556198 14821356 14982834 15079329 15184935 15579137 15608211 16098304 16212004 16438423
5856A6438423K78907K10530M47925R4448K44934K15608L32228J59622N6643M42829
$$ 16438423 16717330 16927860 17375785 17470233 17715167 17930775 18263003 18422625 18479268 18922097
5846A8922097M7111K93691M04626L80881M35582L98731N76832Q33475L31592M92136
$$ 18922097 18969208 19262899 19667525 20048406 20483988 20882719 21459551 22293026 22624618 23116754
5836B3116754O48353J16118J44143k61001j251270q66420j508472j380117r40615
$$ 23116754 23765107 23881225 24025368 23764367 22513097 21646677 20138205 18758088 17817473
5827A7817473n15518k06706o1948L70765N84384P74022Q51363O57763J046787
$$ 17817473 17301955 17095249 17033301 17404066 17988450 18762472 19613835 20271598 21318385
5818B1318385J013875J102495M16790R93302P57724L70468j37584j165265j827440
$$ 21318385 22332260 23434755 23851545 24844847 25602571 25973039 25835455 24670190 22842750
5809B2842750k382835k611313k695910k278231j919648j294860j143041o89371
$$ 22842750 20459915 17848602 15152692 12874461 10954813 9659953 8516912 7827541
5801G827541m85927K24707j47362M85451L30452J137709P99296J073523J002472
$$ 7827541 7341614 7566321 7418959 7904410 8234862 9372571 10171867 11245390 12247862
5792A2247862J022693Q81367Q58959L78484Q8762o21046j508980j894476k064356
$$ 12247862 13270555 14151922 15010881 15389365 15478127 14857081 13348101 11453625 9389269
5783I389269k307264j467928j319459n35193j38773k0066Q78680M35028R51021
$$ 9389269 7082005 5614077 4294618 3759425 3620652 3600586 4479266 4914294 5865315
5774E865315N37865M52991M09242O82292L13462N62755K86152K41190N57722L91883
$$ 5865315 6403180 6856171 7265413 7947705 8261167 8823922 9110074 9351264 9908986 10300869
5764A0300869L00984O56148L83115L75287P14120K25079M32892N40285N05085
$$ 10300869 10601853 11258001 11641116 12016403 12730523 12955602 13388494 13928779 14433864
5755A4433864O06356M95772M64323K86798J57730K9517n37413m49490m04322L3240
$$ 14433864 15040220 15535992 16000315 16287113 16444843 16474360 15936947 15487457 15083135 15116375
5745A5116375k65059R564M77025L93580M44526M43897M13396L95067L35464N05503
$$ 15116375 14851316 14860880 15337905 15731485 16176011 16619908 17033304 17428371 17763835 18269338
5735A8269338K71316M16481L25938N42309L14824M35865L66149L91778K08221
$$ 18269338 18540654 18957135 19283073 19825382 20140206 20576071 20942220 21333998 21542219
5726B1542219N08986K38460N86344q7282L37305K62767M47867L85473L98196K56790
$$ 21542219 22051205 22289665 22876009 22788727 23126032 23388799 23836666 24222139 24620335 24877125
5716B4877125L67630L12754L57538L85331N30536K13188L26680L15506L32844
$$ 24877125 25244755 25557509 25915047 26300378 26830914 27044102 27370782 27686288 28019132
5707B8019132M28212L54135j82348j71478l38995l24088l90141j80961M9047J01032
$$ 28019132 28447344 28801479 28619131 28447653 28108658 27784570 27394429 27213468 27262515 27363547
5697B7363547K58430M13436K97760M30766M19145M89214L99585M17460N48591
$$ 27363547 27621977 28035413 28333173 28763939 29183084 29672298 30071883 30489343 31037934
5688C1037934M62140L41485N05506L55801N58973N21484L89068L26550N57106
$$ 31037934 31500074 31841559 32347065 32702866 33261839 33783323 34172391 34498941 35056047
5679C5056047N33236L52532O08091P58105L00177O85691P44547P17697O14964
$$ 35056047 35589283 35941815 36549906 37308011 37608188 38293879 39038426 39756123 40371087
5670D0371087Q59286O31500R63518K88699J036879O52959Q33460P27965R16253
$$ 40371087 41230373 41861873 42825391 43114090 44150969 44803928 45637388 46365353 47281606
5661D7281606O64987N88503P10465L21894P92998R41119J042882J489787J178060
$$ 47281606 47946593 48535096 49245561 49567455 50360453 51301572 52344454 53834241 55012301
5652E5012301J592753J467514J805205J558992J953057J626374J796870K008803
$$ 55012301 56605054 58072568 59877773 61436765 63389822 65016196 66813066 68821869
5644F8821869K073763K024253K589953K625744K916766L154315L629159M008216
$$ 68821869 70895632 72919885 75509838 78135582 81052348 84206663 87835822 91844038
5636I1844038M607040M558952N297729N522109O267584O966759Q286222R778469
$$ 91844038 96451078 101010030 106307759 111829868 118097452 125064211 133350433 143128902
5628A43128902J1999323J3643163J7682536K5064286L9276862M4641814P042751
$$ 143128902 155128225 168771388 186453924 211518210 250795072 295436886 302479637
5621C02479637o5000087j15200893j13258471r8049525p8279952l3189588o271552
$$ 302479637 237479550 122278657 9020186 -89029339 -167309291 -200498879 -206770431
5614b06770431N901513J1770167J8021656J9809325K0146321J6039830J2634861
$$ -206770431 -200868918 -189098751 -171077095 -151267770 -131121449 -115081619 -102446758
5607a02446758J1318332J0610888Q890896P585739O294872N181988M441367M399613
$$ -102446758 -91128426 -80517538 -71626642 -64040903 -57746031 -52564043 -48122676 -43723063
5599d3723063M063280M178290M071080M350188M119454M129027M096215M089075
$$ -43723063 -39659783 -35481493 -31410413 -27060225 -22940771 -18811744 -14715529 -10626454
5591a0626454L747113L925015L823619L659871K854924K697319J884598J779161
$$ -10626454 -6879341 -2954326 869293 4529164 7384088 10081407 11966005 13745166
5583A3745166J739235K665232L079650L160152K885544J732118K2482J15016J093678
$$ 13745166 15484401 18149633 21229283 24389435 27274979 29007097 29029579 29144595 30238273
5574C0238273L457269O360208Q661067N953258m618930j9641035l0488961l3030955
$$ 30238273 33695542 40055750 48716817 54670075 50051145 30410110 -78851 -33109806
5566c3109806l0888776k3943769j4355030o280677j148161J572304L352795L645680
$$ -33109806 -63998582 -87942351 -102297381 -108578058 -109726219 -108153915 -104801120 -101155440
5558a01155440L152182J654481r0938o71227j099085p37389K04464P86573K068192
$$ -101155440 -98003258 -96348777 -96439715 -97110942 -98210027 -98947416 -98742952 -97956379 -95888187
5549i5888187K495102L213704L265909L472607L614385L104750L016725K449331
$$ -95888187 -93393085 -90179381 -86913472 -83440865 -79826480 -76721730 -73705005 -71255674
5541g1255674K009070J759946Q71705N48434L4069q36246j593079j944282k147716
$$ -71255674 -69246604 -67486658 -66614953 -66066519 -66032450 -66868696 -68461775 -70406057 -72553773
5532g2553773j571676q57517j91296N50725J024240O92975J579124J498840J281043
$$ -72553773 -74125449 -74982966 -75174262 -74623537 -73599297 -72906322 -71327198 -69828358 -68547315
5523f8547315J653469J266828J532395J231746J275271J257138J246151J032182
$$ -68547315 -66893846 -65627018 -64094623 -62862877 -61587606 -60330468 -59084317 -58052135
5515e8052135J153765J124443J060003R97295J254346N30501O59368P19259P65648
$$ -58052135 -56898370 -55773927 -54713924 -53716629 -52462283 -51931782 -51272414 -50553155 -49787507
5506d9787507L14269O70661L70591O55406L99504R06898O82933M19466N62594
$$ -49787507 -49473238 -48802577 -48431986 -47776580 -47377076 -46470178 -45787245 -45367779 -44805185
5497d4805185R81210N30754N37070P59975O21020M51297P11610O03921M47760
$$ -44805185 -43823975 -43293221 -42756151 -41996176 -41375156 -40923859 -40212249 -39608328 -39160568
5488c9160568O20834O80224M03356R05974K82684P70661J97670L16980O29869
$$ -39160568 -38539734 -37859510 -37456154 -36550180 -36267496 -35496835 -35299165 -34982185 -34352316
5479c4352316R579L60428J89184L33199J31609J25654K74583L32748O79775K46022
$$ -34352316 -34342737 -33982309 -33793125 -33459926 -33328317 -33202663 -32928080 -32595332 -31915557 -31669535
5469c1669535L51478M46519O98691M08749M68230N96628R8547P44029j36723L17882
$$ -31669535 -31318057 -30871538 -30172847 -29764098 -29295868 -28699240 -28600693 -27856664 -27993387 -27675505
5459b7675505L24368K47211N51474J61469J29250O4057L51785K94287J13212L23196
$$ -27675505 -27351137 -27103926 -26552452 -26390983 -26261733 -26197676 -25845891 -25551604 -25438392 -25115196
5449b5115196L36803N60476L55863L82231Q41124K59176N39680N08487L43635
$$ -25115196 -24778393 -24217917 -23862054 -23479823 -22638699 -22379523 -21839843 -21331356 -20987721
5440b0987721M65748m2359J65816k08947k85479j69205m67707k39798n86908j55534
$$ -20987721 -20521973 -20564332 -20398516 -20607463 -20892942 -21062147 -21529854 -21769652 -22356560 -22512094
5430b2512094n1643J13366M46771L74692M82945N16641J110648R77868J083822
$$ -22512094 -22563737 -22450371 -22003600 -21628908 -21145963 -20629322 -19518674 -18540806 -17456984
5421a7456984J097844J201222J244451N22222k60258p48625j626603k145894j954245
$$ -17456984 -16359140 -15157918 -13913467 -13391245 -13651503 -14400128 -16026731 -18172625 -20126870
5412b0126870j624339j089217j73312J22610N55491J004424J131723P79457J126255
$$ -20126870 -21751209 -22840426 -23013738 -22891128 -22335637 -21331213 -20199490 -19420033 -18293778
5403a8293778L19007J44572o47572j565315j971387k644015l334750l539818k960606
$$ -18293778 -17974771 -17830199 -18477771 -20043086 -22014473 -24658488 -27993238 -31533056 -34493662
5394c4493662k957988k011519j543537q26449l43471q374L1076M49191P24931
$$ -34493662 -37451650 -39463169 -41006706 -41833155 -42176626 -42185000 -42153924 -41704733 -40979802
5385d0979802P63641M91075R99267O50036O76229O20012Q39887N31055P06575
$$ -40979802 -40216161 -39725086 -38725819 -38075783 -37399554 -36779542 -35939655 -35408600 -34702025
5376c4702025N28439M10197N88013N15901L13237Q31573J47003K80016M94392
$$ -34702025 -34173586 -33763389 -33175376 -32659475 -32346238 -31514665 -31367662 -31087646 -30593254
5367c0593254L87871O22073J20803O44287O2880N74725K06154M12466M53433J19285
$$ -30593254 -30205383 -29583310 -29462507 -28818220 -28755340 -28180615 -27974461 -27561995 -27108562 -26989277
5357b6989277L81188M20473L74906K88893J69907L93435L30781M22838L32660
$$ -26989277 -26608089 -26187616 -25812710 -25523817 -25353910 -24960475 -24629694 -24206856 -23874196
5348b3874196K50817L55136L79999K0039m20874n12343j17284k01290M8601j3167
$$ -23874196 -23623379 -23268243 -22888244 -22868205 -23289079 -23801422 -23918706 -24119996 -24071395 -24084562
5338b4084562L97254J25518L87227K55927K68980K81061K46352L17993P3118J94087
$$ -24084562 -23687308 -23561790 -23174563 -22918636 -22649656 -22368595 -22122243 -21804250 -21731132 -21537045
5328b1537045J81981J22463L61298L29153p54K93761K86730J69288K21315L43630
$$ -21537045 -21355064 -21232601 -20871303 -20542150 -20542904 -20249143 -19962413 -19793125 -19571810 -19228180
5318a9228180o0491J15238L60383l335K1809L97397P1003M42949L821K78090L2557
$$ -19228180 -19288671 -19173433 -18813050 -18816385 -18794576 -18397179 -18326176 -17883227 -17879406 -17601316 -17568759
5307a7568759K97043K81020j42894M39697o9858K44353L04730L5656L26798J46178
$$ -17568759 -17271716 -16990696 -17133590 -16693893 -16763751 -16519398 -16214668 -16179012 -15852214 -15706036
5297a5706036L38457J85911N2603K71290K93137R6061L97219L62847J00841Q881
$$ -15706036 -15367579 -15181668 -15129065 -14857775 -14564638 -14468577 -14071358 -13708511 -13607670 -13598789
5287a3598789p285n18242k36985n04589j04481l11640R9466J05260J27115M24102
$$ -13598789 -13606074 -14124316 -14361301 -14865890 -14970371 -15282011 -15182545 -15077285 -14950170 -14526068
5277a4526068J70411L08989J42512J6114M11585L31711J13012K45701J46644J70198
$$ -14526068 -14355657 -14046668 -13904156 -13888042 -13476457 -13144746 -13031734 -12786033 -12639389 -12469191
5267a2469191r5498K33122K86190K41473R6247K21892K45225K88108J55531K09389
$$ -12469191 -12564689 -12331567 -12045377 -11803904 -11707657 -11485765 -11240540 -10952432 -10796901 -10587512
5257a0587512o479L85533J62806M09469L53650J984N05690L00492K29734M0691
$$ -10587512 -10593991 -10208458 -10045652 -9636183 -9282533 -9280549 -8774859 -8474367 -8244633 -8203942
5247h203942M26858L04655O08187J87591Q0033N25237K27055M35761N05210M54577
$$ -8203942 -7777084 -7472429 -6864242 -6676651 -6596618 -6071381 -5844326 -5408565 -4903355 -4448778
5237d448778J19349O4495L77397l8356K13134K9047M22070L24529P58284K41209
$$ -4448778 -4329429 -4264934 -3887537 -3925893 -3712759 -3683712 -3261642 -2937113 -2178829 -1937620
5227a937620O33084P62159Q95467N08237Q97847M43690J212640O19127P96768
$$ -1937620 -1304536 -542377 353090 861327 1759174 2202864 3415504 4034631 4831399
5218D831399R90084M78664O13874N79157O35549J130572R51164J305979J614577
$$ 4831399 5821483 6300147 6914021 7493178 8128727 9259299 10210463 11516442 13131019
5209A3131019J462216K262457K566290K629196L625608M276192M871056M633966
$$ 13131019 14593235 16855692 19421982 22051178 25676786 29952978 34824034 39458000
5201C9458000K596214k985932j0690781j7128079k0408177j9671569j5833739
$$ 39458000 42054214 39068282 28377501 11249422 -9158755 -28830324 -44664063
5194d4664063j1242394o540964k574436J40254J791828K761657L401388L133346
$$ -44664063 -55906457 -62447421 -65021857 -64881603 -63089775 -60328118 -56926730 -53793384
5186e3793384L293573K946943K901944K588734K766730K143376K072674J717266
$$ -53793384 -50499811 -47552868 -44650924 -42062190 -39295460 -37152084 -35079410 -33362144
5178c3362144R81489q615j419817j473683j621740j241691j108725k75048L37489
$$ -33362144 -32380655 -32389270 -33809087 -35282770 -36904510 -38146201 -39254926 -39529974 -39192485
5169c9192485N51940Q60418J084926P73920Q95658Q13390R45880P58282N75160
$$ -39192485 -38640545 -37780127 -36695201 -35921281 -35025623 -34212233 -33266353 -32508071 -31932911
5160c1932911P14235O66649M91820N61312N32675M33214M05222L05307K9470J34148
$$ -31932911 -31218676 -30552027 -30060207 -29498895 -28966220 -28533006 -28127784 -27822477 -27793007 -27658859
5150b7658859j99209P9987o4341k6390K35227K59630K29896M21585O5309N11023
$$ -27658859 -27858068 -27778081 -27842422 -27868812 -27633585 -27373955 -27144059 -26722474 -26657165 -26146142
5140b6146142L48058M57229L26938M75631K09781L85958O2243j33749m21512m62973
$$ -26146142 -25798084 -25340855 -25013917 -24538286 -24328505 -23942547 -23880304 -24014053 -24435565 -24898538
5130b4898538l96733k02498l68978R5619k3744K34341J35314J80074J63064M65153
$$ -24898538 -25295271 -25497769 -25866747 -25771128 -25794872 -25560531 -25425217 -25245143 -25082079 -24616926
5120b4616926J56929K21249Q6170L06416K68289L23999R0547L05025R8865J83819
$$ -24616926 -24459997 -24238748 -24152578 -23846162 -23577873 -23253874 -23163327 -22858302 -22759437 -22575618
5110b2575618L98582R4854J09885J04067m250K86569M47731k38096K41365K05677
$$ -22575618 -22177036 -22082182 -21972297 -21868230 -21872480 -21585911 -21138180 -21376276 -21134911 -20929234
5100b0929234J22554M41672J0029J23034L57643J49983n5421L67427J0510J81053
$$ -20929234 -20806680 -20365008 -20354979 -20231945 -19874302 -19724319 -19779740 -19412313 -19401803 -19220750
5090a9220750J08630K39459J21895K48862L0286J92617L11549J24639J72263J23068
$$ -19220750 -19112120 -18872661 -18750766 -18501904 -18471618 -18279001 -17967452 -17842813 -17670550 -17547482
5080a7547482K6536K12949L19738P7960L76594j08055M05869K19451J83420K20395
$$ -17547482 -17520946 -17307997 -16988259 -16910299 -16533705 -16641760 -16235891 -16016440 -15833020 -15612625
5070a5612625L71495L23856N49244L77235L80434K02216N56907O85527N07045
$$ -15612625 -15241130 -14917274 -14368030 -13990795 -13610361 -13408145 -12851238 -12165711 -11658666
5061a1658666O96366J100585J007549J611890J541648K38733j098077l133282
$$ -11658666 -10962300 -9861715 -8854166 -7242276 -5700628 -5461895 -6559972 -9693254
5053i693254m155115m922811m658990l276506j887887r55041j5474L55298J110409
$$ -9693254 -13848369 -18771180 -23430170 -26706676 -28594563 -29549604 -29565078 -29209780 -28099371
5044b8099371O21329R72430O22218R33658N63803M72628N50606M44582M50095
$$ -28099371 -27478042 -26505612 -25883394 -24949736 -24385933 -23913305 -23362699 -22918117 -22468022
5035b2468022J94691L15932J63995M68212J43356J29331L53463L24605R0480L9162
$$ -22468022 -22273331 -21957399 -21793404 -21325192 -21181836 -21052505 -20699042 -20374437 -20283957 -20244795
5025b0244795L66034J14868j5281K95654j27012M52770J61050p1936p0314K49366
$$ -20244795 -19878761 -19763893 -19779174 -19483520 -19610532 -19157762 -18996712 -19068648 -19138962 -18889596
5015a8889596K12290N0814j13353J82307P1736J39495j5305K90188N2497R439
$$ -18889596 -18677306 -18626492 -18739845 -18557538 -18485802 -18346307 -18361612 -18071424 -18018927 -18009488
5005a8009488J54248P8001j40404J88493R9217q7814J87871L30804k89717J86547
$$ -18009488 -17855240 -17777239 -17917643 -17729150 -17629933 -17717747 -17529876 -17199072 -17488789 -17302242
4995a7302242K05729Q5011L1982l651J81516j32950J92479N351J06819k6874o6496
$$ -17302242 -17096513 -17011502 -16979520 -16983171 -16801655 -16934605 -16742126 -16736775 -16629956 -16656830 -16723326
4984a6723326J47336q0436K35191J94335J9979R8702o456K9826q1677J44509K09394
$$ -16723326 -16575990 -16656426 -16421235 -16226900 -16206921 -16108219 -16114675 -16084849 -16166526 -16022017 -15812623
4973a5812623k38316K06195J54802j42190K95036l37054N0643R7718J04199M5780
$$ -15812623 -16050939 -15844744 -15689942 -15832132 -15537096 -15874150 -15823507 -15725789 -15621590 -15575810
4963a5575810L68941j24983M5110k898K64688m5950K23089k41411j2616N4959
$$ -15575810 -15206869 -15331852 -15286742 -15289640 -15024952 -15070902 -14847813 -15089224 -15101840 -15046881
4953a5046881L0121M6653J09794m6525r3408L36022j81992K05057Q2518o6594
$$ -15046881 -15016760 -14970107 -14860313 -14906838 -15000246 -14664224 -14846216 -14641159 -14558641 -14625235
4943a4625235J23714j55l4299Q7364j7838j0528J60321J90737j71718J78979o7288
$$ -14625235 -14501521 -14501676 -14535975 -14448611 -14466449 -14476977 -14316656 -14125919 -14297637 -14118658 -14185946
4932a4185946J64757n7348M3515k44521m8714q3959K731P3067K3372j35419J09936
$$ -14185946 -14021189 -14078537 -14035022 -14279543 -14328257 -14412216 -14409485 -14336418 -14313046 -14448465 -14338529
4921a4338529l6978n15J82808J33153J74029p3064r7652K02714P2722j26537J41215
$$ -14338529 -14375507 -14376022 -14193214 -14060061 -13886032 -13959096 -14056748 -13854034 -13781312 -13907849 -13766634
4910a3766634j02393K63311q1020Q9258r724J6297J22118k00211J16407Q083M6118
$$ -13766634 -13869027 -13605716 -13686736 -13597478 -13607202 -13590905 -13468787 -13668998 -13552591 -13544508 -13498390
4899a3498390J57442j32401R9112j4284K38140q0628p3847M4491R1124q4332p0970
$$ -13498390 -13340948 -13473349 -13374237 -13388521 -13150381 -13231009 -13304856 -13260365 -13169241 -13253573 -13324543
4888a3324543J95950J64294k29187J25618K02169j26670J11067O9155l9590o0372
$$ -13324543 -13128593 -12964299 -13193486 -13067868 -12865699 -12992369 -12881302 -12812147 -12851737 -12912109
4878a2912109n497n3419R8747J22188N8173r4197J48615j45879J34366N8961L9571
$$ -12912109 -12917606 -12971025 -12872278 -12750090 -12691917 -12786114 -12637499 -12783378 -12649012 -12590051 -12550480
4867a2550480K42694j97764j06759K29859L6385j01861K31289k23522J79250M3876
$$ -12550480 -12307786 -12505550 -12612309 -12382450 -12346065 -12447926 -12216637 -12440159 -12260909 -12217033
4857a2217033j17731L0222P0081L0003m9027R6809j6293J81206q6761j38389P2151
$$ -12217033 -12334764 -12304542 -12234461 -12204458 -12253485 -12156676 -12172969 -11991763 -12078524 -12216913 -12144762
4846a2144762J29140J10485o992j2371J1406J30998q9923L591q859K04268k94331
$$ -12144762 -12015622 -11905137 -11912129 -11924500 -11913094 -11782096 -11872019 -11868428 -11877287 -11673019 -11967350
4835a1967350K03463M6195k1194K22629k19493J0843l7305L63803k56575o2615
$$ -11967350 -11763887 -11717692 -11738886 -11516257 -11735750 -11724907 -11762212 -11398409 -11654984 -11717599
4825a1717599K23769j02062m631Q8678Q8810J03338Q7660l22280J60251J08432
$$ -11717599 -11493830 -11595892 -11600523 -11511845 -11423035 -11319697 -11232037 -11554317 -11394066 -11285634
4815a1285634n9892j56006R2953m9169P8283J23663l3408K4359P7070m7981J1601
$$ -11285634 -11345526 -11501532 -11408579 -11457748 -11379465 -11255802 -11289210 -11264851 -11187781 -11235762 -11224161
4804a1224161N347K27737j76942J59379j87511K39111j16558q2594K447N2190
$$ -11224161 -11218814 -10991077 -11168019 -11008640 -11196151 -10957040 -11073598 -11156192 -11153745 -11101555
4794a1101555N1424M8247P983j41796J68511k64599J41001J35639n3146o4342
$$ -11101555 -11050131 -11001884 -10993901 -11135697 -10967186 -11231785 -11090784 -10955145 -11008291 -11072633
4784a1072633L17210j96833O9145N8906j3292M9698j20552r161L6747J65484o8109
$$ -11072633 -10755423 -10952256 -10883111 -10824205 -10837497 -10787799 -10908351 -10917512 -10880765 -10715281 -10783390
4773a0783390K57433m6426q1215K1063Q6772k15966M18728j37919O1593j5604
$$ -10783390 -10525957 -10572383 -10653598 -10632535 -10545763 -10761729 -10343001 -10480920 -10419327 -10434931
4763a0434931O39j16641Q1799l3070k45602J36656K19103K10066k10453n5139
$$ -10434931 -10434292 -10550933 -10469134 -10502204 -10747806 -10611150 -10392047 -10181981 -10392434 -10447573
4753a0447573K41349k1688J08079j53413Q3555R7543J01775k22326m3080O3822
$$ -10447573 -10206224 -10227912 -10119833 -10273246 -10189691 -10092148 -9990373 -10212699 -10255779 -10191957
4743a0191957j07373K49574k89989K54048L8301K0639M9289J37087j58492J02585
$$ -10191957 -10299330 -10049756 -10339745 -10085697 -10047396 -10026757 -9977468 -9840381 -9998873 -9896288
4733i896288q0731O6658j4546K01544J4442j79058M5712p4500J90481j37069J77332
$$ -9896288 -9977019 -9910361 -9924907 -9723363 -9708921 -9887979 -9842267 -9916767 -9726286 -9863355 -9686023
4722i686023j83779J08829k26195O9712J39793O9107K30229l01566K36689q4107
$$ -9686023 -9869802 -9760973 -9987168 -9917456 -9777663 -9708556 -9478327 -9779893 -9543204 -9627311
4712i627311P7567J37747l49174J16337Q6119O2650P095O9242r3178k977K60203
$$ -9627311 -9549744 -9411997 -9761171 -9644834 -9558715 -9496065 -9488970 -9419728 -9512906 -9515883 -9255680
4701i255680j05984p0287J23438j82306K23054j85928J8298L5486J28865o4761
$$ -9255680 -9361664 -9431951 -9308513 -9490819 -9267765 -9453693 -9435395 -9399909 -9271044 -9335805
4691i335805J3247L0396O4668o1749M8255M7392k10408J84924o69L720j473o4472
$$ -9335805 -9322558 -9292162 -9227494 -9289243 -9240988 -9193596 -9404004 -9219080 -9219749 -9216029 -9217502 -9281974
4679i281974N2120k1507J20000l2522L5035j06444K23524K8811j32414K72395
$$ -9281974 -9229854 -9251361 -9131361 -9163883 -9128848 -9235292 -9011768 -8982957 -9115371 -8842976
4669h842976k29930p7488k8029K24973m1535J85659j75012p4614K28905K5490
$$ -8842976 -9072906 -9150394 -9178423 -8953450 -8994985 -8809326 -8984338 -9058952 -8830047 -8804557
4659h804557r1401P3164l6527l1563J02401o88j39766K43969k17960o0808K23823
$$ -8804557 -8895958 -8822794 -8859321 -8890884 -8788483 -8789171 -8928937 -8684968 -8902928 -8963736 -8739913
4648h739913m21736M19882j93837K3501Q9025J49997J61251k04554J28095j74460
$$ -8739913 -9161649 -8741767 -8935604 -8912103 -8823078 -8673081 -8511830 -8716384 -8588289 -8762749
4638h762749K93078R223l04324K22257r396j56286j50736K41775R6629j82766
$$ -8762749 -8469671 -8460448 -8764772 -8542515 -8551911 -8708197 -8858933 -8617158 -8520529 -8703295
4628h703295J71265j16450M3688P0580J67121r5427J66648j27162M8534n6486
$$ -8703295 -8532030 -8648480 -8604792 -8534212 -8367091 -8462518 -8295870 -8423032 -8374498 -8430984
4618h430984J71450q0629m9665K35588k48193J28117p5971k444N9406R2559j31190
$$ -8430984 -8259534 -8340163 -8389828 -8154240 -8402433 -8274316 -8350287 -8352731 -8293325 -8200766 -8331956
4607h331956Q7202L5771K348q5252P3766j51834K70534l6298J01003j50489R4211
$$ -8331956 -8244754 -8208983 -8206635 -8291887 -8218121 -8369955 -8099421 -8135719 -8034716 -8185205 -8090994
4596h090994J2885r1804J57199k00956J05617l01647L44050p4952J16620j43109
$$ -8090994 -8078109 -8169913 -8012714 -8213670 -8108053 -8409700 -8065650 -8140602 -8023982 -8167091
4586h167091J29320K3440o9789o3279J98786j27125k6122J42250Q8688P5338r3910
$$ -8167091 -8037771 -8014331 -8084120 -8147399 -7948613 -8075738 -8101860 -7959610 -7870922 -7795584 -7889494
4575g889494j60856K35546k0045l9641m0799j4761L0615o5798J67374q2683N7159
$$ -7889494 -8050350 -7814804 -7834849 -7874490 -7915289 -7930050 -7899435 -7965233 -7797859 -7880542 -7823383
4564g823383n7559M2768j2595n8847J66363p6663q81j15052J8746k0201L36870
$$ -7823383 -7880942 -7838174 -7850769 -7909616 -7743253 -7819916 -7820797 -7935849 -7917103 -7937304 -7600434
4553g600434l64470K21564j13490J19240N9668r8747q2487J73909l6010K19054
$$ -7600434 -7964904 -7743340 -7856830 -7737590 -7677922 -7776669 -7859156 -7685247 -7721257 -7502203
4543g502203l54292K41068o5353L8529J09866K9918J9792J33571K6045j78496
$$ -7502203 -7856495 -7615427 -7680780 -7642251 -7532385 -7502467 -7482675 -7349104 -7323059 -7501555
4533g501555j20420L97750j31981n1167k5274O0125N5419j53880j07463L07202
$$ -7501555 -7621975 -7224225 -7356206 -7407373 -7432647 -7372522 -7317103 -7470983 -7578446 -7271244
4523g271244N102j32091J27325l9520j12251K36259m1659P8012m0302K14745j89489
$$ -7271244 -7266142 -7398233 -7270908 -7310428 -7422679 -7186420 -7228079 -7150067 -7190369 -6975624 -7165113
4512g165113K71085k18153j45098n6931L02612k2480J82103j81964Q8110l8667
$$ -7165113 -6894028 -7112181 -7257279 -7314210 -7011598 -7034078 -6851975 -7033939 -6945829 -6984496
4502f984496K47824j85763N4497P021K5120K75866j43547j49797Q6343j54919
$$ -6984496 -6736672 -6922435 -6867938 -6860917 -6835797 -6559931 -6703478 -6853275 -6766932 -6921851
4492f921851J48665r0279M316M6225R2340L4698K98733k05353n0723J89085Q6142
$$ -6921851 -6773186 -6863465 -6859149 -6812924 -6720584 -6685886 -6387153 -6592506 -6643229 -6454144 -6368002
4481f368002m8918Q3812J26764j59279j50246l5425O9767K02464j04512J8694
$$ -6368002 -6416920 -6333108 -6206344 -6365623 -6515869 -6551294 -6481527 -6279063 -6383575 -6364881
4471f364881J93961J8730k22632K15575J32122j07884r9010J4988R1592k4753
$$ -6364881 -6170920 -6152190 -6374822 -6159247 -6027125 -6135009 -6234019 -6219031 -6127439 -6152192
4461f152192J42382k13194R0909K22312j26048J66264m5585k1010K16982o8930
$$ -6152192 -6009810 -6223004 -6132095 -5909783 -6035831 -5869567 -5915152 -5936162 -5719180 -5788110
4451e788110l0395j39254J87911n7705l4141J23627l6619J53436j42085K10007
$$ -5788110 -5818505 -5957759 -5769848 -5827553 -5861694 -5738067 -5774686 -5621250 -5763335 -5553328
4441e553328j62017K49021j24382N009k09691n443K00089R0309l93719L72112
$$ -5553328 -5715345 -5466324 -5590706 -5585697 -5795388 -5800831 -5600742 -5510433 -5904152 -5532040
4431e532040J34617k7746o0498O4246j8322k2350J66463r867n8071J64316J10012
$$ -5532040 -5397423 -5425169 -5485667 -5421421 -5439743 -5462093 -5295630 -5305497 -5363568 -5199252 -5089240
4420e089240j31795J89714n3413M8969L18136P2714J35213l29836K29558k47163
$$ -5089240 -5221035 -5031321 -5084734 -5035765 -4717629 -4644915 -4509702 -4839538 -4609980 -4857143
4410d857143l47936J35667o2497l03282J11958K53598k4685O7313J86643j6621
$$ -4857143 -5205079 -5069412 -5131909 -5435191 -5323233 -5069635 -5094320 -5027007 -4840364 -4856985
4400d856985J92243p9609K43766n8507Q3980K03140O784J82996j25667K06613
$$ -4856985 -4664742 -4744351 -4500585 -4559092 -4475112 -4271972 -4265188 -4082192 -4207859 -4001246
4390d001246k8619j56935l1040J49931l3834K42686j2729q5262M8119j7066J33097
$$ -4001246 -4029865 -4186800 -4217840 -4067909 -4101743 -3859057 -3871786 -3957048 -3908929 -3925995 -3792898
4379c792898o4260O5094L0272O730K70859j04952J96062m1250L46198P1670R1230
$$ -3792898 -3857158 -3792064 -3761792 -3755062 -3484203 -3589155 -3393093 -3434343 -3088145 -3016475 -2925245
4368b925245J47375J80448j86147L09769J74447n7108J26173q6362J3765o9192
$$ -2925245 -2777870 -2597422 -2783569 -2473800 -2299353 -2356461 -2230288 -2316650 -2302885 -2372077
4358b372077j1551K06613K77174j70792K76938m5212K99795K96795p3739L37269
$$ -2372077 -2383628 -2177015 -1899841 -2070633 -1793695 -1838907 -1539112 -1242317 -1316056 -978787
4348i78787J71689K12540J05617N06152J03652L48330K88945R3923L70802N35294
$$ -978787 -807098 -594558 -488941 17211 120863 469193 758138 852061 1222863 1758157
4338A758157K70325M35504K32702N81075O91597N53113N21945R32232N65185O76024
$$ 1758157 2028482 2463986 2696688 3277763 3969360 4522473 5044418 5976650 6541835 7217859
4328G217859Q54450J147772Q53764J414448K186451K960303M105671L525408K53422
$$ 7217859 8072309 9220081 10073845 11488293 13674744 16635047 20740718 24266126 24519548
4319B4519548o171568j1268865j3057333j2184277r185492n841692k222000l00081
$$ 24519548 18347980 7079115 -5978218 -18162495 -27347987 -33189679 -35411679 -35711760
4311c5711760Q87740J156737K210176J994581J605402J585365J466912J252860
$$ -35711760 -34824020 -33667283 -31457107 -29462526 -27857124 -26271759 -24804847 -23551987
4303b3551987R12565J065045Q98260O93476M70042N74126O92928L96386M25122
$$ -23551987 -22639422 -21574377 -20676117 -19982641 -19512599 -18938473 -18245545 -17849159 -17424037
4294a7424037M93375K99460O00779M6408L02422K41460L32636K0001L31937L28854
$$ -17424037 -16930662 -16631202 -16030423 -15984015 -15681593 -15440133 -15107497 -15087496 -14755559 -14426705
4284a4426705J1266L14727J30045J86615k9597L43133J57078L76k77627J53566
$$ -14426705 -14415439 -14100712 -13970667 -13784052 -13813649 -13470516 -13313438 -13313062 -13590689 -13437123
4274a3437123L33941K03444K25990k0764J87267N9408J40138j74861L72902n234
$$ -13437123 -13103182 -12899738 -12673748 -12694512 -12507245 -12447837 -12307699 -12482560 -12109658 -12114892
4264a2114892M12314j28566J03797K1210m4105N3714J64438m0651K68155j95828
$$ -12114892 -11702578 -11831144 -11727347 -11706137 -11750242 -11696528 -11532090 -11572741 -11304586 -11500414
4254a1500414J79272R8395q287J01239M6794O1543L4004Q5891j3183P5795L7449
$$ -11500414 -11321142 -11222747 -11231034 -11129795 -11083001 -11021458 -10987454 -10901563 -10914746 -10838951 -10801502
4243a0801502N6231J20432K2771K03987R385N6297j33557J61298r39R8918o8679
$$ -10801502 -10745271 -10624839 -10602068 -10398081 -10388696 -10332399 -10465956 -10304658 -10305597 -10206679 -10275358
4232a0275358J66509Q1689n1300l2928J26489O0267j83420K54618R0277j50619
$$ -10275358 -10108849 -10027160 -10078460 -10111388 -9984899 -9924632 -10108052 -9853434 -9763157 -9913776
4222i913776j5309K23922J28664j58947K70876l17423J53804j39701J35002O4331
$$ -9913776 -9929085 -9705163 -9576499 -9735446 -9464570 -9781993 -9628189 -9767890 -9632888 -9568557
4212i568557J22321j10686R1224J4970J38405K7549J29286N6397q3464p4497l1253
$$ -9568557 -9446236 -9556922 -9465698 -9450728 -9312323 -9284774 -9155488 -9099091 -9182555 -9257052 -9288305
4201i288305L5503J1729J72783J1601m7148M7542j26410K62446r8729K689j0543
$$ -9288305 -9252802 -9241073 -9068290 -9056689 -9103837 -9056295 -9182705 -8920259 -9018988 -9016299 -9026842
4190i026842o20K42991j27732N2905M829L220K19152K4905j10330j05108j0227
$$ -9026842 -9027462 -8784471 -8912203 -8859298 -8854469 -8851249 -8632097 -8607192 -8717522 -8822630 -8832857
4179h832857J57099n6395j7010J69374j31359K23976k91666J59877L3412J23611
$$ -8832857 -8675758 -8732153 -8749163 -8579789 -8711148 -8487172 -8778838 -8618961 -8585549 -8461938
4169h461938p4891K9873K01799k02376M5290J65798J5902j63913J32678R4634
$$ -8461938 -8536829 -8506956 -8305157 -8507533 -8462243 -8296445 -8280543 -8444456 -8311778 -8217144
4159h217144M7499q8078j69252J68511J26281j7194l338q4134M9353J23238j95132
$$ -8217144 -8169645 -8257723 -8426975 -8258464 -8132183 -8149377 -8152715 -8236849 -8187496 -8064258 -8259390
4148h259390K72729l43685J09103k7235P6677K31142j07745j8650n1447K48554
$$ -8259390 -7986661 -8330346 -8221243 -8248478 -8171801 -7940659 -8048404 -8067054 -8118501 -7869947
4138g869947J13239j33626r0961l6069K11203m1354j97074P0665J53160P7180
$$ -7869947 -7756708 -7890334 -7981295 -8017364 -7806161 -7847515 -8044589 -7973924 -7820764 -7743584
4128g743584o6553J11402k18375K21230k36349J03487J826J65297N8478j29994
$$ -7743584 -7810137 -7698735 -7917110 -7695880 -7932229 -7828742 -7826916 -7661619 -7603141 -7733135
4118g733135l2214r1266j035K68784K1712O9033o7766j45483L57709j91477o9594
$$ -7733135 -7765349 -7856615 -7857650 -7588866 -7567154 -7498121 -7565887 -7711370 -7353661 -7545138 -7614732
4107g614732q6057R5629J47609j38241K62954l24720K12626p7388J22482l734
$$ -7614732 -7700789 -7605160 -7457551 -7595792 -7332838 -7657558 -7444932 -7522320 -7399838 -7403572
4097g403572L451j05122J26101o1922K0860Q7593O4711m9432p8716k573j3785
$$ -7403572 -7400121 -7505243 -7379142 -7441064 -7420204 -7332611 -7267900 -7317332 -7396048 -7398621 -7412406
4086g412406J14016M2702k556j49486J77920n0028M4733K17892j14849q7115P5671
$$ -7412406 -7298390 -7255688 -7258244 -7407730 -7229810 -7279838 -7235105 -7017213 -7132062 -7219177 -7143506
4075g143506j22387J62290j0273j48302J92353j39941N0370m156J47101l74260
$$ -7143506 -7265893 -7103603 -7113876 -7262178 -7069825 -7209766 -7159396 -7163552 -7016451 -7390711
4065g390711K27473l9717L6544k45408M8034K17821j14176M3404L3048m0564K34390
$$ -7390711 -7163238 -7202955 -7166411 -7411819 -7363785 -7145964 -7260140 -7216736 -7183688 -7224252 -6989862
4054f989862k62347J75743j4431R4025n3985o592n8334J62340j27252l243L4995
$$ -6989862 -7252209 -7076466 -7090897 -6996872 -7050857 -7057449 -7115783 -6953443 -7080695 -7083938 -7048943
4043g048943N082j2964N5654n2901J6253k0317M1679M3807p2505J58595k83954
$$ -7048943 -7043861 -7056825 -7001171 -7054072 -7037819 -7058136 -7016457 -6972650 -7045155 -6886560 -7170514
4032g170514J08940J24994K9830j5841m824J2940q5384J48446r4566K8050k04248
$$ -7170514 -7061574 -6936580 -6906750 -6922591 -6927415 -6914475 -6999859 -6851413 -6945979 -6917929 -7122177
4021g122177J13704j663J931p0641q0153p2324o9988J18058q5858M1783M1085
$$ -7122177 -7008473 -7010136 -7008205 -7078846 -7158999 -7231323 -7301311 -7183253 -7269111 -7227328 -7186243
4010g186243m6631O9940L1476j78492J81355J76147l47370K88162r5620J48782
$$ -7186243 -7232874 -7162934 -7131458 -7309950 -7128595 -6952448 -7299818 -7011656 -7107276 -6958494
4000f958494J9404j44173n382K00555j34416Q535l5180r9413R376R4249q7447
$$ -6958494 -6939090 -7083263 -7088645 -6888090 -7022506 -7013971 -7049151 -7148564 -7139188 -7044939 -7132386
3989g132386r3951L7675m7397J7000K8810J00859r8597m4732j9454J21617J27068
$$ -7132386 -7226337 -7188662 -7236059 -7219059 -7190249 -7089390 -7187987 -7232719 -7252173 -7130556 -7003488
3978g003488k25980K17532r8181J5967J3065N7422r4811P5636j35832J41704k23685
$$ -7003488 -7229468 -7011936 -7110117 -7094150 -7081085 -7023663 -7118474 -7042838 -7178670 -7036966 -7260651
3967g260651K34452o8612K0416j12998L8791L6656J28634k2396J06616q5719K7755
$$ -7260651 -7026199 -7094811 -7074395 -7187393 -7148602 -7111946 -6983312 -7005708 -6899092 -6984811 -6957056
3956f957056J07676p9633j45098K46907j34221R755n6456K4054N7436k22638L17679
$$ -6957056 -6849380 -6929013 -7074111 -6827204 -6961425 -6951670 -7008126 -6984072 -6926636 -7149274 -6831595
3945f831595J03165p4685j51577j86964K93550J41921l06424K23503P7915r2739
$$ -6831595 -6728430 -6803115 -6954692 -7141656 -6848106 -6706185 -7012609 -6789106 -6711191 -6803930
3935f803930R3162j63228J48668j7956Q8537o4569J60391k44838J03858K4275
$$ -6803930 -6710768 -6873996 -6725328 -6743284 -6654747 -6719316 -6558925 -6803763 -6699905 -6675630
3925f675630L9110r7771J08767j09177K3945J08051L3395k35823J80571M927J1830
$$ -6675630 -6636520 -6734291 -6625524 -6734701 -6710756 -6602705 -6569310 -6805133 -6624562 -6619635 -6607805
3914f607805n0610L1098m1130K47892l79274L30131n2642m7659L1109Q737p2142
$$ -6607805 -6658415 -6627317 -6668447 -6420555 -6799829 -6469698 -6522340 -6569999 -6538890 -6530153 -6602295
3903f602295L4923Q1914q1764j02169J91001j79652J0383j18303J50327M4998
$$ -6602295 -6567372 -6485458 -6567222 -6669391 -6478390 -6658042 -6647659 -6765962 -6615635 -6570637
3893f570637R0831p6751N6151j18018J3691J58901p1473J20143q1872j53353K65376
$$ -6570637 -6479806 -6556557 -6500406 -6618424 -6604733 -6445832 -6517305 -6397162 -6479034 -6632387 -6367011
3882f367011l20211L52958k49499K10510j2605k8395R9712l5973K01758j69101
$$ -6367011 -6687222 -6334264 -6583763 -6373253 -6385858 -6414253 -6314541 -6350514 -6148756 -6317857
3872f317857N8979R0944j79071L7336j53941K27704k62640N714J86981P4512n0406
$$ -6317857 -6258878 -6167934 -6347005 -6309669 -6463610 -6235906 -6498546 -6492832 -6305851 -6231339 -6281745
3861f281745J3626j88405K64119m0274J43414q7315p5647l1767Q1819J24304j66523
$$ -6281745 -6268119 -6456524 -6192405 -6232679 -6089265 -6176580 -6252227 -6283994 -6202175 -6077871 -6244394
3850f244394O1201J28269j49570p9176j5735J15955Q3895j88916J22804N2339
$$ -6244394 -6183193 -6054924 -6204494 -6283670 -6299405 -6183450 -6099555 -6288471 -6165667 -6113328
3840f113328j55311J96792j34280l4082J42521m7674M3934M1067Q0487J5548l5286
$$ -6113328 -6268639 -6071847 -6206127 -6240209 -6097688 -6145362 -6101428 -6060361 -5979874 -5964326 -5999612
3829e999612N9709k89878L60331o6881l1298M0309n3108q7207J22926k78892K16300
$$ -5999612 -5939903 -6229781 -5869450 -5936331 -5967629 -5927320 -5980428 -6067635 -5944709 -6223601 -6007301
3818f007301r1281K3440j51411Q9836L444R7849O1427m8992j84170K62582n9733
$$ -6007301 -6098582 -6075142 -6226553 -6136717 -6133273 -6035424 -5973997 -6022989 -6207159 -5944577 -6004310
3807f004310P217q4253J02829j71632J68997j9413p6532K59855j14937J68221
$$ -6004310 -5997093 -6081346 -5978517 -6150149 -5981152 -6000565 -6077097 -5817242 -5932179 -5763958
3797e763958k58815K20998K6430j90451K6883n4397J57026k53100J98138J4950
$$ -5763958 -6022773 -5801775 -5775345 -5965796 -5938913 -5993310 -5836284 -6089384 -5891246 -5876296
3787e876296j96242J63188j90151J36143j1298L00761m4082j38073J17383q6113
$$ -5876296 -6072538 -5909350 -6099501 -5963358 -5974656 -5673895 -5717977 -5856050 -5738667 -5824780
3777e824780J50208j07739l9115Q2105n5908P5110l2010q7105m6276J43595R4979
$$ -5824780 -5674572 -5782311 -5821426 -5739321 -5795229 -5720119 -5752129 -5839234 -5885510 -5741915 -5646936
3766e646936j12669O784j62936K03485k296m8296M025l28122L49553J32881O8749
$$ -5646936 -5759605 -5752821 -5915757 -5712272 -5714568 -5762864 -5758839 -6086961 -5737408 -5604527 -5535778
3755e535778j45622l15484J59803q1965L57629J70621m18434K37306j40877j07180
$$ -5535778 -5681400 -5996884 -5837081 -5919046 -5561417 -5390796 -5809230 -5571924 -5712801 -5819981
3745e819981L29698j47219O9212k62177L13426k22469J39723J36677k66939N7995
$$ -5819981 -5490283 -5637502 -5568290 -5830467 -5517041 -5739510 -5599787 -5463110 -5730049 -5672054
3735e672054M9931j54132L29950k36615K8250J57104J36683k34448L0789K6046
$$ -5672054 -5622123 -5776255 -5446305 -5682920 -5654670 -5497566 -5360883 -5595331 -5564542 -5538496
3725e538496j4430l8965J56433j91040l5489K8638l7699P598J30384j84314L62293
$$ -5538496 -5552926 -5591891 -5435458 -5626498 -5661987 -5633349 -5671048 -5663450 -5533066 -5717380 -5355087
3714e355087l64191K86931k08825J53929j95669l777Q3839Q0704j48376R8925
$$ -5355087 -5719278 -5432347 -5641172 -5487243 -5682912 -5686689 -5602850 -5522146 -5670522 -5571597
3704e571597O741K03997j38095R2660j06926k36936K04687m0251j1339K57866
$$ -5571597 -5564856 -5360859 -5498954 -5406294 -5513220 -5750156 -5545469 -5585720 -5597059 -5339193
3694e339193k33247J68669l8169M9705k00197J29924J4838m8520J1208o3748J942
$$ -5339193 -5572440 -5403771 -5441940 -5392235 -5592432 -5462508 -5447670 -5496190 -5484982 -5548730 -5546788
3683e546788K95282l26166J6177J46054Q3686J8796K3648j04047N9532q5525j57310
$$ -5546788 -5251506 -5577672 -5561495 -5415441 -5331755 -5312959 -5289311 -5393358 -5333826 -5419351 -5576661
3672e576661N1239K85707n3864k87445J43111R5227O4091j25782J5945m9426P4612
$$ -5576661 -5525422 -5239715 -5293579 -5581024 -5437913 -5342686 -5278595 -5404377 -5388432 -5437858 -5363246
3661e363246R057j16816K45852j35182n1502K27798k16654J87190M963l8967L0604
$$ -5363246 -5354189 -5471005 -5225153 -5360335 -5411837 -5184039 -5400693 -5213503 -5208540 -5247507 -5216903
3650e216903M2686j61824J58727j27361L5811R7387q5558N5766n5590J0022n8399
$$ -5216903 -5174217 -5336041 -5177314 -5304675 -5268864 -5171477 -5257035 -5201269 -5256859 -5246837 -5305236
3639e305236J88276L7937j35630J06499j1552p7587n9963l7524R2372J34101M264
$$ -5305236 -5116960 -5079023 -5214653 -5108154 -5119706 -5197293 -5257256 -5294780 -5202408 -5068307 -5064043
3628e064043p7945k4512Q0546j14537J05193j8219p0721J92521k75710J88615
$$ -5064043 -5141988 -5166500 -5085954 -5200491 -5095298 -5113517 -5184238 -4991717 -5267427 -5078812
3618e078812k50757K11107L7745j10502Q2167K9890k07797J87326j13992J34869
$$ -5078812 -5329569 -5118462 -5080717 -5191219 -5109052 -5079162 -5286959 -5099633 -5213625 -5078756
3608e078756p5157j5148K01840j79424J37834p4056R6242n0180J33763l13856
$$ -5078756 -5153913 -5169061 -4967221 -5146645 -5008811 -5082867 -4986625 -5036805 -4903042 -5216898
3598e216898N9426n7213j09128K57185J16750J20694j48730j34457n126j97161
$$ -5216898 -5157472 -5214685 -5323813 -5066628 -4949878 -4829184 -4977914 -5112371 -5117497 -5314658
3588e314658M31364j43723J03041j87785o4898J77984j03045J03468R4030L7551
$$ -5314658 -4883294 -5027017 -4923976 -5111761 -5176659 -4998675 -5101720 -4998252 -4904222 -4866671
3578d866671j31907j08224K74673n6301j07253O4829M704K1290p5419j20688J29680
$$ -4866671 -4998578 -5106802 -4832129 -4888430 -4995683 -4930854 -4926150 -4904860 -4980279 -5100967 -4971287
3567d971287R3612n4877Q4176j20569J88457O3323j01114j46319Q8953L9564j19857
$$ -4971287 -4877675 -4932552 -4848376 -4968945 -4780488 -4717165 -4818279 -4964598 -4875645 -4836081 -4955938
3556d955938o3010J81900J1583p4791Q5175k07733M08755k77418N9614q2447J44044
$$ -4955938 -5018948 -4837048 -4825465 -4900256 -4815081 -5022814 -4614059 -4891477 -4831863 -4914310 -4770266
3545d770266j48246O5180N8732p7631n6844Q5997O2072O088o3836Q4194M2577
$$ -4770266 -4918512 -4853332 -4794600 -4872231 -4929075 -4843078 -4781006 -4774918 -4838754 -4754560 -4711983
3534d711983j81853j2970m6049K04793N7682j32522m4674J76850q1459M7844L1864
$$ -4711983 -4893836 -4906806 -4952855 -4748062 -4690380 -4822902 -4867576 -4690726 -4772185 -4724341 -4692477
3523d692477j85183R2983j34415L43527k61816J71335N1261j46654n4673J05035
$$ -4692477 -4877660 -4784677 -4919092 -4575565 -4837381 -4666046 -4614785 -4761439 -4816112 -4711077
3513d711077l9331Q2113k3503m577P7400r7669j28027J48710J13071K3326q2460
$$ -4711077 -4750408 -4668295 -4691798 -4696375 -4618975 -4716644 -4844671 -4695961 -4582890 -4559564 -4642024
3502d642024P4512m2879l18374K38004K4253J7497J46579J8436m04k35063K62837
$$ -4642024 -4567512 -4610391 -4928765 -4690761 -4666508 -4649011 -4502432 -4483996 -4484400 -4719463 -4456626
3491d456626j33268K71J293M8875l7416n9111Q2953k49999K82917K5849J45513
$$ -4456626 -4589894 -4589623 -4588330 -4539455 -4576871 -4635982 -4553029 -4803028 -4520111 -4494262 -4348749
3480d348749q3402K7581k21914l88J11545O453J14213o2089p294Q4393j11477
$$ -4348749 -4432151 -4404570 -4626484 -4626872 -4515327 -4508874 -4394661 -4456750 -4464044 -4379651 -4491128
3469d491128Q9335P8138j19057M0757K6448N957n5575J54985k39767o624m9273
$$ -4491128 -4401793 -4323655 -4442712 -4401955 -4375507 -4369550 -4425125 -4270140 -4509907 -4516531 -4565804
3458d565804J40672K10868l16385J23675l8153K14587K2783j5691j40002j28403
$$ -4565804 -4425132 -4214264 -4530649 -4406974 -4445127 -4230540 -4207757 -4223448 -4363450 -4491853
3448d491853J50573j6227N6598K71789j60432J1952K07584l37604K82514k24352
$$ -4491853 -4341280 -4357507 -4300909 -4029120 -4189552 -4177600 -3970016 -4307620 -4025106 -4249458
3438d249458R4173L4840J5263j57771n7529K90795j59064L0642J37629k24193
$$ -4249458 -4155285 -4120445 -4105182 -4262953 -4320482 -4029687 -4188751 -4158109 -4020480 -4244673
3428d244673K7802K9129R2193k2875J00006j35622P8750o0298P1283R846Q7470
$$ -4244673 -4216871 -4187742 -4095549 -4118424 -4018418 -4154040 -4075290 -4135588 -4064305 -4054459 -3966989
3417c966989j28540J46838n0664j3515J2169K0731J09624l18348L54630J76755
$$ -3966989 -4095529 -3948691 -3999355 -4012870 -4000701 -3979970 -3870346 -4188694 -3834064 -3657309
3407c657309k43294q727J9282L7629J9493J85457k04835K21143k07053M0088J36257
$$ -3657309 -3900603 -3909330 -3890048 -3852419 -3832926 -3647469 -3852304 -3631161 -3838214 -3798126 -3661869
3396c661869R31r897m9103L62329l65041J01213J38468K0954q6453m2174K76499
$$ -3661869 -3660938 -3670835 -3719938 -3357609 -3722650 -3621437 -3482969 -3462015 -3548468 -3590642 -3314143
3385c314143k272L6601k14877n4647J95219j08371J21894J40306j76244Q6720
$$ -3314143 -3316415 -3279814 -3494691 -3549338 -3354119 -3462490 -3340596 -3200290 -3376534 -3289814
3375c289814j52871O7432L4810O2890O9260J35844j62910p7902K61008j33757
$$ -3289814 -3442685 -3375253 -3340443 -3277553 -3208293 -3072449 -3235359 -3313261 -3052253 -3186010
3365c186010P7970J04666N9216J42762j48163k3758K10974J52664k0295q886K66049
$$ -3186010 -3108040 -3003374 -2944158 -2801396 -2949559 -2973317 -2762343 -2609679 -2629974 -2638860 -2372811
3354b372811k02942O7347J08286Q2929n1852J64732J56110J01147M3655R3228
$$ -2372811 -2575753 -2508406 -2400120 -2317191 -2369043 -2204311 -2048201 -1947054 -1903399 -1810171
3344a810171J23971J23602K60282J56142J29644K0249L77014L99144J99648j171
$$ -1810171 -1686200 -1562598 -1302316 -1146174 -1016530 -996281 -619267 -220123 -20475 -21646
3334b1646K32840J72589J27493P39856M9446Q14212O94954J143284J482753K418850
$$ -21646 211194 383783 511276 1251132 1300578 2114790 2809744 3953028 5435781 7854631
3324G854631J459357j283524m754684n877864n131949m315084k963247q58326
$$ 7854631 9313988 8030464 3275780 -2602084 -7734033 -12049117 -15012364 -15870690
3316a5870690K5755M70284N87422J039297J214794P76314O44325M22868L62931
$$ -15870690 -15844935 -15374651 -14787229 -13747932 -12533138 -11756824 -11112499 -10689631 -10326700
3307a0326700M13737M9318J75980N79215n0795K06122K77847K08472J61001K04080
$$ -10326700 -9912963 -9863645 -9687665 -9108450 -9159245 -8953123 -8675276 -8466804 -8305803 -8101723
3297h101723K03597k3275K71270l427K93257K0936m2085J73933J16943j03495
$$ -8101723 -7898126 -7921401 -7650131 -7653558 -7360301 -7339365 -7381450 -7207517 -7090574 -7194069
3287g194069O7741P7815n9354J67137J7887K33108L0094j93271J25044M9446J87414
$$ -7194069 -7126328 -7048513 -7107867 -6940730 -6922843 -6689735 -6659641 -6852912 -6727868 -6678422 -6491008
3276f491008J4683N0005m3644n8763K67366j62765L3679J38961j38527K16705
$$ -6491008 -6476325 -6426320 -6469964 -6528727 -6261361 -6424126 -6390447 -6251486 -6390013 -6173308
3266f173308k07548J27561l4694J55286K7284q7331Q6904K97402l47019L13827
$$ -6173308 -6380856 -6253295 -6287989 -6132703 -6105419 -6192750 -6105846 -5808444 -6155463 -5841636
3256e841636j33883n8655J32003L888P4636q9317J77871k22417J76060k7636k5890
$$ -5841636 -5975519 -6034174 -5902171 -5898283 -5823647 -5912964 -5735093 -5957510 -5781450 -5809086 -5834976
3245e834976J56062j4692j62719K03736J64729n7783q2130o1234O6636p1898o8520
$$ -5834976 -5678914 -5693606 -5856325 -5652589 -5487860 -5545643 -5627773 -5689007 -5622371 -5694269 -5762789
3234e762789J58809N4474n7776J16705l9533J27765k17823K42976j15569j92153
$$ -5762789 -5603980 -5549506 -5607282 -5490577 -5530110 -5402345 -5620168 -5377192 -5492761 -5684914
3224e684914J42041J17034N3523J43991p4586Q728r9100r393n9662J60106k5105
$$ -5684914 -5542873 -5425839 -5372316 -5228325 -5302911 -5294183 -5393283 -5402676 -5462338 -5302232 -5327337
3213e327337O388J176O1576l06535K30701j8305P6854o4981L9679O4175l288K4112
$$ -5327337 -5320949 -5319773 -5258197 -5564732 -5334031 -5352336 -5275482 -5340463 -5300784 -5236609 -5239897 -5215785
3201e215785K5965j81993K40349k30474K5569J74590M2655m3312j10745o6259
$$ -5215785 -5189820 -5371813 -5131464 -5361938 -5336369 -5161779 -5119124 -5162436 -5273181 -5339440
3191e339440J25499n4297L7171K67301k66238j08540K83985K6118r1001N5707
$$ -5339440 -5213941 -5268238 -5231067 -4963766 -5230004 -5338544 -5054559 -5028441 -5119442 -5063735
3181e063735r552o1377J23480L5391j94220j9747J52185o7523r330O848m1262
$$ -5063735 -5073287 -5134664 -5011184 -4975793 -5170013 -5189760 -5037575 -5105098 -5114428 -5107580 -5148842
3170e148842J24522o0393K7090l0625j12089K22734q0828J09448n7703J31453
$$ -5148842 -5024320 -5084713 -5057623 -5088248 -5200337 -4977603 -5058431 -4948983 -5006686 -4875233
3160d875233l52434K02184k7198L1009J29414m0145k07426K20164n352r5344J20349
$$ -4875233 -5227667 -5025483 -5052681 -5021672 -4892258 -4932403 -5139829 -4919665 -4925017 -5020361 -4900012
3149d900012Q4871M5229k34241J55843J9674j0353p5588p2515J77800j21424J42986
$$ -4900012 -4815141 -4769912 -5004153 -4848310 -4828636 -4838989 -4914577 -4987092 -4809292 -4930716 -4787730
3138d787730k0502J69555j18349r5358q0045L2843N7159k3365n935M0681o860
$$ -4787730 -4808232 -4638677 -4757026 -4852384 -4932429 -4899586 -4842427 -4865792 -4871727 -4831046 -4837906
3127d837906J83178l08748K02517j41058K59479o2587Q1395k13469J04609j14817
$$ -4837906 -4654728 -4963476 -4760959 -4902017 -4642538 -4705125 -4623730 -4837199 -4732590 -4847407
3117d847407p8027J14482R4648J74767n22491K17646k1947K06991k21267L9585
$$ -4847407 -4925434 -4810952 -4716304 -4541537 -5064028 -4846382 -4868329 -4661338 -4882605 -4843020
3107d843020L2661l4106P6243n7166R9449j38211J33137l8743P2623J18470k37094
$$ -4843020 -4810359 -4844465 -4768222 -4825388 -4725939 -4864150 -4731013 -4769756 -4697133 -4578663 -4815757
3096d815757Q0516R8005J05098R0205j43401o4411N6606p1403J3857K9080J9835
$$ -4815757 -4735241 -4637236 -4532138 -4441933 -4585334 -4649745 -4593139 -4664542 -4650685 -4621605 -4601770
3085d601770p3264p841Q6336k02261L8825J21029q484j8489Q6493O1010j38319
$$ -4601770 -4675034 -4682875 -4596539 -4798800 -4759975 -4638946 -4647430 -4665919 -4579426 -4518416 -4656735
3074d656735J18517k95217k8324K23403K9914p7651j52122J54428J83104r5921
$$ -4656735 -4538218 -4833435 -4861759 -4638356 -4608442 -4686093 -4838215 -4683787 -4500683 -4596604
3064d596604K6074j18743q9516J68816m03j67328R8654n8387K35412k56613K19276
$$ -4596604 -4570530 -4689273 -4778789 -4609973 -4610376 -4777704 -4679050 -4737437 -4502025 -4758638 -4539362
3053d539362O8122j99493K33323L6057J2239j05171j31130o7825q5726J96098
$$ -4539362 -4471240 -4670733 -4437410 -4401353 -4389114 -4494285 -4625415 -4693240 -4778966 -4582868
3043d582868j78089J71742K5813Q6281j18836Q3668j28312K47616j51591p5105
$$ -4582868 -4760957 -4589215 -4563402 -4477121 -4595957 -4512289 -4640601 -4392985 -4544576 -4619681
3033d619681J9292P5568O5548K7906P6173K1809k31981j7933J32140p6021K9856
$$ -4619681 -4600389 -4524821 -4459273 -4431367 -4355194 -4333385 -4565366 -4583299 -4451159 -4527180 -4497324
3022d497324J14224j33354j0741P5913O1373j92026J25758N6038j21560P3453
$$ -4497324 -4383100 -4516454 -4527195 -4451282 -4389909 -4581935 -4456177 -4400139 -4521699 -4448246
3012d448246r6788J00586p3218N7801Q9199p0370r1410J5065K23111k25471K3723
$$ -4448246 -4545034 -4444448 -4517666 -4459865 -4370666 -4441036 -4532446 -4517381 -4294270 -4519741 -4496018
3001d496018J70943j51713J14787r1404P2074k48591J68856J15605l3174k9692
$$ -4496018 -4325075 -4476788 -4362001 -4453405 -4381331 -4629922 -4461066 -4345461 -4378635 -4408327
2991d408327m6838J03357k08750K72035m1051j59653J30677J06616j48486K17637
$$ -4408327 -4455165 -4351808 -4560558 -4288523 -4329574 -4489227 -4358550 -4251934 -4400420 -4182783
2981d182783k77061J5798J93763l1949q9460O6527j60122J63416o7218m9640O9412
$$ -4182783 -4459844 -4444046 -4250283 -4282232 -4371692 -4305165 -4465287 -4301871 -4369089 -4418729 -4349317
2970d349317o7901J16078J53106j18512l4068k21934K08800q6778j8398O4526
$$ -4349317 -4417218 -4301140 -4148034 -4266546 -4300614 -4522548 -4313748 -4400526 -4418924 -4354398
2960d354398J15107l19684L97788j81881O3282j18750J16712O4269K5367j60841
$$ -4354398 -4239291 -4558975 -4161187 -4343068 -4279786 -4398536 -4281824 -4217555 -4192188 -4353029
2950d353029Q7604r7099J45772j35580J66887n2909J13503l05498J90677K04233
$$ -4353029 -4265425 -4362524 -4216752 -4352332 -4185445 -4238354 -4124851 -4430349 -4239672 -4035439
2940d035439m99134J7865M2314J97631j69691L51593j10258o2136J2541J71583
$$ -4035439 -4534573 -4516708 -4474394 -4276763 -4446454 -4094861 -4205119 -4267255 -4254714 -4083131
2930d083131j09445M8495j33484j66741o0J33295K8976l7135O6715j12018K49518
$$ -4083131 -4192576 -4144081 -4277565 -4444306 -4444366 -4311071 -4282095 -4319230 -4252515 -4364533 -4115015
2919d115015j66077K9365n716J22861m07193L02401j17175Q1682R8573j46054
$$ -4115015 -4281092 -4251727 -4257443 -4134582 -4541775 -4239374 -4356549 -4274867 -4176294 -4322348
2909d322348O1042J21519k45485J71723M2314M2834j77657J28362J0167J21114
$$ -4322348 -4261306 -4139787 -4385272 -4213549 -4171235 -4128401 -4306058 -4177696 -4167529 -4046415
2899d046415l00726K5896K7753P2844r1498J42047J32006j7900j58615J60093
$$ -4046415 -4347141 -4321245 -4293492 -4220648 -4312146 -4170099 -4038093 -4055993 -4214608 -4054515
2889d054515n0866n2641J68568j01337l7447r4774M7443j4431j01981K32118l9781
$$ -4054515 -4105381 -4158022 -3989454 -4090791 -4128238 -4223012 -4175569 -4190000 -4291981 -4059863 -4099644
2878d099644j59330n892J72654j25706N810J6843K97460k13495l9167O7383o321
$$ -4099644 -4258974 -4264866 -4092212 -4217918 -4212108 -4195265 -3897805 -4111300 -4150467 -4083084 -4089405
2867d089405k3054k66055L12877r5386K0816l6311N6034L1223j64274K78941j85777
$$ -4089405 -4112459 -4378514 -4065637 -4161023 -4140207 -4176518 -4120484 -4089261 -4253535 -3974594 -4160371
2856d160371O8993N4966J18504n0936j78783q333J76653j5385O8630j69316J51546
$$ -4160371 -4091378 -4036412 -3917908 -3968844 -4147627 -4155960 -3979307 -3994692 -3926062 -4095378 -3943832
$$ [...]
##END NTUPLES=NMR SPECTRUM
##END=
