##TITLE=abcd
##JCAMPDX= 6.0         $$ Bruker NMR JCAMP-DX V2.0
##DATA TYPE= NMR SPECTRUM
##DATA CLASS= NTUPLES
##ORIGIN= UXNMR, Bruker Analytische Messtechnik GmbH
##OWNER= root
$$ XWIN-NMR		Version 3.5
$$ Fri Apr 10 17:45:24 2026 Russian Standard Time (UT+4h)  servis@DPX200
##.OBSERVE FREQUENCY= 200.131235884673
##.OBSERVE NUCLEUS= ^1H
##.ACQUISITION MODE= SIMULTANEOUS
##.ACQUISITION SCHEME= undefined
##.AVERAGES= 32
##.DIGITISER RES= 18
##SPECTROMETER/DATA SYSTEM= spect
##.PULSE SEQUENCE= zg
##.SOLVENT NAME= CDCl3
##.SHIFT REFERENCE= (INTERNAL, CDCl3, 0, 16.4885)
##AUDIT TRAIL= $$ (NUMBER, WHEN, WHO, WHERE, WHAT)
$$ ##TITLE= Audit trail, XWIN-NMR		Version 3.5
$$ ##JCAMPDX= 5.01
$$ ##ORIGIN= Bruker BioSpin GmbH
$$ ##OWNER= servis
$$ F:\spectra/data/av/nmr/H1/1/pdata/1/auditp.txt
$$ ##AUDIT TRAIL=  $$ (NUMBER, WHEN, WHO, WHERE, WHAT)
(   1,<2026-04-10 17:44:51.26 +0400>,<servis>,<DPX200>,
      <created by zg, POWCHK disabled, PULCHK disabled
       configuration hash MD5:
       00 E9 B6 7A A2 85 ED C7 34 08 36 98 17 FE 4E 26
       data hash MD5: 32K
       3D 24 80 C7 43 A8 19 B5 1D 5C BF 40 B0 31 70 AB>)
(   2,<2026-04-10 17:44:52.87 +0400>,<servis>,<DPX200>,
      <Start of raw data processing
       efp BC_mod = 2 LB = 0.05 FT_mod = 6 PKNL = 1 PHC0 = -179.7018 PHC1 = -0.898437 SI = 16K 
       data hash MD5: 16K
       40 6F ED F7 52 19 2E AC 6D 6B 5D C8 D9 5C 90 9F>)
(   3,<2026-04-10 17:45:06.62 +0400>,<servis>,<DPX200>,
      <pk PHC0 = 1.8 PHC1 = 0 
       data hash MD5: 16K
       FA B9 C6 D9 E1 01 CD E5 D4 A6 64 A6 4A 2E D4 56>)
$$ ##END=
$$ 
$$ hash MD5
$$ 81 08 9E 22 04 5C C5 DD CD 21 A9 17 97 71 A4 7C
##$RELAX= 
##$RELAX= 
##$RELAX= 
##$RELAX= 
##$RELAX= 
##$RELAX= 
##$RELAX= 
##$RELAX= 
$$ Bruker specific parameters
$$ --------------------------
##$DU= <F:\spectra>
##$EXPNO= 1
##$NAME= <H1>
##$PROCNO= 1
##$TYPE= <nmr>
##$USER= <av>
##$AMP= (0..31)
100 100 100 100 100 100 100 100 100 100 100 100 100 100 100 100 100 100 
100 100 100 100 100 100 100 100 100 100 100 100 100 100 
##$AQSEQ= 0
##$AQ_mod= 1
##$AUNM= <au_zg>
##$AUTOPOS= <>
##$BF1= 200.13
##$BF2= 200.13
##$BF3= 200.13
##$BF4= 200.13
##$BF5= 500.13
##$BF6= 500.13
##$BF7= 500.13
##$BF8= 500.13
##$BYTORDA= 1
##$CFDGTYP= 0
##$CFRGTYP= 5
##$CHEMSTR= <none>
##$CNST= (0..31)
1 1 145 1 1 1 1 1 1 1 1 1 1 1 1 1 1 1 1 1 1 1 1 1 1 1 1 1 1 1 1 1 
##$CPDPRG= <>
##$CPDPRG1= <>
##$CPDPRG2= <>
##$CPDPRG3= <>
##$CPDPRG4= <mlev>
##$CPDPRG5= <mlev>
##$CPDPRG6= <mlev>
##$CPDPRG7= <mlev>
##$CPDPRG8= <mlev>
##$CPDPRGB= <>
##$CPDPRGT= <>
##$D= (0..31)
0 2 0 0 0 0 0 0 0 0.06 0 0 0 0 0 0 0.0002 0 0 0 0 0 0 0 0 0 0 0 0 0 0 
0 
##$DATE= 1775828690
##$DBL= (0..7)
120 120 120 120 120 120 120 120 
##$DBP= (0..7)
150 150 150 150 150 150 150 150 
##$DBP07= 0
##$DBPNAM0= <>
##$DBPNAM1= <>
##$DBPNAM2= <>
##$DBPNAM3= <>
##$DBPNAM4= <>
##$DBPNAM5= <>
##$DBPNAM6= <>
##$DBPNAM7= <>
##$DBPOAL= (0..7)
0.5 0.5 0.5 0.5 0.5 0.5 0.5 0.5 
##$DBPOFFS= (0..7)
0 0 0 0 0 0 0 0 
##$DE= 6
##$DECBNUC= <off>
##$DECIM= 32
$$ [...]
##$SUBNAM4= <"">
##$SUBNAM5= <"">
##$SUBNAM6= <"">
##$SUBNAM7= <"">
##$SUBNAM8= <"">
##$SUBNAM9= <"">
##$SW= 20.6817932712277
##$SWIBOX= (0..15)
0 0 3 0 0 0 0 0 0 0 0 0 0 0 0 0 
##$SW_h= 4139.07284768212
##$TD= 32768
##$TD0= 1
##$TE= 0
##$TE2= 300
##$TE3= 300
##$TEG= 300
##$TL= (0..7)
0 120 120 120 120 120 120 120 
##$TP= (0..7)
150 150 150 150 150 150 150 150 
##$TP07= 0
##$TPNAME0= <>
##$TPNAME1= <>
##$TPNAME2= <>
##$TPNAME3= <>
##$TPNAME4= <>
##$TPNAME5= <>
##$TPNAME6= <>
##$TPNAME7= <>
##$TPOAL= (0..7)
0.5 0.5 0.5 0.5 0.5 0.5 0.5 0.5 
##$TPOFFS= (0..7)
0 0 0 0 0 0 0 0 
##$TUNHIN= 0
##$TUNHOUT= 0
##$TUNXOUT= 0
##$USERA1= <user>
##$USERA2= <user>
##$USERA3= <user>
##$USERA4= <user>
##$USERA5= <user>
##$V9= 5
##$VALIST= <valist>
##$VCLIST= <CCCCCCCCCCCCCCC>
##$VD= 0
##$VDLIST= <DDDDDDDDDDDDDDD>
##$VPLIST= <PPPPPPPPPPPPPPP>
##$VTLIST= <TTTTTTTTTTTTTTT>
##$WBST= 1024
##$WBSW= 30
##$XGAIN= (0..3)
0 0 0 0 
##$XL= 0
##$YL= 0
##$YMAX_a= 2005486
##$YMIN_a= -1640690
##$ZGOPTNS= <>
##$ZL1= 120
##$ZL2= 120
##$ZL3= 120
##$ZL4= 120
##$ABSF1= 0
##$ABSF2= 0
##$ABSG= 0
##$ABSL= 0
##$ALPHA= 0
##$AQORDER= 0
##$ASSFAC= 0
##$ASSFACI= 0
##$ASSFACX= 0
##$ASSWID= 0
##$AUNMP= <proc_1d>
##$AZFE= 0.1
##$AZFW= 0.1
##$BCFW= 0
##$BC_mod= 2
##$BYTORDP= 0
##$COROFFS= 0
##$CY= 18.4799938201904
##$DATMOD= 1
##$DC= 0
##$DFILT= <>
##$DTYPP= 0
##$F1P= 9.9274215381318
##$F2P= -0.165520771350173
##$FCOR= 1
##$FTSIZE= 16384
##$FT_mod= 6
##$GAMMA= 0
##$GB= 0
##$INTBC= 1
##$INTSCL= 4.127829e-11
##$ISEN= 128
##$LB= 0.05
##$LEV0= 0
##$LPBIN= 0
##$MAXI= 10000
##$MC2= 0
##$MEAN= 0
##$ME_mod= 0
##$MI= 50
##$NCOEF= 0
##$NC_proc= -1
##$NLEV= 6
##$NOISF1= 3.799351
##$NOISF2= 2.8
##$NSP= 0
##$NTH_PI= 0
##$NZP= 0
##$OFFSET= 16.48848
##$PC= 4
##$PHC0= -177.9018
##$PHC1= -0.898437
##$PH_mod= 1
##$PKNL= yes
##$PPARMOD= 0
##$PSCAL= 4
##$PSIGN= 0
##$REVERSE= no
##$SF= 200.130005582386
##$SI= 16384
##$SIGF1= 3
##$SIGF2= 2
##$SINO= 400
##$SIOLD= 16384
##$SREGLST= <1H.CDCl3>
##$SSB= 0
##$STSI= 16384
##$STSR= 0
##$SW_p= 4139.07284768211
##$SYMM= 0
##$S_DEV= 0
##$TDeff= 32768
##$TDoff= 0
##$TI= <>
##$TILT= no
##$TM1= 0
##$TM2= 0
##$TOPLEV= 0
##$USERP1= <user>
##$USERP2= <user>
##$USERP3= <user>
##$USERP4= <user>
##$USERP5= <user>
##$WDW= 1
##$XDIM= 16384
##$YMAX_p= 296253692
##$YMIN_p= -99319
$$ End of Bruker specific parameters
$$ ---------------------------------
##NTUPLES= NMR SPECTRUM
##VAR_NAME=  FREQUENCY,     SPECTRUM/REAL,   SPECTRUM/IMAG
##SYMBOL=    X,             R,               I
##VAR_TYPE=  INDEPENDENT,   DEPENDENT,       DEPENDENT
##VAR_FORM=  AFFN,          ASDF,            ASDF
##VAR_DIM=   16384,         16384,           16384
##UNITS=     HZ,            ARBITRARY UNITS, ARBITRARY UNITS
##FACTOR=    0.252644378177508, 1,           1
##FIRST=     3299.83951724647, 0,            0
##LAST=      -839.233330435636, 0,           0
##MIN=       -839.233330435636, -99319,      0
##MAX=       3299.83951724647, 296253692,    0
$$ Real data points
##PAGE= N=1
##DATA TABLE= (X++(R..R)), XYDATA
$$ [...]
7237f3253J670k76M1k41N42j681P15m54J341o87r72Q21M55R11j713j398q13NL843
$$ -63253 -61583 -61859 -61818 -62059 -61517 -63198 -62483 -62937 -61596 -62283 -63255 -62434 -61979 -61068 -62781 -64179 -64992 -64987 -61144
7218f1144k22O17O50o32k341J00J140r39P25J359n40m74k33J704N89M479j6560
$$ -61144 -61366 -60749 -60099 -60731 -63072 -62972 -61832 -62771 -62046 -60687 -61227 -61701 -61934 -60230 -59641 -55162 -71722
7201g1722Q076J053l43L30O92L3l23O16j840J4J863l52R48M18n99j013j98l6O63
$$ -71722 -63646 -62593 -62936 -62606 -61914 -61881 -62204 -61588 -63428 -63414 -61551 -61903 -60955 -60537 -61136 -62149 -62347 -62383 -61720
7182f1720m83J000Q41p49o86J015m82p79J303p79K23r94j34P03M07L20K92j79
$$ -61720 -62203 -61203 -60362 -61111 -61797 -60782 -61264 -62043 -60740 -61519 -61296 -62290 -62424 -61721 -61314 -60994 -60702 -60881
7164f0881r97o67J269O77r72K87P1p16K220j053j125P28o69k97J596p2po1n93
$$ -60881 -61878 -62545 -61276 -60599 -61571 -61284 -61213 -61929 -59709 -60762 -61887 -61159 -61828 -62125 -60529 -60601 -60608 -60669 -61262
7145f1262m3m74P48L77l95K15QL20m56o4N06j309L33k1J644r68m70M06O14j85
$$ -61262 -61305 -61779 -61031 -60654 -61049 -60834 -60826 -60506 -60962 -61026 -60520 -61829 -61496 -61517 -59873 -60841 -61311 -60905 -60291 -60476
7125f0476o55r65m47K341k46l7N47j014n32Q4p3L46J20O71k524J052J499j021
$$ -60476 -61131 -62096 -62543 -60202 -60448 -60485 -59938 -60952 -61484 -61400 -61473 -61127 -61007 -60336 -62860 -61808 -60309 -61330
7107f1330M74N89j076J031m16J078j39M8P21k051j33N84J339o00n1j156K26k50
$$ -61330 -60856 -60267 -61343 -60312 -60728 -59650 -59789 -59741 -59020 -61071 -61204 -60620 -59281 -59881 -59932 -61088 -60862 -61112
7089f1112n74n86J876K47j038k03q00J908j997K46Q84k8k90J83J254J75j628K91
$$ -61112 -61686 -62272 -60396 -60149 -61187 -61390 -62190 -60282 -62279 -62033 -61149 -61177 -61467 -61284 -60030 -59855 -61483 -61192
7071f1192J653j765O20P10K90o01j58p93l31J594j338m67Q3O23O98o0R4k66l14
$$ -61192 -59539 -61304 -60684 -59974 -59684 -60285 -60443 -61236 -61567 -59973 -61311 -61778 -61695 -61072 -60374 -60434 -60340 -60606 -60920
7052f0920J21N3M24j470J45J323r1j080R75j4J11n09K30m14J674j589r12J191
$$ -60920 -60799 -60746 -60322 -61792 -61647 -60324 -60415 -61495 -60520 -60534 -60423 -60932 -60702 -61116 -59442 -61031 -61943 -60752
7034f0752J131j157R4j203J905Rk56O76k94l07P99j249l42J007k57j55j87q85
$$ -60752 -59621 -60778 -60684 -61887 -59982 -59973 -60229 -59553 -59847 -60154 -59355 -60604 -60946 -59939 -60196 -60351 -60538 -61423
7016f1423J234Q0k73P84J27r55n8l23J557o73J323j420O4l80L95k22L24J17m80
$$ -61423 -60189 -60109 -60382 -59598 -59471 -60426 -60484 -60807 -59250 -59923 -58600 -60020 -59956 -60336 -59941 -60163 -59839 -59722 -60202
6997f0202J340j228k21L34j18n86Q95L77r91M98n0L28n3r63j0O26m61O68O2m28
$$ -60202 -58862 -60090 -60311 -59977 -60095 -60681 -59786 -59409 -60400 -59902 -59952 -59624 -59677 -60640 -60650 -60024 -60485 -59817 -59755 -60183
6977f0183J275l41l22j87M17J75j390Q86n0r1L05P96m85J2J51p06J233k040k66
$$ -60183 -58908 -59249 -59571 -59758 -59341 -59166 -60556 -59670 -59720 -59811 -59506 -58710 -59195 -59183 -59032 -59738 -58505 -60545 -60811
6958f0811M36R5Q17j542J416L48l95M22n83m32N06j07O25N05j358M00P64m59o48
$$ -60811 -60375 -60280 -59463 -61005 -59589 -59241 -59636 -59214 -59797 -60229 -59723 -59830 -59205 -58700 -60058 -59658 -58894 -59353 -60001
6939f0001L74l79L47Q55p0m83l1m48J82p46Q36J112j449l15J020j92J224j627
$$ -60001 -59627 -60006 -59659 -58804 -58874 -59357 -59388 -59836 -59654 -60400 -59564 -58452 -59901 -60216 -59196 -59388 -58164 -59791
6921e9791r34Q49O00R83j208j664O84l61J200N21R03q10j065J360J43j79q12m14
$$ -59791 -60725 -59876 -59276 -58293 -59501 -61165 -60481 -60842 -59642 -59121 -58218 -59028 -60093 -58733 -58590 -58769 -59581 -59995
6903e9995O15m83j36k45Q38j052J017N35l14j63k33m7j9m5N6j822K488r90j166
$$ -59995 -59380 -59863 -59999 -60244 -59406 -60458 -59441 -58906 -59220 -59383 -59616 -59663 -59682 -59727 -59671 -61493 -59005 -59995 -61161
6884f1161K305R59r38q2j154J173M12p51M01Q06j186p51L33k97J312R36p29n40
$$ -61161 -58856 -57897 -58835 -58917 -60071 -58898 -58486 -59237 -58836 -58030 -59216 -59967 -59634 -59931 -58619 -57683 -58412 -58952
6866e8952M23O30n26j210j66p47J205R25J401j509m88m98J433r36O11j90k252
$$ -58952 -58529 -57899 -58425 -59635 -59801 -60548 -59343 -58418 -57017 -58526 -59014 -59512 -58079 -59015 -58404 -58594 -60846
6849f0846J391L85O38m31J07k27j10l72J613j221R9j2j63N19M49O31N35l98O57
$$ -60846 -59455 -59070 -58432 -58863 -58756 -58983 -59093 -59465 -57852 -59073 -58974 -58986 -59149 -58630 -58181 -57550 -57015 -57413 -56756
6830e6756m09K44j249j456L22j57R18j195Q62l91O04j136k15J281J159P55j932
$$ -56756 -57165 -56921 -58170 -59626 -59304 -59461 -58543 -59738 -58876 -59267 -58663 -59799 -60014 -58733 -57574 -56819 -58751
6813e8751p64q57R65J415o69r00R88K584J856k058j755o0k86k29q39r45J963r77
$$ -58751 -59515 -60372 -59407 -57992 -58661 -59561 -58573 -55989 -54133 -56191 -57946 -58006 -58292 -58521 -59360 -60305 -58342 -59319
6795e9319K33j018N84N64q75l85o15L118R79j213j739j398J255Q93J012j338L55
$$ -59319 -59086 -60104 -59520 -58956 -59831 -60216 -60831 -57713 -56734 -57947 -59686 -61084 -59829 -58936 -57924 -59262 -58907
6778e8907J886L261j558l238Q54p53J095j423o18J209K51j260O82j406O73l44
$$ -58907 -57021 -53760 -55318 -58556 -57702 -58455 -57360 -58783 -59401 -58192 -57941 -59201 -58519 -59925 -59252 -59596
6762e9596Q02j48j00m29J162m02J5r8J177j548L9p32L211P22p25j369O68L38k01
$$ -59596 -58794 -58942 -59042 -59471 -58309 -58711 -58696 -58794 -57617 -59165 -59126 -59858 -56647 -55925 -56650 -58019 -57351 -57013 -57214
6743e7214q1o37j490J538q23Q67k79k36oP35J343j761j015j510J756K513m56j252
$$ -57214 -57295 -57932 -59422 -57884 -58707 -57840 -58119 -58355 -58361 -57626 -56283 -58044 -59059 -60569 -58813 -56300 -56756 -58008
6725e8008O57j159J002O12n31j952J53J804p08n9m05k40L28n99M15k04J789j281
$$ -58008 -57351 -58510 -57508 -56896 -57427 -59379 -59226 -57422 -58130 -58189 -58594 -58834 -58506 -59105 -58690 -58894 -57105 -58386
6707e8386K85J4N99j77j283L32o3K49M54O14O05r70l7n93q54J065k49m15m3O77
$$ -58386 -58101 -58087 -57488 -57665 -58948 -58616 -58679 -58430 -57976 -57362 -56757 -57727 -57764 -58357 -59211 -58146 -58395 -58810 -58853 -58176
6687e8176k76R41j93q15p07J002N7j331J545L9K59p51M86K56N31K9k873K588N
$$ -58176 -58452 -57511 -57704 -58519 -59226 -58224 -58167 -59498 -57953 -57914 -57655 -58406 -57920 -57664 -57133 -57104 -59977 -57389 -57384
6668e7384J341j658j825K076O71j714L00M21k541J774J733r48q14Q95L61j434
$$ -57384 -56043 -57701 -59526 -57450 -56779 -58493 -58193 -57772 -60313 -58539 -56806 -57754 -58568 -57673 -57312 -58746
6652e8746l25J056J684r83p09m23J670J310p74n82m25J040N93k46m78j5k40n16
$$ -58746 -59071 -58015 -56331 -57314 -58023 -58446 -56776 -55466 -56240 -56822 -57247 -56207 -55614 -55860 -56338 -56353 -56593 -57109
6634e7109k53J088j573Q24q0r83J20N74Q8l16p72L41K849j083K31j268k3J351
$$ -57109 -57362 -56274 -57847 -57023 -57103 -58086 -57966 -57392 -57304 -57620 -58392 -58051 -55202 -56285 -56054 -57322 -57345 -55994
6616e5994j22q32l47J373O40j50k09q64J586o79n48L55j62n49M55M20J58j228
$$ -55994 -56116 -56948 -57295 -55922 -55282 -55432 -55641 -56505 -54919 -55598 -56146 -55791 -55953 -56502 -56047 -55627 -55469 -56697
6598e6697l06K669k642M9J156O20O22n48n25O1j031J507j157J223O47k2j090n56
$$ -56697 -57003 -54334 -56976 -56927 -55771 -55151 -54529 -55077 -55602 -55541 -56572 -55065 -56222 -54999 -54352 -54374 -55464 -56020
6580e6020Q84n58n15N23P77J09o71q8Q08j417J341o42N86p53O4L56Q99Q45n03
$$ -56020 -55136 -55694 -56209 -55686 -54909 -54800 -55471 -55559 -54751 -56168 -54827 -55469 -54883 -55636 -55572 -55216 -54317 -53472 -53975
6561e3975j214j496r53J416K79K44p0K43m57J30Q47l12k98N93r71j119O16J789
$$ -53975 -55189 -56685 -57638 -56222 -55943 -55699 -55769 -55526 -55983 -55853 -55006 -55318 -55616 -55023 -55994 -57113 -56497 -54708
6543e4708n29j67N68j78J325j607j27n28L52J680n01p98j544N77J587j154M17
$$ -54708 -55237 -55404 -54836 -55014 -53689 -55296 -55423 -55951 -55599 -53919 -54420 -55218 -56762 -56185 -54598 -55752 -55335
6526e5335r99J206k47J81l1j89q06K84Q71j17J070j338Q85q68l2q3k5L43l5p64
$$ -55335 -56334 -55128 -55375 -55194 -55225 -55414 -56220 -55936 -55065 -55182 -54112 -55450 -54565 -55433 -55465 -55548 -55573 -55230 -55265 -56029
6506e6029j91J318P00o46k26j426J055K87jO70l07l15m0J38j80L66k92N51p41
$$ -56029 -56220 -54902 -54202 -54848 -55074 -56500 -55445 -55158 -55159 -54489 -54796 -55111 -55151 -55013 -55193 -54827 -55119 -54568 -55309
6487e5309R03O57n11l91k6K86r3J98L02q87j00O40j072R06n09O40m08k2m03J18
$$ -55309 -54406 -53749 -54260 -54651 -54677 -54391 -54484 -54286 -53984 -54871 -54971 -54331 -55403 -54497 -55006 -54366 -54774 -54796 -55199 -55081
6467e5081k92K18K01j50n4K27K73J403j68j135O5p07J011J37M29m79K9p90j032
$$ -55081 -55373 -55155 -54954 -55104 -55158 -54931 -54658 -53255 -53423 -54558 -54493 -55200 -54189 -54052 -53623 -54102 -54073 -54863 -55895
6448e5895J429M15j028K76J475j227M12n05l27L2l06P91J12j23m30J795j209j
$$ -55895 -54466 -54051 -55079 -54803 -53328 -54555 -54143 -54648 -54975 -54943 -55249 -54458 -54346 -54469 -54899 -53104 -54313 -54314
6430e4314O46J54J29m37j07j31M23r98R36q9k85N41j37P82L81m13k40j143K110
$$ -54314 -53668 -53514 -53385 -53822 -53929 -54060 -53637 -54635 -53699 -53788 -54073 -53532 -53669 -52887 -52506 -52919 -53159 -54302 -52192
6411e2192k31l687J345J88K66n44J85J465n03K01j46p56M71j182Q40j212l58J597
$$ -52192 -52423 -56110 -54765 -54577 -54311 -54855 -54670 -53205 -53708 -53507 -53653 -54409 -53938 -55120 -54280 -55492 -55850 -54253
6393e4253k52O59J29o90K45k47J08J014m18L92J1J79K5l42J77K59j055N30p22
$$ -54253 -54505 -53846 -53717 -54407 -54162 -54409 -54301 -53287 -53705 -53313 -53302 -53123 -53098 -53440 -53263 -53004 -54059 -53529 -54251
6374e4251o51J275P25o51O3N02j367l90j15p1J574l76j112P41r10J108J70J373
$$ -54251 -54902 -53627 -52902 -53553 -53490 -52988 -54355 -54745 -54860 -54931 -53357 -53733 -54845 -54104 -55014 -53906 -53736 -52363
6356e2363k93k03m93j211J521J024q99n74l40P06L86r97L25J495j099j636L401
$$ -52363 -52656 -52859 -53352 -54563 -53042 -52018 -52917 -53491 -53831 -53125 -52739 -53736 -53411 -51916 -53015 -54651 -51250
6339e1250j970m27l83j01k43K294j147N10N28K50q55j480M81L46M90q19J242j50
$$ -51250 -53220 -53647 -54030 -54131 -54374 -52080 -53227 -52717 -52189 -51939 -52794 -54274 -53793 -53447 -52957 -53776 -52534 -52684
6321e2684r79L98R62j783M35O14R88K37j130r22J400n69J13j485J750j217L89
$$ -52684 -53663 -53265 -52303 -54086 -53651 -53037 -52049 -51812 -52942 -53864 -52464 -53033 -52920 -54405 -52655 -53872 -53483
6304e3483k95K10J109J21p55j100J204K00j21j30k98P7M03J4K24K04J035k21p50
$$ -53483 -53778 -53568 -52459 -52338 -53093 -54193 -52989 -52789 -52910 -53040 -53338 -53261 -52858 -52844 -52620 -52416 -51381 -51602 -52352
6285e2352k65L37o94j50l59J416p27l71q95J739l8j56j581J533J428j450J36j825
$$ -52352 -52617 -52280 -52974 -53124 -53483 -52067 -52794 -53165 -54060 -52321 -52359 -52515 -54096 -52563 -51135 -52585 -52449 -54274
6267e4274O26P03P92j116N7N01J107J51p98k314J888J57L15j115k85J544k13j166
$$ -54274 -53648 -52945 -52153 -53269 -53212 -52711 -51604 -51453 -52251 -54565 -52677 -52520 -52205 -53320 -53605 -52061 -52274 -53440
6249e3440j578L159K7k217p51K571L93K40j634Q51J475j37j347r04q8n56n14Q59
$$ -53440 -55018 -51859 -51832 -54049 -54800 -52229 -51836 -51596 -53230 -52379 -50904 -51041 -52388 -53292 -53380 -53936 -54450 -53591
6231e3591n4n24j21K89K301m77q33J35K45K47p75K78L71r2j107K864j418k684
$$ -53591 -53645 -54169 -54290 -54001 -51700 -52177 -53010 -52875 -52630 -52383 -53158 -52880 -52509 -52601 -53708 -50844 -52262 -54946
6213e4946n64N504K613k25n329N05K78l298l649K24N139K534k017N36P04J214
$$ -54946 -55510 -50006 -47393 -47618 -52947 -52442 -52164 -55462 -59111 -58887 -53748 -51214 -53231 -52695 -51991 -50777
6197e0777j801r55J337j013n97L77M14N60P40J7j46l267j587M977M323j958k790
$$ -50777 -52578 -53533 -52196 -53209 -53806 -53429 -53015 -52455 -51715 -51698 -51844 -55111 -56698 -51721 -47398 -49356 -52146
6180e2146j245Q58k513m425j339M287M619j305j09R03J229J22k604J14K73j77
$$ -52146 -53391 -52533 -55046 -59471 -60810 -56523 -51904 -53209 -53318 -52415 -51186 -51064 -53668 -53554 -53281 -53458
6164e3458L39J985j061l060Q12J821L47j704n74R96K334q05j031k33k043j792
$$ -53458 -53119 -51134 -52195 -55255 -54443 -52622 -52275 -53979 -54553 -53557 -51223 -52028 -53059 -53292 -55335 -57127
6148e7127J89K351P61n29p54J802J231p86j449Q21O72k11j315R70J15q68j643
$$ -57127 -56938 -54587 -53826 -54355 -55109 -53307 -52076 -52862 -54311 -53490 -52818 -53029 -54344 -53374 -53259 -54127 -55770
6131e5770J107K780J445k229j606J29R87N00j422J21J073m06O81j247J10q6J20
$$ -55770 -54663 -51883 -50438 -52667 -54273 -54144 -53157 -52657 -54079 -53958 -52885 -53291 -52610 -53857 -53747 -53833 -53713
6114e3713N10j345J313j209K396k259M38k04J63j845J374O99J15L87N96j939N95
$$ -53713 -53203 -54548 -53235 -54444 -52048 -54307 -53869 -54073 -53910 -55755 -54381 -53682 -53567 -53180 -52584 -54523 -53928
6097e3928n03J55K90n3Q99P01m27j133J284j110O74j576L02J73J718n93l06M8
$$ -53928 -54431 -54276 -53986 -54039 -53140 -52439 -52866 -53999 -52715 -53825 -53151 -54727 -54425 -54252 -52534 -53127 -53433 -53385
6079e3385J418k202j30O34Q54j801j246Q88O79N18l63m46K78R08n94P32p34Q3
$$ -53385 -51967 -54169 -54299 -53665 -52811 -54612 -55858 -54970 -54291 -53773 -54136 -54582 -54304 -53396 -53990 -53258 -53992 -53909
6061e3909k75J787k297o17J155mJ153j477O65J359j58l87p02k68P78j418r65q57
$$ -53909 -54184 -52397 -54694 -55311 -54156 -54160 -53007 -54484 -53819 -52460 -52618 -53005 -53707 -53975 -53197 -54615 -55580 -56437
6043e6437K10L93J584j82L61r36J323J97M27j401N66J95l73n36J83J108L3j418
$$ -56437 -56227 -55834 -54250 -54432 -54071 -55007 -53684 -53487 -53060 -54461 -53895 -53700 -54073 -54609 -54426 -53318 -53285 -54703
6025e4703K20R49n85N99j098K31M53K23P94m054Q48k642M782J054o17j417j36
$$ -54703 -54483 -53534 -54119 -53520 -54618 -54387 -53934 -53711 -52917 -56971 -56123 -58765 -53983 -52929 -53546 -54963 -55099
6008e5099K177j66K69k029J371p40m65J273l31l17m53J44J131q81M71M28l74L20
$$ -55099 -52922 -53088 -52819 -54848 -53477 -54217 -54682 -53409 -53740 -54057 -54510 -54366 -53235 -54116 -53645 -53217 -53591 -53271
5990e3271P69j453J939k212J338Q9o36J57m01P69J2Q95k827J352M93j115m0P60
$$ -53271 -52502 -53955 -52016 -54228 -52890 -52801 -53437 -53280 -53681 -52912 -52900 -52005 -54832 -53480 -52987 -54102 -54142 -53382
5972e3382n84k91J311r47K73mJ700n03o36j888K304L47P81r21N36l84J72q73o0
$$ -53382 -53966 -54257 -52946 -53893 -53620 -53624 -51924 -52427 -53063 -54951 -52647 -52300 -51519 -52440 -51904 -52288 -52116 -52989 -53049
5953e3049O27j791J777j803Q03O75L13m31o98j074J019l4P8l77K37r55J650k61
$$ -53049 -52422 -54213 -52436 -54239 -53436 -52761 -52448 -52879 -53577 -54651 -53632 -53666 -53588 -53965 -53728 -54683 -53033 -53294
5935e3294N74o00O70j80N98q41l46M13J39N26j9R1j686J190q83J80PN27k70q26
$$ -53294 -52720 -53320 -52650 -52830 -52232 -53073 -53419 -53006 -52867 -52341 -52360 -52269 -53955 -52765 -53648 -53468 -53461 -52934 -53204 -54030
5915e4030n37J6R97q77p52N35P96k83N67l01m1j096N37J36J048M21q22R31j330
$$ -54030 -54567 -54551 -53554 -54431 -55183 -54648 -53852 -54135 -53568 -53869 -53910 -55006 -54469 -54333 -53285 -52864 -53686 -52755 -54085
5896e4085M52J196j667P26k14P67k048J309j162R92j27m33M72o60l27l46K66Q49
$$ -54085 -53633 -52437 -54104 -53378 -53592 -52825 -54873 -53564 -54726 -53734 -53861 -54294 -53822 -54482 -54809 -55155 -54889 -54040
5878e4040N3q17J575j167k24N48J259N25k12j503K78L72R74K93j180q34J074k72
$$ -54040 -53987 -54804 -53229 -54396 -54620 -54072 -52813 -52288 -52500 -54003 -53725 -53353 -52379 -52086 -53266 -54100 -53026 -53298
5860e3298j54k64L85m38l03N50P47p16q86J269n82q9P25j0p04k80m27J183j52
$$ -53298 -53452 -53716 -53331 -53769 -54072 -53522 -52775 -53491 -54377 -53108 -53690 -53779 -53054 -53064 -53768 -54048 -54475 -53292 -53444
5841e3444j27r82J659j064J419j161O50r00L55j280K048r15L03L87n68K60k43
$$ -53444 -53571 -54553 -52894 -53958 -52539 -53700 -53050 -53950 -53595 -54875 -52827 -53742 -53439 -53052 -53620 -53360 -53603
5824e3603o37L53R26p13l8M72M24J18r82j317J28J146p8J064r72J67p32L85o82
$$ -53603 -54240 -53887 -52961 -53674 -53712 -53240 -52816 -52698 -53680 -54997 -54869 -53723 -53801 -52737 -53709 -53542 -54274 -53889 -54571
5805e4571K246r93q18j99J125r97J203j52j010R48l18J420j288Q6J017J92k27
$$ -54571 -52325 -53318 -54136 -54335 -53210 -54207 -53004 -53156 -54166 -53218 -53536 -52116 -53404 -53318 -52301 -52109 -52336
5788e2336q22p00o1k44m21k74J522K81p37p78P90M84N55l75j377J077M4p30k93
$$ -52336 -53158 -53858 -53919 -54163 -54584 -54858 -53336 -53055 -53792 -54570 -53780 -53296 -52741 -53116 -54493 -53416 -53372 -54102 -54395
5769e4395j22O07J255q00L6J082j203J341k34j395j62N05j738Q34k75n52P31J310
$$ -54395 -54517 -53910 -52655 -53455 -53419 -52337 -53540 -52199 -52433 -53828 -53990 -53485 -55223 -54389 -54664 -55216 -54485 -53175
5751e3175j549q28K24K57J221J496q90n88j606L66R44N09r10k1J276k16m12O68
$$ -53175 -54724 -55552 -55328 -55071 -53850 -52354 -53244 -53832 -55438 -55072 -54128 -53619 -54529 -54550 -53274 -53490 -53902 -53234
5733e3234o39Q84j88j026n27Q61Q71P12j572o30j209J559r01o19Q46J66P19K71
$$ -53234 -53873 -52989 -53177 -54203 -54730 -53869 -52998 -52286 -53858 -54488 -55697 -54138 -55039 -55658 -54812 -54646 -53927 -53656
5715e3656l73j192K44M4J552K35k9n80Q78o96j153J063R82k167J326J5K36J17
$$ -53656 -54029 -55221 -54977 -54933 -53381 -53146 -53175 -53755 -52877 -53573 -54726 -53663 -52681 -54848 -53522 -53507 -53271 -53154
5697e3154j549M56Q32j776N83L68o45n06q93M11J314M13J27m03J154N34j307k85
$$ -53154 -54703 -54247 -53415 -55191 -54608 -54240 -54885 -55391 -56284 -55873 -54559 -54146 -54019 -54422 -53268 -52734 -54041 -54326
5679e4326J792j029k43J39L81k32L55o98K68k975R9J558K720j589j647Q10K450
$$ -54326 -52534 -53563 -53806 -53667 -53286 -53518 -53163 -53861 -53593 -56568 -56469 -54911 -52191 -53780 -55427 -54617 -52167
5662e2167k149k654j10K596J100M8p14p35J41K94L73o8K88n74o68k064J209l04
$$ -52167 -54316 -56970 -57080 -54484 -53384 -53336 -54050 -54785 -54644 -54350 -53977 -54045 -53757 -54331 -54999 -57063 -55854 -56158
5644e6158K816p88k124j025K684N67k157k405P57L630K338p66j500j343J252J105
$$ -56158 -53342 -54130 -56254 -57279 -54595 -54028 -56185 -58590 -57833 -54203 -51865 -52631 -54131 -55474 -54222 -53117
5628e3117j421q41j221R00Q70k212J329k13K54J585k022J373M46k687J166Q91
$$ -53117 -54538 -55379 -56600 -55700 -54830 -57042 -55713 -55926 -55672 -54087 -56109 -54736 -54290 -56977 -55811 -54920
5612e4920K400l218o939j209M095L501N241M106J892n448n495J749K312q65l266
$$ -54920 -52520 -55738 -62677 -63886 -59791 -56290 -51049 -46943 -45051 -50499 -55994 -54245 -51933 -52798 -56064
5597e6064K000J496k88j526P35J271j720M63l3K25R55k386J727J541j477p475
$$ -56064 -54064 -52568 -52856 -54382 -53647 -52376 -54096 -53633 -53666 -53441 -52486 -54872 -53145 -51604 -53081 -60556
5581f0556k794L361M468M352O455J568l822p558l7M350q43l011L98K867l62n14
$$ -60556 -63350 -59989 -55521 -51169 -44714 -43146 -46968 -54526 -54563 -50213 -51056 -54067 -53669 -50802 -51164 -51678
5565e1678J349L02Nj933o4Q5J053o48j392J14Q55K167m047M46R70M118K429j422
$$ -51678 -50329 -50027 -50022 -51955 -52019 -51934 -50881 -51529 -52921 -52807 -51952 -49785 -53832 -53386 -52416 -48298 -45869 -47291
5547d7291j075j715K595j396k09j789J920R80o25j378P92o43r0J34J042k105Q82
$$ -47291 -48366 -50081 -47486 -48882 -49091 -50880 -48960 -47980 -48605 -49983 -49191 -49834 -49924 -49790 -48748 -50853 -49971
5530d9971P1j255j301J462K529M19j217n60J330k44j255p17O67K380q69K0o06
$$ -49971 -49900 -51155 -52456 -50994 -48465 -48046 -49263 -49823 -48493 -48737 -49992 -50709 -50042 -47662 -48531 -48511 -49117
5513d9117J669n14O5o83k5J362j847O91Q39l10q26p31K140p36QJ074j66m48L39
$$ -49117 -47448 -47962 -47897 -48580 -48605 -47243 -49090 -48399 -47560 -47870 -48696 -49427 -47287 -48023 -48015 -46941 -47107 -47555 -47216
5494d7216J339j848j124r18J173J360J500j935N0J963j242m35Q92O57j456k71
$$ -47216 -45877 -47725 -48849 -49767 -48594 -47234 -45734 -47669 -47619 -45656 -46898 -47333 -46441 -45784 -47240 -47511
5478d7511J844l5j882K23J847J443j547k21l85m6q45J126L45l47n52N87Q72M62
$$ -47511 -45667 -45702 -47584 -47361 -45514 -44071 -45618 -45839 -46224 -46270 -47115 -45989 -45644 -45991 -46543 -45956 -45084 -44622
5460d4622j816K97J111k35j056J70L078j395j367j454J793J120p12N2J614P15
$$ -44622 -46438 -46141 -45030 -45265 -46321 -46151 -43073 -44468 -45835 -47289 -45496 -44376 -45088 -45036 -43422 -42707
5444d2707J027m46m50m93j397N14O75J61J485k496K37R62j365J432m89M28J85
$$ -42707 -41680 -42126 -42576 -43069 -44466 -43952 -43277 -43116 -41631 -44127 -43890 -42928 -44293 -42861 -43350 -42922 -42737
5427d2737m68O59Q41m1k216J932j33J151N14j047N40J008K04N2m54r83K25P16
$$ -42737 -43205 -42546 -41705 -41746 -43962 -42030 -42163 -41012 -40498 -41545 -41005 -39997 -39793 -39741 -40195 -41178 -40953 -40237
5409d0237R32m21n82J0j53j359J964l3J721O2l75M61L84J86j705J424L8J336l31
$$ -40237 -39305 -39726 -40308 -40298 -40451 -41810 -39846 -39879 -38158 -38096 -38471 -38010 -37626 -37440 -39145 -37721 -37683 -36347 -36678
5390c6678k6Q13L0N08p39l5l84O71Q5P92kp90K20N08Q50l88O4J586N14M85J322
$$ -36678 -36704 -35891 -35861 -35353 -36092 -36127 -36511 -35840 -35755 -34963 -34965 -35755 -35535 -35027 -34177 -34565 -34501 -32915 -32401 -31916 -30594
5369c0594k59N53j937J018j85K508n45j599J920j501P49k09J463M95o3N70Q27
$$ -30594 -30853 -30300 -32237 -31219 -31404 -28896 -29441 -31040 -29120 -30621 -29872 -30081 -28618 -28123 -28186 -27616 -26789
5352b6789K68k32m05K479J76O03j257J330R69J083K1l5K595j00J55Q4j36R51J536
$$ -26789 -26521 -26753 -27158 -24679 -24503 -23900 -25157 -23827 -22858 -21775 -21754 -21789 -19194 -19294 -19139 -19055 -19191 -18240 -16704
5333a6704J735K20M21K946J864L220K849N045J2628K2425L7846L4551P883j3512
$$ -16704 -14969 -14749 -14328 -11382 -9518 -6298 -3449 1596 14224 36649 74495 109046 116929 103417
5319A03417k0073j9126j8668j1322r215o434n081m232o62o30Nq34k92J987K369
$$ 103417 83344 64218 45550 34228 25013 18579 13498 9266 8604 7974 7979 7145 6853 8840 11209
5304A1209L497M473K473M672M980Q295J0998K6424N8293J04096J18568M9390l6545
$$ 11209 14706 19179 21652 26324 31304 39599 50597 77021 135314 239410 357978 407368 370823
5291C70823o2446o1842n8205m5156l2056k2614j7881j1586r282m685m337j036
$$ 370823 308377 246535 188330 143174 111118 88504 70623 59037 49755 45070 40733 39697
5279C9697j521l48J208J401J457L612M134K943P511J1039K0536N2027R3657J22255
$$ 39697 38176 37828 39036 40437 41894 45506 49640 52583 60094 71133 91669 143696 237353 359608
5265C59608P1327k2139n9872o4228o2092n0221l5825k7246j9374j4054r016o870
$$ 359608 430935 408796 348924 284696 222604 172383 136558 109312 89938 75884 66868 59998
5253E9998n016k382l78m71M5k413q83J024O73J547L904L278O787J4284K8901M0828
$$ 59998 54982 52600 52222 51751 51796 49383 48500 49524 50197 51744 55648 58926 65713 79997 108898 149726
5237A49726K8027k115j7275k1533k0045j8690j3554r387n679m042j704l756k042
$$ 149726 177753 175638 158363 136830 116785 98095 84541 75154 69475 65433 63729 59973 57931
5224E7931l63J89J025R94P75k96n07K38n5J586K721L121J931o58O06p5K128J738
$$ 57931 57568 57757 58782 59776 60551 60255 59748 59986 59931 61517 64238 67359 69290 68632 69238 69163 71291 73029
5206G3029J39l74P48O30J980K686L828J016R98K113J315q83O5K123L831K498K142
$$ 73029 73168 72794 73542 74172 76152 78838 82666 83682 84680 86793 88108 87225 87290 89413 93244 95742 97884
5189I7884M96J37J293K887L681M189RR82J912M266K466M738J580J276m54p37J116
$$ 97884 98380 98517 99810 102697 106378 110567 110576 111558 113470 117736 120202 124940 126520 127796 127342 126605 127721
5172A27721N462O159N324K855L348J03K709L373P63K097L879L449O34k339Q85
$$ 127721 133183 139342 144666 147521 150869 150972 153681 157054 157817 159914 163793 167242 167876 165537 166422
5157A66422M594L720L325J8m55M629N060Q054Q767M085m44m558j82J315R653J1800
$$ 166422 171016 174736 178061 178079 177624 182253 187313 195367 204134 208219 207775 203217 203035 204350 214003 225803
5141B25803R052N810K572O283L669L580M015O753K568L12n08M783P518R456O654
$$ 225803 234855 240665 243237 249520 253189 256769 260784 267537 270105 270417 269909 274692 282210 291666 298320
5126B98320J20o55K595N604J0854J2464R314M759j47J898N471J3207J5016J0994
$$ 298320 298440 297785 300380 305984 316838 329302 338616 343375 343228 345126 350597 363804 378820 389814
5112C89814P748M992N422N223J1199J2218J1739P364M488M478R140J3246J6220
$$ 389814 397562 402554 407976 413199 424398 436616 448355 455719 460207 464685 473825 487071 503291
5099E03291J4271Q631J453L938Q829J4327K0091J7796J4088J1453J1401J1345
$$ 503291 517562 526193 527646 531584 540413 554740 574831 592627 606715 618168 629569 640914
5087F40914J3526J4964J4059J2856J2405J2195J7647J8879K3768K2193J4364J1607
$$ 640914 654440 669404 683463 696319 708724 720919 738566 757445 781213 803406 817770 829377
5075H29377J4526J8732K2091K7911K7729K5124K0149K0320K1653K6161L3568L7307
$$ 829377 843903 862635 884726 912637 940366 965490 985639 1005959 1027612 1053773 1087341 1124648
5063A124648L7627L3656L3760L2630L1018K9507L5468L6810M2638M4233N2004
$$ 1124648 1162275 1195931 1229691 1262321 1293339 1322846 1358314 1395124 1437762 1481995 1533999
5052A533999N7312N7292N9227N8614O6969Q0660R9894J29840J53790J73690K04568
$$ 1533999 1591311 1648603 1707830 1766444 1833413 1914073 2013967 2143807 2297597 2471287 2675855
5041B675855K61440L33033M08768N27074R96847K475427N031522P287461N697370
$$ 2675855 2937295 3270328 3679096 4206170 5203017 7678444 12709966 19997427 25694797
5032B5694797J85964l135199l801547l746547l099722k271568j675129j209397
$$ 25694797 25880761 22745562 18944015 15197468 12097746 9826178 8151049 6941652
5024F941652q28418n16980l11827j98286j17320l3099N0444J57992K69203L54479
$$ 6941652 6113234 5596254 5284427 5086141 4968821 4935722 4986166 5144158 5413361 5767840
5014E767840M58112O24515Q53725J113239J469091K522085O151357J3359401K0555450
$$ 5767840 6225952 6850467 7704192 8817431 10286522 12808607 18959964 32319365 52874815
5005E2874815J9182998M426920q076386j1194165j1627288j0473201p890953n839921
$$ 52874815 72057813 76484733 68408347 57214182 45586894 35113693 27222740 21382819
4997B1382819m321101l086788k066140j334141r39180p20034n49860l79921k10474
$$ 21382819 17061718 13974930 11908790 10574649 9635469 8915435 8365575 7985654 7775180
4988G775180k1707J42444K83863M64489P06277R83006J315286K106408M934402
$$ 7775180 7753473 7895917 8179780 8644269 9350546 10333552 11648838 13755246 18689648
4979A8689648J1524227J9469066K1225885Q679095o418465j1365225j2049705
$$ 18689648 30213875 49682941 70908826 79587921 73169456 61804231 49754526
4972D9754526j1366761q857478o535785m881955l547529k457409j616542j144845
$$ 49754526 38387765 29530287 22994502 18112547 14565018 12107609 10491067 9346222
4964I346222q98642p44511o04526m69831l32816j99847r1670p402R1073J96125
$$ 9346222 8447580 7703069 7098543 6628712 6295896 6096049 6004379 5996977 6088050 6284175
4954F284175K99686M96133J224495L175000O041039P726518M380694j560596m088229
$$ 6284175 6583861 7079994 8304489 11479489 17520528 25247046 29627740 28067144 23978915
4945B3978915m385119m095498l244540k399519j809302j343403r65716o61784
$$ 23978915 19593796 15498298 12253758 9854239 8044937 6701534 5735818 5074034
4937E074034m77810l79916l23571k82108k42986k04895j66974j33396j11573r9446
$$ 5074034 4596224 4216308 3892737 3610629 3367643 3162748 2995774 2862378 2750805 2651359
4927B651359r2689q6141q2065p6290o8503o7714o6312o2303n6507n3329n1504
$$ 2651359 2558670 2472529 2390464 2314174 2245671 2177957 2111645 2049342 1992835 1939506 1888002
4916A888002m3883l8935m3206m6084n0523m8382m5250m1154l5246l5079l7662
$$ 1888002 1844119 1805184 1761978 1715894 1665371 1616989 1571739 1530585 1495339 1460260 1422598
4905A422598m0729m2227l7571l3909k5099k6567k9025l2562k7807k6084k0726
$$ 1422598 1381869 1339642 1302071 1268162 1243063 1216496 1187471 1154909 1127102 1101018 1080292
4894A080292k3209k4197k6466k7574k7907k3589j5517j0406j3600j8776k5959
$$ 1080292 1057083 1032886 1006420 978846 950939 927350 911833 901427 887827 869051 843092
4883H43092k6847k2235j4650j2897j2987j8972k1940j9828j7814j2127j0963j1755
$$ 843092 816245 794010 779360 766463 753476 734504 712564 692736 674922 662795 651832 640077
4871F40077j3211j8754j7217j4716r787m396m335p859j7540j7715j5777p094n968
$$ 640077 626866 608112 590895 576179 566392 561996 557661 549802 532262 514547 498770 491676 485708
4858D85708k611q395j3895j7016j2783p334n088o295j1893j3789j4150r168o996
$$ 485708 483097 474702 460807 443791 431008 423674 418586 412291 400398 386609 372459 363291 356295
4845C56295o622q952j1303j1386j0486q018l529p71J673l284q353j2146j0292
$$ 356295 349673 340721 329418 318032 307546 299528 295999 295228 296901 293617 285264 273118 262826
4832B62826o487o160j510l425n282o408r496l850l060l015o183j0990q494p659
$$ 262826 256339 250179 248669 245244 239962 233554 224058 220208 217148 214133 207950 196960 188466 180807
4818A80807m571l850l811o361o818o895n205m100j198J349j775l919m204m798
$$ 180807 176236 172386 168575 162214 155396 148501 143296 139196 137998 139347 137572 133653 129449 124651
4804A24651l557n398l886j266k559l624m461j695j013j900j761l447n685l537
$$ 124651 121094 115696 111810 110544 107985 104361 99900 98205 97192 95292 93531 90084 84399 80862
4790H0862m013k055j033R78l619l803m042l020k252k057k92R59j781k161l329
$$ 80862 76849 74794 73761 74739 71120 67317 63275 60255 58003 55946 55654 56613 54832 52671 49342
4775D9342j541j628j425n96l144l715l593j271M96R67M70k445j117l313j410N61
$$ 49342 47801 46173 44748 44152 41008 37293 33700 32429 32925 33892 34362 31917 30800 27487 26077 26638
4759B6638j071L22j757R05q47k056L61O05o23L30j711n23P41K784L512O035R867
$$ 26638 25567 25889 24132 25037 24190 22134 22495 23100 22477 22807 21096 20573 21314 24098 27610 33645 43512
4742D3512K4278L5516K5790m74j6276j8931j9121j7906j3342r997p097k748j830
$$ 43512 67790 103306 129096 128622 112346 93415 74294 56388 43046 33049 25952 23204 21374
4729B1374k743r83k205j43J74P45Q56r75J937K467M912N240R467J3226L0300O8997
$$ 21374 18631 17648 15443 15300 15474 16219 17075 16100 18037 20504 25416 30656 40123 53349 83649 152646
4713A52646J08670J05948K0450m7189o0752o2590n5064m0819k9752k4214j7897
$$ 152646 261316 367264 387714 340525 279773 217183 162119 121300 91548 67334 49437
4702D9437j0106m992o331l182m868j842k229J429N07J249J638L157N708P683J2529
$$ 49437 39331 34339 28008 24826 19958 18116 15887 17316 17823 19072 20710 23867 29575 37258 49787
4687D9787K5360O0939J02341J17715M7178l7317o4825o6105n9923m6012l4033
$$ 49787 75147 136086 238427 356142 403320 366003 301178 235073 175150 129138 95105
4676I5105k6117j9043j3045q013m583m436n928l354l258l11L9q87m42J263K192
$$ 95105 68988 49945 36900 28887 24304 19868 13940 10586 7328 7017 7056 6169 5727 6990 9182
4661I182J906L012P665J9775L5137M0920K5948l400j3314j5030j6449j4829j2421
$$ 9182 11088 14100 21765 41540 76677 117597 143545 140145 126831 111801 95352 80523 68102
4648F8102q449j0000q521p448o661l713k676m090n79j053P70L20J644M458Q200
$$ 68102 59653 49653 41132 33684 27023 23310 20634 16544 15965 14912 15682 16002 17646 22104 30304
4633C0304P816O557P260N206K115K301L850J0108J4759K1350J7533P781m352j1160
$$ 30304 38120 44677 51937 57143 59258 61559 65409 75517 90276 111626 129159 136940 132588 121428
4619A21428j1678j2078j2911j1696r703n737j839k176j36R55N728Q107J2275J5265
$$ 121428 109750 97672 84761 73065 63362 57625 55786 53610 53474 54429 60157 68264 80539 95804
4605I5804K1001K3377J8599L272q217j1351o823J202P931J0212O713J031p579
$$ 95804 116805 140182 158781 162053 153836 142485 135662 136864 144795 155007 161720 162751 155172
4592A55172j4949k0275j7577j3394j1454o690p600n953l817K12L138L677Q053
$$ 155172 140223 119948 102371 88977 77523 70833 63233 57280 53463 53675 56813 60490 68543
4579F8543J3464J7447K0883J9495R365j236j2340j5838j6213j1306r325n336n108
$$ 68543 82007 99454 120337 139832 149197 147961 135621 119783 103570 92264 82939 77603 72495
4566G2495p745r974q422o870o714n467p816l329k536o83k573j63P2N44K727L578
$$ 72495 64750 54776 46354 39484 32770 27303 19487 16158 13622 12939 10366 10203 10275 10819 13546 17124
4550A7124P086O701M944j625m486l543l382o933p182p371m354l182m087p692l622
$$ 17124 24210 30911 35855 34230 29744 26201 22819 15886 8704 1333 -3021 -6203 -10290 -17982 -21604
4535b1604m30K608L03J115l558P60j102K10r93L85R71p89j665j603J022J011j826
$$ -21604 -22034 -19426 -19123 -18008 -21566 -20806 -21908 -21698 -22691 -22306 -21335 -22124 -23789 -25392 -24370 -23359 -25185
4518b5185j417k73K122J518k21k807p05m9n51j561j982K10K048q06n55j251J647
$$ -25185 -26602 -26875 -24753 -23235 -23456 -26263 -26968 -27017 -27568 -29129 -31111 -30901 -28853 -29659 -30214 -31465 -29818
4501b9818J63K48q67k76k17J970M65k081m016Q71L63J367J201j603l696J365K483
$$ -29818 -29655 -29407 -30274 -30550 -30767 -28797 -28332 -30413 -34429 -33558 -33195 -31828 -30627 -32230 -35926 -34561 -32078
4484c2078K144k321k591L628L072m21k379k435j086J16J743p57k387p03L189J508
$$ -32078 -29934 -32255 -34846 -31218 -28146 -28567 -30946 -33381 -34467 -34351 -32608 -33365 -35752 -36455 -33266 -31758
4468c1758k332k609K656L598j540l686j076K022Q09k772J344K138o41j093j448
$$ -31758 -34090 -36699 -34043 -30445 -31985 -35671 -36747 -34725 -33916 -36688 -35344 -33206 -33847 -34940 -36388
4453c6388K875j321k695l25K539N14j005l71k147m57K573J474j729n178K057L223
$$ -36388 -33513 -34834 -37529 -37854 -35315 -34801 -35806 -36177 -38324 -38781 -36208 -34734 -36463 -41641 -39584 -36361
4437c6361N41j216l926K780L430J707o83k480l155K418J484j754k334M98M84K068
$$ -36361 -35820 -37036 -40962 -38182 -34752 -33045 -33728 -36208 -39363 -36945 -35461 -37215 -39549 -39051 -38567 -36499
4421c6499j083M5m38N41p40r97K697j87l214q21L827O80o593m868M336O714K505
$$ -36499 -37582 -37537 -37975 -37434 -38174 -39171 -36474 -36661 -39875 -40696 -36869 -36189 -42782 -47650 -43314 -36600 -34095
4404c4095K595K991j807o460m921L011K920j501m33J498n26P5m41R27N94j036
$$ -34095 -31500 -28509 -30316 -36776 -41697 -38686 -35766 -37267 -37700 -36202 -36728 -36653 -37094 -36167 -35573 -36609
4388c6609L41K20R24l01l405O72J673k102n308K00O017L743L488N461q13q517
$$ -36609 -36268 -36048 -35124 -35425 -38830 -38158 -36485 -38587 -43895 -43695 -37678 -33935 -30447 -24986 -25799 -34316
4372c4316o659K775M402Q8j399j02J106K51K46j363J602r34M72m86J176J097l004
$$ -34316 -40975 -38200 -33798 -33710 -35109 -35211 -34105 -33854 -33608 -34971 -33369 -34303 -33831 -34317 -33141 -32044 -35048
4355c5048l411K501K384k0k840O5L691K643J132n47k713p92K204M8k190N00l90
$$ -35048 -38459 -35958 -33574 -33594 -36434 -36369 -32678 -30035 -28903 -29450 -32163 -32955 -30751 -30703 -32893 -32393 -32783
4338c2783M97M34R7j016p67P59O44j674p27K65J557j618P23K919J444J164j961
$$ -32783 -32286 -31852 -31755 -32771 -33538 -32779 -32135 -33809 -34536 -34271 -32714 -34332 -33609 -30690 -29246 -28082 -30043
4321c0043p47K123m41j417j60R30J742n22k005j322J640j80j607K32J802r7k43
$$ -30043 -30790 -28667 -29108 -30525 -30685 -29755 -28013 -28535 -30540 -31862 -30222 -30402 -32009 -31777 -29975 -30072 -30315
4304c0315J069j339r35n81Q78K269k132N27n5k99N51L9j363N87j671j22L91J590
$$ -30315 -29246 -30585 -31520 -32101 -31223 -28954 -31086 -30559 -30614 -30913 -30362 -30323 -31686 -31099 -32770 -32892 -32501 -30911
4286c0911R89j218j00l55J335j101n51Q47R06n35L67k81J049J68r19J913m64j407
$$ -30911 -29922 -31140 -31240 -31595 -30260 -31361 -31912 -31065 -30159 -30694 -30327 -30608 -29559 -29391 -30310 -28397 -28861 -30268
4268c0268o1n08n5J137m67p53M40n71N79m6L03o37l85J164N08j106R39j273J03
$$ -30268 -30329 -30837 -30892 -29755 -30222 -30975 -30535 -31106 -30527 -30573 -30270 -30907 -31292 -30128 -29620 -30726 -29787 -31060 -30957
4249c0957R27l41Q50J67R1J337N57p75j49r07k08q00N63J14m65K51R42P21k081
$$ -30957 -30030 -30371 -29521 -29354 -29263 -27926 -27369 -28144 -28293 -29200 -29408 -30208 -29645 -29531 -29996 -29745 -28803 -28082 -30163
4230c0163J260q81Q55o86p42L11R59J091j99r52j281J812o22J824j493M74N23
$$ -30163 -28903 -29784 -28929 -29615 -30357 -30046 -29087 -27996 -28195 -29147 -30428 -28616 -29238 -27414 -28907 -28433 -27910
4213b7910O31m60O13j190K1L13o8J514j165M20m55p57J286M11n35k75l50K90J569
$$ -27910 -27279 -27739 -27126 -28316 -28295 -27982 -28050 -26536 -27701 -27281 -27736 -28493 -27207 -26796 -27331 -27606 -27956 -27666 -26097
4194b6097k051P33n14Q88l2J071j535J19J111j360R75M85J44m99N74o73P71k60
$$ -26097 -28148 -27415 -27929 -27041 -27073 -26002 -27537 -27418 -26307 -27667 -26692 -26207 -26063 -26562 -25988 -26661 -25890 -26150
4176b6150n00P83P85J77q55m93M75R88n72n55N02Q26j001J450q07n77J181O61
$$ -26150 -26650 -25867 -25082 -24905 -25760 -26253 -25778 -24790 -25362 -25917 -25415 -24589 -25590 -24140 -24947 -25524 -24343 -23682
4158b3682l96R75q44L17j3L26O1n12J133j809Q14k58J239l32k41K24J464k6m71
$$ -23682 -24078 -23103 -23947 -23630 -23643 -23317 -23256 -23768 -22635 -24444 -23630 -23888 -22649 -22981 -23222 -22998 -21534 -21560 -22031
4139b2031L87Q61p8K98L46j76R89Q9p3j315J770K32J371J092p83P35Q71J514J959
$$ -22031 -21644 -20783 -20861 -20563 -20217 -20393 -19404 -19315 -19388 -20703 -18933 -18701 -17330 -16238 -17021 -16286 -15415 -13901 -11942
4120a1942q77Q89q57J238K347J972K161k61J656M136L304K840L159N145O773P986
$$ -11942 -12819 -11930 -12787 -11549 -9202 -7230 -5069 -5330 -3674 462 3766 6606 9765 14910 21683 29669
4104B9669Q670J0770Q902M277J367j112n148l977m263n973l948l581j384K378
$$ 29669 38339 49109 58011 62288 63655 62543 57395 53418 49155 43182 39234 35653 34269 36647
4090C6647J222Q66M972O660R475J3352J4271J4918J3725Q648L342m408j0088j2330
$$ 36647 37869 38735 43707 50367 59842 73194 87465 102383 116108 124756 128098 123690 113602 101272
4076A01272j2940j1742j1046r951o677p197l034k893j358j323K662J19K929M500
$$ 101272 88332 76590 65544 55593 48916 41719 38685 35792 34434 33111 35773 35892 38821 43321
4062D3321O434M201M71k308k552n657n579q523n751n348n099l297k158j612m265
$$ 43321 49755 53956 54427 52119 49567 43910 38331 29808 24057 18709 13610 10313 8155 6543 2278
4047B278k541k861m76j466j392j339n18N29k666k510r33K137J139l440k793j236
$$ 2278 -263 -3124 -3600 -5066 -6458 -7797 -8315 -7786 -10452 -12962 -13895 -11758 -10619 -14059 -16852 -18088
4031a8088N604R45l427k816j586J753N97j175k384M98M078J133l484l336j87K288
$$ -18088 -12484 -11539 -14966 -17782 -19368 -17615 -17018 -18193 -20577 -20079 -16001 -14868 -18352 -21688 -21875 -19587
4015a9587K541j863j881p07J488J129j193k240J031R01J357N46j665l706p90M739
$$ -19587 -17046 -18909 -20790 -21497 -20009 -18880 -20073 -22313 -21282 -20381 -19024 -18478 -20143 -23849 -24639 -19900
3999a9900M269j831m162m92L411k708q055m487P366P527j262n001o61M961J650
$$ -19900 -15631 -17462 -21624 -22116 -18705 -21413 -29468 -33955 -26589 -19062 -20324 -25325 -25986 -21025 -19375
3984a9375j326l863J521K225N37k766j972P2K408K528l109j092k75J110J367k240
$$ -19375 -20701 -24564 -23043 -20818 -20281 -23047 -25019 -24947 -22539 -20011 -23120 -24212 -24487 -23377 -22010 -24250
3968b4250l142R49N585M249j721o213k50M519J558k594l615O13J157L125J523
$$ -24250 -27392 -26443 -20858 -16609 -18330 -24543 -24793 -20274 -18716 -21310 -24925 -24312 -23155 -20030 -18507
3953a8507k651k943p6L249M93k524n495K77Q646L347q688j2977j405J2168N612
$$ -18507 -21158 -24101 -24177 -20928 -20435 -22959 -28454 -28177 -19531 -16184 -24872 -37849 -39254 -27086 -21474
3938b1474m45L469J1360M281j0879q913M84K562j220R47N59k657l326L173K655
$$ -21474 -21919 -18450 -7090 -2809 -13688 -22601 -22117 -19555 -20775 -19828 -19269 -21926 -25252 -22079 -19424
3923a9424J087l943j340K429J572O90j851j015J52j070K80O30k747M281M018L676
$$ -19424 -18337 -22280 -23620 -21191 -19619 -18929 -20780 -21795 -21643 -22713 -22433 -21803 -24550 -20269 -16251 -12575
3907a2575o229l922K265M261m95l498k838J422L138J402k282j073K03J248N52
$$ -12575 -18804 -22726 -20461 -16200 -16695 -20193 -23031 -21609 -18471 -17069 -19351 -20424 -20221 -18973 -18421
3892a8421J206P58j218l503j321M935M197m03n789LL470k165r341m072O895Q706
$$ -18421 -17215 -16457 -17675 -21178 -22499 -17564 -13367 -13770 -19559 -19556 -16086 -18251 -27592 -31664 -24769 -16063
3876a6063O91m796r20K411L373j155l199p06J786K564k11l572k456P88L416K253
$$ -16063 -15372 -20168 -21088 -18677 -15304 -16459 -19658 -20364 -18578 -16014 -16225 -19797 -22253 -21465 -18049 -15796
3860a5796r35k161p24q00K005j44j374Q19J070L679k164l762j322J381J005L906
$$ -15796 -16731 -18892 -19616 -20416 -18411 -18555 -19929 -19110 -18040 -14361 -16525 -20287 -21609 -20228 -19223 -15317
3844a5317j126l790k77L422M005k006m140N35L249J223l211j823J708j461n77
$$ -15317 -16443 -20233 -20510 -17088 -13083 -15089 -19229 -18694 -15445 -14222 -17433 -19256 -17548 -19009 -19586
3829a9586R61J335J566j035K79K499K160j997k674R74J337q24j053o90J67J395
$$ -19586 -18625 -17290 -15724 -16759 -16480 -13981 -11821 -13818 -16492 -15518 -14181 -15005 -16058 -16748 -16581 -15186
3813a5186L76J537j317j715L015L814n52n356l390Q78p8M24j66L864L859n2k163
$$ -15186 -14810 -13273 -14590 -16305 -13290 -9476 -10028 -15384 -18774 -17896 -17974 -17550 -17716 -13852 -9993 -10045 -12208
3796a2208j507J035J159J67QJ25J44k418J828R07q58j52J043N09P96K00K518J30
$$ -12208 -13715 -12680 -11521 -11354 -11346 -11221 -11077 -13495 -11667 -10760 -11618 -11770 -10727 -10218 -9422 -9222 -6704 -6574
3778f574l959k570l04P79j830j16M007M145J647k738r62J686Q29q97J052l19K26
$$ -6574 -10533 -13103 -13407 -12628 -14458 -14574 -10567 -6422 -4775 -7513 -8475 -6789 -5960 -6857 -5805 -6124 -5898
3761e898m87N76J602k747m79J648L551j876j081K77K120J899k117J82J9J362J071
$$ -5898 -6385 -5809 -4207 -6954 -7433 -5785 -2234 -4110 -5191 -4914 -2794 -895 -3012 -2830 -2811 -1449 -378
3744c78J386L069P12l313K10J015k052m16j248J045K277m48L042L485K294r35
$$ -378 1008 4077 4789 1476 1686 2701 649 233 -1015 30 2307 1859 4901 8386 10680 9745
3728I745r5K006j75J10n28M24J543K489m85K004K568M082O030K809K008j106n39
$$ 9745 9650 11656 11481 11591 11063 11487 13030 15519 15034 17038 19606 23688 29718 32527 34535 33429 32890
3711C2890n62j295m067o33O06J135J365J898L313L559N086M294P540J1445J3673
$$ 32890 32328 31033 26966 26333 26939 28074 29439 31337 34650 38209 43295 47589 55129 66574 80247
3696H0247J6520J4402P889J638n553q115r319q232m847l694o094k394m490n554
$$ 80247 96767 111169 119058 120696 115143 107028 97709 89477 84630 80936 74842 72448 67958 62404
3682F2404o279n239l415l120k917j576j14q35j406m23L32O41j450O49J465J459
$$ 62404 56125 50886 47471 44351 41434 39858 39744 38909 37503 37080 37412 38053 36603 37252 38717 40176
3666D0176J69p90r6K147p7R89L48Q36J948L199J162Lj309j437K285j2k65P68J11
$$ 40176 40345 39555 39459 41606 41529 42518 42866 43702 45650 48849 50011 50014 48705 47268 49553 49541 49276 50044 50155
3647E0155J337r81J376k1J323k91K26M13J870J045J556J621Q78L88K409L87J835
$$ 50155 51492 50511 51887 51866 53189 52898 53124 53537 55407 56452 58008 59629 60507 60895 63304 63691 65526
3630F5526J786L31O57J411M64J99K185K22P54N81K743L259K189J649M16J755K537
$$ 65526 67312 67643 68300 69711 70175 70374 72559 72781 73535 74116 76859 80118 82307 83956 84372 86127 88664
3613H8664L203M322L555K458M771K341K000K490N649R086Q514Q505Q267N789O546
$$ 88664 91867 96189 99744 102202 106973 109314 111314 113804 119453 128539 137053 145558 153825 159614 166160
3598A66160J0128J4061J9195K4340M3282J30879L25756N45701N41983J9011k71771
$$ 166160 176288 190349 209544 233884 277166 408045 733801 1279502 1821485 1840496 1568725
3587A568725k84722k88734k46735j71084j21192q4814n8808l5998j9909j5163
$$ 1568725 1284003 995269 748534 577450 456258 371444 312636 276638 256729 241566
3577B41566j1439r012j0407p223m874k928k843m054m503k012k661p38j382k873
$$ 241566 230127 221115 210708 203485 198611 195683 192840 188786 184283 182271 179610 178872 177490 174617
3563A74617m620l678J073J966K329n88J402J131J974L124K883J414R02k155K20
$$ 174617 169997 166319 167392 169358 171687 171099 172501 173632 175606 178730 181613 183027 183929 181774 181994
3548A81994P99K220K337L115L224J787O60J132R72L644K558L714K350J497L399
$$ 181994 182793 185013 187350 190465 193689 195476 196136 197268 198240 201884 204442 208156 210506 212003 215402
3533B15402N801P608O928M038J672O62Q09K656M465L577N458J324J704J137M313
$$ 215402 221203 228811 235739 239777 241449 242111 242920 245576 250041 253618 259076 260400 262104 263241 267554
3518B67554O830N489N599N480R050J2299J0593O270J748P18J649l2K923L349L471
$$ 267554 274384 279873 285472 290952 300002 312301 322894 329164 330912 331630 333279 333247 336170 339519 342990
3503C42990M982O198P196N698J979k134k165O02O104J1382J4145K335l990m587
$$ 342990 347972 354170 361366 367064 369043 366909 364744 365346 371450 382832 396977 399312 395322 390735
3489C90735k816l876q325j2332j1053k591J3530K0268K5894J2731N583p031j0951
$$ 390735 387919 384043 375718 363386 352333 349742 363272 383540 409434 422165 427748 420717 409766
3476D09766n229K750R861J9546K2922K5138K2255J7984J0724N613p54m325r207
$$ 409766 404537 407287 417148 436694 459616 484754 507009 524993 535717 541330 540576 536251 527044
3463E27044k263P105J7132L0710L1032K1347Q069J411J346P059O783O308J240
$$ 527044 524781 531886 549018 579728 610760 632107 640176 641587 642933 649992 656775 663083 664323
3450F64323L261J5353L2856L6206L5940K6648O106n225j2632r151Q662K7365L5674
$$ 664323 667584 682937 715793 751999 787939 814587 820693 815468 802836 793685 802347 829712 865386
3437H65386L6013K8715K8225K5094J7927J6681J3044M299L87L461K0303L3017
$$ 865386 901399 930114 958339 983433 1001360 1018041 1031085 1035384 1035771 1039232 1059535 1092552
3425A092552L5470M2109M2940L6362K2934K441R89L923O521J3783K5798M6250
$$ 1092552 1128022 1170131 1213071 1249433 1272367 1274808 1275797 1279720 1286241 1300024 1325822 1372072
3413A372072N8076O4155O1713M5412K9808L961n246r64J2818L4253M1188M0813
$$ 1372072 1430148 1494303 1556016 1601428 1631236 1635197 1629951 1628987 1641805 1676058 1717246 1758059
3401A758059L9722M0609M0745L5207L2214L7494M0194M7238M8879N3597N8962
$$ 1758059 1797781 1838390 1879135 1914342 1946556 1984050 2024244 2071482 2120361 2173958 2232920
3390B232920N8684O1044O1210N5350N4588O5325P0764P0543O7332P4090Q0436
$$ 2232920 2291604 2352648 2413858 2469208 2523796 2589121 2659885 2730428 2797760 2871850 2952286
3379B952286Q3068Q7410R3437R5802R3160R8290J11174J25426J20498R8375J20710
$$ 2952286 3035354 3122764 3216201 3312003 3405163 3503453 3614627 3740053 3860551 3958926 4079636
3368D079636J63421J74870J87462J99697K27006K16314J79651J94389K41512K51275
$$ 4079636 4243057 4417927 4605389 4805086 5032092 5248406 5428057 5622446 5863958 6115233
3358F115233K61766K74483L10803L65035M22575M78280O36560R62050J328788
$$ 6115233 6376999 6651482 6962285 7327320 7749895 8228175 8864735 9826785 11155573
3349A1155573J398076J217018J364909J609364K069661K856214L982731N812081
$$ 11155573 12553649 13770667 15135576 16744940 18814601 21670815 25653546 31465627
3341C1465627R230307J8326377M5490927P5040132P4646153M2054169j971128
$$ 31465627 40695934 59022311 104513238 179553370 254199523 296253692 294282564
3334B94282564k4685657l2134967m1516282m4798483l7239782k9396082k1675836
$$ 294282564 269596907 237461940 195945658 151147175 113907393 84511311 62835475
3327F2835475j5460542r916093o160727m220956l132091k457452k367447k243026
$$ 62835475 47374933 37458840 31298113 27077157 23945066 21487614 19120167 16877141
3319A6877141j789624j335063j056898q50814p17506o44124n88787m91224m26256
$$ 16877141 15087517 13752454 12695556 11844742 11127236 10483112 9894325 9403101 8976845
3310H976845l87297l56208l00339k43962k53030k59585k07767j79172j86231j92990
$$ 8976845 8589548 8233340 7933001 7689039 7436009 7176424 6968657 6789485 6603254 6410264
3300F410264j92639j86196j81965j78308j71352j65363j60080j55240j48453j40382
$$ 6410264 6217625 6031429 5849464 5671156 5499804 5334441 5174361 5019121 4870668 4730286
3290D730286j33948j32317j27705j25485j22897j22573j19017j07014j00425r4549
$$ 4730286 4596338 4464021 4336316 4210831 4087934 3965361 3846344 3739330 3638905 3544356
3280C544356q6706q4702q1813q2758q2335p8563q3170q6919q4867p7165o8951
$$ 3544356 3457650 3372948 3291135 3208377 3126042 3047479 2964309 2877390 2792523 2715358 2646407
3269B646407o4468n9333m9196m9352n8826p2974q1796p9610p3121o2036n2346
$$ 2646407 2581939 2522606 2473410 2424058 2365232 2292258 2210462 2130852 2057731 1995695 1943349
3258A943349l4745j9780j8705k6819l5452n3019o1982p0390o2443l6909k0742
$$ 1943349 1908604 1888824 1870119 1843300 1807848 1754829 1692847 1622457 1560014 1523105 1502363
3247A502363j6465j3119j7489j9094k6939l3340l3558l5509l6903m1826m1152
$$ 1502363 1485898 1472779 1455290 1436196 1409257 1375917 1342359 1306850 1269947 1228121 1186969
3236A186969l1996k0200l009R953O123j1070k8358m4047m6153l9053k4231j1870
$$ 1186969 1154973 1134773 1131764 1141717 1147840 1136770 1108412 1064365 1018212 979159 954928 943058
3224I43058p624j0408j2093j1691q131n887j6597k5534l4169l5782l0791j5101
$$ 943058 935434 925026 912933 901242 893111 887224 870627 845093 810924 775142 744351 729250
3212G29250j764K703J33n575j3845j7790k0412k2634k5015k6848k3140j4407l998
$$ 729250 727486 730189 730322 724747 710902 693112 672700 650066 625051 598203 575063 560656 556658
3199E56658P136J0285P620m83j5627k4643k9122k0704j1899K30K424l986o246
$$ 556658 563794 574079 581699 581216 565589 540946 511824 491120 479221 479451 481875 477889 471643
3186D71643p294p557r860j9434k9179l0712k5849j4546m724j572n444j0941j3220
$$ 471643 464349 456792 446932 427498 398319 367607 341758 327212 322488 320916 315472 304531 291311
3173B91311j1432j1663j2367r930q650m873k374m409n664m684j0028j2137q580
$$ 291311 279879 268216 255849 245919 237269 232396 230022 225613 219949 215265 205237 193100 184520
3160A84520o517n158l145l367m84J114J253K79j609l430n358k958k293l79m328
$$ 184520 178003 172845 169700 166333 165849 166963 168216 168495 166886 163456 158098 155140 152847 152468 148140
3145A48140n907q575p911m393J454l65J009Q06k129l949j169l244K95j89j21m003
$$ 148140 142233 133658 125747 121354 122808 122443 123452 124258 122129 118180 117011 113767 114062 113873 113752 109749
3129A09749j461k318N55k137j303j066l948l553n895k972J082J46J077j127k932
$$ 109749 108288 105970 106525 104388 103085 102019 98071 94518 88623 85651 86733 86879 87956 86829 83897
3114H3897N61R06j203o58m523k617n68K955L5J874q91m331p295m523j637M14J140
$$ 83897 84458 85364 84161 83503 78980 76363 75795 78750 78785 80659 79768 75437 68142 63619 61982 62396 63536
3097F3536K489K910L365M266M992N999N925P420P451J0283J0763J1852J5894K5003
$$ 63536 66025 68935 72300 76566 81558 87557 93482 100902 108353 118636 129399 141251 157145 182148
3083A82148N9733J87431L99932N98545L89348j41048k81771k80892k81005k17394
$$ 182148 241881 429312 829244 1427789 1817137 1676089 1394318 1113426 832421 615027
3073F15027j55338j13893p8041n5585l1270k0425j5930j2539j0617j1809j1371
$$ 615027 459689 345796 267755 212170 180900 160475 144545 132006 121389 109580 98209
3062I8209q908m926j392j941q39k873l429k967k266n72j83j591p05P6q92m02J64
$$ 98209 89301 84375 82983 81042 80203 77330 73901 70934 68668 68096 67913 66322 65617 65693 64801 64399 64563
3045F4563O36k509k143k160k47k03j550l60J746J778J591P49k17Q57K111R36K036
$$ 64563 65199 62690 60547 58387 58140 57937 56387 56027 57773 59551 61142 61891 61674 62531 64642 65578 67614
3028F7614j292l51q76L009J941L806L249N002O030N542Q423J4433M5118R5156
$$ 67614 66322 65971 65095 68104 70045 73851 77100 82102 88132 93674 102097 116530 161648 256804
3014B56804J45749J29561k3130o5817o7089p1849n7274m2552l0716k0687j4017
$$ 256804 402553 532114 508984 443167 376078 304229 246955 204403 173687 153000 138983
3003A38983o269l633j199k567j346j405j484J925N519O567Q425R049R222J2773
$$ 138983 132714 129081 127882 125315 123969 122564 121080 123005 128524 135091 143516 152565 161787 174560
2989A74560J7889O3487J60725K64987L09745m561j29170j33838j42157j22824
$$ 174560 192449 255936 416661 681648 991393 986832 857662 723824 581667 458843
2979D58843q8098o6121m6604l0692j7760r515p537n719n871n024n950n139K712
$$ 458843 370745 304624 258020 227328 209568 200053 192516 186797 180926 175902 169952 164813 167525
2966A67525K310L975K532L256M116J0955K3603O6234J17025J51507M4812n8359
$$ 167525 169835 173810 176342 179598 183714 194669 218272 284506 401531 553038 597850 539491
2954E39491o7473o7389o1357m4986l1863k5220j8862j0316l799j555r22j747j085
$$ 539491 472018 404629 343272 298286 266423 241203 222341 212025 208226 206671 205749 204002 202917
2941B02917q92J823O114M076J180K27j971Q34L752N067N048N332L872L936r82
$$ 202917 202025 203848 209962 214038 215218 215445 213474 214308 218060 223127 228175 233507 237379 241315 240333
2926B40333q85r4L231M358L696P092L121L58j760K533M132M079J97J375M500R732
$$ 240333 239448 239354 242585 246943 250639 257731 260852 261210 259450 261983 266115 270194 270391 271766 276266 285998
2910B85998R342R222P120L574l548n500k089L757R134J2530J1911R154Q335N940
$$ 285998 295340 304562 311682 315256 311708 306208 304119 307876 317010 329540 341451 350605 358940 364880
2896C64880J690K002N242Q513L701m693m020J505R436J1985N359n081l365P069
$$ 364880 366570 368572 373814 382327 386028 381335 377315 378820 388256 400241 405600 400519 397154 404223
2882D04223J3658J6125J4788R861l042q572j550Q564J8360K6190J7710J2545Q119
$$ 404223 417881 434006 448794 458655 455613 447041 445491 454055 472415 498605 516315 528860 536979
2869E36979M253M859R884J4895J7751N984p84J568Q965K0916K2111J6520L252
$$ 536979 541232 546091 555975 570870 588621 594605 593821 595389 604354 625270 647381 663901 667153
2856F67153q146J495J0308K2427K7843K0543J2257P590N602J7377J9362K5121
$$ 667153 659007 660502 670810 693237 721080 741623 753880 761470 767072 784449 803811 828932
2844H28932J7822J3312P622O793J7776K7220L0547K5481J2507R519J2792J8916
$$ 828932 846754 860066 867688 874481 892257 919477 950024 975505 988012 997531 1010323 1029239
2832A029239K4939L1416L3790K2094R702R129J4434K9475M2324L6052L9312K8528
$$ 1029239 1054178 1085594 1119384 1141478 1151180 1160309 1174743 1204218 1246542 1282594 1321906 1350434
2820A350434K2044K8336K3664K1591K8729K5570L2642L6520M5242M6931M3778
$$ 1350434 1372478 1400814 1424478 1446069 1474798 1500368 1533010 1569530 1614772 1661703 1705481
2809A705481M2485L2731K7180L0754L9840N7462O2493N9683N5454N2015O0216
$$ 1705481 1747966 1780697 1807877 1838631 1878471 1935933 1998426 2058109 2113563 2165578 2225794
2798B225794N9370N8362O4798Q0755J03647P7313J00056R9779P0928P4867R6627
$$ 2225794 2285164 2343526 2408324 2489079 2592726 2670039 2770095 2869874 2940802 3015669 3112296
2787C112296R5001J01418J07111J22236J41695J51853J53662J53156J79617K28744
$$ 3112296 3207297 3308715 3415826 3538062 3679757 3831610 3985272 4138428 4318045 4546789
2777D546789K83278L82734N03484N84788P06136P90321P91448R52153J350311
$$ 4546789 4830067 5212801 5716285 6301073 7007209 7797530 8588978 9541131 10891442
2768A0891442K336346P084837J7080893K7048804K6941049j549800j2742726j3481359
$$ 10891442 13227788 20312625 37393518 64442322 91383371 89833571 77090845 63609486
2760F3609486j4220314j2001620q392568o103772m168089k828100j672517j096447
$$ 63609486 49389172 37387552 28994984 22891212 18723123 15895023 14222506 13126059
2752A3126059p93451o08362l99519j74229Q5419M68776P37609J028580J285706
$$ 13126059 12332608 11724246 11324727 11150498 11235917 11704693 12442302 13470882 14756588
2743A4756588J277271J591838K374275L970635J1288063K9840462M7201196N0603555
$$ 14756588 16033859 17625697 19999972 23970607 35258670 65099132 112300328 162903883
2735A62903883N297559j9215143k2498841k5201894k5061835j8365533j3831154
$$ 162903883 168201442 148986299 126487458 101285564 76223729 57858196 44027042
2728D4027042r796876o848368m347284k876530k156203j775758j509946j163335
$$ 44027042 34230166 27381798 23034514 20157984 18001781 16226023 14716077 13552742
2720A3552742q63096n23416j66960O8491K70645L45186M37788O88538J236563
$$ 13552742 12689646 12166230 11999270 12067761 12338406 12683592 13121380 13809918 15046481
2711A5046481L176042J0458999K0766101K8439415J3545412r512496j3140652
$$ 15046481 18222523 28681522 49447623 77887038 91432450 81919954 68779302
2704F8779302j3443330j3548608r897704p236317n200176l618501k455958j603716
$$ 68779302 55335972 41787364 31889660 24653343 19453167 15834666 13378708 11774992
2696A1774992j215579r71678q13298o22585m75334n41269m73461l86467l46069
$$ 11774992 10559413 9587735 8774437 8151852 7676518 7135249 6661788 6275321 5929252
2687E929252k98402k48846k22406k06215j88349j65664j41026j59509j27981j13404
$$ 5929252 5630850 5382004 5159598 4953383 4765034 4599370 4458344 4298835 4170854 4057450
2677D057450j27108j14697q6789q3152r1016r6825r9283q9088p6409o8038N514
$$ 4057450 3930342 3815645 3728856 3645704 3554688 3457863 3358580 3269492 3193083 3125045 3130559
2666C130559J24805K37247J82018j71085k28848k14395k17467j70581j43176j25021
$$ 3130559 3255364 3492611 3674629 3503544 3274696 3060301 2842834 2672253 2529077 2404056
2656B404056r8453p7431o2472o6350o3087o9854o6197n1238m7058l3515k0851
$$ 2404056 2305603 2228172 2165700 2099350 2036263 1966409 1900212 1848974 1801916 1768401 1747550
2645A747550k7731l6210m5336m7155l5650j9156K9683Q3422J23137M0900r7056
$$ 1747550 1719819 1683609 1638273 1591118 1555468 1536312 1565995 1649417 1772554 1813454 1716398
2634A716398j06917r6512r1697p1468o4112o0250m9803l9632k0598j7281k2365
$$ 1716398 1609481 1512969 1421272 1349804 1285692 1225442 1175639 1136007 1115409 1098128 1075763
2623A075763k8390m2041m0097k7249j4106n591r359k0941l1842l4838k4610j3542
$$ 1075763 1047373 1005332 965235 937986 923880 918289 908930 887989 856147 821309 796699 783157
2611G83157j0062r861k3180k6371k2930j7927j1572j0322j1764j7644k4155k0531
$$ 783157 773095 763234 740054 713683 690753 672826 661254 650932 639168 621524 597369 576838
2599E76838j2386l542M339J960q261j9319k8066k2382j3058n093k492p401j4024
$$ 576838 564452 560910 565249 567209 558948 539629 511563 489181 476123 471030 468538 461137 447113
2586D47113k2029j3193m623n389q060j5535k0005j8605p707p479j0793q999j0556
$$ 447113 425084 411891 407268 401879 393819 378284 358279 339674 331967 324488 313695 304696 294140
2573B94140q576n875k775l614j208r18o108j2913j7071j3330j0660j0077m457
$$ 294140 285564 279689 276914 273300 272092 271174 265066 252153 235082 221752 211092 201015 196558
2560A96558k441j903o764q819k460r56k720p648j0771r489n828k589j949j331
$$ 196558 194117 192214 185450 176631 174171 173215 170495 162847 152076 142587 136759 134170 132221 130890
2546A30890p83k068K597P842O076m711q113p350r702j0036q604n886p037n583
$$ 130890 130107 128039 130636 138478 144554 139843 131730 124380 114678 104642 96038 90152 83115 77532
2532G7532l059l851n104n792l035M84J574L394J791J03q96j293M65K305O708P510
$$ 77532 74473 70622 65518 59726 56691 57175 58749 62143 63934 64037 63141 61848 62313 64618 71326 78836
2516G8836J2028L6411Q8005J42854J46872j2125p1261p6715q0487o6840m7702
$$ 78836 90864 127275 215280 358134 505006 492881 421620 344905 264418 197578 149876
2505A49876l4192k2435j7839j4599j3827r217n263k747J050J649J716J256K872
$$ 149876 115684 93249 75410 60811 46984 37767 32504 29757 30807 32456 34172 35428 38300
2492C8300L258O155N545J3050J7920M7811J41410K48705L26197M3035j29186j39990
$$ 38300 41558 47713 53258 66308 84228 132039 273449 522154 848351 891386 762200 622210
2480F22210j49368j35089r4274o9170m8181l5019k3597j9869j3592j2004j0798
$$ 622210 472842 337753 243479 174309 126128 91109 67512 47643 34051 22047 11249
2469A1249n568k936k046j993k505M64P07J266O607P106J6683N4063J07687J51115
$$ 11249 5681 2745 699 -1294 -3799 -3335 -2628 -1362 5245 12351 29034 83097 190784 341899
2455C41899O8852n5319o9905p3448p1466n1071l5854k5443j8618j3348j0503o428
$$ 341899 410751 355432 285527 212079 140613 89542 53688 28245 9627 -3721 -14224 -20652
2443b0652p154o861m936l268m087l610k268j263k631r73j836l70j776P1l213j26
$$ -20652 -27806 -34667 -39603 -42871 -46958 -50568 -52836 -54099 -56730 -57703 -59539 -59909 -61685 -61614 -64827 -64953
2427f4953O3o90K07j639k550l04R28N55n99M77m41J325q91j221k272q81k027j400
$$ -64953 -64890 -65580 -65373 -67012 -69562 -69866 -68938 -68383 -68982 -68505 -68946 -67621 -68512 -69733 -72005 -72886 -74913 -76313
2409g6313j626j187J317q7r19j797Q95Jj812R7o10J775K74j201l9j94k3j167j932
$$ -76313 -77939 -79126 -77809 -77896 -78815 -80612 -79717 -79716 -81528 -81431 -82041 -80266 -79992 -81193 -81232 -81426 -81449 -82616 -84548
2390h4548O48K465J212k006m46O0j027N09k89j829j042L08K52J553j057n25N8
$$ -84548 -83900 -81435 -80223 -82229 -82675 -82615 -83642 -83133 -83422 -85251 -86293 -85985 -85733 -84180 -85237 -85762 -85704
2373h5704k16K2p18O68j616p31J919N99k4J8p21L66L05J46r65o70K49J66k46O61
$$ -85704 -85920 -85898 -86616 -85948 -87564 -88295 -86376 -85777 -85801 -85783 -86504 -86138 -85833 -85687 -86652 -87322 -87073 -86907 -87153 -86492
2353h6492J522k001q2j892Q98j85M70j44J491J49j581q55J93J77K180m23k73N44
$$ -86492 -84970 -86971 -87053 -88945 -88047 -88232 -87762 -87906 -86415 -86266 -87847 -88702 -88509 -88332 -86152 -86575 -86848 -86304
2335h6304J228J266K11j484j033J178P36p50r75m24Q87R9J649j199k266n11R27
$$ -86304 -85076 -83810 -83599 -85083 -86116 -84938 -84202 -84952 -85927 -86351 -85464 -85365 -83716 -84915 -87181 -87692 -86765
2318h6765J298q31j286J371j246j462l27J598O89O91M2K41J29N97j945K86J588
$$ -86765 -85467 -86298 -87584 -86213 -87459 -88921 -89248 -87650 -86961 -86270 -86228 -85987 -85858 -85261 -87206 -86920 -85332
2301h5332J865j441K90k658j074m46P65N21M53n39J317j80R7R42K83q1J72j105
$$ -85332 -83467 -84908 -84618 -87276 -88350 -88796 -88031 -87510 -87057 -87596 -86279 -86459 -86362 -85420 -85137 -85218 -85046 -86151
2283h6151Q81q72q5r82J736J775k895o98R97K194r15R6j416o97q44M8l5n27R16
$$ -86151 -85270 -86142 -86227 -87209 -85473 -83698 -86593 -87291 -86294 -84100 -85015 -84919 -86335 -87032 -87876 -87828 -87863 -88390 -87474
2264h7474J092K80k0L77J007j226o01J389m0M95J73k409L38k77J757n34n49P36
$$ -87474 -86382 -86102 -86122 -85745 -84738 -85964 -86565 -85176 -85216 -84721 -84548 -86957 -86619 -86896 -85139 -85673 -86222 -85486
2246h5486j654K52Q13M24N40J9Q12M4M18j451m85j315K897J222j430j898O10J539
$$ -85486 -87140 -86888 -86075 -85651 -85111 -85092 -84280 -84236 -83818 -85269 -85754 -87069 -84172 -82950 -84380 -86278 -85668 -84129
2228h4129N67k399k28K524J411o37m224J295O49l51j998R91J548K718j500j379
$$ -84129 -83562 -85961 -86189 -83665 -82254 -82891 -87115 -85820 -85171 -85522 -87520 -86529 -84981 -82263 -83763 -85142
2212h5142K053J60j061l78M17m42N94k88o05j437J427K086k307l469k52N754L393
$$ -85142 -83089 -82929 -83990 -84368 -83951 -84393 -83799 -84087 -84692 -86129 -84702 -82616 -84923 -88392 -88644 -82890 -79497
2195g9497l391l648J421P36M44p92j81K152j78j332j71m49L57r48k075J440K597
$$ -79497 -82888 -86536 -85115 -84379 -83935 -84727 -84908 -82756 -82934 -84266 -84437 -84886 -84529 -85477 -87552 -86112 -83515
2178h3515J059k236j672J625J152j41m083J153L634K04p530m401Q370N517k776
$$ -83515 -82456 -84692 -86364 -84739 -83587 -83728 -87811 -86658 -83024 -82820 -90350 -94751 -86381 -80864 -83640
2163h3640L771L206k124p978q52L895L573m502M27J278J041q20j472J583L54q26
$$ -83640 -79869 -76663 -78787 -86765 -87617 -83722 -80149 -84651 -84224 -82946 -81905 -82725 -84197 -82614 -82260 -83086
2147h3086L09J373j867m174K789M359J609j2177q454J0562J2562n855N034P367
$$ -83086 -82777 -81404 -83271 -87445 -84656 -80297 -78688 -90865 -99319 -88757 -76195 -82050 -77016 -69649
2133f9649p73j3613r310P914Q752k020l979R0L677n18o44n68J136J0k049J053
$$ -69649 -70422 -84035 -93345 -85431 -76679 -78699 -82678 -82588 -78911 -79429 -80073 -80641 -79505 -79495 -81544 -80491
2117h0491L866l402k593J76M547l454n601J83Q191l19J044L973J154n847n648
$$ -80491 -76625 -80027 -82620 -82444 -77897 -81351 -86952 -86769 -78578 -78897 -77853 -73880 -72726 -78573 -84221
2102h4221L94N445m38k600J006K021p52j823K109n28J448j962j173K507N79k118
$$ -84221 -83827 -78382 -78820 -81420 -80414 -78393 -79145 -80968 -78859 -79387 -77939 -79901 -81074 -78567 -77988 -80106
2086h0106k521K69M801K285l778l425M741r6p01j855P76M487M82l449j176K47
$$ -80106 -82627 -82358 -77557 -75272 -79050 -82475 -77734 -77830 -78531 -80386 -79610 -75123 -74641 -78090 -79266 -79019
2070g9019J916N10l9j850M09p36K105N67j779l278K724J913j57k024r71J434J568
$$ -79019 -77103 -76593 -76632 -78482 -78073 -78809 -76704 -76137 -77916 -81194 -78470 -76557 -76714 -78738 -79709 -78275 -76707
2053g6707j015l087K423p94r4r71K882J162M00k663p78K085j407l0R17J415o45
$$ -76707 -77722 -80809 -78386 -79180 -79274 -80245 -77363 -76201 -75801 -78464 -79242 -77157 -78564 -78594 -77677 -76262 -76907
2036g6907j958J991Pq49j226J641K05k12J375j651K18K25N84j306O75j474Q65
$$ -76907 -78865 -76874 -76867 -77716 -78942 -77301 -77096 -77308 -75933 -77584 -77366 -77141 -76557 -77863 -77188 -78662 -77797
2019g7797l64j017J600K16o97Q21J068n18j204O97J950k036m24r6J256J164rj363
$$ -77797 -78161 -79178 -77578 -77362 -78059 -77238 -76170 -76688 -77892 -77195 -75245 -77281 -77705 -77801 -76545 -75381 -75390 -76753
2001g6753M05L21n34L31j364o5m63L10M05K022j64j751l48R5J131K10N20k14n51
$$ -76753 -76348 -76027 -76561 -76230 -77594 -77659 -78122 -77812 -77407 -75385 -75549 -77300 -77648 -77553 -76422 -76212 -75692 -75906 -76457
1982g6457M61j005O09j50J44k69R23n44m6o91J706m41O20q06k20j56q73R78Q75
$$ -76457 -75996 -77001 -76392 -76542 -76398 -76667 -75744 -76288 -76334 -77025 -75319 -75760 -75140 -75946 -76166 -76322 -77195 -76217 -75342
1963g5342J418j341j546J97O07n50N56o03M91q44Q01M52j037O14l36L19j103l5
$$ -75342 -73924 -75265 -76811 -76614 -76007 -76557 -76001 -76604 -76113 -76957 -76156 -75704 -76741 -76127 -76463 -76144 -77247 -77282
1945g7282J2R33o1J584k37P7j621Q74J034n70K71n38P10k40j74q05M28q63K541
$$ -77282 -77270 -76337 -76398 -74814 -75051 -74974 -76595 -75721 -74687 -75257 -74986 -75524 -74814 -75054 -75228 -76033 -75605 -76468 -73927
1926g3927l64j111J030r21R9n03m16k78P17J14p85N34R38L86N07N28k173P19j91
$$ -73927 -74291 -75402 -74372 -75293 -75194 -75697 -76113 -76391 -75674 -75560 -76345 -75811 -74873 -74487 -73980 -73452 -75625 -74906 -75097
1907g5097m71n35K060R20j899l53M64J42L80j273N33Q29j505J048N18P41j271
$$ -75097 -75568 -76103 -74043 -73123 -75022 -75375 -74911 -74769 -74389 -75662 -75129 -74300 -75805 -74757 -74239 -73498 -74769
1890g4769Q99m35n69k04O74j285J251l7J68N12o32j218J44J508j090Q12r6j34
$$ -74769 -73870 -74305 -74874 -75078 -74404 -75689 -74438 -74475 -74307 -73795 -74427 -75645 -75501 -73993 -75083 -74271 -74367 -74501
1872g4501q19K39m33J342r28K34r63K119M30o02j003J665j371N69N88k0q22P16
$$ -74501 -75320 -75081 -75514 -74172 -75100 -74866 -75829 -73710 -73280 -73882 -74885 -73220 -74591 -74022 -73434 -73454 -74276 -73560
1854g3560O5r58R6J279l75j31k189P44R0J250p00R5M72j606J136m70O29k74m08
$$ -73560 -73495 -74453 -74357 -73078 -73453 -73584 -75773 -75029 -74939 -73689 -74389 -74294 -73822 -75428 -74292 -74762 -74133 -74407 -74815
1835g4815p87J354L99K85r15M35M60K22o89Q43J89m64m86P3J180p51J22j934N31
$$ -74815 -75602 -74248 -73849 -73564 -74479 -74044 -73584 -73362 -74051 -73208 -73019 -73483 -73969 -73896 -72716 -73467 -73345 -75279 -74748
1816g4748J177L69l39r29r6P05J029j030l55N41l31L24J713o77j442K81P29R02
$$ -74748 -73571 -73202 -73541 -74470 -74566 -73861 -72832 -73862 -74217 -73676 -74007 -73683 -71970 -72647 -74089 -73808 -73079 -72177
1798g2177j178J02O48j387O97J69l76o32k07J325r07k17k917L339K98n99o92L56
$$ -72177 -73355 -73253 -72605 -73992 -73295 -73126 -73502 -74134 -74341 -73016 -73923 -74140 -77057 -73718 -73420 -74019 -74711 -74355
1780g4355J632M91j255j649n44K069K44m59jM63K99m26r0k11O34j879m40K210
$$ -74355 -72723 -72232 -73487 -75136 -75680 -73611 -73367 -73826 -73827 -73364 -73065 -73491 -73581 -73792 -73158 -75037 -75477 -73267
1762g3267J331J44j774m42P79O34r08j54p25n24J76k67N03j216n45L05PJ282n0
$$ -73267 -71936 -71792 -73566 -74008 -73229 -72595 -73503 -73657 -74382 -74906 -74730 -74997 -74494 -75710 -76255 -75950 -75943 -74661 -74711
1743g4711pJ860n36j056p03J432p85m32Q50N67r40j012J667K013Q47k272q03P56
$$ -74711 -74718 -72858 -73394 -74450 -75153 -73721 -74506 -74938 -74088 -73521 -74461 -75473 -73806 -71793 -70946 -73218 -74021 -73265
1725g3265k112j004j104R71K934m8j762J544J977n13j434r42J735M53j004J236
$$ -73265 -75377 -76381 -77485 -76514 -73580 -73628 -75390 -73846 -71869 -72382 -73816 -74758 -73023 -72570 -73574 -72338
1709g2338j603M63o99O73j283m74N67K627j661j976k8K378J665m28j236J122J53
$$ -72338 -73941 -73478 -74177 -73504 -74787 -75261 -74694 -72067 -73728 -75704 -75732 -73354 -71689 -72117 -73353 -72231 -72078
1692g2078Q25j129p79K181M6j448j94M11N26j67q57O15OQ86j258j45j369k05K728
$$ -72078 -71253 -72382 -73161 -70980 -70934 -72382 -72576 -72165 -71639 -71806 -72663 -72048 -72042 -71156 -72414 -72559 -73928 -74133 -71405
1673g1405l21k728K77K644J973p50k033m72Q83K880j9j059j824J91J539j161k18
$$ -71405 -71726 -74454 -74177 -71533 -69560 -70310 -72343 -72815 -71932 -69052 -69071 -70130 -71954 -71763 -70224 -71385 -71603
1656g1603K46j531J938P13r71j497J464J741j445j507J086L343j665j490O48J56
$$ -71603 -71357 -72888 -70950 -70237 -71208 -72705 -71241 -69500 -70945 -72452 -71366 -68023 -69688 -71178 -70530 -70374
1640g0374k567j760L75K726L072j095n83j822L707J4k167p6J308Ol54L39j761
$$ -70374 -72941 -74701 -74326 -71600 -68528 -69623 -70206 -72028 -68321 -68307 -70474 -70550 -69242 -69236 -69590 -69251 -71012
1623g1012k559K706K695L31j195k163J919Q83j002j464J9j037K189J7P8r57j764
$$ -71012 -73571 -70865 -68170 -67839 -69034 -71197 -69278 -68395 -69397 -70861 -70842 -71879 -69690 -69673 -69595 -70552 -72316
1606g2316K29K025O36L03k139J072J911M57k588j558L97J055K1M90N82Q8O21o55
$$ -72316 -72087 -70062 -69426 -69123 -71262 -70190 -68279 -67822 -70410 -71968 -71571 -70516 -70495 -70005 -69423 -69335 -68714 -69369
1588f9369o02O20r06o19O39K598n45q26j589l26k17m14N3J490r2p19J280M58k095
$$ -69369 -69971 -69351 -70257 -70876 -70237 -67639 -68184 -69010 -70599 -70925 -71142 -71556 -71503 -70013 -70105 -70824 -69544 -69086 -71181
1569g1181J104J227K477k571j306j833L85J328n41O56K50K249j918j986J008N14
$$ -71181 -70077 -68850 -66373 -68944 -70250 -72083 -71698 -70370 -70911 -70255 -70005 -67756 -69674 -71660 -70652 -70138
1553g0138M41m14k45N97k25k057N47J588M39J65O5j888k20L189K512j350m658
$$ -70138 -69697 -70111 -70356 -69759 -69984 -72041 -71494 -69906 -69467 -69302 -69237 -71125 -71345 -68156 -65644 -66994 -71652
1536g1652k165L146R10k035j068K288M338J108m705j735J381Q45l50l5j81j521
$$ -71652 -73817 -70671 -69761 -71796 -72864 -70576 -66238 -65130 -69835 -71570 -70189 -69344 -69694 -69729 -69910 -71431
1520g1431K431K87m61k150O79J317J119k488j02J889j6k299J77q6J851j572k368
$$ -71431 -69000 -68713 -69174 -71324 -70645 -69328 -68209 -70697 -70799 -68910 -68926 -71225 -71048 -71134 -69283 -70855 -73223
1503g3223L098K262o94j513R72J107n45j652J76P00p56j252J930P46j434m05J921
$$ -73223 -70125 -67863 -68557 -70070 -69098 -67991 -68536 -70188 -70012 -69312 -70068 -71320 -69390 -68644 -70078 -70483 -68562
1486f8562R92j791k82j431J099K209l03j177Q07l55L73q43l43n38M94J123O12
$$ -68562 -67570 -69361 -69643 -71074 -69975 -67766 -68069 -69246 -68439 -68794 -68421 -69264 -69607 -70145 -69651 -68528 -67916
1469f7916j500k02J87J342p07l95j041K409L91k590J232R07O92O66j154k513J80
$$ -67916 -69416 -69618 -69431 -68089 -68796 -69191 -70232 -67823 -67432 -70022 -68790 -67883 -67191 -66525 -67679 -70192 -70012
1452g0012K845L60k216n95J974m19j322q70k32J497O42R90p62j378L92J371O1
$$ -70012 -67167 -66807 -69023 -69618 -67644 -68063 -69385 -70255 -70487 -68990 -68348 -67358 -68120 -69498 -69106 -67735 -67674
1435f7674m63m23N87J52J34j404N70N5P32J479l156J41R27P88O35j436m72m06
$$ -67674 -68137 -68560 -67973 -67821 -67687 -69091 -68521 -68466 -67734 -66255 -69411 -69270 -68343 -67555 -66920 -68356 -68828 -69234
1417f9234J483L91j693Q99j542J271l99l74k68J124N37j180l4J55l5J123q56o50
$$ -69234 -67751 -67360 -69053 -68154 -69696 -68425 -68824 -69198 -69466 -68342 -67805 -68985 -69019 -68864 -68899 -67776 -68632 -69282
1399f9282K49J687j169k35l49O38j184L81m07N75n51J620l75J440j115j793N42
$$ -69282 -69033 -67346 -68515 -68750 -69099 -68461 -69645 -69264 -69671 -69096 -69647 -68027 -68402 -66962 -68077 -69870 -69328
1382f9328J223M14n43j090N1n67J400J14J90j204R30K84q51l84J886j556P80j382
$$ -69328 -68105 -67691 -68234 -69324 -69273 -69840 -68440 -68326 -68136 -69340 -68410 -68126 -68977 -69361 -67475 -69031 -68251 -69633
1364f9633R55L70l8M60m70j7p54N24P79k86j286o84Q81L96j40P33n11P0L23J852
$$ -69633 -68678 -68308 -68346 -67886 -68356 -68373 -69127 -68603 -67824 -68110 -69396 -70080 -69199 -68803 -68943 -68210 -68721 -68651 -68328 -66476
1344f6476j014j197L01l96J841j471j30n60J311j978J414m12P14o97M13m22P01
$$ -66476 -67490 -68687 -68386 -68782 -66941 -68412 -68542 -69102 -67791 -69769 -68355 -68767 -68053 -68750 -68337 -68759 -68058
1327f8058R68m59m06j62o81J047p1Q71j230pk66J037m79M0M29l88J15j697N32
$$ -68058 -67090 -67549 -67955 -68117 -68798 -67751 -67822 -66951 -68181 -68188 -68454 -67417 -67896 -67856 -67427 -67815 -67700 -69397 -68865
1308f8865K05j210J261O37J40j139N09Q37J170k910Q76k29J393R5k72j022O51
$$ -68865 -68660 -69870 -68609 -67972 -67832 -68971 -68462 -67625 -66455 -69365 -68489 -68718 -67325 -67230 -67502 -68524 -67873
1291f7873j73P96j379J281j433Q82J204o57j184J392p69J22J47j273J647l85q19
$$ -67873 -68046 -67250 -68629 -67348 -68781 -67899 -66695 -67352 -68536 -67144 -67913 -67791 -67644 -68917 -67270 -67655 -68474
1274f8474n14L46L71J532j164j100J290Q34r90J72J22r27M42r75R26J55o65J29
$$ -68474 -68988 -68642 -68271 -66739 -67903 -69003 -67713 -66879 -67869 -67697 -67575 -68502 -68060 -69035 -68109 -67954 -68619 -68490
1256f8490M75O39p12j65j576J763j86L11p77Q08k56J823j497q4k71RO99j064O7
$$ -68490 -68015 -67376 -68088 -68253 -69829 -68066 -68252 -67941 -68718 -67910 -68166 -66343 -67840 -67924 -68195 -68186 -67487 -68551 -68484
1237f8484Q75m65J59N95q19J71j921N23Q16J57N54o91J0L88m75j277J589k116
$$ -68484 -67609 -68074 -67915 -67320 -68139 -67968 -69889 -69366 -68550 -68393 -67839 -68530 -68520 -68132 -68607 -69884 -68295 -70411
1219g0411J175J607O13j271l64l04J093J65q55O7n39O09P01k07r17K49p71J685
$$ -70411 -69236 -67629 -67016 -68287 -68651 -68955 -67862 -67697 -68552 -68485 -69024 -68415 -67714 -67921 -68838 -68589 -69360 -67675
1201f7675Ml91j013K83J321J94j615O73N42k396R01N86K96J538k080J587q14L3
$$ -67675 -67671 -68062 -69075 -68792 -67471 -67277 -68892 -68219 -67677 -70073 -69172 -68586 -68290 -66752 -68832 -67245 -68059 -68026
1183f8026n72L86M97j346J2m6J260j406l67J597N01j19j294J055N54j719q12K269
$$ -68026 -68598 -68212 -67715 -69061 -69049 -69095 -67835 -69241 -69608 -68011 -67510 -67629 -68923 -67868 -67314 -69033 -69845 -67576
1165f7576J55k472P44J767o50j427o92M570k66j409j581K017J4j260j156k4K015
$$ -67576 -67421 -69893 -69149 -67382 -68032 -69459 -70151 -65581 -65847 -67256 -68837 -66820 -66806 -68066 -69222 -69246 -67231
1148f7231j51l52j209J330K73j691l55k48j47J229k07j570o93J987J939j04l411
$$ -67231 -67382 -67734 -68943 -67613 -67340 -69031 -69386 -69634 -69781 -68552 -68759 -70329 -71022 -69035 -67096 -67200 -70611
1131g0611q67K634Q22l050k089J567M659J337Rj626j018P70N97k959n43o45K796
$$ -70611 -71478 -68844 -68022 -71072 -73161 -71594 -66935 -65598 -65589 -67215 -68233 -67463 -66866 -69825 -70368 -71013 -68217
1114f8217j020M11j350J355J05n79J001M19o32j909O79M032k31n535p658J547
$$ -68217 -69237 -68826 -70176 -68821 -68716 -69295 -68294 -67875 -68507 -70416 -69737 -65705 -65936 -71471 -79129 -77582
1098g7582N134M231M387M910J78o568n005K010J692l841j55L724m9q60k51J101
$$ -77582 -72448 -68217 -63830 -58920 -58742 -65310 -70315 -68305 -66613 -70454 -70609 -66885 -66934 -67794 -68045 -66944
1082f6944J094j632j294K175k89p91j201K433J187l053o132k007L493M316N011
$$ -66944 -65850 -67482 -68776 -66601 -66890 -67681 -68882 -66449 -65262 -68315 -74447 -76454 -72961 -68645 -63634
1067f3634M414K952o739o665J723K951j480j619j0K900m94K04J015q64N64j542
$$ -63634 -59220 -56268 -63007 -69672 -67949 -64998 -66478 -68097 -68107 -65207 -65701 -65497 -64482 -65346 -64782 -66324
1051f6324P52J58J90p90j474J098J518o20k970m79Q75M658J432j701J30j002J259
$$ -66324 -65572 -65414 -65224 -66014 -67488 -66390 -64872 -65492 -68462 -68941 -68066 -63408 -61976 -63677 -63547 -64549 -63290
1034f3290M75j543j424J462l54r22J960p99j25Q40k99l92q68p3J61p88j629J343
$$ -63290 -62815 -64358 -65782 -64320 -64674 -65596 -63636 -64435 -64560 -63720 -64019 -64411 -65279 -65352 -65191 -65979 -67608 -66265
1016f6265L327q39p83L70L74L73k460j739L822J983j838k89N7N82n03m15n21J438
$$ -66265 -62938 -63777 -64560 -64190 -63816 -63443 -65903 -67642 -63820 -61837 -63675 -63964 -63907 -63325 -63828 -64243 -64764 -63326
998f3326o87p51J715j11o87j668Q53O74j043N70L78K31j47o8Q20n27k500R56O40
$$ -63326 -64013 -64764 -63049 -63160 -63847 -65515 -64662 -63988 -65031 -64461 -64083 -63852 -63999 -64067 -63247 -63774 -66274 -65318 -64678
979f4678J175n27r25J56J076M59p20m17j36J016N26j192j82J89n31J005O36M62
$$ -64678 -63503 -64030 -64955 -64799 -63723 -63264 -63984 -64401 -64537 -63521 -62995 -64187 -64369 -64180 -64711 -63706 -63070 -62608
961f2608j476L84n18k9m90J89j074J487j091O81o25o09O46J682l50j261P43P22
$$ -62608 -64084 -63700 -64218 -64247 -64737 -64548 -65622 -64135 -65226 -64545 -65170 -65779 -65133 -63451 -63801 -65062 -64319 -63597
943f3597K46r71J740o18j404j555J793J251o98q0j401K094n80n87k82N58O68n40
$$ -63597 -63351 -64322 -62582 -63200 -64604 -66159 -64366 -63115 -63813 -63893 -65294 -63200 -63780 -64367 -64649 -64091 -63423 -63963
925f3963J94p41p30J113K69O28q00j093j48J946M01r94o43J755m49j85j350N54
$$ -63963 -63769 -64510 -65240 -64127 -63858 -63230 -64030 -65123 -65271 -63325 -62924 -63918 -64561 -62806 -63255 -63440 -64790 -64236
907f4236q16O9j39J081n07R8L15q54J405l67L50o04R64q16k78p63R58N35m06n31
$$ -64236 -65052 -64983 -65122 -64041 -64548 -64450 -64135 -64989 -63584 -63951 -63601 -64205 -63241 -64057 -64335 -65098 -64140 -63605 -64011 -64542
887f4542R80o70j005Q55j559J759R16j412j82N72O92q62K24n42Q43p25l2k09j315
$$ -64542 -63562 -64232 -65237 -64382 -65941 -64182 -63266 -64678 -64860 -64288 -63596 -64458 -64234 -64776 -63933 -64658 -64690 -64899 -66214
868f6214J368j52P97K46j084J052m22k82K01rj522K72j34O55J156j094O03J033
$$ -66214 -64846 -64998 -64201 -63955 -65039 -63987 -64409 -64691 -64490 -64499 -66021 -65749 -65883 -65228 -64072 -65166 -64563 -63530
850f3530k429Q99n68O49r42r3R88J739m76k127L22K253j001j35L5N98m80j194
$$ -63530 -65959 -65060 -65628 -64979 -65921 -66014 -65026 -63287 -63763 -65890 -65568 -63315 -64316 -64451 -64416 -63818 -64298 -65492
832f5492j7J572j168R5N5l54kL42K64J355j638K2K9j19M8O85p50O36L64q28j350
$$ -65492 -65509 -63937 -65105 -65010 -64955 -65309 -65311 -64969 -64705 -63350 -64988 -64966 -64937 -65056 -65008 -64323 -65073 -64437 -64073 -64901 -66251
811f6251K662l12j257O68P00o06L80j48k53o44M59O03M46p22J50J82k39K99J002
$$ -66251 -63589 -63901 -65158 -64490 -63790 -64396 -64016 -64164 -64417 -65061 -64602 -63999 -63553 -64275 -64125 -63943 -64182 -63883 -62881
792f2881j535M32j90K73j241m79L45J380k99j14Q0l02j90J280j715O69K078k709
$$ -62881 -64416 -63984 -64174 -63901 -65142 -65621 -65276 -63896 -64195 -64309 -64229 -64531 -64721 -63441 -65156 -64487 -62409 -65118
774f5118K26o2Q71J44n68J203q05K93q04J057L62m72j176J139o68K23p64j88K38
$$ -65118 -64892 -64954 -64083 -63939 -64507 -63304 -64109 -63816 -64620 -63563 -63201 -63673 -64849 -63710 -64378 -64155 -64919 -65107 -64869
755f4869L82k99N15m2K5n35m79Q97n30Q0J68o6J253r47J17K71J07j177P00P21
$$ -64869 -64487 -64786 -64271 -64313 -64288 -64823 -65302 -64405 -64935 -64855 -64687 -64753 -63500 -64447 -64330 -64059 -63952 -65129 -64429 -63708
735f3708M21K41j842J052j028N28J326j072j063N04k67J697rk466J226q2Q14p73
$$ -63708 -63287 -63046 -64888 -63836 -64864 -64336 -63010 -64082 -65145 -64641 -64908 -63211 -63220 -65686 -64460 -64542 -63728 -64501
717f4501M17O27l84p77l97K60J340p84J20k42p43P92n2m07J90K4k09K39q28J407
$$ -64501 -64084 -63457 -63841 -64618 -65015 -64755 -63415 -64199 -64079 -64321 -65064 -64272 -64324 -64731 -64541 -64517 -64726 -64487 -65315 -63908
697f3908n48o31O86L45o62J076J28J45L97j339m09J60Q9j362P29L77j41l66J442
$$ -63908 -64456 -65087 -64401 -64056 -64718 -63642 -63514 -63369 -62972 -64311 -64720 -64560 -64471 -65833 -65104 -64727 -64868 -65234 -63792
678f3792n93j308J816n38J072n42j65k8m42P2R80p54p0j58M64J759n59j263p89
$$ -63792 -64385 -65693 -63877 -64415 -63343 -63885 -64050 -64078 -64520 -64448 -63468 -64222 -64292 -64450 -63986 -62227 -62786 -64049 -64838
659f4838J707j489k92m42O96P73j623J041R61R37o10k75O00j442N47J77k45l51
$$ -64838 -63131 -64620 -64912 -65354 -64658 -63885 -65508 -64467 -63506 -62569 -63179 -63454 -62854 -64296 -63749 -63572 -63817 -64168
641f4168K05R81j533J389j420j42K4O47O43J58N77j755o22J243j109j97%J488
$$ -64168 -63963 -62982 -64515 -63126 -64546 -64688 -64664 -64017 -63374 -63216 -62639 -64394 -65016 -63773 -64882 -65079 -65079 -63591
623f3591K4r81J173O99n27k59j232N64L59q55O79J3pJ53j271J685j55n89N1P36
$$ -63591 -63567 -64548 -63375 -62676 -63203 -63462 -64694 -64130 -63771 -64626 -63947 -63934 -63941 -63788 -65059 -63374 -63529 -64118 -64067 -63331
603f3331L43n65j064M69j740N87J032J66q4r82J090P74O28k093j64N47o96N01
$$ -63331 -62988 -63553 -64617 -64148 -65888 -65301 -64269 -64103 -64187 -65169 -64079 -63305 -62677 -64770 -64934 -64387 -65083 -64582
585f4582O74N46q9j35P0Kn79j58K93R50K14q59n02M96j797L24J411R08k252L4
$$ -64582 -63908 -63362 -63451 -63586 -63516 -63514 -64093 -64251 -63958 -63008 -62794 -63653 -64155 -63659 -65456 -65132 -63721 -62813 -65065 -65031
565f5031J062M59j093j21L00J195l0K76k270j021J898J87M71K35m97L005k555
$$ -65031 -63969 -63510 -64603 -64724 -64424 -63229 -63259 -62983 -65253 -66274 -64376 -64189 -63718 -63483 -63980 -60975 -63530
548f3530j006P9o19m0M64J151J2J29m91j281r2K150j741j165j01P06J526O6J062
$$ -63530 -64536 -64457 -65076 -65116 -64652 -63501 -63489 -63360 -63851 -65132 -65224 -63074 -64815 -65980 -66081 -65375 -63849 -63783 -62721
529f2721n14j822k575L81M533j632M89L050k655m514R91J672J730j054O38M82
$$ -62721 -63235 -65057 -67632 -67251 -62718 -64350 -63861 -60811 -63466 -67980 -66989 -65317 -63587 -64641 -64003 -63521
513f3521j080l39J005K71l55j059n80Q04J177j915j113L316M079l608p356N41
$$ -63521 -64601 -64940 -63935 -63664 -64019 -65078 -65658 -64854 -63677 -65592 -66705 -63389 -59310 -62918 -70274 -69733
497f9733O345j851r13P045k996p832J962L629K087j259pO15J150j572o19N34R69
$$ -69733 -63388 -65239 -66152 -59107 -62103 -69935 -67973 -64344 -62257 -63516 -63523 -62908 -61758 -63330 -63949 -63415 -62446
480f2446N9k453O89J637j290r57J572L211k097m942k217M754Q94k915P118O11
$$ -62446 -62387 -64840 -64151 -62514 -63804 -64761 -63189 -59978 -62075 -67017 -69234 -64480 -63586 -66501 -59383 -58772
464e8772q185n87M988J33j95l24K338m78r38k223J325K98L45j064j320K165n75
$$ -58772 -66957 -67544 -62556 -62423 -62618 -62942 -60604 -61082 -62020 -64243 -62918 -62620 -62275 -63339 -64659 -62494 -63069
447f3069k09J625p74l89j915n41J459J928j656K635J424k390l397J241J159q68
$$ -63069 -63278 -61653 -62427 -62816 -64731 -65272 -63813 -61885 -63541 -60906 -59482 -61872 -65269 -64028 -62869 -63737
431f3737Q78J137R84k371O17N1l09o87q8Q95q86N05Q21J392r43j442j52J148q81
$$ -63737 -62859 -61722 -60738 -63109 -62492 -62441 -62750 -63437 -63525 -62630 -63516 -63011 -62190 -60798 -61741 -63183 -63335 -62187 -63068
412f3068N15l4Q14M31Q08k049r06J97J109l49K62J29p16J140q73m47M18n78J407
$$ -63068 -62553 -62587 -61773 -61342 -60534 -62583 -63489 -63292 -62183 -62532 -62270 -62141 -62857 -61717 -62590 -63037 -62619 -63197 -61790
393f1790o5l61L58n03M98K66J68j13O04j802P21O62n21j363N78J24P90j09p68
$$ -61790 -61855 -62216 -61858 -62361 -61863 -61597 -61429 -61542 -60938 -62740 -62019 -61357 -61878 -63241 -62663 -62539 -61749 -61858 -62626
374f2626O96r01O35k79k82K63J2KL49r6l61j43L46k48J066P28k98K2n81j213q74
$$ -62626 -61930 -62831 -62196 -62475 -62757 -62494 -62482 -62480 -62131 -62227 -62588 -62731 -62385 -62633 -61567 -60839 -61137 -61115 -61696 -62909 -63783
353f3783J067O13m96R61m32K01m64o5Q04j257J201j104n82N78N86n15J84O80m52
$$ -63783 -62716 -62103 -62599 -61638 -62070 -61869 -62333 -62398 -61594 -62851 -61650 -62754 -63336 -62758 -62172 -62687 -62503 -61823 -62275
334f2275j91L34k77k57J019p04L87j212MN32n20L23J120j343P47m20J24J286L62
$$ -62275 -62466 -62132 -62409 -62666 -61647 -62351 -61964 -63176 -63172 -62640 -63160 -62837 -61717 -63060 -62313 -62733 -62609 -61323 -60961
315f0961j910J70P00k78j397J074l31o6R23m03j36Q20j112O30J195n32j622l00
$$ -60961 -62871 -62701 -62001 -62279 -63676 -62602 -62933 -62999 -62076 -62479 -62615 -61795 -62907 -62277 -61082 -61614 -63236 -63536
297f3536M64N56l78M08q99R36l69l58k73J765r72J25P7j471J238r36l92J390j5
$$ -63536 -63072 -62516 -62894 -62486 -63385 -62449 -62818 -63176 -63449 -61684 -62656 -62531 -62454 -63925 -62687 -63623 -64015 -62625 -62640
278f2640P35M04k5k49j016o2P56j238J459m04L02Q69j273Q1l97L33P30j84o66
$$ -62640 -61905 -61501 -61526 -61775 -62791 -62853 -62097 -63335 -61876 -62280 -61978 -61109 -62382 -62301 -62698 -62365 -61635 -61819 -62485
259f2485n32J096M80n58K20j464J89k88J112o39j60J000M90j168O71j362P94J371
$$ -62485 -63017 -61921 -61441 -61999 -61779 -63243 -63054 -63342 -62230 -62869 -63029 -62029 -61539 -62707 -62036 -63398 -62604 -61233
241f1233m18j340L12J014k90m44o86J157j358R22j7K12j786K488l09O79j386q60
$$ -61233 -61651 -62991 -62679 -61665 -61955 -62399 -63085 -61928 -63286 -62364 -62381 -62169 -63955 -61467 -61776 -61097 -62483 -63343
223f3343K01J670j124l02M27N57p95O64j90j378J265q53O47J089o89j454Q28N67
$$ -63343 -63142 -61472 -62596 -62898 -62471 -61914 -62709 -62045 -62235 -63613 -62348 -63201 -62554 -61465 -62154 -63608 -62780 -62213
205f2213o02o17L92J518k221J348N69J4j28j337k06j72L5N27k40m06q46K169j153
$$ -62213 -62815 -63432 -63040 -61522 -63743 -62395 -61826 -61812 -61940 -63277 -63483 -63655 -63620 -63093 -63333 -63739 -64585 -62416 -63569
186f3569j32J82J83K02l87j06r41J319N30j140k30o89J603P79p6j429n81M58J086
$$ -63569 -63701 -63519 -63336 -63134 -63521 -63627 -64568 -63249 -62719 -63859 -64089 -64778 -63175 -62396 -62472 -63901 -64482 -64024 -62938
167f2938O29m75j73o28m9j055O64j87P39J66j079J56P33p06q7Q52j041m71J218
$$ -62938 -62309 -62784 -62957 -63585 -63634 -64689 -64025 -64212 -63473 -63307 -64386 -64230 -63497 -64203 -64290 -63438 -64479 -64950 -63732
148f3732J43l91m12L97L13o29l64K81r32n32J113R50j634Q61j253J078J08o10
$$ -63732 -63589 -63980 -64392 -63995 -63682 -64311 -64675 -64394 -65326 -65858 -64745 -63795 -65429 -64568 -65821 -64743 -64635 -65245
130f5245R58j00N43k849K830j392R54n47m54q27J052k73M5K43L2Q2p57j58Q38
$$ -65245 -64287 -64387 -63844 -66693 -63863 -65255 -64301 -64848 -65302 -66129 -65077 -65350 -65305 -65062 -65030 -64948 -65705 -65863 -65025
111f5025j309K23K73R48m78m61m10J066o02J42l54K23r77K06J04J012j445N70
$$ -65025 -66334 -66111 -65838 -64890 -65368 -65829 -66239 -65173 -65775 -65633 -65987 -65764 -66741 -66535 -66431 -65419 -66864 -66294
93f6294o38O81o68M43n94O77j006J033q42R83j277Q30J48k88K56M06p24m15K4
$$ -66294 -66932 -66251 -66919 -66476 -67070 -66393 -67399 -66366 -67208 -66225 -67502 -66672 -66524 -66812 -66556 -66150 -66874 -67289 -67265
74f7265K6L62m4p89l08r4O66r01N76l88M34K61j065M84p86P56O6P77o9j050O82
$$ -67265 -67239 -66877 -66921 -67710 -68018 -68112 -67446 -68347 -67771 -68159 -67725 -67464 -68529 -68045 -68831 -68075 -68009 -67232 -67301 -68351 -67669
53f7669p45P68K25k63n10l04m22o65K63k46K12N64j89l23M6j76n61J596o61L51
$$ -67669 -68414 -67646 -67421 -67684 -68194 -68498 -68920 -69585 -69322 -69568 -69356 -68792 -68981 -69304 -69258 -69434 -69995 -68399 -69060 -68709
33f8709r51N63j247m8J75J064K88Nr80mm32N76o44K90K2K40j110R9Q50q92O47
$$ -68709 -69660 -69097 -70344 -70392 -70217 -69153 -68865 -68860 -69840 -69844 -70276 -69700 -70344 -70054 -70032 -69792 -70902 -70803 -69953 -70845 -70198
12g0198m15o57Q21K35o91M02p98k38M93n76K79j57
$$ -70198 -70613 -71270 -70449 -70214 -70905 -70503 -71301 -71539 -71046 -71622 -71343 -71500
0g1500
$$ -71500
$$ Imaginary data points
##PAGE= N=2
##DATA TABLE= (X++(I..I)), XYDATA
16383c20294L045K148L747L901L889K445M132L401L963L503L365L849K973L237
$$ -320294 -317249 -315101 -311354 -307453 -303564 -301119 -296987 -293586 -289623 -286120 -282755 -278906 -275933 -272696
16369b72696L587L448M341K281L855L341M027K818L085M294L614L518L629L300
$$ -272696 -269109 -265661 -261320 -259039 -255184 -251843 -247816 -244998 -241913 -237619 -234005 -230487 -226858 -223558
16355b23558L253L153K660L867M109K730K516N192K414L066M232K615M027K584
$$ -223558 -220305 -217152 -214492 -210625 -206516 -203786 -201270 -196078 -193664 -190598 -186366 -183751 -179724 -177140
16341a77140L465L729K779L654K571L539L420L250L416K817M154K363K790K755
$$ -177140 -173675 -169946 -167167 -163513 -160942 -157403 -153983 -150733 -147317 -144500 -140346 -137983 -135193 -132438
16327a32438L144L996K770L575K977L272L781L067K133L133L166K339L711J656
$$ -132438 -129294 -125298 -122528 -118953 -115976 -112704 -108923 -105856 -103723 -100590 -97424 -95085 -91374 -89718
16313h9718M710K613L309J698K840L334K521L345L487K268K880J778K491L742
$$ -89718 -85008 -82395 -79086 -77388 -74548 -71214 -68693 -65348 -61861 -59593 -56713 -54935 -52444 -48702
16299d8702L115K642L843J609L178J766L801K424K879K003L609K630J035K590
$$ -48702 -45587 -42945 -39102 -37493 -34315 -32549 -28748 -26324 -23445 -21442 -17833 -15203 -14168 -11578
16285a1578K763M526J478K409K098K442K306K405J732M119K765K083J606K122
$$ -11578 -8815 -4289 -2811 -402 1696 4138 6444 8849 10581 14700 17465 19548 21154 23276
16271B3276K468K931K465J960K730K880J365K782K714J481L461J395J028J254
$$ 23276 25744 28675 31140 33100 35830 38710 40075 42857 45571 47052 50513 51908 52936 54190
16257E4190M539J740J987J264J841L349K130N66K939J790K825R90K084J945J439
$$ 54190 58729 60469 62456 63720 65561 68910 71040 71606 74545 76335 79160 80150 82234 84179 85618
16242H5618K207J080K253J866J925J550K569J884J871J166K516J326J949J734
$$ 85618 87825 88905 91158 93024 94949 96499 99068 100952 102823 103989 106505 107831 109780 111514
16228A11514N76J795J432J368K333K182Q33K834P53k98K210K142J448J789R89
$$ 111514 112090 113885 115317 116685 119018 121200 122033 124867 125620 125322 127532 129674 131122 132911 133900
16213A33900J313K265P59N12J242K798P20K006P89P23J633J150K678J579nK454
$$ 133900 135213 137478 138237 138749 139991 142789 143509 145515 146304 147027 148660 149810 152488 154067 154062 156516
16197A56516p75J729Q21J435J362J805k89J477K83K566n0J530J059J004J567J528
$$ 156516 155741 157470 158291 159726 161088 162893 162604 164081 164364 166930 166880 168410 169469 170473 172040 173568
16181A73568m21Q91J202O64K373l21O76J408q4K089j44R43N41O96J640P83J367
$$ 173568 173147 174038 175240 175904 178277 177956 178632 180040 179956 182045 181901 182844 183385 184081 185721 186504 187871
16164A87871J207o39O56N71J095Q06O61J522N50M96P71J67P59J76O76P68N58K747
$$ 187871 189078 188439 189095 189666 190761 191567 192228 193750 194300 194796 195567 195734 196493 196669 197345 198113 198671 201418
16146B01418j372J214m32P21j392M004L3r24J462J068m37Q0R20L33J394j265J345
$$ 201418 200046 201260 200828 201549 200157 204161 204194 203270 204732 205800 205363 205443 206363 206696 208090 206825 208170
16129B08170K84J416J22N36Q4K00R82q5n4j99J360O3N26j21J319m77N84O26K54
$$ 208170 208454 209870 209992 210528 210612 210812 211794 211709 211655 211456 212816 212879 213405 213284 214603 214126 214710 215336 215590
16110B15590K37N48j055Q44L83J81J833j01K16o19r10K048j78k70N46M46O76M97
$$ 215590 215827 216375 215320 216164 216547 216728 218561 218460 218676 218057 217147 219195 219017 218747 219293 219739 220415 220912
16092B20912m93n52R39P27K88J189j103j87M78k6N04J223j204K52J07p2M63R33
$$ 220912 220419 219867 220806 221533 221821 223010 221907 221720 222198 222172 222676 223899 222695 222947 223054 222982 223445 224378
16074B24378j143K23J84L10l29N07L13J26j0J298n29J351j490p73J143J205P2
$$ 224378 223235 223458 223642 223952 223623 224130 224443 224569 224559 225857 225328 226679 225189 224416 225559 226764 226836
16057B26836J91k30j528P50M06m13P77L8k77j72O82j275P97Q2J2O31j19J632o32
$$ 226836 227027 226797 225269 226019 226425 226012 226789 226827 226550 226378 227060 225785 226582 226664 226676 227307 227188 228820 228188
16038B28188q74O6R75J12o6j741R91K42O60m65jJ091j045N70j487J077k31oK80
$$ 228188 227314 227380 228355 228467 228401 226660 227651 227893 228553 228088 228087 229178 228133 228703 227216 228293 228062 228056 228336
16019B28336M59j112J44o05M86n53O77K35m17L36J536j59l72J046p11j077O91
$$ 228336 228795 227683 227827 227222 227708 227155 227832 228067 227650 227986 229522 229363 228991 230037 229326 228249 228940
16002B28940j587J901r3K97J66p58O42j73r8j004M3Q08J75J07r02k1J157m16l79
$$ 228940 227353 229254 229161 229458 229624 228866 229508 229335 229237 228233 228276 229084 229259 229366 228464 228443 229600 229184 228805
15983B28805M70L89N33K47j247J697k261J682r39k02p7O6L04n47R95j007K121
$$ 228805 229275 229664 230197 230444 229197 230894 228633 230315 229376 229174 229097 229163 229467 228920 229915 228908 231029
15966B31029q31l74p60Q53j27M11o49l9q55J466O56L67k52p92P81Q68l22j269
$$ 231029 230198 229824 229064 229917 229790 230201 229552 229513 228658 230124 230780 231147 230895 230103 230884 231752 231430 230161
15948B30161k47K25K02l15k82K63N0P93r68P02k85o49L19k3M31N09l32l16N87
$$ 230161 229914 230139 230341 230026 229744 230007 230057 230850 229882 230584 230299 229650 229969 229946 230377 230886 230554 230238 230825
15929B30825n73O76Q03K85j373L07J093q79Q64j517J727j622JO97n86M69K9K96
$$ 230825 230252 230928 231731 232016 230643 230950 232043 231164 232028 230511 232238 230616 230617 231314 230728 231197 231226 231522
15911B31522M2o37N72m60K04L08J203p75J23k147R14J562m10M34o33O8o23j88
$$ 231522 231564 230927 231499 231039 231243 231551 232754 231979 232102 229955 230869 232431 232021 232455 231822 231890 231267 231079
15893B31079j35L53J399l03l00k33J500j460l87O48O42qj898K94J044m14L3o13
$$ 231079 230944 231297 232696 232393 232093 231860 233360 231900 231513 232161 232803 232795 230897 231191 232235 231821 231854 231241
15875B31241L32O24j01o22M96M07k10L11N53j222M08O79n40J64K91l80J081n67
$$ 231241 231573 232197 232096 231474 231970 232377 232167 232478 233031 231809 232217 232896 232356 232520 232811 232431 233512 232945
$$ [...]
##END NTUPLES=NMR SPECTRUM
##END=
