##TITLE=abcd
##JCAMPDX= 6.0         $$ Bruker NMR JCAMP-DX V2.0
##DATA TYPE= NMR SPECTRUM
##DATA CLASS= NTUPLES
##ORIGIN= UXNMR, Bruker Analytische Messtechnik GmbH
##OWNER= root
$$ XWIN-NMR		Version 3.5
$$ Tue Aug  4 16:26:07 2026 Russian Standard Time (UT+4h)  servis@DPX200
##.OBSERVE FREQUENCY= 200.131235884673
##.OBSERVE NUCLEUS= ^1H
##.ACQUISITION MODE= SIMULTANEOUS
##.ACQUISITION SCHEME= undefined
##.AVERAGES= 16
##.DIGITISER RES= 18
##SPECTROMETER/DATA SYSTEM= spect
##.PULSE SEQUENCE= zg
##.SOLVENT NAME= CDCl3
##.SHIFT REFERENCE= (INTERNAL, CDCl3, 0, 16.4885)
##AUDIT TRAIL= $$ (NUMBER, WHEN, WHO, WHERE, WHAT)
$$ ##TITLE= Audit trail, XWIN-NMR		Version 3.5
$$ ##JCAMPDX= 5.01
$$ ##ORIGIN= Bruker BioSpin GmbH
$$ ##OWNER= servis
$$ F:\spectra/data/av/nmr/H1/1/pdata/1/auditp.txt
$$ ##AUDIT TRAIL=  $$ (NUMBER, WHEN, WHO, WHERE, WHAT)
(   1,<2026-08-04 16:25:35.59 +0400>,<servis>,<DPX200>,
      <created by zg, POWCHK disabled, PULCHK disabled
       terminated by command 'halt'
       configuration hash MD5:
       00 E9 B6 7A A2 85 ED C7 34 08 36 98 17 FE 4E 26
       data hash MD5: 32K
       FB 4C 0C 72 19 45 D6 8E A9 4B E0 2B 6F 9E 23 E2>)
(   2,<2026-08-04 16:25:37.35 +0400>,<servis>,<DPX200>,
      <Start of raw data processing
       efp BC_mod = 2 LB = 0.05 FT_mod = 6 PKNL = 1 PHC0 = -415.9518 PHC1 = 3.101563 SI = 16K 
       data hash MD5: 16K
       A6 1E 1D 71 96 84 86 D7 67 7E A2 67 E3 AC 62 B4>)
(   3,<2026-08-04 16:25:48.00 +0400>,<servis>,<DPX200>,
      <pk PHC0 = 3.2 PHC1 = 0 
       data hash MD5: 16K
       2A 95 AB 9E EC B2 E1 E8 0C ED 61 FD 1F 2C 31 26>)
$$ ##END=
$$ 
$$ hash MD5
$$ A2 E8 F8 20 79 E5 32 08 8F A5 D6 46 9A B3 EA 6D
##$RELAX= 
##$RELAX= 
##$RELAX= 
##$RELAX= 
##$RELAX= 
##$RELAX= 
##$RELAX= 
##$RELAX= 
$$ Bruker specific parameters
$$ --------------------------
##$DU= <F:\spectra>
##$EXPNO= 1
##$NAME= <H1>
##$PROCNO= 1
##$TYPE= <nmr>
##$USER= <av>
##$AMP= (0..31)
100 100 100 100 100 100 100 100 100 100 100 100 100 100 100 100 100 100 
100 100 100 100 100 100 100 100 100 100 100 100 100 100 
##$AQSEQ= 0
##$AQ_mod= 1
##$AUNM= <au_zg>
##$AUTOPOS= <>
##$BF1= 200.13
##$BF2= 200.13
##$BF3= 200.13
##$BF4= 200.13
##$BF5= 500.13
##$BF6= 500.13
##$BF7= 500.13
##$BF8= 500.13
##$BYTORDA= 1
##$CFDGTYP= 0
##$CFRGTYP= 5
##$CHEMSTR= <none>
##$CNST= (0..31)
1 1 145 1 1 1 1 1 1 1 1 1 1 1 1 1 1 1 1 1 1 1 1 1 1 1 1 1 1 1 1 1 
##$CPDPRG= <>
##$CPDPRG1= <>
##$CPDPRG2= <>
##$CPDPRG3= <>
##$CPDPRG4= <mlev>
##$CPDPRG5= <mlev>
##$CPDPRG6= <mlev>
##$CPDPRG7= <mlev>
##$CPDPRG8= <mlev>
##$CPDPRGB= <>
##$CPDPRGT= <>
##$D= (0..31)
0 2 0 0 0 0 0 0 0 0.06 0 0 0 0 0 0 0.0002 0 0 0 0 0 0 0 0 0 0 0 0 0 0 
0 
##$DATE= 1785846335
##$DBL= (0..7)
120 120 120 120 120 120 120 120 
##$DBP= (0..7)
150 150 150 150 150 150 150 150 
##$DBP07= 0
##$DBPNAM0= <>
##$DBPNAM1= <>
##$DBPNAM2= <>
##$DBPNAM3= <>
##$DBPNAM4= <>
##$DBPNAM5= <>
##$DBPNAM6= <>
##$DBPNAM7= <>
##$DBPOAL= (0..7)
0.5 0.5 0.5 0.5 0.5 0.5 0.5 0.5 
##$DBPOFFS= (0..7)
0 0 0 0 0 0 0 0 
##$DE= 6
$$ [...]
##$SUBNAM4= <"">
##$SUBNAM5= <"">
##$SUBNAM6= <"">
##$SUBNAM7= <"">
##$SUBNAM8= <"">
##$SUBNAM9= <"">
##$SW= 20.6817932712277
##$SWIBOX= (0..15)
0 0 3 0 0 0 0 0 0 0 0 0 0 0 0 0 
##$SW_h= 4139.07284768212
##$TD= 32768
##$TD0= 1
##$TE= 0
##$TE2= 300
##$TE3= 300
##$TEG= 300
##$TL= (0..7)
0 120 120 120 120 120 120 120 
##$TP= (0..7)
150 150 150 150 150 150 150 150 
##$TP07= 0
##$TPNAME0= <>
##$TPNAME1= <>
##$TPNAME2= <>
##$TPNAME3= <>
##$TPNAME4= <>
##$TPNAME5= <>
##$TPNAME6= <>
##$TPNAME7= <>
##$TPOAL= (0..7)
0.5 0.5 0.5 0.5 0.5 0.5 0.5 0.5 
##$TPOFFS= (0..7)
0 0 0 0 0 0 0 0 
##$TUNHIN= 0
##$TUNHOUT= 0
##$TUNXOUT= 0
##$USERA1= <user>
##$USERA2= <user>
##$USERA3= <user>
##$USERA4= <user>
##$USERA5= <user>
##$V9= 5
##$VALIST= <valist>
##$VCLIST= <CCCCCCCCCCCCCCC>
##$VD= 0
##$VDLIST= <DDDDDDDDDDDDDDD>
##$VPLIST= <PPPPPPPPPPPPPPP>
##$VTLIST= <TTTTTTTTTTTTTTT>
##$WBST= 1024
##$WBSW= 30
##$XGAIN= (0..3)
0 0 0 0 
##$XL= 0
##$YL= 0
##$YMAX_a= 315031
##$YMIN_a= -457792
##$ZGOPTNS= <>
##$ZL1= 120
##$ZL2= 120
##$ZL3= 120
##$ZL4= 120
##$ABSF1= 0
##$ABSF2= 0
##$ABSG= 0
##$ABSL= 0
##$ALPHA= 0
##$AQORDER= 0
##$ASSFAC= 0
##$ASSFACI= 0
##$ASSFACX= 0
##$ASSWID= 0
##$AUNMP= <proc_1d>
##$AZFE= 0.1
##$AZFW= 0.1
##$BCFW= 0
##$BC_mod= 2
##$BYTORDP= 0
##$COROFFS= 0
##$CY= 18.4799938201904
##$DATMOD= 1
##$DC= 0
##$DFILT= <>
##$DTYPP= 0
##$F1P= 9.9274215381318
##$F2P= -0.165520771350173
##$FCOR= 1
##$FTSIZE= 16384
##$FT_mod= 6
##$GAMMA= 0
##$GB= 0
##$INTBC= 1
##$INTSCL= 4.127829e-11
##$ISEN= 128
##$LB= 0.05
##$LEV0= 0
##$LPBIN= 0
##$MAXI= 10000
##$MC2= 0
##$MEAN= 0
##$ME_mod= 0
##$MI= 50
##$NCOEF= 0
##$NC_proc= -6
##$NLEV= 6
##$NOISF1= 3.799351
##$NOISF2= 2.8
##$NSP= 0
##$NTH_PI= 0
##$NZP= 0
##$OFFSET= 16.48848
##$PC= 4
##$PHC0= -412.7518
##$PHC1= 3.101563
##$PH_mod= 1
##$PKNL= yes
##$PPARMOD= 0
##$PSCAL= 4
##$PSIGN= 0
##$REVERSE= no
##$SF= 200.130005582386
##$SI= 16384
##$SIGF1= 3
##$SIGF2= 2
##$SINO= 400
##$SIOLD= 16384
##$SREGLST= <1H.CDCl3>
##$SSB= 0
##$STSI= 16384
##$STSR= 0
##$SW_p= 4139.07284768211
##$SYMM= 0
##$S_DEV= 0
##$TDeff= 32768
##$TDoff= 0
##$TI= <>
##$TILT= no
##$TM1= 0
##$TM2= 0
##$TOPLEV= 0
##$USERP1= <user>
##$USERP2= <user>
##$USERP3= <user>
##$USERP4= <user>
##$USERP5= <user>
##$WDW= 1
##$XDIM= 16384
##$YMAX_p= 526991759
##$YMIN_p= -911891
$$ End of Bruker specific parameters
$$ ---------------------------------
##NTUPLES= NMR SPECTRUM
##VAR_NAME=  FREQUENCY,     SPECTRUM/REAL,   SPECTRUM/IMAG
##SYMBOL=    X,             R,               I
##VAR_TYPE=  INDEPENDENT,   DEPENDENT,       DEPENDENT
##VAR_FORM=  AFFN,          ASDF,            ASDF
##VAR_DIM=   16384,         16384,           16384
##UNITS=     HZ,            ARBITRARY UNITS, ARBITRARY UNITS
##FACTOR=    0.252644378177508, 1,           1
##FIRST=     3299.83951724647, 0,            0
##LAST=      -839.233330435636, 0,           0
##MIN=       -839.233330435636, -911891,     0
##MAX=       3299.83951724647, 526991759,    0
$$ Real data points
##PAGE= N=1
##DATA TABLE= (X++(R..R)), XYDATA
$$ [...]
7317B2027084K327604L387885O572060J5694540K1850290J9977136J1806366J498761
$$ 22027084 24354688 27742573 34314633 50009173 71859463 91836599 103642965 105141726
7309A05141726n405203j0293993j3586901j2065320r323512p689741n539184n025327
$$ 105141726 99736523 89442530 75855629 63790309 54466797 46777056 41237872 36212545
7301C6212545n193100l663701k094924m98466K45730R28625J705576L170456P988947
$$ 36212545 31019445 27355744 25260820 24762354 25008084 25936709 27642285 30812741 38801688
7292C8801688J7879487K1925012J8912543R071089p13426p327968j1609690j4519022
$$ 38801688 56681175 78606187 97518730 106589819 105876393 98548425 86938735 72419713
7284G2419713j1849486r244194p916557n974389n546836n691582l982390k591750
$$ 72419713 60570227 51326033 43409476 37435087 31888251 26196669 22214279 19622529
7276A9622529j145847p26578m47442N14253P55605L153358O096483O823921N442433
$$ 19622529 18476682 17750104 17302662 17816915 18572520 21725878 27822361 34646282 40088715
7267D0088715J625086r47625k989956m457627n138793l871997l270139k861380
$$ 40088715 41713801 40766176 37776220 33318593 28179800 24307803 21037664 18176284
7259A8176284k194414k031429k319978j417681q65691o88061o32659m26453k48523
$$ 18176284 15981870 13950441 11630463 10212782 9347091 8659030 8026371 7599918 7351395
7250G351395l93849l73853j18327l22664k85898l1595l27951k40985j67839j58411
$$ 7351395 6957546 6583693 6465366 6142702 5856804 5825209 5497258 5256273 5088434 4930023
7240D930023k4936j66892j63662j1490k03202Q3920k9770l11053l9947J23143
$$ 4930023 4905087 4738195 4574533 4563043 4359841 4443761 4413991 4102938 4062991 4186134
7230D186134l1348o5656O9800J18995l60710r3882j28816j98575j61533m8639
$$ 4186134 4154786 4089130 4158930 4277925 3917215 3823333 3694517 3495942 3334409 3285770
7220C285770q5481j17166k72873j1069r7345j21792Q3743p7856J200n4561P7783
$$ 3285770 3200289 3083123 2810250 2799181 2701836 2580044 2663787 2585931 2587131 2532570 2610353
7209B610353k09685l8563O9751n4914J92693O4493l6916L6825K3149k5859j41842
$$ 2610353 2400668 2362105 2431856 2376942 2569635 2634128 2597212 2634037 2657186 2631327 2489485
7198B489485k05246J1782j68781l25991R6606k04979p9825q3400M301j3682q8645
$$ 2489485 2284239 2296021 2127240 1801249 1897855 1692876 1613051 1529651 1533952 1520270 1431625
7187A431625L6008j13711L1590K7234k09909K06452l7487P2548k32317q096Q1064
$$ 1431625 1467633 1353922 1385512 1412746 1202837 1409289 1371802 1444350 1212033 1203937 1285001
7176A285001P8249J01157o7037j62180k9322O5555k68181J10555j22073l1782
$$ 1285001 1363250 1464407 1397370 1235190 1205868 1271423 1003242 1113797 991724 959942
7166I59942l773n7631j09834P5542j7762j89253P6233k9893p4358j7617l234M4394
$$ 959942 956169 898538 788704 864246 846484 657231 733464 703571 629213 611596 608362 652756
7154F52756o741m9743q6777M1342q0985M2239J25373J2683R746n3062p2649J17010
$$ 652756 646015 596272 509495 550837 469852 512091 637464 650147 659893 606831 534182 651192
7142F51192j06553o7044J20162j57399L8253L2639p0400p3139r7303J23191p2852
$$ 651192 544639 477595 597757 440358 478611 511250 440850 367711 270408 393599 320747
7131C20747o7821O9106m5468P0675j45152J70883q7925O5667m8350j81266K91994
$$ 320747 252926 322032 276564 347239 202087 372970 285045 350712 302362 121096 413090
7120D13090j03798M0121o2291K0974K2666j97698J78482J40383k8808j08957P1922
$$ 413090 309292 349413 287122 308096 330762 133064 311546 451929 423121 314164 386086
7109C86086k66358L0983M4866o3561J19676j26557M9266n5309J3605m2481P2148
$$ 386086 119728 150711 195577 132016 251692 125135 174401 119092 132697 90216 162364
7098A62364J50926j93941K04180m24681J14684J41260M8343r1840J23503k36218
$$ 162364 313290 119349 323529 -101152 13532 154792 203135 111295 234798 -1420
7088a420Q0103j62082K39464J29706k39405J04247k25614K3422j4858K22169j77454
$$ -1420 78683 -83399 156065 285771 46366 150613 -75001 -51579 -66437 155732 -21722
7077b1722M2493j1765M3157k21856K99862j13039O8770n9371j00857L3605l2070
$$ -21722 20771 9006 52163 -169693 130169 17130 85900 26529 -74328 -40723 -72793
7066g2793J76756Q94j11553P8090k1279k40538K35731J2645J3136j85119L14473
$$ -72793 103963 104857 -6696 71394 50115 -190423 45308 57953 71089 -114030 200443
7055B00443k84250P3275Q337J28055j18020p2144j430K0690j12475R2903J18847
$$ 200443 -83807 -10532 -2195 125860 7840 -64304 -65734 -45044 -157519 -64616 54231
7044E4231o8974k5586J03262p5860n2125M3939L0183N108k01650J75853j06902
$$ 54231 -14743 -40329 62933 -12927 -65052 -21113 9070 14178 -187472 -11619 -118521
7033a18521J12991q8947J37090p4067j24897K16471n9818q3557K00647j53224
$$ -118521 -5530 -94477 42613 -31454 -156351 60120 302 -83255 117392 -35832
7023c5832j50883J87748j36251P7255m3243K44648j83194n0661J01503N0955l77933
$$ -35832 -186715 1033 -135218 -57963 -101206 143442 -39752 -90413 11090 62045 -315888
7012c15888K27159J19412J8404r2620J21743l3837m7817J25763m3347M1796l3345
$$ -315888 -88729 30683 49087 -43533 78210 44373 -3444 122319 78972 120768 87423
7001H7423j07999p983J03356j10251K10098k17306L0331j4557O8576j08388j7540
$$ 87423 -20576 -28559 74797 -35454 174644 -42662 -12331 -26888 41688 -66700 -84240
6990h4240L4464K08431m7374J83950r2497K03202Q7078k1230n6171j69232J3055
$$ -84240 -49776 158655 111281 295231 202734 405936 493014 471784 415613 246381 259436
6979B59436j86173J1407k3141N6723L7899r0396j42328J3552j6354R8647p5247
$$ 259436 73263 84670 61529 118252 156151 65755 -76573 -63021 -79375 19272 -55975
6968e5975R0700O537P2432M0334J49628K56752j11606O8889k84208R4138j77279
$$ -55975 34725 41262 113694 154028 303656 560408 448802 517691 233483 327621 150342
6957A50342M0177l7863p2530M7920k48143Q7674O9617q3689j5600l1589m9798
$$ 150342 190519 152656 80126 128046 -120097 -32423 37194 -46495 -62095 -93684 -143482
6946a43482L4510L109K82403r1838N7865p7715M4358r5706R3452k30071K04556
$$ -143482 -108972 -105863 176540 84702 142567 64852 109210 13504 106956 -123115 81441
6935H1441j15058K9508m1469J46807j29463j15084J51431j0721P4626j69716J26336
$$ 81441 -33617 -4109 -45578 101229 -28234 -143318 8113 -2608 72018 -97698 28638
6924B8638j07949j15769Q0768q0589n4334R6789J05500J8933r9162m33m6880K27714
$$ 28638 -79311 -195080 -114312 -194901 -249235 -152446 -46946 -28013 -127175 -127608 -174488 53226
6912E3226k43397Q2356R6146j37156k297J62323m2712p1561J05851j34806q5004
$$ 53226 -190171 -107815 -11669 -148825 -151122 11201 -31511 -103072 2779 -132027 -217031
6901b17031M1060J48939o4973J1524m5542J06598j51442J6007K263q7547J63005
$$ -217031 -175971 -27032 -92005 -80481 -126023 -19425 -170867 -154860 -152597 -240144 -77139
6890g7139p1960P8397J8851J2700J9544J29547j35758J54025j70833J82818J26592
$$ -77139 -149099 -70702 -51851 -39151 -19607 109940 -25818 128207 -42626 140192 266784
6879B66784o7897j85437R1622j9441q6953o626N1431j43978Q9903k19077J38079
$$ 266784 198887 13450 105072 85631 -1322 -7948 43483 -100495 -10592 -229669 -91590
6868i1590J31274j66511J78642j41531r7950j3759K32105j01358R0570n8256r9286
$$ -91590 39684 -126827 51815 -89716 -187666 -201425 30680 -70678 19892 -38364 -137650
6857a37650M0644J4910m5492J85967j51448J78181j78939L2347J44648j52347
$$ -137650 -97006 -82096 -127588 58379 -93069 85112 -93827 -61480 83168 -69179
6847f9179p4454J67081k9781j33579J9958J67132j66928o6367J35560k1169m421
$$ -69179 -143633 23448 -6333 -139912 -119954 47178 -119750 -186117 -50557 -71726 -76147
6836g6147R502k4115M6595J21911j73567p120k2534K34743r9760p8414J06536
$$ -76147 -66645 -90760 -44165 77746 -95821 -102941 -125475 109268 9508 -68906 37630
6825C7630j31699J06918R4622n3474q3672O9269o5087R1183j53138J26048m7226
$$ 37630 -94069 12849 107471 53997 -29675 39594 -25493 65690 -87448 38600 -8626
6814h626j3941j59494Q0985K2036J9794M4856J16644j91013n4789J12194J55228
$$ -8626 -22567 -182061 -101076 -79040 -59246 -14390 102254 -88759 -143548 -31354 123874
6803A23874j09843q2029K32666j16084J42441L9586N516N6313O7694q0407K74833
$$ 123874 14031 -67998 164668 48584 191025 230611 236127 292440 360134 279727 554560
6792E54560j95209J34899j8041k42021J78183j85259j39618N6651N5405j82561
$$ 554560 359351 494250 476209 234188 412371 227112 87494 144145 199550 16989
6782A6989P0867j40031L23911k52771K27315n0420J46673k8174k07234J7668Q015
$$ 16989 87856 -52175 271736 18965 246280 195860 342533 314359 107125 124793 132808
6771A32808J02411N6697J45873N8606P3430J38734J44482p3149K53537j18584
$$ 132808 235219 291916 437789 496395 569825 708559 853041 779892 1033429 914845
6761I14845J7632J17075K87376J8228J11664J03079l22355p7879M5589k01637
$$ 914845 932477 1049552 1336928 1355156 1466820 1569899 1247544 1169665 1215254 1013617
6751A013617j87385O8900l49760R3897m7084n3699j9661K5959j34470O0778N6646
$$ 1013617 826232 895132 545372 639269 592185 538486 518825 544784 410314 471092 527738
6740E27738R1859k15908L01823o1530o7915L40112L4420L08582K43828J15952
$$ 527738 619597 403689 705512 643982 576067 916179 950599 1259181 1503009 1618961
6730A618961J16242R1046P9937R4916j18222K32505k9766M8548K276j30285k1926
$$ 1618961 1735203 1826249 1906186 2001102 1882880 2115385 2085619 2134167 2136443 2006158 1984232
6719A984232k39937k28995j13329j58008N5961l28142J03336P7939j08437N621
$$ 1984232 1744295 1515300 1401971 1243963 1299924 971782 1075118 1153057 1044620 1050241
6709A050241Q647L75334K08943N5707K66730K60876R5794K19121J79349J24932
$$ 1050241 1058888 1434222 1643165 1698872 1965602 2226478 2322272 2541393 2720742 2845674
6699B845674m9557K0658J1076J24152q243Q6918k43678L4678r0265l6113l781
$$ 2845674 2796117 2816775 2827851 2952003 2943760 3030678 2787000 2821678 2731413 2695300 2691519
6688B691519l4890K033k46724j17560m8454j68958L6934K63109K84406K86579
$$ 2691519 2656629 2658662 2411938 2294378 2245924 2076966 2113900 2377009 2661415 2947994
6678B947994N17537M00569L1793m5775j95171k19395l80321k40581k10253l09378
$$ 2947994 3465531 3866100 3897893 3852118 3656947 3437552 3057231 2816650 2606397 2297019
6668B297019j75655K47083N192j96731J81189R0434L4552N4432R4654l85728L8119
$$ 2297019 2121364 2368447 2373639 2176908 2358097 2448531 2483083 2537515 2632169 2246441 2284560
6657B284560M8002n9883K32280J7666K57541L03971L99477K78541K61122q0409
$$ 2284560 2332562 2272679 2504959 2522625 2780166 3084137 3483614 3762155 4023277 3942868
6647C942868k16670q9975m15314n17539j21324k89499j84819j55651m6194j53991
$$ 3942868 3726198 3636223 3220909 2703370 2582046 2292547 2107728 1952077 1905883 1751892
6637A751892J26987j11764o5307l14987K00751n2881o7313K27268J38496j36363
$$ 1751892 1878879 1767115 1701808 1386821 1587572 1534691 1467378 1694646 1833142 1696779
6627A696779J15288J67767p4233O9033J124J33101l29778J73716o011j80932p9205
$$ 1696779 1812067 1979834 1905601 1974634 1975758 2108859 1779081 1952797 1946786 1765854 1686649
6616A686649l21563J9183j75097o6911L0916l3959M811N2432j05911R0192k28035
$$ 1686649 1365086 1384269 1209172 1142261 1173177 1139218 1144029 1196461 1090550 1180742 952707
6605I52707J21919J0435l4113M9350J34501K3459J42463p1928o9258j72331K7182
$$ 952707 1074626 1085061 1050948 1100298 1234799 1258258 1400721 1328793 1259535 1087204 1114386
6594A114386j20174k83165Q3324K2525j20656r3235K08706k18139n7273J95611
$$ 1114386 994212 711047 794371 816896 696240 603005 811711 593572 536299 731910
6584G31910P9273k31378K02500R9006j71689J41811L6650J0168j12008J39448
$$ 731910 811183 579805 782305 881311 709622 851433 888083 898251 786243 925691
6574I25691J59005L9274K11101p4870J21298n3800m9694k48532l0555o8209N2350
$$ 925691 1084696 1123970 1335071 1260201 1381499 1327699 1278005 1029473 998918 930709 983059
6563I83059j85508J15616n9014j43075J27046m3878J56526l1110j55376J35967
$$ 983059 797551 913167 854153 711078 838124 794246 950772 919662 764286 900253
6553I00253l7372R4357j31599J16995N3922j00674J33971L642j35874K81236Q9898
$$ 900253 862881 957238 825639 942634 996556 895882 1029853 1033495 897621 1178857 1268755
6542A268755j15551p3290N4002M9238j48811j3603J33437m6672j3662J81688k42858
$$ 1268755 1153204 1079914 1133916 1183154 1034343 1020740 1154177 1107505 1093843 1275531 1032673
6531A032673J42245J39848J48466k45663J9473R7608r5726K02832r4189j01245
$$ 1032673 1174918 1314766 1463232 1217569 1237042 1334650 1238924 1441756 1347567 1246322
6521A246322J87717N6238l2192j89416J06798J64509p7220J60967k9723j08650
$$ 1246322 1434039 1490277 1458085 1268669 1375467 1539976 1462756 1623723 1594000 1485350
6511A485350J43421K3656m3666L61905j86514K46128O6971J41305m8599K1313
$$ 1485350 1628771 1652427 1608761 1970666 1784152 2030280 2097251 2238556 2189957 2211270
6501B211270J29462k00783k5661M6789j16613J96542Q1637K996k7340J50911O6148
$$ 2211270 2340732 2139949 2114288 2161077 2044464 2241006 2322643 2325639 2298299 2449210 2515358
6490B515358N3595L49266q0749j17278K75778Q8617J83220L25810K80495L8663
$$ 2515358 2568953 2918219 2837470 2720192 2995970 3084587 3267807 3593617 3874112 3912775
6480C912775k448J84218N1611j02668L71421J6968r2152J99760j80636n2029O0968
$$ 3912775 3910327 4094545 4146156 4043488 4414909 4431877 4339725 4539485 4358849 4306820 4367788
6469D367788j98j67478P563K75599J8838J7186K62476Q5010M1284L01781J23133
$$ 4367788 4367590 4200112 4207675 4483274 4502112 4519298 4781774 4866784 4908068 5209849 5332982
6458E332982L01599N35277J116802Q13162R13088J597686K446220L086272K546252
$$ 5332982 5634581 6169858 7286660 8099822 9012910 10610596 13056816 16143088 18689340
6449A8689340J140636L06533j72287j115071j549159j358176j340715j261832
$$ 18689340 19829976 20136509 19964222 18849151 17299992 15941816 14601101 13339269
6441A3339269r38040q25765q17403l73181p4816l21344M2970O0995J68546J13525
$$ 13339269 12401229 11575464 10758061 10384880 10310064 9988720 10031690 10092685 10261231 10374756
6431A0374756N81701N68914O52327J604809J731810K038602L504546P560666R348647
$$ 10374756 10956457 11525371 12177698 13782507 15514317 17552919 21057465 28618131 37966778
6422C7966778Q376226M514663P98307j479367l210684m479237l578483k279434
$$ 37966778 46343004 50857667 51655974 50176607 46965923 42486686 38908203 36628769
6414C6628769k77554J634990J322059K4602j198980j702280k624824k966464l045062
$$ 36628769 36351215 37986205 39308264 39332866 38133886 36431606 33806782 30840318 27795256
6405B7795256k169021k291023j245196o86627l50467K43007R69007J193532L054243
$$ 27795256 25626235 23335212 22090016 21403389 21052922 21295929 22264936 23458468 26512711
6396B6512711P204765R636677Q603646N238072J091239j322400k722333m049793
$$ 26512711 33717476 43354153 51957799 57195871 58287110 56964710 54242377 50192584
6388E0192584k439131j9364N421504J0699322R670617N669473k99290m010992
$$ 50192584 47753453 47734089 53155593 63854915 73525532 79195005 78895715 74884723
6380G4884723o513999r223251q531518o545294o018999m307576l843129l723860
$$ 74884723 68370724 59147473 50615955 44070661 38051662 33744086 29900957 26177097
6372B6177097l175312j565379q77410M43369K293660L042708L157792K196682
$$ 26177097 23001785 21436406 20558996 21002365 23296025 26338733 29496525 31693207
6364C1693207P49102r1218k66854o63890M81980K089089P303114J2914599J1442143
$$ 31693207 32442309 32351091 32084237 31420347 31902327 33991416 41294530 54209129 65651272
6355F5651272Q013759J203019l361824o481391q710293q511144o627481n759945
$$ 65651272 73665031 74868050 71506226 65024835 56314542 47803398 41175917 35415972
6347C5415972m580153l904358l936189l600437k085928j248850n73568m21312
$$ 35415972 30835819 26931461 22995272 19394835 17308907 16060057 15486489 15065177
6339A5065177k06144j13513o6968j11359O0484J9763o4603M95254R36614K450763
$$ 15065177 14859033 14745520 14678552 14567193 14627677 14647440 14582837 15078091 16014705 18465468
6329A8465468M602643M111232L158532O78248q36547j904755k887597k767556
$$ 18465468 23068111 27179343 30337875 31016123 30179576 28274821 25387224 22619668
6321B2619668k204970k013219j840147j313382j104549j247560p75260l72726
$$ 22619668 20414698 18401479 16561332 15247950 14143401 12895841 12120581 11747855
6313A1747855p45241m00640p08496m08855n53830l95561j65364j86454l18132
$$ 11747855 11002614 10601974 9893478 9484623 8930793 8535232 8369868 8183414 7865282
6304G865282J89343l23940J67328M1629j62293O6665n689o0500k34558q9871q4846
$$ 7865282 8054625 7730685 7898013 7939642 7777349 7844014 7838325 7777825 7543267 7453396 7368550
6293G368550j54440N7054J06463M14155P74680N17837P66675J52975j76021l67403
$$ 7368550 7214110 7271164 7377627 7791782 8566462 9084299 9850974 10003949 9827928 9460525
6283I460525n37771l65747n52130k06971L0639l67698j08185n3883j41865r4066
$$ 9460525 8922754 8557007 8004877 7797906 7828545 7460847 7352662 7298779 7156914 7062848
6273G062848Q4344J81167K71603J93956L71044J45141L68461L80798K12182N40397
$$ 7062848 7147192 7328359 7599962 7793918 8164962 8310103 8678564 9059362 9271544 9811941
6263I811941M83777J009283J442563J408506K198443L010407M314306M303271
$$ 9811941 10295718 11305001 12747564 14156070 16354513 19364920 23679226 27982497
6255B7982497K492168N24726j004466k242042k899300k874060j908435k074405
$$ 27982497 30474665 30999391 29994925 27752883 24853583 21979523 20071088 17996683
6247A7996683j352460j059093j146428p67231l05158j89469K71806J04359M66684
$$ 17996683 16644223 15585130 14438702 13671471 13366313 13176844 13448650 13553009 14019693
6238A4019693M42903O19496Q63954J135400J672080K065497L061996N075725R499134
$$ 14019693 14462596 15082092 15946046 17081446 18753526 20819023 23881019 28956744 38455878
6229C8455878J4272345J3899879R264164K255272k842717o309802q570545q308370
$$ 38455878 52728223 66628102 75892266 78147538 75304821 68995019 60424474 52116104
6221E2116104o139323m151160j615237p32197j464250k477808k349793k378222
$$ 52116104 45976781 41825621 40210384 39478187 38013937 35536129 33186336 30808114
6213C0808114k362969k134597j499143j234413m52753k2673j02971P43709J162145
$$ 30808114 28445145 26310548 24811405 23576992 23124239 23101566 22998595 23742304 24904449
6204B4904449K532324M802624R833062J4981342J4009061R691898K249338k878002
$$ 24904449 27436773 32239397 42072459 57053801 71062862 80754760 83004098 80126096
6196H0126096o087519q265132p517150m339749o43561M273454N268203L156047
$$ 80126096 74038577 65773445 58256295 53916546 53272985 57546439 62814642 65970689
6188F5970689r89013l786048n217669o406226o889593n499125m189412l496288
$$ 65970689 64981676 61195628 55977959 49571733 42682140 37183015 32993603 29497315
6180B9497315k583356k550432k116832j238172J2040J174231L419185M753933
$$ 29497315 26913959 24363527 22246695 21008523 21020563 22194794 25613979 30367912
6172C0367912M585397L116367Q04225p33984j873256k180472j416263L85556L309906
$$ 30367912 34953309 38069676 38873901 38139917 36266661 34086189 32669926 33055482 36365388
6163C6365388P673933Q119825N474193J376062k889259m742762o267226o865455
$$ 36365388 44039321 52159146 57633339 59009401 56120142 51377380 45110154 38244699
6155C8244699n527371m219106l636057l160202k570732k459312k100891r48760
$$ 38244699 32717328 28498222 24862165 21701963 19131231 16671919 14571028 13622268
6147A3622268q05802n62946o36297l70905k19319m80545R3660l7888J04923P26055
$$ 13622268 12816466 12253520 11617223 11246318 11026999 10546454 10640114 10602226 10707149 11433204
6137A1433204Q56297J884502L275131K963671K403710M56441q35314j612893k042200
$$ 11433204 12289501 14174003 17449134 20412805 22816515 23272956 22437642 20824749 18782549
6128A8782549k261290j887370j327397j204564j110105r97413r77715o32516k73290
$$ 18782549 16521259 14633889 13306492 12101928 10991823 9994410 9016695 8384179 8110889
6119H110889l45116k25220k87990o6878k72844k87683q9793k22867l02913k16600
$$ 8110889 7765773 7540553 7252563 7185685 6912841 6625158 6535365 6312498 6009585 5792985
6109E792985o073j46703j31128j48239j80042o9656j27905l0640j91462J01923
$$ 5792985 5786912 5640209 5509081 5360842 5180800 5111144 4983239 4952599 4761137 4863060
6099D863060l3275j04268J99527K0222j23843M862J5892l3472Q7166l831J22685
$$ 4863060 4829785 4725517 4925044 4945266 4821423 4826285 4842177 4808705 4895871 4892040 5014725
6088E014725k11440j5045m1754j37359L6571m6075M5099n7779j76381L9216k95517
$$ 5014725 4803285 4788240 4746486 4609127 4645698 4599623 4644722 4586943 4410562 4449778 4154261
6077D154261K9910r9480k14952k08196l7076M2782J77392k32717J1536R5827j3201
$$ 4154261 4184171 4084691 3869739 3661543 3624467 3667249 3844641 3611924 3623460 3719287 3706086
6066C706086j40643P1596p9705l4657Q5673J13819j0247k8518K13519q5652N4236
$$ 3706086 3565443 3637039 3557334 3522677 3608350 3722169 3711922 3683404 3896923 3811271 3865507
6055C865507L29975K0459J10665M4069J22700k44531N2070K00509k69696K4537
$$ 3865507 4195482 4215941 4326606 4370675 4493375 4248844 4300914 4501423 4231727 4256264
6045D256264J08500j24846J7640J42986K1311Q7049J7089P3447o7351J82589J86310
$$ 4256264 4364764 4239918 4257558 4400544 4421855 4508904 4525993 4599440 4532089 4714678 4900988
6034D900988K3296L16585J6322P8827J80371J3747p2971N6399L30987m1601q2183
$$ 4900988 4924284 5240869 5257191 5336018 5516389 5530136 5457165 5513564 5844551 5802950 5720767
6023E720767K13053P0380R5401M40543J34225K90624K63314M66165K02490L66745
$$ 5720767 5933820 6004200 6099601 6540144 6674369 6964993 7228307 7694472 7896962 8263707
6013H263707L45329J99110m3566J4304j07684l24528k81507j69504l49405n08185
$$ 8263707 8609036 8808146 8764580 8778884 8671200 8346672 8065165 7895661 7546256 7038071
6003G038071k17156l93926l26431m88556m00269j51422k10594m56110J8011k40672
$$ 7038071 6820915 6426989 6100558 5612002 5211733 5060311 4849717 4393607 4411618 4170946
5993D170946l02893J14812o0661j83166r4854O7033q9959k31575N0142k1638j86725
$$ 4170946 3868053 3982865 3922204 3739038 3644184 3711217 3621258 3389683 3439825 3418187 3231462
5982C231462J57767j02386j10464J27892n033k97070J23662J46629J33270j14302
$$ 3231462 3389229 3286843 3176379 3304271 3299238 3002168 3125830 3272459 3405729 3291427
5972C291427J88765j42447j73407J26230Q2376M2777k80896K72170l5495l02943
$$ 3291427 3480192 3337745 3164338 3290568 3372944 3415721 3134825 3406995 3371500 3068557
5962C068557J85959j5309m04363j5287j08748n2176K5799j75674j28612P2754
$$ 3068557 3254516 3239207 2834844 2819557 2710809 2658633 2684432 2508758 2380146 2452900
5952B452900J230k64746K33187m069k70776K45837Q3181j12961L6210J43056P794
$$ 2452900 2454130 2189384 2422571 2418502 2147726 2393563 2476744 2363783 2399993 2543049 2550843
5941B550843o3484j37174j60563j3142k3353n6722j03527K1957k13111k44099
$$ 2550843 2487359 2350185 2189622 2176480 2153127 2096405 1992878 2014835 1801724 1557625
5931A557625J91664R621P5484r9280L3793n3789j36905K49174n8291O3333P6602
$$ 1557625 1749289 1758910 1834394 1735114 1768907 1715118 1578213 1827387 1769096 1832429 1909031
5920A909031J02887K4744n776N5227o2484p5376K7775q4242p8849M4363j94885
$$ 1909031 2011918 2036662 2030886 2086113 2023629 1948253 1976028 1891786 1812937 1857300 1662415
5909A662415k4399J23805R792k75955J87964J5491j56489J31344j74640n6018
$$ 1662415 1638016 1761821 1771613 1495658 1683622 1699113 1542624 1673968 1499328 1443310
5899A443310l1708P4663l7784l8554q74M1768j4922O5202J7354j51867J29704
$$ 1443310 1411602 1486265 1448481 1409927 1409053 1450821 1435899 1501101 1518455 1366588 1496292
5888A496292n1965r2961J4513L0092L4057J11957j05680p5484K77002n7361O182
$$ 1496292 1444327 1351366 1365879 1395971 1430028 1541985 1436305 1360821 1637823 1580462 1586644
5877A586644J17935O9603L6239J63381J5101K5674j60843P923q5742j41552n6558
$$ 1586644 1704579 1774182 1810421 1973802 1988903 2014577 1853734 1861657 1775915 1634363 1577805
5866A577805R6975j20212P2902p5423P6296j39118L1956k7349N261J72776j30885
$$ 1577805 1674780 1554568 1627470 1552047 1628343 1489225 1521181 1493832 1499093 1671869 1540984
5855A540984j56728K93236j08141o874O4423M8251K6645J01016J55278j36347
$$ 1540984 1384256 1677492 1569351 1562477 1626900 1675151 1701796 1802812 1958090 1821743
5845A821743J76497K97215k74377R9309N2390K01990M4177N0266J36615j81434
$$ 1821743 1998240 2295455 2021078 2120387 2172777 2374767 2418944 2469210 2605825 2424391
5835B424391K9941r7031k45409K29936j90612L0624j49222j21436R4198j81641
$$ 2424391 2454332 2357301 2111892 2341828 2151216 2181840 2032618 1911182 2005380 1823739
5825A823739q0056N9925j17049J04169l5884J28144j57474M0248J45117j17714
$$ 1823739 1743683 1803608 1686559 1790728 1754844 1882988 1725514 1765762 1910879 1793165
5815A793165K20194l6055K33025Q1446J94150J22106K11527l14997k763L2739
$$ 1793165 2013359 1977304 2210329 2291775 2485925 2608031 2819558 2504561 2501798 2534537
5805B534537K23571j41545K118N3264j01868l397j02390j24023j28890K22342
$$ 2534537 2758108 2616563 2618681 2671945 2570077 2566680 2464290 2340267 2211377 2433719
5795B433719k75282J02304o8249K8905j16873K12638q3614R793J46446J52291
$$ 2433719 2158437 2260741 2192492 2221397 2104524 2317162 2233548 2243341 2389787 2542078
5785B542078M2896J50104J37793R2455J33491L84291L91913l1418M06873K95355
$$ 2542078 2584974 2735078 2872871 2965326 3098817 3483108 3875021 3843603 4250476 4545831
5775D545831J17237J22580M6239j97106q8693L1681P73k59738j51753l6942j54150
$$ 4545831 4663068 4785648 4831887 4634781 4546088 4577769 4578542 4318804 4167051 4130109 3975959
5764C975959M3978k18636K8569K3211p9912J49074r0024J88996L28393K9870K28628
$$ 3975959 4019937 3801301 3829870 3853081 3773169 3922243 3832219 4021215 4349608 4379478 4608106
5753D608106K84325J78911L95265L96783M25624N63748K92883L99814K86228K24897
$$ 4608106 4892431 5071342 5466607 5863390 6289014 6852762 7145645 7545459 7831687 8056584
5743H056584K18039l7009P799k50530j08071l09564m99943k7768m97656j16174
$$ 8056584 8274623 8237614 8245413 7994883 7886812 7577248 7077305 7049537 6551881 6435707
5733F435707k96638k58781J5315j62296j2222r0838P2420P738J73501M99J83622
$$ 6435707 6139069 5880288 5895603 5733307 5721085 5630247 5702667 5710405 5883906 5884405 6068027
5722F068027L11255O4536L58799J95753L22875J58238K04581K02078K29680J17009
$$ 6068027 6379282 6443818 6802617 6998370 7321245 7479483 7684064 7886142 8115822 8232831
5712H232831J2642P3420j61113l1668j29581k69397p513k25996l41045m8502j50796
$$ 8232831 8245473 8318893 8157780 8126112 7996531 7727134 7719621 7493625 7152580 7104078 6953282
5701F953282l2829k64255R422k33055J54023k01072j53160J94537j82031J0078
$$ 6953282 6920453 6656198 6665620 6432565 6586588 6385516 6232356 6426893 6244862 6254940
5691F254940M6728J9634L5074N9942p4166J70018M5875r3727J47781M9801j9411
$$ 6254940 6301668 6321302 6356376 6416318 6342152 6512170 6558045 6464318 6612099 6661900 6642489
5680F642489P8637K9299P1895j4119Q6282J61301O3656n7307L43167k09663M9729
$$ 6642489 6721126 6750425 6822320 6808201 6894483 7055784 7119440 7062133 7405300 7195637 7245366
5669G245366K34236j5366J38930J94098J78603J04339O2972J26539m9811L6273
$$ 7245366 7479602 7464236 7603166 7797264 7975867 8080206 8143178 8269717 8219906 8256179
5659H256179J46522L5201j94231K56354J63573o6006J63351J6689J06703K77288
$$ 8256179 8402701 8437902 8243671 8500025 8663598 8597592 8760943 8777632 8884335 9161623
5649I161623J66526J13657K01998Q8628K19834J51537K82963r5455K81294j72669
$$ 9161623 9328149 9441806 9643804 9732432 9952266 10103803 10386766 10291311 10572605 10399936
5639A0399936j9242J07972j09153k58192j56417k03822o2093n4650m16724j36947
$$ 10399936 10380694 10488666 10379513 10121321 9964904 9761082 9698989 9644339 9227615 9090668
5629I090668k11627q4040j79907r2150j08625k2173l02435p6457q5831k4784j47453
$$ 9090668 8879041 8795001 8615094 8522944 8414319 8392146 8089711 8013254 7927423 7902639 7755186
5618G755186J52038r6862J14446o2391J10098j29726m8967m6010l11822m9966
$$ 7755186 7907224 7810362 7924808 7862417 7972515 7842789 7793822 7747812 7435990 7386024
5608G386024j86062k90064k05021j21586j73180n7189j32775k6272j68908r3052
$$ 7386024 7199962 6909898 6704877 6583291 6410111 6352922 6220147 6193875 6024967 5931915
5598E931915j08570k21688j27646m3169k71963K30066o7461j94620J76355l24152
$$ 5931915 5823345 5601657 5474011 5430842 5158879 5388945 5321484 5126864 5303219 4979067
5588D979067k25508k233j94444m2640k66021J22493p4441K4299K64687l1148Q3660
$$ 4979067 4753559 4751326 4556882 4514242 4248221 4370714 4296273 4320572 4585259 4554111 4637771
5577D637771k3560m7022O8264j02246q7755k92329P3545k85991p2886k99418J22675
$$ 4637771 4614211 4567189 4635453 4533207 4445452 4153123 4226668 3940677 3867791 3568373 3691048
5566C691048l35714N0037J69253j23777r6654J51952J60068j40120L05334J18598
$$ 3691048 3355334 3405371 3574624 3450847 3354193 3506145 3666213 3526093 3831427 3950025
5556C950025R3231J44077K97595m037Q221K69248j00213p9789J11368k10358J54080
$$ 3950025 4043256 4187333 4484928 4480891 4489112 4758360 4658147 4578358 4689726 4479368 4633448
5545D633448q250K64099r8277K88984R0608J78177K10006J42154K33058K6407
$$ 4633448 4625198 4889297 4791020 5080004 5170612 5348789 5558795 5700949 5934007 5960414
5535E960414J50651M7925Q1699R6587K77162p73K30331n7344r2633J13478J01111
$$ 5960414 6111065 6158990 6240689 6337276 6614438 6613665 6843996 6786652 6694019 6807497 6908608
5524F908608k98384o3713j45107k67193j9909K6379j54230n6707M0170r305M00332
$$ 6908608 6610224 6546511 6401404 6134211 6114302 6140681 5986451 5929744 5969914 5960609 6360941
5513F360941j80564K76713P6250L0901K13390j839J24199K74082K91352J65918
$$ 6360941 6180377 6457090 6533340 6564241 6777631 6775792 6899991 7174073 7465425 7631343
5503G631343J8329J94321J01296P3066P0429l27425J7657k23802m62187j96208
$$ 7631343 7649672 7843993 7945289 8018355 8088784 7761359 7779016 7555214 7093027 6896819
5493F896819j85293m25565l04295p6340j88881j13791n0151j25388j95473j61019
$$ 6896819 6711526 6285961 5981666 5905326 5716445 5602654 5552503 5427115 5231642 5070623
5483E070623J45264j34502J18896j80781P8714K87609o7872J17433o294N530k2132
$$ 5070623 5215887 5081385 5200281 5019500 5098214 5385823 5317951 5435384 5429090 5434620 5412488
5472E412488R7990O2051k8537k32118r8252j47980j94666p0920k28077k11915
$$ 5412488 5510478 5572529 5543992 5311874 5213622 5065642 4870976 4800056 4571979 4360064
5462D360064o5330j08093l16123j78290r1271j60531j72893K9664R7415l18469
$$ 4360064 4294734 4186641 3870518 3692228 3600957 3440426 3267533 3297197 3394612 3076143
5452C076143q7481N5511M8475l245k13259K67206o7459j64410j65720p950j06138
$$ 3076143 2988662 3044173 3092648 3089403 2876144 3143350 3075891 2911481 2745761 2737811 2631673
5441B631673p8114Q2185k06541L3752j46708J01397j19101N9253O3096j38726
$$ 2631673 2553559 2635744 2429203 2462955 2316247 2417644 2298543 2357796 2420892 2282166
5431B282166k6753K4157l4778J23240j780R9977J68815K18226J89678J41848L66192
$$ 2282166 2255413 2279570 2244792 2368032 2366252 2466229 2635044 2853270 3042948 3184796 3550988
5420C550988K17841J74614j67022n0942j63597k21588k75474P3525j73287r1740
$$ 3550988 3768829 3943443 3776421 3725479 3561882 3340294 3064820 3138345 2965058 2873318
5410B873318q7422j16400r3959k3336Q1189J88417O8824J23667N77325J233282
$$ 2873318 2785896 2669496 2575537 2552201 2633390 2821807 2890631 3014298 3591623 4824905
5400D824905J080299P22074L28992m16279m27693q04250o20946o51055p5890o90033
$$ 4824905 5905204 6627278 6956270 6539991 6112298 5308048 4687102 4036047 3960157 3270124
5390C270124m7829m13818k49689J9673j27804j01463l0289J972l0634J34906j90171
$$ 3270124 3222295 2808477 2558788 2578461 2450657 2349194 2318905 2320877 2290243 2425149 2234978
5379B234978J64388j11638m8557j89326J76004j80708J77364r7412o3556j00542
$$ 2234978 2399366 2287728 2239171 2049845 2225849 2045141 2222505 2125093 2061537 1960995
5369A960995J97744j25075m8883J02492r4513Q755J73798k46411P8064k3616K3139
$$ 1960995 2158739 2033664 1984781 2087273 1992760 2001515 2175313 1928902 2006966 1983350 2006489
5358B006489r4689j07004J00671j2379p7818N1239K7004l02653J86605j04286
$$ 2006489 1911800 1804796 1905467 1893088 1815270 1866509 1893513 1590860 1777465 1673179
5348A673179j3743J13781m5387O1336l21j9959r7222J30292o3734m7136M5451
$$ 1673179 1659436 1773217 1727830 1789166 1788845 1768886 1671664 1801956 1738222 1691086 1736537
5337A736537O2102j96472K05358j13105P1439l6922q2290N368L0168p9288k5165
$$ 1736537 1798639 1602167 1807525 1694420 1765859 1728937 1646647 1652015 1682183 1602895 1577730
5326A577730j9625l1246J65128k14698J83346L4370N7896r4069P0977K8396J06554
$$ 1577730 1558105 1526859 1691987 1477289 1660635 1695005 1752901 1658832 1729809 1758205 1864759
5315A864759j82735J64480l9037K03271O3474j3933M1157K13571R4139K01507
$$ 1864759 1682024 1846504 1807467 2010738 2074212 2060279 2101436 2315007 2409146 2610653
5305B610653K22499n5621J14015L7714l0634m9108j33637K37878j07628n5288
$$ 2610653 2833152 2777531 2891546 2929260 2898626 2849518 2715881 2953759 2846131 2790843
5295B790843J87830j71097J8529K63231j08884L3779J90257L791M5207J3961J48394
$$ 2790843 2978673 2807576 2826105 3089336 2980452 3014231 3204488 3208279 3253486 3267447 3415841
5284C415841J48578K3167K31320k04845L4742O8525K00280o7624K01513O0814
$$ 3415841 3564419 3587586 3818906 3614061 3648803 3717328 3917608 3849984 4051497 4112311
5274D112311L4320L7319L30293q5251K53583k3868K24O7464O6173J01449p1952
$$ 4112311 4146631 4183950 4514243 4428992 4682575 4658707 4658931 4726395 4792568 4894017 4822065
5263D822065J1795o0313k8983p8080K7804l0136L815o4046j56023Q7806r7396
$$ 4822065 4833860 4773547 4744564 4666484 4694288 4664152 4667967 4603921 4447898 4535704 4438308
5252D438308j68511J49626j51804m6427r8133j94077p7965P32Q0333k62509k03159
$$ 4438308 4269797 4419423 4267619 4221192 4123059 3928982 3851017 3851749 3932082 3669573 3466414
5241C466414O6141q4685j60804L7789k90377J73211k96818J02811j62086j86371
$$ 3466414 3532555 3447870 3287066 3324855 3034478 3207689 2910871 3013682 2851596 2665225
5231B665225N8023k20264K2156k325j68571q4445r5882L9495l5619l04310L3434
$$ 2665225 2723248 2502984 2525140 2522815 2354244 2269799 2173917 2213412 2177793 1873483 1906917
5220A906917O3194L0714j58322L7997l9989P4315r7591N0206k0379K17095m1364
$$ 1906917 1970111 2000825 1842503 1880500 1840511 1914826 1817235 1867441 1847062 2064157 2022793
5209B022793K30684k8109L0014j13440n7708j44761q4934O399j08305n7049n9265
$$ 2022793 2253477 2225368 2255382 2141942 2084234 1939473 1854539 1860938 1752633 1695584 1636319
5198A636319q5652r1616J42415p6266K365n2928o8816J25115j21579Q029j09489
$$ 1636319 1550667 1459051 1601466 1525200 1527565 1474637 1405821 1530936 1409357 1417386 1307897
5187A307897O9040o8882J06374j26328K8630Q7807q6625J49641r6998q6314r2838
$$ 1307897 1376937 1308055 1414429 1288101 1316731 1404538 1317913 1467554 1370556 1284242 1191404
5176A191404L7032J49399j42284J70801j09028N4472m9939O32K5255J81053L6599
$$ 1191404 1228436 1377835 1235551 1406352 1297324 1351796 1301857 1302489 1327744 1508797 1545396
5165A545396k27700K23259N7476K47962q7630L14059K97383J029371J311687J298690
$$ 1545396 1317696 1540955 1598431 1846393 1758763 2072822 2370205 3399576 4711263 6009953
5155F009953N67697N7137k17915o17181r54017n80902n88328m25984j92825j77335
$$ 6009953 6577650 6634787 6416872 5799691 4845674 4264772 3676444 3250460 3057635 2880300
5145B880300m6943l69001j00883k07453j64331O352k85369j41256j09398j20680
$$ 2880300 2833357 2464356 2363473 2156020 1991689 1998041 1712672 1571416 1462018 1341338
5135A341338M0655q8558k21473J98970l8863J24237j78717K2059j08667L9313
$$ 1341338 1381993 1293435 1071962 1270932 1232069 1356306 1177589 1199648 1090981 1130294
5125A130294P8180L6885m12024L48932j92194M3958O980K52303k9199j93356K08606
$$ 1130294 1208474 1245359 833335 1182267 990073 1034031 1041011 1293314 1264115 1070759 1279365
5114A279365j85739J06156Q765J86471m02532O3678J47449R5749j85931J45366
$$ 1279365 1093626 1199782 1208547 1395018 992486 1056164 1203613 1299362 1113431 1258797
5104A258797j79607J83873m3925L31942k05505N50K26970p3172J91495j14657
$$ 1258797 1079190 1263063 1219138 1551080 1345575 1346125 1573095 1499923 1691418 1576761
5094A576761m8733J58422J55638j06037J22024k5732L08926K99494O12447M53546
$$ 1576761 1528028 1686450 1842088 1736051 1858075 1832343 2141269 2440763 3053210 3506756
5084C506756P91348j34638K64833j47247k41849r6393l05036j66962L7547Q3273
$$ 3506756 4298104 4163466 4428299 4281052 4039203 3942810 3637774 3470812 3508359 3591632
5074C591632P23335M13559K06309P9177k27419l33904m29052j77166j27291j26731
$$ 3591632 4314967 4728526 4934835 5014012 4786593 4452689 4023637 3846471 3719180 3592449
5064C592449j890j47904l6478Q1618r3793J95162J18974K88068L14803M65833
$$ 3592449 3590559 3442655 3406177 3487795 3394002 3589164 3708138 3996206 4311009 4776842
5054D776842R19043J544052J846972J527544N07877l30890m71767q93321j148355
$$ 4776842 5695885 7239937 9086909 10614453 11122330 10791440 10319673 9426352 8277997
5045H277997j064849n14451q33861r8245m33564n76050k99775M4722N4306J02759
$$ 8277997 7213148 6698697 5864836 5766591 5333027 4756977 4457202 4501924 4556230 4658989
5035D658989q7065N9590N2674M5502K7191m5677Q0510J79419K535O6655J59492
$$ 4658989 4571924 4631514 4684188 4729690 4756881 4711204 4791714 4971133 4973668 5040323 5199815
5024E199815j12659M822K15693J3978j82899L50206j12656L3865K00391R5065
$$ 5199815 5087156 5091978 5307671 5321649 5138750 5488956 5376300 5410165 5610556 5705621
5014E705621L3677J33279P4445m4798J88707M4254J47646Q8540L84259K90458
$$ 5705621 5739298 5872577 5947022 5902224 6090931 6135185 6282831 6371371 6755630 7046088
5004G046088J22449K51587K54502J74876L98737l1989K00353Q791K31201j46871
$$ 7046088 7168537 7420124 7674626 7849502 8248239 8216250 8416603 8425394 8656595 8509724
4994H509724K6899j6537l3360J5885J35176J35497m479p2684K3073O2118K53824
$$ 8509724 8536623 8520086 8486726 8502611 8637787 8773284 8768805 8696121 8719194 8781312 9035136
4983I035136K27668k3751K17288J73183K09622L20069K34101L88214M95238R15590
$$ 9035136 9262804 9239053 9456341 9629524 9839146 10159215 10393316 10781530 11276768 12192358
4973A2192358N35341R05800J005970J040689J071757J110865R92454J202079J340303
$$ 12192358 12727699 13633499 14639469 15680158 16751915 17862780 18855234 20057313 21397616
4964B1397616J892207K065670K848765M518564P768972J7583863K9516088K8440712
$$ 21397616 23289823 25355493 28204258 32722822 40491794 58075657 87591745 116032457
4956A16032457K0002135N643101n036801j2708458j8006620j7938281j4039619
$$ 116032457 136034592 141677693 136640892 123932434 105925814 87987533 73947914
4949G3947914j1649623q855533p575919p739523o954877m985224k782958k389385
$$ 73947914 62298291 53442758 45866839 38127316 31172439 26187215 23404257 21014872
4941B1014872j776135j484218j169526j280876j011048q83036p50008q02964m89507
$$ 21014872 19238737 17754519 16584993 15304117 14293069 13410033 12660025 11857061 11367554
4932A1367554o99590l01774m82181l85696p9827k42062p6305l68118m93610l70857
$$ 11367554 10667964 10366190 9884009 9498313 9418486 9176424 9100119 8732001 8238391 7867534
4922G867534l24538j94683k74077l25013k79516l56812p4273j11625j93905l6245
$$ 7867534 7542996 7348313 7074236 6749223 6469707 6112895 6038622 5926997 5733092 5696847
4912E696847k33181j99704J26886k49097n0333q167j2834J74481j17820m883q5554
$$ 5696847 5463666 5263962 5390848 5141751 5091418 5083251 5070417 5244898 5127078 5122195 5036641
4901E036641l27825N1873m01931k03721k41622j20918j76332k47809o580q9609
$$ 5036641 4708816 4760689 4358758 4155037 3913415 3792497 3616165 3368356 3361776 3272167
4891C272167j28337K2309k99404J55168j83643N9625N9527k95768M2751m8094
$$ 3272167 3143830 3166139 2866735 3021903 2838260 2897885 2957412 2661644 2704395 2656301
4881B656301o2604Q9561o9477j24566m2316n4778J13733k21386j0543K8446q3435
$$ 2656301 2593697 2683258 2613781 2489215 2446899 2392121 2505854 2284468 2273925 2302371 2218936
4870B218936R8294j02171l9199n5517o2211J223N9044M9196j23462N1697o7127
$$ 2218936 2317230 2215059 2175860 2120343 2058132 2059355 2118399 2167595 2044133 2095830 2028703
4859B028703J1273j17457K15721p6499q7974J38890j07129J49296N6216j483l6935
$$ 2028703 2039976 1922519 2138240 2061741 1973767 2112657 2005528 2154824 2211040 2209557 2172622
4848B172622j33329J17652q5364L9709P3942l1961O7574o6332K23518q6900L6843
$$ 2172622 2039293 2156945 2071581 2111290 2185232 2153271 2220845 2154513 2378031 2291131 2327974
4837B327974K83417l20728Q0596j845j59284K95058j16136j3193J4646n8248J02251
$$ 2327974 2611391 2290663 2371259 2369414 2210130 2505188 2389052 2375859 2390505 2332257 2434508
4826B434508N7903J67140j9831K7168J84329j9986L344J98135l1308J73210m0896
$$ 2434508 2492411 2659551 2639720 2666888 2851217 2831231 2834575 3032710 3001402 3174612 3133716
4815C133716M3553J74011n4795J55772P8301J13488j37693P6276q709j8762O0269
$$ 3133716 3177269 3351280 3296485 3452257 3530558 3644046 3506353 3582629 3573920 3555158 3615427
4804C615427J03112K9355J71879j71369n5919J85246P4951J31095n0411K8205
$$ 3615427 3718539 3747894 3919773 3748404 3692485 3877731 3952682 4083777 4033366 4061571
4794D061571O5836k5252K12580K1446M1888K15519J869J60680k4063M266R2238
$$ 4061571 4127407 4102155 4314735 4336181 4378069 4593588 4595457 4756137 4732074 4736340 4828578
4783D828578R2941J29106R8578K34445O4589R7503J43516J54531L78818L96212
$$ 4828578 4921519 5050625 5149203 5383648 5448237 5545740 5689256 5843787 6222605 6618817
4773F618817K74322K45653K09590j68938K35022m3101r9317j70221K30097J5544
$$ 6618817 6893139 7138792 7348382 7179444 7414466 7371365 7272048 7101827 7331924 7347468
4763G347468k05712K24155M8578J44011O6158J60559J09038J23030L21050J47294
$$ 7347468 7141756 7365911 7414489 7558500 7624658 7785217 7894255 8017285 8338335 8485629
4753H485629L7804P4681L01842r4437K84300J67536J20119M09912N4215M3729
$$ 8485629 8523433 8598114 8899956 8805519 9089819 9257355 9377474 9787386 9841601 9885330
4743I885330j34895K01191r0510j98480k3419j48646q5416l465n2579n944l6358
$$ 9885330 9750435 9951626 9861116 9662636 9639217 9490571 9405155 9401690 9349111 9343167 9306809
4732I306809m7836j3348K8633L0086j43390o4600j16087L5065Q3147O3591j59796
$$ 9306809 9258973 9245625 9274258 9304344 9160954 9096354 8980267 9015332 9098479 9162070 9002274
4721I002274N8426M4162m7352J18303J31257J36346J55992M36988k7071J50949
$$ 9002274 9060700 9104862 9057510 9175813 9307070 9443416 9599408 10036396 10009325 10160274
4711A0160274J85895K63272j9122k2794P0592j13017o3618K0234Q5671M9772P3294
$$ 10160274 10346169 10609441 10590319 10567525 10638117 10525100 10461482 10481716 10567387 10617159 10690453
4700A0690453K05411j17292j76806J87298k82523r7292L3828k71792q7012J16926
$$ 10690453 10895864 10778572 10601766 10789064 10506541 10409249 10443077 10171285 10084273 10201199
4690A0201199R9459j83939J09731N1033k54809R1640k43649j96327n0687j93717
$$ 10201199 10300658 10116719 10226450 10277483 10022674 10114314 9870665 9674338 9623651 9429934
4680I429934j60064j26259k95959j05633k6094n7350r4561J05887J3719N5826
$$ 9429934 9269870 9143611 8847652 8742019 8715925 8658575 8564014 8669901 8683620 8739446
4670H739446J00744L45127N3578L65766N61876J101941J208333J661951J525755
$$ 8739446 8840190 9185317 9238895 9604661 10166537 11268478 12476811 14138762 15664517
4661A5664517J231794N91308J84836o82717q45413j030640j128954r70782r50045
$$ 15664517 16896311 17487619 17672455 16989738 16144325 15113685 13984731 13013949 12063904
4652A2063904q08042p26046m06275n12719k38428j17358K31730P3350K70733N54177
$$ 12063904 11255862 10529816 10123541 9610822 9372394 9255036 9486766 9560116 9830849 10385026
4642A0385026L49836N02837L09154J77959Q3383L33869L64426J069722P61844
$$ 10385026 10734862 11237699 11546853 11724812 11808195 12142064 12506490 13576212 14338056
4633A4338056R53884Q3206r334o13086j002074j022755n83943r58180o83599n32590
$$ 14338056 15291940 15375146 15365812 14752726 13750652 12727897 12143954 11185774 10502175 9969585
4623I969585l23844o43611k95201p8202R5715q7678j1239K17800p9370J23070
$$ 9969585 9645741 9002130 8706929 8628727 8724442 8636764 8625525 8843325 8763955 8887025
4613H887025L3093M76428K91782L31259O74750Q71396R76443N59627K03753Q9231
$$ 8887025 8920118 9396546 9688328 10019587 10694337 11565733 12542176 13101803 13305556 13394787
4603A3394787l32423m75259k94046n54358k46275l89146m11327m39046p7294l86880
$$ 13394787 13062364 12587105 12293059 11738701 11492426 11103280 10691953 10252907 10175613 9788733
4593I788733O6624N93737Q79484J119035R92442M43941N8805o1453o8504k07742
$$ 9788733 9855357 10449094 11328578 12447613 13440055 13883996 13942801 13881348 13812844 13605102
4583A3605102k37851K77005L42612Q3839M93066j06148l20068K4431n56103m88647
$$ 13605102 13367251 13644256 13986868 14070707 14563773 14457625 14137557 14161988 13605885 13117238
4573A3117238n57268o73898n98381n19841n32668m74808l55716j52186j11371
$$ 13117238 12559970 11886072 11287691 10767850 10235182 9760374 9404658 9252472 9141101
4564I141101L62348Q41256R01131J003145L78494K8299k07350j18304k53412m77070
$$ 9141101 9503449 10344705 11245836 12248981 12627475 12655774 12448424 12330120 12076708 11599638
4554A1599638m14024m36992r11268l79957p87916n43489j1378m14270l07766p8894
$$ 11599638 11185614 10748622 9837354 9457397 8669481 8125992 8114614 7700344 7392578 7313684
4544G313684m51500J13363l7760M4508j29539R5383j2770q9018K967K8263J55113
$$ 7313684 6862184 6975547 6937787 6982295 6852756 6948139 6935369 6846351 6849318 6877581 7032694
4533G032694j16719l4382L76265L26798M27608Q45831Q17422J057656P77662M37548
$$ 7032694 6915975 6881593 7257858 7584656 8012264 8858095 9675517 10733173 11510835 11948383
4523A1948383k13782k92490n36433o45403o62921l24737l35722l2864k86906j44022
$$ 11948383 11734601 11442111 10905678 10260275 9597354 9272617 8936895 8904031 8617125 8473103
4513H473103j59443k38544J40764R431M1352K83589l80254L68592J18856k28252
$$ 8473103 8313660 8075116 8215880 8225311 8266663 8550252 8169998 8538590 8657446 8429194
4503H429194N37638L82997P72910J284394O49566K66701J31142l27961l36494
$$ 8429194 8966832 9349829 10122739 11407133 12056699 12323400 12454542 12126581 11790087
4494A1790087m62743m01496k58823k38108N6598j37675k63385p2053N4134j10651
$$ 11790087 11327344 10925848 10667025 10428917 10485515 10347840 10084455 10012402 10066536 9955885
4484I955885M8285L11774J46915R7096J81422K5992L86298L51285N0275L05885
$$ 9955885 10004170 10315944 10462859 10559955 10741377 10767369 11153667 11504952 11555227 11861112
4474A1861112K11340K39338K91891J75065M45779J86140J71054J68044K37458
$$ 11861112 12072452 12311790 12603681 12778746 13224525 13410665 13581719 13749763 13987221
4465A3987221J30406K84949L55350M93634K26163L95823N26666K72104N67934
$$ 13987221 14117627 14402576 14757926 15251560 15477723 15873546 16400212 16672316 17240250
4456A7240250M00087P50084N33282M81159Q90572N2143P41000M99821P13360P13941
$$ 17240250 17640337 18390421 18923703 19404862 20295434 20347577 21088577 21588398 22301758 23015699
4446B3015699P41073R64601R61442Q08212P51158Q36347P20201R14447J665151
$$ 23015699 23756772 24721373 25682815 26491027 27242185 28078532 28798733 29713180 31378331
4437C1378331J415538K102501K653462K311991K515119K383500L254926N892014
$$ 31378331 32793869 34896370 37549832 39861823 42376942 44760442 48015368 53907382
4429E3907382P290884O967482O563216N424102M868091L293228J237847J694704
$$ 53907382 61198266 68165748 74728964 80153066 85021157 88314385 89552232 91246936
4421I1246936J656859J443462K966102M505546O602900J1193821K0325575N2149833
$$ 91246936 92903795 94347257 97313359 101818905 108421805 119615626 139941201 192091034
4413A92091034J06491840J09139343Q6533585K9992668r468263l7407951n4844302
$$ 192091034 298582874 407722217 494255802 524248470 514780207 477372256 422527954
4406D22527954o2313758m4897540l7328307k9587415k3369692k6162676k4927296
$$ 422527954 360214196 315316656 277988349 248400934 225031242 198868566 173941270
4399A73941270j3572504m306818N59150K042220L144850P194687J7740988N5850955
$$ 173941270 160368766 156061948 156621098 158663318 161808168 169002855 186743843 242594798
4391B42594798J04024693R8074385O8822212J3475671k1742202m9045266o8224615
$$ 242594798 346619491 444693876 513516088 526991759 505249557 456204291 387979676
4384C87979676o5537633m8937352m1343297l1041073k3919902k3336806j9402097
$$ 387979676 322442043 273504691 232161394 201120321 177200419 153863613 134461516
4377A34461516r080457k853921k103660k912117n395658o919382o771305o798272
$$ 134461516 125381059 122527138 120423478 117511361 112115703 105196321 98425016 91626744
4369I1626744n356670j731552Q19008J133841L42778j913758l449736l704757
$$ 91626744 86270074 84538522 85357530 86491371 86834149 84920391 81470655 77765898
4361G7765898m367733l145399j902964L80785L504758L309395J582634l9077j474173
$$ 77765898 73398165 70252766 68349802 68730587 72235345 75544740 77127374 77088297 75614124
4352G5614124k254604k966764k652004j228778k05324J636918M832403O038787
$$ 75614124 73359520 70392756 67740752 66511974 66306650 67943568 72775971 78814758
4344G8814758N430136M260096K932141J998665L329170O305556K0423021M6520311
$$ 78814758 84244894 88504990 91437131 93435796 96764966 103070522 123493543 170013854
4336A70013854N2226442M2799651J8196317j878102j6571466k6875964l3416033
$$ 170013854 222240296 265039947 283236264 281358162 264786696 237910732 204494699
4329B04494699k6444808k2801764j8613216j4873173j4175686j3610410q789157
$$ 204494699 178049891 155248127 136634911 121761738 107586052 93975642 85186485
4322H5186485m188745q18809N71756J797689K684459L322045L548831M492667
$$ 85186485 80997740 80178931 80750687 82548376 85232835 88554880 92103711 96596378
4314I6596378N487365P182104J0763521J7592009M3080216R6986871J06055175
$$ 96596378 102083743 109265847 120029368 137621377 180701593 277688464 383743639
4307C83743639Q7911434L6330925k662935l3047051n3015168o8229778n3173947
$$ 383743639 471655073 507985998 505323063 472276012 419260844 351031066 297857119
4300B97857119m5863531l8479421l0684498k9628112k9579709k0555262j2378829
$$ 297857119 251993588 213514167 182829669 153201557 123621848 103066586 90687757
4293I0687757p963931n689168l512685j860924n14496l02042N00415J320149K274026
$$ 90687757 82723826 77034658 73521973 71661049 71146553 70844511 71344926 72665075 74939101
4284G4939101M336053Q007288K0190010M4524716M9782918M0668993J7499291
$$ 74939101 79275154 87282442 107472452 151997168 201780086 242449079 259948370
4277B59948370j935840j6036143k6409620l3109517k6709817k3045900j9234563
$$ 259948370 258012530 241976387 215566767 182457250 155747433 132701533 113466970
4270A13466970j5719794j5112816j5071992j0727300o945542m577138l583380
$$ 113466970 97747176 82634360 67562368 56835068 49889526 45312388 41729008
4263D1729008k990429k281466j772935j819404j401388j170718j174554q79732
$$ 41729008 38738579 36457113 34684178 32864774 31463386 30292668 29118114 28238382
4255B8238382r87120j113665o12480j020462r32278n04078p53761o58441m66718
$$ 28238382 27251262 26137597 25525117 24504655 23572377 23068299 22314538 21656097 21189379
4246B1189379p84242n13801n25878n73449p12090l86114o02075m52672m36251
$$ 21189379 20405137 19891336 19365458 18792009 18079919 17693805 17091730 16639058 16202807
4237A6202807l41954l92019l93274m49293j81422j85493k89225j54982l12427
$$ 16202807 15860853 15468834 15075560 14626267 14444845 14259352 13970127 13815145 13502718
4228A3502718P240n06135j44464k36599k97947k96675j53994l27917m42762k3363
$$ 13502718 13509958 13003823 12859359 12622760 12324813 12028138 11874144 11546227 11103465 11080102
4218A1080102l24137m13582l964k68862m07690j69398k29431j45445j44184l04754
$$ 11080102 10755965 10342383 10338419 10069557 9661867 9492469 9263038 9117593 8973409 8668655
4208H668655j09629k33565r3686j25194m9453j33880j30695r6214o5675j1043
$$ 8668655 8559026 8325461 8231775 8106581 8057128 7923248 7792553 7696339 7630664 7619621
4198G619621k31004k54555K2987k04307j19795p1847l27339Q0096j46864k97611
$$ 7619621 7388617 7134062 7157049 6952742 6832947 6761100 6433761 6513857 6366993 6069382
4188F069382j1564k70184K6578r1140l31897r5116j51166R0675j57992j25063
$$ 6069382 6057818 5787634 5814212 5723072 5391175 5296059 5144893 5235568 5077576 4952513
4178D952513K3987K0385k87255k4777P6757n9600r4668n1386l9701j94173J93817
$$ 4952513 4976500 4996885 4709630 4684853 4761610 4702010 4607342 4555956 4516255 4322082 4515899
4167D515899j93721Q9587R5498l9686n290l1412m7054J48647K10032N84656L67260
$$ 4515899 4322178 4411765 4507263 4467577 4462287 4430875 4383821 4532468 4742500 5327156 5694416
4156E694416K97575O9599o4739l66830l48291m15768k69881l07104l6165k76023
$$ 5694416 5991991 6061590 5996851 5630021 5281730 4865962 4596081 4288977 4252812 3976789
4146C976789j84636j40654j93886O9475j92023J14980P5169N0599Q4468N63913
$$ 3976789 3792153 3651499 3457613 3527088 3335065 3450045 3525214 3575813 3660281 4224194
4136D224194M53042M08701K96386n9175j76702k83215j96771m29950k63492k17249
$$ 4224194 4677236 5085937 5382323 5323148 5146446 4863231 4666460 4236510 3973018 3755769
4126C755769j28719m08732k09798R6626l08602J03643K10126l78015k5003L4352
$$ 3755769 3627050 3218318 3008520 3105146 2796544 2900187 3110313 2732298 2707295 2741647
4116B741647K5638l02112O6248Q2056j27271L5006J15103j90456K4448j56642
$$ 2741647 2767285 2465173 2531421 2613477 2486206 2521212 2636315 2445859 2470307 2313665
4106B313665R3258j52589q7629k904K27389j64483J90808j73771J0827m9334J2719
$$ 2313665 2406923 2254334 2166705 2163801 2391190 2226707 2417515 2243744 2254571 2205237 2217956
4095B217956M6574m017j54637R3509m5741K0615J92887j07498P889L37997L62504
$$ 2217956 2264530 2260513 2105876 2199385 2153644 2174259 2367146 2259648 2267537 2605534 2968038
4084B968038J17699R6271J61657j01574k71303j80969J8438m72146j40985o8986
$$ 2968038 3085737 3182008 3343665 3242091 2970788 2789819 2808257 2336111 2195126 2126140
4074B126140m9315j92413L7884j85589K77843j15997r7637m621n8446J30946q1171
$$ 2126140 2076825 1884412 1922296 1736707 2014550 1898553 1800916 1796295 1737849 1868795 1787624
4063A787624L3771J46647m6492M9067L10094N07411M76201N93885L61430m5141
$$ 1787624 1821395 1968042 1921550 1970617 2280711 2788122 3264323 3858208 4219638 4174497
4053D174497J1311k29496l23737n82988k79297r6538l28163M1707l56163j81581
$$ 4174497 4185808 3956312 3632575 3049587 2770290 2673752 2345589 2387296 2031133 1849552
4043A849552L8134n4536k12550J34461L1567r7443K08906q4015q2342M0997Q0150
$$ 1849552 1887686 1833150 1620600 1755061 1786628 1689185 1898091 1814076 1731734 1772731 1852881
4032A852881J278K49786P3569J92662J12294K78028l3381o2422m1522k71896j58334
$$ 1852881 1854159 2103945 2177514 2370176 2482470 2760498 2727117 2664695 2623173 2351277 2192943
4021B192943q181q7223j1118k52144J60923k61911m8906O3940J11966P6001j67623
$$ 2192943 2184762 2097539 2086421 1834277 1995200 1733289 1684383 1748323 1860289 1936290 1768667
4010A768667o3722k1042j15049k1565P024j77590r2123j12625K11638j19316l2767
$$ 1768667 1704945 1683903 1568854 1547289 1554313 1376723 1284600 1171975 1383613 1264297 1231530
3999A231530J40273k04483O1839K6295J72461k7538m6891Q2338J734p0649K15096
$$ 1231530 1371803 1167320 1229159 1255454 1427915 1400377 1353486 1435824 1437558 1366909 1582005
3988A582005k95362Q6538J75431j70435r5355m1448q2824L1637q3311K9086q1495
$$ 1582005 1286643 1373181 1548612 1378177 1282822 1241374 1158550 1190187 1106876 1135962 1054467
3977A054467J8462l6254J45797j45877j19000J79015k49130p3002J88872K0103
$$ 1054467 1072929 1036675 1182472 1036595 917595 1096610 847480 774478 963350 983453
3967I83453k2408k4520j40780O6489J2546o182J03789r5327o4689j1382J01793
$$ 983453 961045 936525 795745 862234 874780 868598 972387 877060 812371 800989 902782
3956I02782l03155K07039j99654O7138j26008O0442R554K883M105P2864j94102
$$ 902782 599627 806666 607012 674150 548142 608584 618138 621021 625126 697990 503888
3945E03888Q4292j1289O3473l7072J29932l21577P7740J6821k769n9811L4728
$$ 503888 588180 576891 640364 603292 733224 411647 489387 506208 503439 443628 478356
3934D78356R9371k8659j22775l5273j3969L6088L391J71763k44648J27771J3420
$$ 478356 577727 549068 426293 391020 377051 413139 416530 588293 343645 471416 484836
3923D84836r3636L7129q098N5429o2877q6605J9399K30325j81162J31649J2855
$$ 484836 391200 428329 420231 475660 412783 326178 345577 575902 394740 526389 539244
3912E39244k41837J71460P8972p8319j22019o3664J00636J08298n1333M8730j48737
$$ 539244 297407 468867 547839 469520 347501 283837 384473 492771 441438 490168 341431
3901C41431j8769P3635O9149k26770K0245Q4239k1115r941N5581j51983O9927
$$ 341431 322662 396297 465446 238676 258921 343160 322045 312104 367685 215702 285629
3890B85629K27351j63096l2995r6197O0940O365L2377P2855l2062k22530L59957
$$ 285629 512980 349884 316889 220692 281632 287997 320374 393229 361167 138637 498594
3879D98594j41321j54220J09276p2344j50552J89865K8344p9289j1758K2602l5007
$$ 498594 357273 203053 312329 239985 89433 279298 307642 228353 216595 239197 204190
3868B04190j7947j6333O9471Q3581j60651J06393K7689L7218p9778N5995n5K720
$$ 204190 186243 169910 239381 322962 162311 268704 296393 333611 253833 309828 309773 312493
3856C12493k3462L64q0697j35624K52876r2087p0377O1133Q9547j80200J63839
$$ 312493 289031 289395 208698 73074 325950 233863 163486 224619 314166 133966 297805
3845B97805R6153j89131p1937J31426k5749j57857J09234K02923j89252M5792
$$ 297805 393958 204827 132890 264316 238567 80710 189944 392867 203615 249407
3835B49407J09272j88111j7710J506J31088j12680j0299r5520K29612q6354k7369
$$ 249407 358679 170568 152858 154364 285452 172772 162473 66953 296565 210211 182842
3824A82842j27349K36140j26207J06194m2292q0916N3874o4109M1009J06952j52814
$$ 182842 55493 291633 165426 271620 229328 148412 202286 138177 179186 286138 133324
3813A33324j63441K34920K3457k6072j00445J29564j34458J32646k02323J56255
$$ 133324 -30117 204803 228260 202188 101743 231307 96849 229495 27172 183427
3803A83427N0699j69724J84381k20319J06811j70J09128M773j21388m86K19612
$$ 183427 234126 64402 248783 28464 135275 135105 244233 249006 127618 127132 346744
3792C46744l28325M0622J57383L875j37692L19235j55078j71251L2806M6747K2522
$$ 346744 18419 59041 216424 220299 82607 401842 246764 75513 108319 155066 177588
3781A77588p3626J06277k4833P7885j45958O5664K7732j2936n2556m4413l4795
$$ 177588 103962 210239 185406 263291 117333 182997 210729 197793 145237 100824 66029
3770F6029L40683k54992M2689M5143q0575K9885O1588j60682J73864j51909j085
$$ 66029 406712 151720 194409 239552 158977 188862 250450 89768 263632 111723 110638
3759A10638M2625r2831N6776j47988K43543j61884K20214k58950O0175m1069Q71
$$ 110638 153263 60432 117208 -30780 212763 50879 271093 12143 72318 31249 32120
3748C2120J43403j68009q9332K89222r1790j290J34183l20013K38165R6528q8031
$$ 32120 175523 7514 -81818 207404 115614 114324 248507 -71506 166659 263187 175156
3737A75156o696q5492L3778K1108O6417L1190j83822J03701M7138p54j55760L3884
$$ 175156 168460 82968 116746 137854 204271 235461 51639 155340 202478 201724 45964 79848
3725G9848K23271q3956N684J26357j95654o487M7969m4814O5231k24220R1246
$$ 79848 303119 219163 224847 351204 155550 149063 197032 152218 217449 -6771 84475
3714H4475J9940J49274k60636K6682J54252q5317O1834J05810j34956R852r9394
$$ 84475 104415 253689 -6947 19735 173987 88670 150504 256314 121358 131210 31816
3703C1816J38490q9294o9026J6143l6774O5201J29287q2656K4364J32717k19736
$$ 31816 170306 81012 11986 28129 -8645 56556 185843 103187 127551 260268 40532
3692D0532O2459R4976j87562Q3643P9965j83840J32078k1624J47472k92726J30733
$$ 40532 102991 197967 10405 94048 174013 -9827 122251 100627 248099 -44627 86106
3681H6106L0086m1564j7738j35913J33748q507k2687K35429k64104N1636J13243
$$ 86106 116192 74628 56890 -79023 54725 46218 23531 258960 -5144 46492 159735
3670A59735j86908K35021l6014O154j61222J8515Q9941j00908K2370m999j9064
$$ 159735 -27173 207848 171834 177988 16766 35281 125222 24314 46684 41685 22621
3659B2621O5522L3407O4554p1650K6505q0304j23763K03372j66674J09903J07930
$$ 22621 88143 121550 186104 114454 140959 60655 -63108 140264 -26410 83493 191423
3648A91423l05514J31021N5803j30624N1476j167O0508l8743n9007l1363m4201
$$ 191423 -114091 16930 72733 -57891 -6415 -7582 52926 14183 -44824 -76187 -120388
3637a20388J90817q5043J25645j53044O2742O1612K4518j14878L34694l51786
$$ -120388 70429 -14614 111031 -42013 20729 82341 106859 -8019 326675 -25111
3627b5111O0232N2405p5267m3565L2135K7506k7800l2640l5865J13926k271m1684
$$ -25111 35121 87526 12259 -31306 829 28335 535 -32105 -67970 45956 43685 2001
3615B001N0899K0737j98804J53135p18j2834l3093J65186j36724K06448j47733
$$ 2001 52900 73637 -125167 27968 27250 14416 -18677 146509 9785 216233 68500
3604F8500N8596k68701O8422N8613l2243J45340M7470j27941k213Q3081j02505
$$ 68500 127096 -141605 -73183 -14570 -46813 98527 145997 18056 15843 98924 -3581
3593c581P2843j10375R3673J04214p8536k4495j2738J5382J4054R1952j50393
$$ -3581 69262 -41113 52560 156774 78238 53743 41005 56387 70441 162393 12000
3582A2000N0028n2246n9572r4904J18956M4286n925j54596K39705j30693J9033
$$ 12000 62028 9782 -49790 -144694 -25738 18548 12623 -141973 97732 -32961 -13928
3571a3928J4262p238R6371j94753O0523J68099j77477J24246j23796l9608N0968
$$ -13928 334 -6904 89467 -105286 -44763 123336 -54141 70105 -53691 -93299 -42331
3560d2331j44796J97816J8844j27580J56122j27870L5901J05868j80255J32610
$$ -42331 -187127 10689 29533 -98047 58075 -69795 -33894 71974 -108281 24329
3550B4329n4315L4966K744o9482K07786l03165K62841j8973N5158j24967o6765
$$ 24329 -29986 4980 7724 -61758 146028 -157137 105704 86731 141889 16922 -49843
3539d9843K82329j32650k9438j01643J47604k87035K34908j22875J2987r045m532
$$ -49843 232486 99836 70398 -31245 116359 -170676 64232 -58643 -45656 -54701 -59233
3528e9233P9210m0019J51326j58237L2474M3513l3904r1140K16772l32047M5956
$$ -59233 19977 -20042 131284 -26953 5521 49034 15130 -76010 140762 -191285 -145329
3517a45329M38J91483m4926o1653J9079J1700K5326J89560j71083M6503j00304
$$ -145329 -144891 46592 1666 -59987 -40908 -29208 -3882 185678 14595 61098 -39206
3506c9206J71999j20863n6086Q7464O0750j56850J46721j27835J59711j18787
$$ -39206 132793 11930 -44156 43308 104058 -52792 93929 -33906 125805 7018
3496G018J16372L5984k05060K4570O7712j12442R3062p595K2101M79K1017k38637
$$ 7018 123390 159374 -45686 -21116 46596 -65846 27216 19621 41722 42201 63218 -175419
3484a75419J87118j04717O3935J09065j38928K9826J42249j74116M3303j1459
$$ -175419 11699 -93018 -29083 79982 -58946 -29120 113129 -60987 -17684 -29143
3474b9143k5160J08610l4173J7260j70915K00791j31491O4662j26442J38509j919
$$ -29143 -54303 54307 20134 37394 -133521 67270 -64221 441 -126001 12508 10589
3463A0589j05551J52085m5563j16179N099R3088l1603O2753m8782K6267m9553
$$ 10589 -94962 57123 11560 -104619 -99520 -6432 -38035 24718 -24064 2203 -47350
3452d7350J48338j56365J55396j53031M3390j7272K0647n478R2796j73820J24875
$$ -47350 100988 -55377 100019 -53012 -9622 -26894 -6247 -11725 81071 -92749 32126
3441C2126J29064l23804K2465M9960J87205K7453r3311R3548n5580n8128o7077
$$ 32126 161190 -162614 -140149 -90189 97016 124469 31158 124706 69126 10998 -56079
3430e6079O3295j1095N7651p3364N3792J0764k047m3975m8600R6108j65881J63607
$$ -56079 7216 -3879 53772 -19592 34200 44964 42917 -1058 -49658 46450 -119431 44176
3418D4176J22169j09523p6927J9877K05520k30441R9736j31961K80917j59175
$$ 44176 166345 56822 -20105 -228 205292 -25149 74587 -57374 223543 64368
3408F4368J25465j01545p3880k03857L35693k06652N0619J3371j037q747o4702
$$ 64368 189833 88288 14408 -189449 146244 -60408 -9789 3582 2545 -6202 -70904
3397g0904K08936k42753K03486r4441L5738o5759J06399j24684n0739J78970j27806
$$ -70904 138032 -104721 98765 4324 40062 -25697 80702 -43982 -94721 84249 -43557
3386d3557J56401q7417Q0862q1393R051M2038K1652l8228L3900J5457R4750R228
$$ -43557 112844 25427 106289 24896 33947 75985 97637 59409 93309 108766 203516 212744
3374B12744J8357J74273j17318k47679J30108M7247j49096J12574m7839j8743
$$ 212744 231101 405374 288056 40377 170485 217732 68636 181210 133371 114628
3364A14628j82161J78326M1024j91390O0703l1952j29358J43353P9061J9766j72954
$$ 114628 -67533 110793 151817 -39573 21130 -10822 -140180 3173 82234 102000 -70954
3353g0954Q0692n9341j3751r289Q7655k0212Q4466r770k1475n683O8596j96776
$$ -70954 9738 -49603 -63354 -72643 15012 -5200 79266 69496 48021 42338 110934 -85842
3341h5842j9064P1179Q9838p5457J92523j46606P6686n3744J2469O9617n5586
$$ -85842 -104906 -33727 56111 -19346 173177 26571 103257 49513 61982 131599 76013
3330G6013L1250K5429k2371l7462P9874j72334K69367j44639K99493j16015m5274
$$ 76013 107263 132692 110321 72859 152733 -19601 249766 105127 404620 288605 243331
3319B43331K72476M24288K21153K83589j23968j40144j38746j93160j02536k67162
$$ 243331 515807 940095 1161248 1444837 1320869 1180725 1041979 848819 746283 479121
3309D79121J36583j44081k39883l526j3267m7669j33679J17845J08684j72211
$$ 479121 615704 471623 231740 228214 214947 167278 33599 151444 260128 87917
3299H7917J15545q6687l8238J9858o1565O718k3122k6574M2633k8130O6192J4657
$$ 87917 203462 116775 78537 98395 36830 43548 20426 -6148 36485 8355 74547 89204
3287H9204j2550j047k70428J50047K9308Q0306K2493M6388j35482j24523J19435
$$ 89204 76654 75607 -194821 -44774 -15466 64840 87333 133721 -1761 -126284 -6849
3276f849O1414k13280K34877r7013k1829R9806R8773k23577J0728n5907J4588
$$ -6849 54565 -158715 76162 -20851 -42680 57126 155899 -67678 -56950 -112857 -98269
3265i8269J2434M0580J09207k15186J29505O3406o6867j00036J66405j31070p2298
$$ -98269 -85835 -45255 63952 -151234 -21729 41677 -25190 -125226 41179 -89891 -162189
3254a62189O1436J08109J3136J59046m4365l85977K70442k9203P429M8207j5623
$$ -162189 -100753 7356 20492 179538 135173 -250804 19638 -9565 -2136 46071 30448
3243C0448M0981j89133J42865j25212J22425j23524R0592j05710m1383J03932
$$ 30448 71429 -117704 25161 -100051 22374 -101150 -10558 -116268 -157651 -53719
3233e3719J13366r6871J29906j35410J85713k07638O5078o4354M3347j46193R9772
$$ -53719 59647 -37224 92682 -42728 142985 -64653 425 -63929 -20582 -166775 -67003
3222f7003K34510k11202P5549j7850O0765o4635P5713j14343r0867K2976J46447
$$ -67003 167507 -43695 31854 14004 74769 10134 85847 -28496 -119363 -96387 50060
3211E0060k71922K58689l5090J01116j86591J48292K5338k69392K02219J5767
$$ 50060 -221862 36827 1737 102853 -83738 64554 89892 -179500 22719 38486
3201C8486j26083J42049J8890n3217j718q7866M9680k10260L30163k04857O6285
$$ 38486 -87597 54452 73342 20125 18407 -69459 -19779 -230039 100124 -104733 -38448
3190c8448m9069K3219n570k8870j19630K09469n9402k03706K08875K1073J37202
$$ -38448 -87517 -64298 -69868 -98738 -218368 -8899 -68301 -272007 -63132 -42059 95143
3179I5143j77844J6025N7216k41237K59191n8494j41095J41747K562k9927q0595
$$ 95143 -82701 -66676 -9460 -250697 8494 -50000 -191095 -49348 -46786 -76713 -157308
3168a57308K8247O6058n8694K9464J17244j78715R0273j9267O003O0118j42102
$$ -157308 -129061 -63003 -121697 -92233 25011 -153704 -63431 -82698 -76695 -16577 -158679
3157a58679J66771k05004K77014j77391q5435J84480k17402J21809J84479j88646
$$ -158679 8092 -196912 80102 -97289 -182724 1756 -215646 -93837 90642 -98004
3147i8004O2090m6833M5429j3921K2749P3127l48726L84922j69152j6126n2120
$$ -98004 -35914 -82747 -37318 -51239 -28490 44637 -304089 80833 -88319 -104445 -156565
3136a56565J75744M073j20710n7276J96951k38642K17963o4897r5825L5593L8380
$$ -156565 19179 23252 -97458 -154734 42217 -196425 21538 -43359 -139184 -103591 -65211
3125f5211p4135j2952K61497j39012j29725L7080N3401p9098N5429M1408m9501
$$ -65211 -139346 -152298 109199 -29813 -159538 -122458 -69057 -148155 -92726 -51318 -100819
3114a00819R920n0180M0513P0640l2365N8732j16636L3010j6127J4313J35786
$$ -100819 -90899 -141079 -100566 -29926 -62291 -3559 -120195 -87185 -103312 -88999 46787
3103D6787j14618j7997J17225j36478M6509q2791q0884J66686m1832q1652P8999
$$ 46787 -67831 -85828 31397 -105081 -58572 -141363 -222247 -55561 -97393 -179045 -100046
3092a00046R7907J08796k02333J33784j03671k776j23666j1010L16312j66327
$$ -100046 -2139 106657 -95676 38108 -65563 -68339 -192005 -203015 113297 -53030
3082e3030J4051K1292j56487J51898k42448J53115P4621j07981J16391j64038
$$ -53030 -38979 -17687 -174174 -22276 -264724 -111609 -36988 -144969 -28578 -192616
3072a92616M4169J67823j36407R7167j28747J11759j63390J97051m5403l8698
$$ -192616 -148447 19376 -117031 -19864 -148611 -36852 -200242 -3191 -48594 -87292
3062h7292L2178O1894o4969J7123R914q6718J03706j27676J08668r9362J58254
$$ -87292 -55114 6780 -58189 -41066 -31152 -117870 -14164 -141840 -33172 -132534 25720
3051B5720j23932L662j33477J71745P4517m9754k5446o4043M9237p6283N2940
$$ 25720 -98212 -94550 -228027 -56282 18235 -31519 -56965 -121008 -71771 -148054 -95114
3040i5114R5901j06421q9112J14213J89206l06172n9216K45567j42124J83271
$$ -95114 787 -105634 -194746 -80533 108673 -197499 -256715 -11148 -153272 29999
3030B9999j20229j35021K06218L4323j41310N5510l6105J17311j7720k05407J37992
$$ 29999 -90230 -225251 -19033 15290 -126020 -70510 -106615 10696 -7024 -212431 -74439
3019g4439j64982L42802l25912Q4777o5072K70767k44333J17416l0922J1891m9617
$$ -74439 -239421 103381 -222531 -137754 -202826 67941 -176392 -58976 -89898 -78007 -127624
3008a27624K8376R4192m2723j46266k7332K61036j16027l3353J15847o1612J02631
$$ -127624 -99248 -5056 -47779 -194045 -221377 39659 -76368 -109721 6126 -55486 47145
2997D7145o1600j65428J38616o8136R6527j0641J9644j58159M0219J84275j96408
$$ 47145 -14455 -179883 -41267 -109403 -12876 -23517 -3873 -162032 -121813 62462 -133946
2986a33946J66099j43376J60416j55383J2822Q0644Q8019k58412J59490P4904
$$ -133946 32153 -111223 49193 -106190 -93368 -12724 75295 -183117 -23627 51277
2976E1277n6158l9298M4099n1292M734l66o7701L2317j11702R7218K3454O7107
$$ 51277 -4881 -44179 -80 -51372 -46638 -47004 -114705 -82388 -194090 -96872 -73418 -6311
2964f311q9180M9346n0526J89102j94844j59912J18870J49730l0250j65127L04451
$$ -6311 -95491 -46145 -96671 92431 -102413 -262325 -143455 6275 -23975 -189102 115349
2953A15349j32517K5329j39198Q476K0049K4814J04899j89547J30133o6485l9534
$$ 115349 -17168 8161 -131037 -122561 -102512 -77698 27201 -162346 -32213 -98698 -138232
2942a38232L2907K5934Q5010j45352R8967k28623J60130K4231k3434O7369n2503
$$ -138232 -105325 -79391 5619 -139733 -40766 -269389 -109259 -85028 -108462 -41093 -93596
2931i3596J4889M3422k7417j25887J19795R986k7404o0838J24883p5927P9430
$$ -93596 -78707 -35285 -62702 -188589 -68794 -58808 -86212 -147050 -22167 -98094 -18664
2920a8664k1906J9937j10770m3063J10097J134N4524M6280j35218J6605J72525
$$ -18664 -40570 -20633 -131403 -174466 -64369 -63235 -8711 37569 -97649 -81044 91481
2909I1481k21393J60874j90097J25789j25306L2697R0506j8843n4786J24056r4951
$$ 91481 -129912 30962 -159135 -33346 -158652 -125955 -35449 -54292 -109078 14978 -79973
2898g9973p5048J01322k6915j42513J51347M4731n3431J810j09466L6646J28618
$$ -79973 -155021 -53699 -80614 -223127 -71780 -27049 -80480 -78670 -188136 -151490 -22872
2887b2872q9708j5436n54R5324P277J5172j77217J18397P8907j36729J19698j37698
$$ -22872 -112580 -128016 -128570 -33246 -25969 -10797 -188014 -69617 9290 -127439 -7741 -145439
2875a45439N5201q8809R8522j20783J14834j792K5789O6438j38174N1668m9275
$$ -145439 -90238 -179047 -80525 -201308 -86474 -88266 -62477 3961 -134213 -82545 -131820
2864a31820n8403J5030J28210p5207L2622j37713K04097j08556J67610j28903
$$ -131820 -190223 -175193 -46983 -122190 -89568 -227281 -23184 -131740 35870 -93033
2854i3033o2893r4233J33274j1765o5516R4601o1640p0808J82688q1524l7034
$$ -93033 -155926 -250159 -116885 -128650 -194166 -99565 -161205 -232013 -49325 -130849 -167883
2843a67883K27202j57079N840l1225P1996n880q0212O7916m625q9977M3436o4664
$$ -167883 59319 -97760 -91920 -123145 -51149 -57029 -137241 -69325 -73950 -163927 -120491 -185155
2831a85155p0851R9433K3248P7141j80045J88910o1051P1452j9343O6449j29798
$$ -185155 -256006 -156573 -133325 -56184 -236229 -47319 -108370 -36918 -56261 10188 -119610
2820a19610N4863k2241J62772j06602j01599n0599l3680J32103n7632L9217l7238
$$ -119610 -64747 -86988 75784 -30818 -132417 -183016 -216696 -84593 -142225 -103008 -140246
2809a40246J7655n5268l023k5322J71038n9428j06562J80211L6670k52105J34948
$$ -140246 -122591 -177859 -180882 -206204 -35166 -94594 -201156 -20945 15725 -236380 -101432
2798a01432J2581o6712j4734M5525K8850p69l9221M8182P4610j50363J66999k41097
$$ -101432 -88851 -155563 -170297 -124772 -95922 -96691 -135912 -87730 -13120 -163483 3516 -237581
2786b37581J67865l4625j53747M9336J38231j43002J24103P9493J0385q2521K389
$$ -237581 -69716 -104341 -258088 -208752 -70521 -213523 -89420 -9927 458 -82063 -79674
2775g9674J53074j34921p3785K03418R521l23540J15487J63379j35053l6317J22270
$$ -79674 73400 -61521 -135306 68112 77633 -245907 -130420 32959 -102094 -138411 -16141
2764a6141j71939R3884l2966k7334j5217n0745M7488O7679l1716m359J05802k6997
$$ -16141 -188080 -94196 -127162 -154496 -169713 -220458 -172970 -105291 -137007 -141366 -35564 -62561
2752f2561m4912l5366K62261l51845J02878k68053L16534j20338N8297P5560l3978
$$ -62561 -107473 -142839 119422 -232423 -129545 -397598 -81064 -201402 -143105 -67545 -101523
2741a01523K9433P1305k24372J1003K69570k87400J74174k05434J26677n6863
$$ -101523 -72090 -785 -225157 -214154 55416 -231984 -57810 -263244 -136567 -193430
2731a93430K13907j72262O9523J26703j10941n4191J2231P507j0304j3034q5947
$$ -193430 20477 -151785 -82262 44441 -66500 -120691 -108460 -100953 -111257 -124291 -210238
2720b10238N6337k4773n1007J09208N5879j2097M0429N9945j10149p5161K1777
$$ -210238 -153901 -178674 -229681 -120473 -64594 -76691 -36262 23683 -86466 -161627 -139850
2709a39850O286J4853m4890M650o7741J28116R3747j47330J27581j20397j0440
$$ -139850 -133564 -118711 -163601 -158951 -226692 -98576 -4829 -152159 -24578 -144975 -155415
2698a55415k0742J41059j00476M1446j29985K45508j73753r4679J94760N4482
$$ -155415 -176157 -35098 -135574 -94128 -224113 21395 -152358 -247037 -52277 2205
2688B205j91657P0498k9111L0233o5640J32681n4565k43714K36823j95066K36911
$$ 2205 -189452 -118954 -148065 -117832 -183472 -50791 -105356 -349070 -112247 -307313 -70402
2677g0402o409n3941j17240o973M9505Q0316j88288L19537j41574J1529l0096
$$ -70402 -76811 -130752 -247992 -254965 -205460 -125144 -313432 6105 -135469 -123940 -154036
2666a54036j7141n8161J02353r8554J24143j6205L6712Q1345N1155k13267o4406
$$ -154036 -171177 -229338 -126985 -225539 -101396 -117601 -80889 456 51611 -161656 -226062
2655b26062K38911k87086Q4176J73703j07664N1285j69740O2349O3557q3578J29916
$$ -226062 12849 -274237 -190061 -16358 -124022 -72737 -242477 -180128 -116571 -200149 -70233
2644g0233j43166L9804K2978Q5142k18054K43257L8862j72864O9858J62372k34849
$$ -70233 -213399 -173595 -150617 -65475 -283529 -40272 -1410 -174274 -104416 57956 -176893
2633a76893M1339o4658R678R1958j48174K04086r1016k3193L1840J50154j95318
$$ -176893 -135554 -200212 -190534 -98576 -246750 -42664 -133680 -156873 -125033 25121 -170197
2622a70197r486J16670j92788J83916N2714j57681P886M2406m0439J20090L731
$$ -170197 -179683 -63013 -255801 -71885 -19171 -176852 -168966 -126560 -166999 -46909 -43178
2611d3178j04190r8701p9532K63323j0621p5025Q5375k02512M5548k0452R4624
$$ -43178 -147368 -246069 -325601 -62278 -72899 -147924 -62549 -265061 -219513 -239965 -145341
2600a45341J18372l7897q7350j4897J4001o7608K14172K3274j67325j5619J97968
$$ -145341 -26969 -64866 -152216 -167113 -153112 -220720 -6548 16726 -150599 -166218 31750
2589C1750k58165L16506k50862K5409P9099P8145j41646P9760K8958r2726q8780
$$ 31750 -226415 90091 -160771 -135362 -56263 21882 -119764 -40004 -11046 -103772 -192552
2578a92552l9435K20692j20540N5441M6844r9294J4515J85194k22677N3299n6774
$$ -192552 -231987 -11295 -131835 -76394 -29550 -128844 -114329 70865 -151812 -98513 -155287
2567a55287K1120M2909p6617l5453m9596J29747m0854J39294K5842j45394j8583
$$ -155287 -134167 -91258 -167875 -203328 -252924 -123177 -164031 -24737 1105 -144289 -162872
2556a62872R584N3164k9474m2276J06409j62516J79023n3626m4602j4126n2793
$$ -162872 -153288 -100124 -129598 -171874 -65465 -227981 -48958 -102584 -147186 -161312 -214105
2545b14105J30179j41663J90025M7290k27673R5750L9758q599o0045Q6832O7743
$$ -214105 -83926 -225589 -35564 11726 -215947 -120197 -80439 -89038 -149083 -62251 5492
2534E492l46773J48788J03449K2138K0431J03654J6554l06611K24936q5459o4543
$$ 5492 -341281 -192493 -89044 -66906 -46475 57179 73733 -232878 -7942 -93401 -157944
2523a57944J53819M7414j62684k3237K2260q8866J22441J12073j8348k27532J20811
$$ -157944 -4125 43289 -119395 -142632 -120372 -209238 -86797 25276 6928 -220604 -99793
2512i9793J04652j35031O1940j34889k3563P3352M2597n3205J8133R4580o8844
$$ -99793 4859 -130172 -68232 -203121 -226684 -153332 -110735 -163940 -145807 -51227 -120071
2501a20071J54909k23728K5559J73804J8443j51266N3257j19022l4434K72575
$$ -120071 34838 -188890 -163331 10473 28916 -122350 -69093 -188115 -222549 50026
2491E0026n1105j39160P4841j9964n3138r868n9833Q6270L5397j7555p1881P8827
$$ 50026 -1079 -140239 -65398 -85362 -138500 -148368 -208201 -121931 -86534 -104089 -175970 -97143
2479i7143L4785o825j99241K20222j12754j07753J98908P850r9555l4432m4668
$$ -97143 -62358 -69183 -268424 -48202 -160956 -268709 -69801 -61951 -161506 -195938 -240606
2468b40606O2381J4711O4120J9341J20322j28619Q880j29557J39261j5075L5104
$$ -240606 -178225 -163514 -99394 -80053 40269 -88350 -79470 -209027 -69766 -84841 -49737
2457d9737N838r954j61918J71927J14323j42850k15522K71765l23798L4529K04827
$$ -49737 -43899 -53853 -215771 -43844 70479 -72371 -287893 -16128 -339926 -305397 -100570
2446a00570Q0250j93654N02N9267Q0990q4103J42179N8371j56792K3427j03708
$$ -100570 -20320 -213974 -213472 -154205 -73215 -157318 -15139 43232 -113560 -90133 -193841
2435a93841N5144j8587J03975J9751j61285m156J30600j49408J89300Q6027j72290
$$ -193841 -138697 -157284 -53309 -33558 -194843 -198999 -68399 -217807 -28507 57520 -114770
2424a14770J9270n5424l3731m4646J44782r9099L2431j52899P1684J35358m2772
$$ -114770 -95500 -150924 -184655 -229301 -84519 -183618 -151187 -304086 -232402 -97044 -139816
2413a39816J24997j42885Q3631m4847m0630Q2806j10639J21669m9528j14292q5930
$$ -139816 -14819 -157704 -74073 -118920 -159550 -76744 -187383 -65714 -115242 -229534 -315464
2402c15464J99693J17925j65668N5384n0603j54173J51372J34932j30466o7533
$$ -315464 -115771 2154 -163514 -108130 -158733 -312906 -161534 -26602 -157068 -224601
2392b24601Q5609p8936J22528K2777K703k7037n3445J14990j67202J5232P5316
$$ -224601 -138992 -217928 -95400 -72623 -69920 -96957 -150402 -35412 -202614 -187382 -112066
2381a12066P8970j34177L7463o7098q699j01036K70741r2415q4702L4344J578
$$ -112066 -33096 -167273 -129810 -196908 -205607 -306643 -35902 -128317 -213019 -178675 -177097
2370a77097J78644n8356n9439K3258j82603L9929J81303j55606L6338R0442l743
$$ -177097 1547 -56809 -116248 -92990 -275593 -235664 -54361 -209967 -173629 -83187 -86930
2359h6930j01898L9938j10501K39438n0968M4270j12868j08019P1535R8927j90961
$$ -86930 -188828 -148890 -259391 -19953 -70921 -26651 -139519 -247538 -176003 -77076 -268037
2348b68037J15130R8158k7663p3535O1104N5665k37503J77554p0894M8837R4153
$$ -268037 -152907 -54749 -82412 -155947 -94843 -39178 -276681 -99127 -170021 -121184 -27031
2337b7031o1870K9962j67828m8647J01326L1034l3752J0603J11306p1783p0315
$$ -27031 -88901 -58939 -226767 -275414 -174088 -143054 -176806 -166203 -54897 -126680 -196995
2326a96995J21101j62488J45723K08521j86024n4555o5492J00594N731J0608l2262
$$ -196995 -75894 -238382 -92659 115862 -70162 -124717 -190209 -89615 -83884 -73276 -105538
2315a05538j06839p2035R1829K3607M1632r0596K76134k16023m8448O3117j59277
$$ -105538 -212377 -284412 -192583 -168976 -127344 -217940 58194 -157829 -206277 -143160 -302437
2304c02437K03155n226q9828J463j28463K66220o984q1524J09166o1946j6139
$$ -302437 -99282 -104508 -194336 -192873 -321336 -55116 -62100 -143624 -34458 -96404 -112543
2293a12543l9593L4487k4526O3038j07888O3136l9448p572n9578J06509j2467
$$ -112543 -152136 -117649 -142175 -79137 -187025 -123889 -163337 -170909 -230487 -123978 -136445
2282a36445J41614j91928j6332K5595O6763p9973m8218O9898j4786O1649j06096
$$ -136445 5169 -186759 -203091 -177496 -110733 -190706 -238924 -169026 -183812 -122163 -228259
2271b28259J86454j56428p2310M7605j9179P702J49808r2736j7109J5562K09668
$$ -228259 -41805 -198233 -270543 -222938 -242117 -234415 -84607 -177343 -194452 -178890 30778
2260C0778k29329J29130J06457j48753M4401k1991q9613j8076J03918o2404J23006
$$ 30778 -198551 -69421 37036 -111717 -67316 -89307 -178920 -196996 -93078 -155482 -32476
2249c2476k59236J10517K3946j54751K26685k4482p3599N7821K413l7274J7011
$$ -32476 -291712 -181195 -157249 -312000 -85315 -109797 -183396 -125575 -123162 -160436 -143425
2238a43425q6206N8166Q6320n9290k9642J17079p8263L410P1380k05186j7391
$$ -143425 -229631 -171465 -85145 -144435 -174077 -56998 -135261 -131851 -60471 -265657 -283048
2227b83048K48120r3454J9266k6394q455j8955P4423j12137J18085K3977q1896
$$ -283048 -34928 -128382 -109116 -135510 -143965 -162920 -88497 -200634 -82549 -58572 -140468
2216a40468q0831O3558M7387l989o9422o5697M851O4287L6686Q9854o4599k5341
$$ -140468 -221299 -157741 -110354 -114343 -183765 -249462 -244611 -180324 -143638 -53784 -118383 -143724
2204a43724k4416K7090P977J32769j37769p0554J65146k00924K3369N4756J27682
$$ -143724 -168140 -141050 -133073 -304 -138073 -208627 -43481 -244405 -221036 -166280 -38598
2193c8598n1541M0518j52109P9244J04167o412j81053Q5565J7873q8772N1334
$$ -38598 -90139 -49621 -201730 -122486 -18319 -24731 -205784 -120219 -102346 -191118 -139784
2182a39784j26552J34029K7758r315o7060J49959p8672l8071N9695q0835j66177
$$ -139784 -266336 -132307 -104549 -113864 -180924 -30965 -109637 -147708 -88013 -168848 -335025
2171c35025L38209k38384N2127J9683Q0332p999p6326o683o7606J61102P2098
$$ -335025 3184 -235200 -183073 -163390 -83058 -91057 -167383 -174066 -241672 -80570 -8472
2160h472o7069n4540P4371j61462J23511l1269m1269J11440k11594J84412l5164
$$ -8472 -75541 -130081 -55710 -217172 -93661 -124930 -166199 -54759 -266353 -81941 -117105
2149a17105j2749l7647k2430L3753J01539p8798J24950j41982O2814J9906p0277
$$ -117105 -129854 -167501 -189931 -156178 -54639 -133437 -8487 -150469 -87655 -67749 -138026
2138a38026n7072J89876q6161n1971R7685K6473j07156J7945l7376J2755K6179
$$ -138026 -195098 -5222 -91383 -143354 -45669 -19196 -126352 -108407 -145783 -133028 -106849
2127a06849J6893q3154R7416j9195j0403J7089o4040O5401K0850O511k3277R4111
$$ -106849 -89956 -173110 -75694 -94889 -105292 -88203 -152243 -86842 -65992 -59481 -82758 11353
2115A1353j22136j52801K46220l35314J31051N8211O1627L1012q9190m9527R6113
$$ 11353 -110783 -263584 -17364 -352678 -221627 -163416 -101789 -70777 -159967 -209494 -113381
2104a13381k08662J58224J04865k35703N9140J54004O3924j19151p0716P0536
$$ -113381 -322043 -163819 -58954 -294657 -235517 -81513 -17589 -136740 -207456 -136920
2094a36920Q9281j32005J98824j59948N6165n7385j8502m2308K1705k262P6168
$$ -136920 -47639 -179644 19180 -140768 -84603 -141988 -160490 -202798 -181093 -183355 -107187
2083a07187j6810j52185R3788L3994J29125j70632J09816j43164J57611j07321
$$ -107187 -123997 -276182 -182394 -148400 -19275 -189907 -80091 -223255 -65644 -172965
2073a72965P725R1775M3466o1509L6455j02718p5696P162J55604M6058k05331
$$ -172965 -165240 -73465 -29999 -91508 -55053 -157771 -233467 -226305 -70701 -24643 -229974
2062b29974j8832J7874n545o9854K78544l2214j39190Q762J96697l57075L05925
$$ -229974 -248806 -230932 -236477 -306331 -27787 -60001 -199191 -190429 6268 -350807 -44882
2051d4882N0518q3973k12324Q1573l5711L8149J12478K5372l5016J9312J00545
$$ -44882 5636 -78337 -290661 -209088 -244799 -206650 -94172 -68800 -103816 -84504 16041
2040A6041k54382J22716J0008K926j53622J43944n0642J05297o4574J60859j56230
$$ 16041 -238341 -115625 -105617 -102691 -256313 -112369 -163011 -57714 -122288 38571 -117659
2029a17659j45635p2648K27425P341j17177J39848j39590M5793l1911J80995k17540
$$ -117659 -263294 -335942 -108517 -101176 -218353 -78505 -218095 -172302 -204213 -23218 -240758
2018b40758J21791j12172Q3038o6089J71984j74q8252l0892k616K8213q6624N8974
$$ -240758 -118967 -231139 -148101 -214190 -42206 -42380 -130632 -161524 -164140 -135927 -222551 -163577
2006a63577J0029r3247l4251J54915M2182j10824Q2363l5455Q4317j40654J3278
$$ -163577 -153548 -246795 -281046 -126131 -83949 -194773 -112410 -147865 -63548 -204202 -190924
1995a90924r856j7930J40292j82434J2049L1507K5931K2703N7571L5633r2568
$$ -190924 -200780 -218710 -78418 -260852 -248803 -217296 -191365 -168662 -111091 -75458 -168026
1984a68026K3281r5600m68J85518L6864k28474J94696j25826k2358k7832o047
$$ -168026 -144745 -240345 -240813 -55295 -18431 -246905 -52209 -178035 -200393 -228225 -234272
1973b34272K46950j18405k5411j43078P1495J25463j76104J34128k20412J97429
$$ -234272 12678 -105727 -131138 -274216 -202721 -77258 -253362 -119234 -339646 -142217
1963a42217p8507Q53K91851m03340L13532o6172o4959j3583N763J06N6634j69625
$$ -142217 -220724 -219871 71980 -331360 -17828 -84000 -148959 -162542 -156779 -156673 -100039 -269664
1951b69664J01723J7726k4941M6974K4695o8672q8896K11848j11280M5048M1439
$$ -269664 -167941 -150215 -175156 -128182 -103487 -172159 -261055 -49207 -160487 -115439 -74000
1940g4000j15975L1844j06630J57734R9264j69820O3674m9883j16418J17488J27911
$$ -74000 -189975 -158131 -264761 -107027 -7763 -177583 -113909 -163792 -280210 -162722 -34811
1929c4811j82990n4127K5321L9337p9566N8614J06046K4535j83905O494J40112
$$ -34811 -217801 -271928 -246607 -207270 -286836 -228222 -122176 -97641 -281546 -275052 -134940
1918a34940j99242K36362l6225l8787j09529K16462j84209J33259j49130Q8680
$$ -134940 -334182 -97820 -134045 -172832 -282361 -65899 -250108 -116849 -265979 -177299
1908a77299P4516j79827j571K47266j30359n4830K9786k7050O3165j20545O3118
$$ -177299 -102783 -282610 -284181 -36915 -167274 -222104 -192318 -219368 -156203 -276748 -213630
1897b13630j33196K82973k32168J30047k2602R7843m7641j48292K80404k87700
$$ -213630 -346826 -63853 -296021 -165974 -188576 -90733 -138374 -286666 -6262 -293962
1887b93962L6099J64659Q5076k75239L5120J05200J8387j43421J11712r0584R5019
$$ -293962 -257863 -93204 -8128 -283367 -248247 -143047 -124660 -268081 -156369 -246953 -151934
1876a51934j26560J55008k32712J59300k424R1779k5245j39808J24358o8305N5150
$$ -151934 -278494 -123486 -356198 -196898 -199322 -107543 -132788 -272596 -148238 -216543 -161393
1865a61393N7224j7781j77856L8931L311K21431k44438K34258k1599j80933P8339
$$ -161393 -104169 -121950 -299806 -260875 -257564 -36133 -280571 -46313 -67912 -248845 -170506
1854a70506J35115j98586K8784J8868r1658K8597q8782J10560K5393J9321k0792
$$ -170506 -35391 -233977 -205193 -186325 -277983 -249386 -338168 -227608 -202215 -182894 -203686
1843b03686M9036j92926K71372J1228j4700j10888N1418k35784L29256J1896j03820
$$ -203686 -154650 -347576 -76204 -64976 -79676 -190564 -139146 -374930 -45674 -33778 -137598
1832a37598j9985L8654j2918p3683J14368o6767J11292j41941J95364k61284L2140
$$ -137598 -157583 -118929 -131847 -205530 -91162 -157929 -46637 -188578 6786 -254498 -222358
1821b22358Q4845J1495j99677K03145q0238R4408j19839J7550O4521N1574l4061
$$ -222358 -137513 -126018 -325695 -122550 -202788 -108380 -228219 -210669 -146148 -94574 -128635
1810a28635l2637r408l3351K19716j59905k4370L7274n9621J57013Q986p0771
$$ -128635 -161272 -170680 -204031 15685 -144220 -168590 -131316 -190937 -33924 -24938 -95709
1799i5709m677j58637J03129J0031N3204j36370J170J84122k25596J61736j16606
$$ -95709 -100386 -259023 -155894 -145863 -92659 -229029 -227859 -43737 -269333 -107597 -224203
1788b24203j6532j0366j4585P8707m389K844o0130N3163M8018j41166P4183K6040
$$ -224203 -240735 -251101 -265686 -186979 -191368 -188524 -248654 -195491 -147473 -288639 -214456 -188416
1776a88416K72981k16223J3890N8401j08999l9312J23686j68011K4475J30248
$$ -188416 84565 -131658 -117768 -59367 -168366 -207678 -83992 -252003 -227528 -97280
1766i7280p8077N543r3659J93033j45588M7479n3806k7177J58180o8536L2871
$$ -97280 -175357 -169814 -263473 -70440 -216028 -168549 -222355 -249532 -91352 -159888 -127017
1755a27017r1773N4011l4247n186O2323l1875J81636j5537k34641J05086L0797
$$ -127017 -218790 -164779 -199026 -204212 -141889 -173764 7872 -7665 -242306 -137220 -106423
1744a06423J7562j03620l0407R6741r6965L1080Q9886j08269K52067l12728J97336
$$ -106423 -88861 -192481 -222888 -126147 -223112 -192032 -102146 -210415 41652 -271076 -73740
1733g3740j93783J22143N3178R0543r5303J22064k00286j7269O6128j485M2885
$$ -73740 -267523 -145380 -92202 -1659 -96962 25102 -175184 -192453 -126325 -127810 -84925
1722h4925j28098k253P1368R4518j30160J71031k15316J67787k48630J90087l437
$$ -84925 -213023 -215276 -143908 -49390 -179550 -8519 -223835 -56048 -304678 -114591 -118028
1711a18028L7517P4224n9460J171q3862l4782k2903r16n340J59209k04356K38584
$$ -118028 -80511 -6287 -65747 -64576 -148438 -183220 -206123 -207039 -212379 -53170 -257526 -18942
1699a8942k13103J30982j53863R0964k4549o9146J35572P2117r2629j2226k35624
$$ -18942 -232045 -101063 -254926 -163962 -188511 -257657 -122085 -49968 -142597 -154823 -390447
1688c90447K41086K4277M1403j48584m6267J65183p005n0556o8458K42545j21328
$$ -390447 -149361 -125084 -83681 -232265 -278532 -113349 -120354 -170910 -239368 3177 -118151
1677a18151j01858J06468j592j3761J0222o4535j5274J34270j13853J48369m2715
$$ -118151 -220009 -113541 -115133 -128894 -118672 -183207 -198481 -64211 -178064 -29695 -72410
1666g2410O7026j41226Q3114j36418J42365k26612K22812k20867J2873L8612J29128
$$ -72410 -5384 -146610 -63496 -199914 -57549 -284161 -61349 -282216 -269343 -230731 -101603
1655a01603q5373J18953j89009J27174q0143R3670N3378j19153N5837j85205J94763
$$ -101603 -186976 -68023 -257032 -129858 -210001 -116331 -62953 -182106 -126269 -311474 -116711
1644a16711j88959O566L9827J09470j51288J89868j37150J35520j5722L5257Q105
$$ -116711 -305670 -299104 -259277 -149807 -301095 -111227 -248377 -112857 -128579 -93322 -85217
1633h5217k00804N4780N5103j40908J74344K1360m9137o0827l7416K08168k34521
$$ -85217 -286021 -231241 -176138 -317046 -142702 -121342 -170479 -231306 -268722 -60554 -295075
1622b95075M5633M0080J48558j67081J10106L5190m4209R6707j38595j18757Q2345
$$ -295075 -249442 -209362 -60804 -227885 -117779 -82589 -126798 -30091 -168686 -287443 -205098
1611b05098J15849j45239J20018j54744K12482q5020l5307L2252l176O2649j00149
$$ -205098 -89249 -234488 -114470 -269214 -56732 -141752 -177059 -144807 -147983 -85334 -185483
1600a85483L6124J29960k31128N9194P9274m7599o6631j27603J66622Q5843j1150
$$ -185483 -149359 -19399 -250527 -191333 -112059 -159658 -226289 -353892 -187270 -101427 -112577
1589a12577k04606R3751l433M3020j11564M2335K16113j49370q0563k0329J04572
$$ -112577 -317183 -223432 -226865 -183845 -295409 -253074 -36961 -186331 -266894 -287223 -182651
1578a82651K2252M4150P2326k09700j3597K64714k25719O1259j5621J62359j72626
$$ -182651 -160399 -116249 -43923 -253623 -267220 -2506 -228225 -166966 -182587 -20228 -192854
1567a92854M020P8184P4682k06358J06030k23814K32174k00350J30473p9755J84664
$$ -192854 -188834 -110650 -35968 -242326 -136296 -360110 -127936 -328286 -197813 -277568 -92904
1556i2904j26715r8039M7336M0939J07236m3639J09402j05075n0188n1930J41475
$$ -92904 -219619 -317658 -270322 -229383 -122147 -165786 -56384 -161459 -211647 -263577 -122102
1545a22102j04478O8573k4296p5452J33629j91170J42167J03051j98105J56317
$$ -122102 -226580 -158007 -182303 -257755 -124126 -315296 -173129 -70078 -268183 -111866
1535a11866N4154k37807J49160n7866J58868k19751l5656K51608o8864j21024
$$ -111866 -57712 -295519 -146359 -204225 -45357 -265108 -300764 -49156 -118020 -239044
1525b39044Q1855o5413n861J02155P9247j75236P8245n1915l6098q6174J38023
$$ -239044 -157189 -222602 -228463 -126308 -47061 -222297 -144052 -195967 -232065 -318239 -180216
1514a80216L4164M8887j15404m0343J6417M8505J04073p395l7388J6326l4384
$$ -180216 -146052 -97165 -212569 -252912 -236495 -187990 -83917 -91312 -128700 -112374 -146758
1503a46758j0605L2534j29910K37507k90843P9752P4598J3746j65827R8721J00829
$$ -146758 -157363 -124829 -254739 -17232 -308075 -228323 -153725 -139979 -305806 -207085 -106256
1492a06256q9667M0472J58701j97732j34375J05184J40785M2044k90127J61184
$$ -106256 -195923 -155451 3250 -194482 -328857 -223673 -82888 -40844 -330971 -169787
1482a69787L3782r0158J53048k91956J05122J39075m4721r7149K8095P8197P5021
$$ -169787 -136005 -226163 -73115 -365071 -259949 -120874 -165595 -262744 -234649 -156452 -81431
1471h1431j77211J04977L3842k7201p5460N3821j45088J73317l8070M5986j05359
$$ -81431 -258642 -153665 -119823 -147024 -222484 -168663 -313751 -140434 -178504 -132518 -237877
1460b37877R195J64137n0518N6539j75867Q3775j28512j84828L07196J60695l07580
$$ -237877 -228682 -64545 -115063 -58524 -234391 -150616 -279128 -463956 -156760 3935 -303645
1449c03645K77114j00790r3357m2625R8306J1759n0846J77170j25273j47040K24703
$$ -303645 -26531 -127321 -220678 -263303 -164997 -153238 -204084 -26914 -152187 -299227 -74524
1438g4524j32738l2875j180j9991L1906k7542L58609j77695j02153J45161l7477
$$ -74524 -207262 -240137 -241317 -261308 -229402 -256944 101665 -76030 -178183 -33022 -70499
1427g0499j49732Q3832L7940J01583k74196J3758K20778k91994J83928k2472P2634
$$ -70499 -220231 -136399 -98459 3124 -271072 -257314 -36536 -328530 -144602 -167074 -94440
1416i4440j57379O3525l4884o2152Q0365J25730n3329l9961k0447J48969j20542
$$ -94440 -251819 -188294 -223178 -285330 -204965 -79235 -132564 -172525 -192972 -44003 -164545
1405a64545j8968J93802j83380l0642J25560n8434K4850j51833J79139j83253
$$ -164545 -183513 10289 -173091 -203733 -78173 -136607 -111757 -263590 -84451 -267704
1395b67704l5905J33407j27p0894q2314J73469j21190J62724l863q6568j42197
$$ -267704 -303609 -170202 -170329 -241223 -323537 -150068 -271258 -108534 -112397 -198965 -341162
1384c41162L28814k60145j0989K60942k71766K08019j35019r5459R4325n0435
$$ -341162 -12348 -272493 -283482 -22540 -294306 -86287 -221306 -316765 -222440 -272875
1374b72875M7241Q9923l0235L2462k8093l4635q5921J90980o2831J0074j80055
$$ -272875 -225634 -135711 -165946 -133484 -161577 -196212 -282133 -91153 -153984 -143910 -323965
1363c23965J61238l9016O5003O6658M1015j15480j36942N8417P6227l4881o5213
$$ -323965 -162727 -201743 -136740 -70082 -29067 -144547 -281489 -223072 -146845 -181726 -246939
1352b46939M7395l2035J4798P6854J1981q9717J23232P130j45550q1263K42136
$$ -246939 -199544 -231579 -216781 -139927 -127946 -217663 -94431 -87301 -232851 -314114 -71978
1341g1978m1638n133N6105j67146q7628K18834O9770l55730L04291k00508L8351
$$ -71978 -113616 -118749 -62644 -229790 -317418 -98584 -28814 -384544 -80253 -280761 -242410
1330b42410R3626m2510Q2775o3068M2746l5511J1735k2902N0927q0763O2542O1399
$$ -242410 -148784 -191294 -108519 -171587 -128841 -164352 -152617 -175519 -124592 -205355 -142813 -81414
$$ [...]
##END NTUPLES=NMR SPECTRUM
##END=
