##TITLE=abcd
##JCAMPDX= 6.0         $$ Bruker NMR JCAMP-DX V2.0
##DATA TYPE= NMR SPECTRUM
##DATA CLASS= NTUPLES
##ORIGIN= UXNMR, Bruker Analytische Messtechnik GmbH
##OWNER= root
$$ XWIN-NMR		Version 3.5
$$ Wed May  6 11:49:29 2026 Russian Standard Time (UT+4h)  servis@DPX200
##.OBSERVE FREQUENCY= 200.131235884673
##.OBSERVE NUCLEUS= ^1H
##.ACQUISITION MODE= SIMULTANEOUS
##.ACQUISITION SCHEME= undefined
##.AVERAGES= 32
##.DIGITISER RES= 18
##SPECTROMETER/DATA SYSTEM= spect
##.PULSE SEQUENCE= zg
##.SOLVENT NAME= DMSO
##.SHIFT REFERENCE= (INTERNAL, DMSO, 0, 16.4885)
##AUDIT TRAIL= $$ (NUMBER, WHEN, WHO, WHERE, WHAT)
$$ ##TITLE= Audit trail, XWIN-NMR		Version 3.5
$$ ##JCAMPDX= 5.01
$$ ##ORIGIN= Bruker BioSpin GmbH
$$ ##OWNER= servis
$$ F:\spectra/data/av/nmr/H1/1/pdata/1/auditp.txt
$$ ##AUDIT TRAIL=  $$ (NUMBER, WHEN, WHO, WHERE, WHAT)
(   1,<2026-05-06 11:46:00.43 +0400>,<servis>,<DPX200>,
      <created by zg, POWCHK disabled, PULCHK disabled
       configuration hash MD5:
       00 E9 B6 7A A2 85 ED C7 34 08 36 98 17 FE 4E 26
       data hash MD5: 32K
       C9 B4 18 88 3D 96 76 FB 2E CC D0 0A B2 EE 0E C4>)
(   2,<2026-05-06 11:48:56.81 +0400>,<servis>,<DPX200>,
      <Start of raw data processing
       efp BC_mod = 2 LB = 0.05 FT_mod = 6 PKNL = 1 PHC0 = -187.6659 PHC1 = 3.101563 SI = 16K 
       data hash MD5: 16K
       9E 53 6A 16 BE 0B 8E 53 FB FC 73 55 8C 2A 19 2E>)
$$ ##END=
$$ 
$$ hash MD5
$$ 77 2C 50 88 C0 7E 96 00 85 11 E3 2E 27 16 DE 2F
##$RELAX= 
##$RELAX= 
##$RELAX= 
##$RELAX= 
##$RELAX= 
##$RELAX= 
##$RELAX= 
##$RELAX= 
$$ Bruker specific parameters
$$ --------------------------
##$DU= <F:\spectra>
##$EXPNO= 1
##$NAME= <H1>
##$PROCNO= 1
##$TYPE= <nmr>
##$USER= <av>
##$AMP= (0..31)
100 100 100 100 100 100 100 100 100 100 100 100 100 100 100 100 100 100 
100 100 100 100 100 100 100 100 100 100 100 100 100 100 
##$AQSEQ= 0
##$AQ_mod= 1
##$AUNM= <au_zg>
##$AUTOPOS= <>
##$BF1= 200.13
##$BF2= 200.13
##$BF3= 200.13
##$BF4= 200.13
##$BF5= 500.13
##$BF6= 500.13
##$BF7= 500.13
##$BF8= 500.13
##$BYTORDA= 1
##$CFDGTYP= 0
##$CFRGTYP= 5
##$CHEMSTR= <none>
##$CNST= (0..31)
1 1 145 1 1 1 1 1 1 1 1 1 1 1 1 1 1 1 1 1 1 1 1 1 1 1 1 1 1 1 1 1 
##$CPDPRG= <>
##$CPDPRG1= <>
##$CPDPRG2= <>
##$CPDPRG3= <>
##$CPDPRG4= <mlev>
##$CPDPRG5= <mlev>
##$CPDPRG6= <mlev>
##$CPDPRG7= <mlev>
##$CPDPRG8= <mlev>
##$CPDPRGB= <>
##$CPDPRGT= <>
##$D= (0..31)
0 2 0 0 0 0 0 0 0 0.06 0 0 0 0 0 0 0.0002 0 0 0 0 0 0 0 0 0 0 0 0 0 0 
0 
##$DATE= 1778053559
##$DBL= (0..7)
120 120 120 120 120 120 120 120 
##$DBP= (0..7)
150 150 150 150 150 150 150 150 
##$DBP07= 0
##$DBPNAM0= <>
##$DBPNAM1= <>
##$DBPNAM2= <>
##$DBPNAM3= <>
##$DBPNAM4= <>
##$DBPNAM5= <>
##$DBPNAM6= <>
##$DBPNAM7= <>
##$DBPOAL= (0..7)
0.5 0.5 0.5 0.5 0.5 0.5 0.5 0.5 
##$DBPOFFS= (0..7)
0 0 0 0 0 0 0 0 
##$DE= 6
##$DECBNUC= <off>
##$DECIM= 32
##$DECNUC= <off>
##$DECSTAT= 4
##$DIGMOD= 1
##$DIGTYP= 9
##$DL= (0..7)
0 120 120 120 120 120 120 120 
##$DP= (0..7)
150 150 150 150 150 150 150 150 
##$DP07= 0
##$DPNAME0= <>
$$ [...]
##$SUBNAM4= <"">
##$SUBNAM5= <"">
##$SUBNAM6= <"">
##$SUBNAM7= <"">
##$SUBNAM8= <"">
##$SUBNAM9= <"">
##$SW= 20.6817932712277
##$SWIBOX= (0..15)
0 0 3 0 0 0 0 0 0 0 0 0 0 0 0 0 
##$SW_h= 4139.07284768212
##$TD= 32768
##$TD0= 1
##$TE= 0
##$TE2= 300
##$TE3= 300
##$TEG= 300
##$TL= (0..7)
0 120 120 120 120 120 120 120 
##$TP= (0..7)
150 150 150 150 150 150 150 150 
##$TP07= 0
##$TPNAME0= <>
##$TPNAME1= <>
##$TPNAME2= <>
##$TPNAME3= <>
##$TPNAME4= <>
##$TPNAME5= <>
##$TPNAME6= <>
##$TPNAME7= <>
##$TPOAL= (0..7)
0.5 0.5 0.5 0.5 0.5 0.5 0.5 0.5 
##$TPOFFS= (0..7)
0 0 0 0 0 0 0 0 
##$TUNHIN= 0
##$TUNHOUT= 0
##$TUNXOUT= 0
##$USERA1= <user>
##$USERA2= <user>
##$USERA3= <user>
##$USERA4= <user>
##$USERA5= <user>
##$V9= 5
##$VALIST= <valist>
##$VCLIST= <CCCCCCCCCCCCCCC>
##$VD= 0
##$VDLIST= <DDDDDDDDDDDDDDD>
##$VPLIST= <PPPPPPPPPPPPPPP>
##$VTLIST= <TTTTTTTTTTTTTTT>
##$WBST= 1024
##$WBSW= 30
##$XGAIN= (0..3)
0 0 0 0 
##$XL= 0
##$YL= 0
##$YMAX_a= 2353452
##$YMIN_a= -2379510
##$ZGOPTNS= <>
##$ZL1= 120
##$ZL2= 120
##$ZL3= 120
##$ZL4= 120
##$ABSF1= 0
##$ABSF2= 0
##$ABSG= 0
##$ABSL= 0
##$ALPHA= 0
##$AQORDER= 0
##$ASSFAC= 0
##$ASSFACI= 0
##$ASSFACX= 0
##$ASSWID= 0
##$AUNMP= <proc_1d>
##$AZFE= 0.1
##$AZFW= 0.1
##$BCFW= 0
##$BC_mod= 2
##$BYTORDP= 0
##$COROFFS= 0
##$CY= 18.4799938201904
##$DATMOD= 1
##$DC= 0
##$DFILT= <>
##$DTYPP= 0
##$F1P= 9.9274215381318
##$F2P= -0.165520771350173
##$FCOR= 1
##$FTSIZE= 16384
##$FT_mod= 6
##$GAMMA= 0
##$GB= 0
##$INTBC= 1
##$INTSCL= 4.127829e-11
##$ISEN= 128
##$LB= 0.05
##$LEV0= 0
##$LPBIN= 0
##$MAXI= 10000
##$MC2= 0
##$MEAN= 0
##$ME_mod= 0
##$MI= 50
##$NCOEF= 0
##$NC_proc= -2
##$NLEV= 6
##$NOISF1= 3.799351
##$NOISF2= 2.8
##$NSP= 0
##$NTH_PI= 0
##$NZP= 0
##$OFFSET= 16.48848
##$PC= 4
##$PHC0= -187.6659
##$PHC1= 3.101563
##$PH_mod= 1
##$PKNL= yes
##$PPARMOD= 0
##$PSCAL= 4
##$PSIGN= 0
##$REVERSE= no
##$SF= 200.130005582386
##$SI= 16384
##$SIGF1= 3
##$SIGF2= 2
##$SINO= 400
##$SIOLD= 16384
##$SREGLST= <1H.CDCl3>
##$SSB= 0
##$STSI= 16384
##$STSR= 0
##$SW_p= 4139.07284768211
##$SYMM= 0
##$S_DEV= 0
##$TDeff= 32768
##$TDoff= 0
##$TI= <>
##$TILT= no
##$TM1= 0
##$TM2= 0
##$TOPLEV= 0
##$USERP1= <user>
##$USERP2= <user>
##$USERP3= <user>
##$USERP4= <user>
##$USERP5= <user>
##$WDW= 1
##$XDIM= 16384
##$YMAX_p= 365279223
##$YMIN_p= -268954
$$ End of Bruker specific parameters
$$ ---------------------------------
##NTUPLES= NMR SPECTRUM
##VAR_NAME=  FREQUENCY,     SPECTRUM/REAL,   SPECTRUM/IMAG
##SYMBOL=    X,             R,               I
##VAR_TYPE=  INDEPENDENT,   DEPENDENT,       DEPENDENT
##VAR_FORM=  AFFN,          ASDF,            ASDF
##VAR_DIM=   16384,         16384,           16384
##UNITS=     HZ,            ARBITRARY UNITS, ARBITRARY UNITS
##FACTOR=    0.252644378177508, 1,           1
##FIRST=     3299.83951724647, 0,            0
##LAST=      -839.233330435636, 0,           0
##MIN=       -839.233330435636, -268954,     0
##MAX=       3299.83951724647, 365279223,    0
$$ Real data points
##PAGE= N=1
##DATA TABLE= (X++(R..R)), XYDATA
$$ [...]
$$ plain form
6067 13092953 14319872 15662438 17152463 18769578 20572757 22542636 24674895 27036946
6059 27036946 29586914 32401996 35494824 38847509 42592055 46733156 51271986 56320659
6051 56320659 61830681 67800375 74129040 80679393 87211537 93442476 99015368 103600329
6043 103600329 106966826 108870285 109285414 108251065 105897792 102471464 98234428 93457197
6035 93457197 88359327 83162719 77993795 72988066 68182416 63625932 59312144 55280175
6027 55280175 51458969 47886024 44545535 41412225 38499635 35748645 33223943 30869248
6019 30869248 28701716 26701424 24852230 23158715 21601840 20194252 18892773 17711550
6011 17711550 16640168 15631376 14744151 13902881 13156169 12458784 11824554 11245792 10707083
$$ packed form
6067A3092953J226919J342566J490025J617115J803179J969879K132259K362051
6059B7036946K549968K815082L092828L352685L744546M141101M538830N048673
6051E6320659N510022N969694O328665O550353O532144O230939N572892M584961
6043A03600329L366497J903459M15129j034349k353273l426328m237036m777231
6035I3457197n097870n196608n168924n005729m805650m556484m313788m031969
6027E5280175l821206l572945l340489l133310k912590k750990k524702k354695
6019C0869248k167532k000292j849194j693515j556875j407588j301479j181223
6011A7711550j071382j008792q87225q41270p46712o97385o34230n78762n38709
$$ plain form
6002 10707083 10220063 9750729 9339693 8947428 8579781 8236485 7922227 7636606 7352020
5993 7352020 7087876 6845960 6607855 6399477 6182494 5981761 5789819 5611318 5446845 5299797
5983 5299797 5126900 4969531 4831760 4701012 4572171 4454506 4321121 4210432 4103471 3988693
5973 3988693 3881922 3793472 3674430 3605581 3499722 3416181 3339297 3246097 3161002 3082426 2997999
5962 2997999 2933310 2863610 2798398 2732231 2659898 2606817 2537856 2475784 2425724 2368058 2316905
5951 2316905 2252491 2210099 2143123 2099424 2052836 1998369 1959773 1917560 1862320 1840402 1794591
5940 1794591 1747828 1720213 1683453 1653828 1598661 1575611 1545045 1508509 1469906 1446928 1418814
5929 1418814 1388504 1371217 1340777 1306521 1282104 1250755 1231740 1204060 1167392 1158530 1131531 1103653
$$ packed form
6002A0707083m87020m69334m11036l92265l67647l43296l14258k85621k84586
5993G352020k64144k41916k38105k08378k16983k00733j91942j78501j64473j47048
5983E299797j72897j57369j37771j30748j28841j17665j33385j10689j06961j14778
5973C988693j06771q8450j19042o8849j05859q3541p6884r3200q5095p8576q4427
5962B997999o4689o9700o5212o6167p2333n3081o8961o2072n0060n7666n1153
5951B316905o4414m2392o6976m3699m6588n4467l8596m2213n5240k1918m5811
5940A794591m6763k7615l6760k9625n5167k3050l0566l6536l8603k2978k8114
5929A418814l0310j7287l0440l4256k4417l1349j9015k7680l6668q862k6999k7878
$$ plain form
5917 1103653 1088865 1066749 1034789 1018873 994254 973254 954959 936788 922344 904096 882483
5906 882483 854638 846949 835880 802986 791680 788046 760964 753507 731534 710970 694881 680338
5894 680338 673275 673978 644172 636930 618788 604537 598795 594139 574783 550110 542902 531377 515757
5881 515757 506938 480331 471586 468948 454373 435570 425500 412289 396341 389314 373716 370092 371696
5868 371696 367315 344147 343313 328207 320919 314701 309042 309634 283603 277348 278835 273413 253673 254916
5854 254916 245849 249448 243562 238494 236867 220976 211940 215594 208065 198485 194379 180256 182727 178827
5840 178827 178406 169710 156758 157304 146034 156862 133466 133333 136067 141893 126843 135163 118369 119559
5826 119559 119317 98394 91530 104618 88992 96296 78931 92376 83913 80992 70206 76836 73313
$$ packed form
5917A103653j4788k2116l1960j5916k4619k1000j8295j8171j4444j8248k1613
5906H82483k7845p689j1069l2894j1306l634k7082p457k1973k0564j6089j4543
5894F80338p063P03k9806p242j8142j4251n742m656j9356k4673p208j1525j5620
5881E15757q819k6607q745k638j4575j8803j0070j3211j5948p027j5598l624J604
5868C71696m381k3168q34j5106p288o218n659N92k6031o255J487n422j9740J243
5854B54916r067L599n886n068j627j5891r036L654p529r580m106j4123K471l900
5840A78827m21q696j2952N46j1270J0828k3396j33K734N826j5050Q320j6794J190
5826A19559k42k0923o864J3088j5626P304j7365J3445q463k921j0786O630l523
$$ plain form
5813 73313 67751 70553 68686 68562 66141 51737 63541 55314 46499 39632 47559 21838 38060 29305
5799 29305 29752 21277 27115 19810 11563 13765 9367 16657 3360 20892 6202 -1002 -1283 -1076 -11250
5784 -11250 -4675 -5022 -14850 -511 -17566 -13255 -14616 -18886 -26320 -25199 -23196 -26837 -25688 -25953 -33452
5769 -33452 -33841 -40387 -40828 -39295 -51222 -41999 -41875 -33776 -45728 -48806 -44873 -45028 -55555 -49723 -48362
5754 -48362 -46583 -53447 -62292 -48640 -49858 -54902 -54382 -67345 -56136 -56181 -56974 -52262 -62269 -68564 -59197
5739 -59197 -49424 -64254 -64998 -62419 -71671 -70202 -69662 -59930 -58082 -68394 -67827 -78897 -67673 -84615
5725 -84615 -62304 -68888 -66568 -72879 -80876 -75466 -68771 -76324 -75792 -78347 -80914 -78448 -71610 -70817 -74515
5710 -74515 -68231 -66108 -84735 -86062 -76946 -82177 -75392 -81534 -74852 -76548 -79868 -70301 -76393 -78769
$$ packed form
5813G3313n562K802j867j24k421j4404J1804q227q815o867P927k5721J6222q755
5799B9305M47q475N838p305q247K202m398P290j3297J7532j4690p204k81K07j0174
5784a1250O575l47r828J4339j7055M311j361m270p434J121K003l641J149k65p499
5769c3452l89o546m41J533j1927R223J24Q099j1952l078L933j55j0527N832J361
5754d8362J779o864q845J3652j218n044N20j2963J1209m5p93M712j0007o295R367
5739e9197R773j4830p44K579r252J469N40R732J848j0312N67j1070J1224j6942
5725h4615K2311o584K320o311p997N410O695p553N32k555k567K466O838P93l698
5710g4515O284K123j8627j327R116n231O785o142O682j696l320R567o092k376
$$ plain form
5696 -78769 -78454 -86495 -71813 -85339 -80765 -71450 -78605 -81868 -75365 -97805 -78372 -72920 -85619 -75409
5682 -75409 -75977 -92224 -84120 -84352 -83056 -80231 -89723 -95920 -74024 -76110 -74717 -76424 -92277 -85194
5668 -85194 -81504 -92599 -79365 -83307 -85037 -80054 -86582 -78196 -75731 -84379 -73621 -82073 -90765 -79726
5654 -79726 -81395 -82902 -75775 -88750 -74923 -70192 -75655 -73117 -76003 -71543 -89782 -70595 -78522 -83501
5640 -83501 -89548 -83537 -75915 -93006 -80357 -80861 -83122 -84625 -96617 -86546 -81280 -82881 -77633 -83293
5626 -83293 -83526 -80574 -77467 -78617 -74910 -77271 -73465 -76536 -76689 -85695 -79349 -72662 -76135 -64006 -70679
5611 -70679 -64314 -74946 -91923 -80207 -69378 -67848 -69729 -66706 -70372 -68567 -79411 -72036 -76799
5598 -76799 -71330 -77706 -68968 -66363 -66322 -73425 -66878 -73816 -71394 -58766 -74615 -62007 -78941 -64287
$$ packed form
5696g8769L15q041J4682j3526M574R315p155l263O503k2440J9433N452j2699J0210
5682g5409n68j6247Q104k32J296K825r492o197K1896k086J393j707j5853P083
5668h5194L690j1095J3234l942j730M983o528Q386K465q648J0758q452q692J1039
5654g9726j669j507P127j2975J3827M731n463K538k886M460j8239J9187p927m979
5640h3501o047O011P622j7091J2649n04k261j503j1992J0071N266j601N248n660
5626h3293k33K952L107j150L707k361L806l071j53r006O346O687l473J2129o673
5611g0679O365j0632j6977J1716J0829J530j881L023l666J805j0844P375m763
5598g6799N469o376Q738K605M1p103O547o938K422J2628j5849J2608j6934J4654
$$ plain form
5584 -64287 -63079 -64574 -63084 -65799 -71589 -60219 -56188 -64093 -46159 -63644 -57891 -51319 -52666 -53228
5570 -53228 -69932 -60119 -41763 -66811 -52379 -51377 -53519 -55007 -53311 -56933 -52630 -47354 -52217 -40861
5556 -40861 -46413 -44463 -39570 -36536 -42218 -46799 -43997 -41349 -35795 -44448 -33583 -31140 -37125 -34783
5542 -34783 -26445 -34479 -36681 -28932 -12333 -21182 -27459 -23916 -27999 -16465 -30013 -34286 -22529 -14548
5528 -14548 -17477 -5237 -8737 -19037 -13558 -10029 -2264 -13404 -11062 -5930 -5195 3517 3298 18287
5514 18287 9661 18758 12477 24641 25842 22762 24943 26378 31470 28935 48656 30032 40131 41231
5500 41231 41503 50384 56205 57776 55977 69040 74527 85753 85531 84263 90825 96046 113756 124831
5486 124831 120909 130455 125071 134372 138902 151297 164675 170637 175154 195516 196919 199425 219824
$$ packed form
5584f4287J208j495J490k715n790J1370M031p905J7934j7485N753O572j347n62
5570e3228j6704R813J8356k5048J4432J002k142j488J696l622M303N276m863J1356
5556d0861n552J950M893L034n682m581K802K648N554q653J0865K443n985K342
5542c4783Q338q034k202P749J6599q849o277L543m083J1534j3548m273J1757P981
5528a4548k929J2240l500j0300N479L529P765j1140K342N132P35Q712k19J4989
5514A8287q626R097o281J2164J201l080K181J435N092k535J9721j8624J0099J100
5500D1231K72Q881N821J571j799J3063N487J1226k22j268O562N221J7710J1075
5486A24831l922R546n384R301M530J2395J3378N962M517K0362J403K506K0399
$$ plain form
5473 219824 233900 235961 247536 269215 275239 302483 305921 326353 348134 365643 387507 399904
5461 399904 430102 460069 476426 514996 545399 575113 621614 674515 706804 745370 801274 858987
5449 858987 938989 989223 1077222 1166693 1261148 1352443 1466584 1588334 1717010 1869012 2021710
5438 2021710 2192040 2358972 2524158 2703837 2864954 3021779 3161501 3270791 3380806 3423955
5428 3423955 3445976 3428635 3368023 3295740 3191434 3075740 2951619 2779004 2637818 2488749
5418 2488749 2340931 2201357 2051792 1908770 1785510 1671007 1559365 1454604 1370196 1273669
5408 1273669 1188593 1126834 1055250 994940 932904 867978 821964 788530 736646 706126 660565
5397 660565 622704 587261 560204 528707 516804 476403 457726 430030 413482 400057 370331 351366
$$ packed form
5473B19824J4076K061J1575K1679O024K7244L438K0432K1781J7509K1864J2397
5461C99904L0198K9967J6357L8570L0403K9714M6501N2901L2289L8566N5904N7713
5449H58987Q0002N0234Q7999Q9471R4455R1295J14141J21750J28676J52002J52698
5438B021710J70330J66932J65186J79679J61117J56825J39722J09290J10015M3149
5428C423955K2021j7341o0612p2283j04306j15694j24121j72615j41186j49069
5418B488749j47818j39574j49565j43022j23260j14503j11642j04761q4408r6527
5408A273669q5076o1759p1584o0310o2036o4926m6014l3434n1884l0520m5561
5397F60565l7861l5443k7057l1497j1903m0401j8677k7696j6548j3425k9726j8965
$$ plain form
5385 351366 348873 329245 308821 306757 288303 267987 264534 251607 250543 229498 213997 208547 190911
5372 190911 193012 184155 174557 162576 165933 145324 143882 128887 118180 125414 116027 119479 96038
5359 96038 96144 93586 81034 83103 70699 67429 70500 51995 63239 54395 47423 56162 29316 35229
5345 35229 35717 39196 35764 28079 15873 15214 18022 6498 1659 17879 -1447 11198 11649 -18230
5331 -18230 -6371 -18917 -13439 -17138 -26613 -25503 -18595 -21965 -27877 -40605 -38532 -40187 -25866 -29460
5317 -29460 -40411 -46359 -41468 -41540 -43302 -51046 -51002 -44779 -39820 -46305 -46376 -70048 -56940 -46854 -66964
5302 -66964 -65385 -66488 -67097 -54964 -74387 -63875 -72517 -65671 -71513 -71774 -64490 -76473 -70254 -70816
5288 -70816 -74486 -85884 -79309 -74818 -80912 -84643 -96024 -84085 -72468 -89197 -87320 -85965 -105007
$$ packed form
5385C51366k493j9628k0424k064j8454k0316l453j2927j064k1045j5501n450j7636
5372A90911K101q857r598j1981L357k0609j442j4995j0707P234r387L452k3441
5359I6038J06k558j2552K069j2404l270L071j8505J1244q844o972Q739k6846N913
5345C5229M88L479l432p685j2206o59K808j1524m839J6220j9326J2645M51k9879
5331a8230J1859j2546N478l699r475J110O908l370n912j2728K073j655J4321l594
5317b9460j0951n948M891p2j762p744M4O223M959o485p1k3672J3108J0086k0110
5302f6964J579j103o09J2133j9423J0512q642O846n842k61P284j1983O219n62
5288g0816l670j1398O575M491o094l731j1381J1939J1617j6729J877J355j9042
$$ plain form
5275 -105007 -94148 -102122 -88093 -92013 -91414 -95310 -80651 -101304 -99715 -90926 -103877 -96205 -98066
5262 -98066 -94031 -92736 -97980 -109094 -93707 -108517 -106958 -117653 -98931 -101357 -110395 -112758 -110320
5249 -110320 -107788 -112743 -112251 -119397 -122376 -114919 -106837 -109689 -117309 -112568 -112477 -121395 -122074 -115224 -113580
5234 -113580 -111976 -117499 -115710 -101598 -107767 -118328 -109709 -109690 -107764 -123721 -116422 -118971 -119616 -123539
5220 -123539 -125926 -113962 -129461 -123783 -118466 -124531 -129583 -130421 -119804 -116172 -114645 -135764 -122710
5207 -122710 -120571 -119091 -113948 -115169 -126283 -109540 -107406 -128503 -128761 -126799 -123001 -120493 -127439 -123188
5193 -123188 -118675 -116418 -123231 -124372 -123260 -120675 -130653 -124829 -123102 -131778 -108947 -123901 -125826 -121393
5179 -121393 -112552 -123785 -125683 -124169 -129834 -124050 -124300 -117150 -123550 -124695 -122404 -125678 -124186 -134802
$$ packed form
5275a05007J0859p974J4029l920N99l896J4659k0653J589Q789j2951P672j861
5262i8066M035J295n244j1114J5387j4810J559j0695J8722k426r038k363K438
5249a10320K532m955M92p146k979P457Q082k852p620M741R1q918o79O850J644
5234a13580J604n523J789J4112o169j0561Q619J9J926j5957P299k549o45l923
5220a23539k387J1964j5499N678N317o065n052q38J0617L632J527k1119J3054
5207a22710K139J480N143j221j1114J6743K134k1097k58J962L798K508o946M251
5193a23188M513K257o813j141J112K585r978N824J727q676K2831j4954j925M433
5179a21393Q841j1233j898J514n665N784k50P150o400j145K291l274J492j0616
$$ plain form
5165 -134802 -123729 -129433 -128909 -119112 -126288 -120153 -136576 -129927 -136088 -125486 -125550 -131769 -126594 -109265
5151 -109265 -129194 -136332 -118165 -122465 -132764 -132206 -131400 -122423 -119698 -126035 -116146 -134893 -129809 -121675
5137 -121675 -133659 -137808 -124728 -131450 -116552 -134448 -123382 -131802 -122760 -127613 -146998 -127458 -123854
5124 -123854 -120293 -129450 -115769 -123323 -119110 -136267 -117055 -114705 -122678 -135782 -121587 -113928 -122556
5111 -122556 -139934 -121113 -131327 -118670 -134438 -133315 -126434 -120353 -123945 -116807 -106981 -133120 -114411
5098 -114411 -132980 -119733 -125451 -123501 -109315 -119954 -123066 -120288 -118058 -132187 -124680 -119951 -128605
5085 -128605 -109712 -126507 -112710 -115142 -134911 -112994 -130070 -134012 -125044 -108004 -124164 -122327
5073 -122327 -117418 -126898 -108693 -126448 -116578 -119858 -114092 -112674 -120960 -124546 -113463 -117076 -120245 -129323
$$ packed form
5165a34802J1073n704N24R797p176O135j6423O649o161J0602o4o219N175J7329
5151a09265j9929p138J8167m300j0299N58Q06Q977K725o337R889j8747N084Q134
5137a21675j1984m149J3080o722J4898j7896J1066q420R042m853j9385J9540L604
5124a23854L561r157J3681p554M213j7157J9212K350p973j3104J4195P659q628
5111a22556j7378J8821j0214J2657j5768J123O881O081l592P138R826k6139J8709
5098a14411j8569J3247n718J950J4186j0639l112K778K230j4129P507M729q654
5085a28605J8893j6795J3797k432j9769K1917j7076l942Q968J7040j6160J837
5073a22327M909r480J8205j7755R870l280N766J418q286l586J1083l613l169r078
$$ plain form
5059 -129323 -121112 -115744 -116759 -126551 -122424 -116513 -109436 -115528 -119524 -132569 -127915 -119990 -110024 -112549
5045 -112549 -107915 -103179 -106816 -106946 -97080 -122761 -120508 -106694 -103453 -111122 -125251 -115636 -117928 -109161
5031 -109161 -121685 -120915 -121118 -122816 -117254 -109672 -128371 -111580 -113236 -103713 -110794 -121416 -120153 -115604
5017 -115604 -108495 -107783 -101566 -99481 -106134 -111410 -104862 -98504 -105427 -115144 -110955 -121103 -109988 -116055
5003 -116055 -96885 -105366 -98285 -110541 -107777 -95474 -96548 -103714 -100662 -95793 -105648 -99281 -110755
4990 -110755 -101391 -90634 -114283 -104705 -107171 -97338 -92291 -93625 -94328 -100926 -95858 -109866 -86026 -82952
4976 -82952 -85962 -86148 -83012 -80546 -91374 -78546 -83247 -83879 -70952 -76773 -56571 -72396 -79192 -74268
4962 -74268 -74742 -59608 -62317 -52237 -44408 -35175 -33495 -9094 -3043 14884 13070 37749 56303
$$ packed form
5059a29323Q211N368j015r792M127N911P077o092l996j3045M654P925R966k525
5045a12549M634M736l637j30R866k5681K253J3814L241p669j4129R615k292Q767
5031a09161j2524P70k03j698N562P582j8699J6791j656R523p081j0622J263M549
5017a15604P109P12O217K085o653n276O548O358o923r717M189j0148J1115o067
5003a16055J9170q481P081j2256K764J2303j074p166L052M869r855O367j1474
4990a10755R364J0757k3649R578k466R833N047j334p03o598N068j4008K3840L074
4976h2952l010j86L136K466j0828J2828m701o32J2927n821K0202j5825o796M924
4962g4268m74J5134k709J0080P829R233J680K4401O051J7927j814K4679J8554
$$ plain form
4949 56303 57667 72325 100733 105737 116717 122344 134635 126443 122151 119809 111526 105097 106252 100762
4935 100762 106627 103786 81879 98260 117828 118526 127152 159431 185683 209629 236552 266884 306799
4922 306799 346469 399427 445215 458412 497371 522815 527573 549744 522314 503124 476270 455566
4910 455566 422311 397121 377860 372311 335690 325806 310005 289082 291941 292112 297247 311565 343432
4897 343432 365198 389272 431464 460524 489665 525069 553662 581905 598987 606927 607757 593304
4885 593304 569591 555319 514708 473117 445939 412940 390223 358184 325447 322823 295433 272402
4873 272402 261572 253041 259903 257380 267035 273275 272088 282172 286626 292105 308085 301736 297057 308162
4859 308162 301598 298527 314775 292191 263627 252172 239282 236810 215735 217287 214665 204543 215673
$$ packed form
4949E6303J364J4658K8408N004J0980N627J2291q192m292k342q283o429J155n490
4935A00762N865k841k1907J6381J9568O98Q626L2279K6252K3946K6923L0332L9915
4922C06799L9670N2958M5788J3197L8959K5444M758K2171k7430j9190k6854k0704
4910D55566l3255k5190j9261n549l6621r884j5801k0923K859J71N135J4318L1867
4897C43432K1766K4074M2192K9060K9141L5404K8593K8243J7082P940Q30j4453
4885E93304k3713j4272m0611m1591k7178l2999k2717l2039l2737k624k7390k3031
4873B72402j0830q531O862k523R655O240j187J0084M454N479J5980o349m679J1105
4859C08162o564l071J6248k2584k8564j1455j2890k472k1075J552k622j0122J1130
$$ plain form
4846 215673 202599 191771 198305 181787 173447 184394 184388 189517 186152 184671 191648 182805 185803 175192
4832 175192 183758 180277 190045 199158 203144 189854 202428 210982 209582 216768 203617 213360 235154
4819 235154 231716 231721 250886 245528 264988 265321 263752 290567 275424 289418 287662 293586 304924 321925
4805 321925 323756 315665 317314 321139 337678 324119 331430 334389 347220 363138 361715 354629 390514
4792 390514 383657 395689 404245 413101 428005 440085 449525 456678 466151 477412 492387 500059 510447
4779 510447 512830 527414 543337 552375 572509 571918 580596 591647 596837 627816 636614 638418 654307
4766 654307 666745 677104 683834 701653 713931 753874 735740 773841 775946 802500 820122 835560
4754 835560 859800 867932 900966 908441 931079 954131 984746 997660 1012630 1043051 1052254 1084507
$$ packed form
4846B15673j3074j0828O534j6518q340J0947oN129l365j481O977q843K998j0611
4832A75192Q566l481R768R113L986j3290J2574Q554j400P186j3151R743K1794
4819B35154l438NJ9165n358J9460L33j569K6815j5143J3994j756N924J1338J7001
4805C21925J831q091J649L825J6539j3559P311K959J2831J5918j423p086L5885
4792C90514o857J2032Q556Q856J4904J2080R440P153R473J1261J4975P672J0388
4779E10447K383J4584J5923R038K0134n91Q678J1051N190L0979Q798J804J5889
4766F54307J2438J0359O730J7819J2278L9943j8134L8101K105K6554J7622J5438
4754H35560K4240Q132L3034P475K2638K3052L0615J2914J4970L0421R203L2253
$$ plain form
4742 1084507 1095659 1122746 1152908 1176928 1194717 1232481 1245288 1280318 1307052 1341926 1358802
4731 1358802 1397998 1439183 1465155 1502104 1524191 1575266 1611536 1633694 1691577 1735424 1780178
4720 1780178 1830518 1879845 1923783 1963783 2021942 2059761 2115889 2182626 2246467 2316692 2380711
4709 2380711 2433287 2497762 2579598 2664247 2751872 2827434 2938528 3039963 3158118 3272065 3391313
4698 3391313 3521782 3678461 3820956 4003288 4196631 4404024 4633339 4912144 5212882 5540479
4688 5540479 5936617 6376812 6877779 7475570 8186314 9016366 9979700 11127994 12468179
4679 12468179 14040665 15846004 17909779 20205268 22722784 25400545 28111421 30786781
4671 30786781 33260993 35417698 37135081 38343428 38990611 39125255 38775290 38026921 37023944
$$ packed form
4742A084507J1152K7087L0162K4020J7789L7764J2807L5030K6734L4874J6876
4731A358802L9196M1185K5972L6949K2087N1075L6270K2158N7883M3847M4754
4720A780178N0340M9327M3938M0000N8159L7819N6128O6737O3841P0225O4019
4709B380711N2576O4475Q1836Q4649Q7625P5562J11094J01435J18155J13947J19248
4698C391313J30469J56679J42495J82332J93343K07393K29315K78805L00738L27597
4688E540479L96138M40195N00967N97791P10744Q30052R63334J148294J340185
4679A2468179J572486J805339K063775K295489K517516K677761K710876K675360
4671C0786781K474212K156705J717383J208347O47183J34644l49965p48369j002977
$$ plain form
4662 37023944 35903384 34768263 33772496 33002334 32551533 32501720 32917855 33888612 35451080
4653 35451080 37692654 40674423 44469927 49067157 54494476 60670913 67467436 74646225
4645 74646225 81898219 88855168 95139482 100344428 104171230 106405213 106979320 105886886
4637 105886886 103338763 99565683 94936518 89764525 84369320 79097727 74178160 69796048
4629 69796048 66113882 63234057 61223143 60167287 60071796 61016266 63036747 66061310 70133061
4620 70133061 75112153 80832286 87038626 93343695 99399118 104785195 109079906 112004636
4612 112004636 113317961 112938778 110906953 107393293 102682428 97067775 90889552 84474396
4604 84474396 78120766 72028247 66374315 61261004 56746682 52883282 49668688 47093348
$$ packed form
4662C7023944j120560j135121r95767p70162m50801m9813M16135R70757J562468
4653C5451080K241574K981769L795504M597230N427319O176437O796523P178789
4645G4646225P251994O956949O284314N204946L826802K233983N74107j092434
4637A05886886k548123l773080m629165n171993n395205n271593m919567m382112
4629F9796048l682166k879825k010914j055856r5491R44470K020481L024563M071751
4620G0133061M979092N720133O206340O305069O055423N386077M294711K924730
4612A12004636J313325l79183k031825l513660m710865n614653o178223o415156
4604H4474396o353630o092519n653932n113311m514322l863400l214594k575340
$$ plain form
4596 47093348 45154633 43829864 43109750 42943544 43266265 44014226 45054364 46270808 47491582
4587 47491582 48556804 49294891 49599078 49383175 48583132 47239079 45407562 43200611 40698399
4578 40698399 38075596 35396056 32752388 30245310 27908166 25726944 23744506 21949125
4570 21949125 20337105 18913259 17596052 16430077 15409800 14481883 13651742 12890331 12230038
4561 12230038 11626301 11078605 10584371 10144781 9730996 9347754 9004168 8680628 8398777
4552 8398777 8109885 7852315 7612677 7366593 7151573 6950812 6762034 6579981 6403159 6238203
4542 6238203 6078825 5920128 5767957 5618831 5474069 5346330 5203852 5084721 4956932 4843642
4532 4843642 4736724 4606524 4504946 4394157 4304682 4194913 4100237 4002449 3914996 3836460
$$ packed form
4596D7093348j938715j324769p20114j66206L22721P47961J040138J216444J220774
4587D7491582J065222P38087L04187k15903q00043j344053j831517k206951k502212
4578D0698399k622803k679540k643668k507078k337144k181222j982438j795381
4570B1949125j612020j423846j317207j165975j020277r27917q30141p61411o60293
4561A2230038o03737n47696m94234m39590m13785l83242l43586l23540k81851
4552H398777k88892k57570k39638k46084k15020k00761j88778j82053j76822j64956
4542F238203j59378j58697j52171j49126j44762j27739j42478j19131j27789j13290
4532D843642j06918j30200j01578j10789q9475j09769r4676r7788q7453p8536
$$ plain form
4522 3836460 3735115 3665346 3573709 3508480 3430896 3345711 3271626 3212233 3143037 3071572 3014666
4511 3014666 2938490 2877031 2821442 2755201 2697251 2638681 2587707 2546763 2490442 2421909 2372524
4500 2372524 2330805 2282923 2241062 2179058 2140193 2112685 2069567 2026966 1972538 1952247 1910998
4489 1910998 1856773 1820539 1792387 1763245 1717331 1697827 1665445 1632521 1584320 1538823 1497484
4478 1497484 1471239 1458200 1433257 1395002 1381059 1330878 1326406 1287398 1253367 1214950 1210220 1181260
4466 1181260 1156972 1130277 1114008 1084228 1082860 1053004 1026005 1015007 1004587 961151 964294 924135
4454 924135 928270 911025 880854 857575 834166 814491 798621 773304 764818 750615 733412 716766
4442 716766 698597 668298 657330 661956 642619 623936 617934 595773 600803 585074 564932 560834
$$ packed form
4522C836460j01345o9769r1637o5229p7584q5185p4085n9393o9196p1465n6906
4511C014666p6176o1459n5589o6241n7950n8570n0974m0944n6321o8533m9385
4500B372524m1719m7882m1861o2004l8865k7508m3118m2601n4428k0291m1249
4489A910998n4225l6234k8152k9142m5914j9504l2382l2924m8201m5497m1339
4478A497484k6245j3039k4943l8255j3943n0181m472l9008l4031l8417m730k8960
4466A181260k4288k6695j6269k9780j368k9856k6999j0998j0420m3436L143m0159
4454I24135M135j7245l0171k3279k3409j9675j5870k5317q486j4203j7203j6646
4442G16766j8169l0299j0968M626j9337j8683o002k2161N030j5729k0142m098
$$ plain form
4430 560834 548652 529915 521964 506796 504713 499603 483862 464454 460307 449704 446381 439074 419527
4417 419527 412040 424155 415242 414418 412000 390594 382739 381569 360493 347775 345330 342493 351829 336277
4403 336277 325887 332898 309093 315650 319744 321493 328620 344078 346727 352713 375763 370068 373332
4390 373332 379279 377035 385743 386777 383545 376222 378233 367137 347984 336776 333676 312471 307351
4377 307351 308217 302014 297150 290478 303181 328595 337345 347826 394207 390328 438307 483034 509914
4364 509914 549496 580932 593655 623295 631831 637577 635178 618940 604642 576887 555520 515110
4352 515110 471150 446410 414651 397090 375916 366164 352866 352825 345306 358497 377027 383503 401030
4339 401030 437592 467191 502096 543824 564443 593409 604600 610698 618907 600055 577688 542705
$$ packed form
4430E60834j2182j8737p951j5168k083n110j5741j9408m147j0603l323p307j9547
4417D19527p487J2115q913q24k418k1406p855j170k1076j2718k445k837R336j5552
4403C36277j0390P011k3805O557M094J749P127J5458K649N986K3050n695L264
4390C73332N947k244Q708J034l232p323K011j1096j9153j1208l100k1205n120
4377C07351Q66o203m864o672J2703K5414Q750J0481M6381l879M7979M4727K6880
4364E09914L9582L1436J2723K9640Q536N746k399j6238j4298k7755k1367m0410
4352E15110m3960k4740l1759j7561k1174r752j3298m1p519J3191J8530O476J7527
4339D01030L6562K9599L4905M1728K0619K8966J1191O098Q209j8852k2367l4983
$$ plain form
4327 542705 515933 483359 446248 406465 378353 339008 316866 297733 258311 241709 234058 225117
4315 225117 215074 196715 202014 201188 199221 205131 211963 217699 225037 228888 223369 213572 214994 204333
4301 204333 214792 188796 166311 159893 150221 144865 115809 87705 89193 77110 71742 51307 64810
4288 64810 43094 41723 33193 27042 25613 18059 11503 -7783 5059 -1964 -11194 819 -15499
4275 -15499 1308 -20754 -24170 -23456 -13989 -21250 -31184 -20119 -37161 -26758 -22404 -31464 -28809 -32817
4261 -32817 -38713 -33790 -34182 -46773 -39490 -36116 -35322 -31224 -37661 -40504 -39334 -62666 -37828 -46256
4247 -46256 -39224 -37454 -59941 -61687 -59496 -68506 -64803 -66061 -56231 -50403 -51333 -56029 -63358 -63363 -75599
4232 -75599 -67044 -52278 -64668 -60175 -54565 -64818 -56081 -75093 -63468 -70090 -63240 -63433 -47683
$$ packed form
4327E42705k6772l2574l7111l9783k8112l9345k2142j9133l9422j6602p651q941
4315B25117j0043j8359N299q26j967N910O832N736P338L851n519r797J422j0661
4301B04333J0459k5996k2485o418r672n356k9056k8104J488j2083n368k0435J3503
4288F4810k1716j371q530o151j429p554o556j9286J2842p023r230J2013j6318
4275a5499J6807k2062l416P14R467p261r934J1065j7042J0403M354r060K655m008
4261c2817n896M923l92j2591P283L374P94M098o437k843J170k3332K4838q428
4247d6256P032J770k2487j746K191r010L703j258R830N828r30m696p329nj2236
4232g5599Q555J4766j2390M493N610j0253Q737j9012J1625o622O850j93J5750
$$ plain form
4219 -47683 -57383 -59892 -58964 -73598 -68240 -62984 -70035 -65268 -81024 -75142 -62355 -70642 -72575 -64136
4205 -64136 -72896 -73779 -79958 -76684 -72998 -75040 -71114 -78459 -76986 -61786 -66419 -70276 -85081 -61455
4191 -61455 -77250 -75023 -54352 -68667 -64283 -77441 -78542 -76583 -69316 -90203 -79206 -52915 -74167
4178 -74167 -69433 -81083 -85894 -81109 -82002 -83901 -86478 -81828 -87674 -83684 -81149 -80474 -73209 -85251 -78739
4163 -78739 -71739 -86033 -83788 -74386 -94783 -93952 -90035 -95367 -84805 -101709 -92856 -79698 -91861
4150 -91861 -91445 -89022 -84372 -82183 -93372 -83960 -90619 -80643 -78556 -79654 -81766 -87962 -81229 -84309 -80659
4135 -80659 -93409 -83065 -75721 -89193 -81709 -71052 -70716 -79662 -74319 -84295 -69793 -87143 -86365 -88625
4121 -88625 -81647 -73590 -83338 -91991 -96119 -67646 -91175 -88662 -89237 -80536 -84255 -78841 -74018 -76303
$$ packed form
4219d7683r700k509R28j4634N358N256p051M767j5756N882J2787q287j933Q439
4205f4136q760q83o179L274L686k042L926p345J473J5200m633l857j4805K3626
4191f1455j5795K227K0671j4315M384j3158j101J959P267k0887J0997K6291k1252
4178g4167M734j1650m811M785q93j899k577M650n846L990K535O75P265j2042O512
4163g8739P000j4294K245R402k0397Q31L917n332J0562j6904Q853J3158j2163
4150i1861M16K423M650K189j1189R412o659R976K087j098k112o196O733l080L650
4135h0659j2750J0344P344j3472P484J0657L36q946N343r976J4502j7350P78k260
4121h8625O978Q057r748q653m128K8473k3529K513n75Q701l719N414M823k285
$$ plain form
4107 -76303 -88727 -91005 -80856 -84090 -97214 -89858 -71789 -75642 -83924 -72545 -80489 -87105 -81888
4094 -81888 -93780 -72932 -73203 -90066 -81257 -80691 -83225 -89504 -88639 -86149 -76740 -78136 -84726 -84471 -78099
4079 -78099 -77645 -68337 -83869 -77168 -89580 -83589 -71584 -79664 -78718 -79706 -66647 -77455 -91513 -98840
4065 -98840 -76408 -87569 -81701 -72788 -68725 -67296 -90316 -75154 -77832 -86923 -82170 -82619 -75008 -90597
4051 -90597 -84778 -78524 -74754 -91106 -87373 -76609 -81996 -79350 -77959 -77317 -68571 -78439 -62948 -70244
4037 -70244 -68139 -91605 -80233 -76005 -81371 -85580 -79662 -75639 -76982 -83878 -87036 -79555 -80453 -82247
4023 -82247 -73327 -85729 -74717 -86301 -60877 -61706 -79269 -81388 -63298 -80913 -85095 -71623 -74259
4010 -74259 -73383 -79411 -72386 -80384 -79662 -71481 -71002 -68725 -70426 -86121 -73915 -81109 -87293 -82388 -85291
$$ packed form
4107g6303j2424k278J0149l234j3124P356J8069l853q282J1379p944o616N217
4094h1888j1892K0848k71j6863Q809N66k534o279Q65K490R409j396o590K55O372
4079g8099M54R308j5532O701j2412N991J2005q080R46r88J3059j0808j4058p327
4065i8840K2432j1161N868Q913M063J429k3020J5162k678r091M753m49P611j5589
4051i0597N819O254L770j6352L733J0764n387K646J391O42Q746r868J5491p296
4037g0244K105k3466J1372M228n366m209N918M023j343o896l158P481q98j794
4023h2247Q920j2402J1012j1584K5424q29j7563k119J8090j7615m182J3472k636
4010g4259Q76o028P025p998P22Q181M79K277j701j5695J2206p194o184M905k903
$$ plain form
3995 -85291 -75941 -75407 -75559 -67072 -75157 -79590 -81728 -73015 -68915 -85440 -89138 -80249 -72802 -70592 -65339
3980 -65339 -75265 -73631 -75932 -93392 -91227 -75641 -75700 -86931 -66558 -82561 -61115 -86421 -94998
3967 -94998 -75288 -90321 -93447 -73760 -74220 -78642 -75313 -80575 -74624 -83150 -78808 -68467 -72483 -77139
3953 -77139 -78986 -64238 -72320 -74790 -74614 -81447 -75744 -76292 -77442 -69110 -83858 -82683 -87103 -80568 -87593
3938 -87593 -82215 -88998 -78227 -72236 -74779 -67453 -85134 -82872 -68131 -80720 -85221 -95274 -92873
3925 -92873 -69356 -76172 -82407 -78839 -85484 -90442 -90148 -88929 -85348 -75090 -80100 -78026 -68366 -75463
3911 -75463 -74064 -85221 -90639 -94861 -83066 -84319 -82896 -93314 -72776 -83188 -66786 -81420 -85930
3898 -85930 -84804 -90122 -73384 -76428 -81740 -79952 -79990 -89194 -80888 -83625 -86634 -86425 -83566 -82642 -74304
$$ packed form
3995h5291R350N34j52Q487q085m433k138Q713M100j6525l698Q889P447K210N253
3980f5339r926J634k301j7460K165J5586n9j1231K0373j6003K1446k5306q577
3967i4998J9710j5033l126J9687m60m422L329n262N951q526M342J0341m016m656
3953g7139j847J4748q082k470J76o833N703n48j150Q332j4748J175m420O535p025
3938h7593N378o783J0771N991k543P326j7681K262J4741j2589m501j0053K401
3925i2873K3517o816o235L568o645m958K94J219L581J0258n010K074R660p097
3911g5463J399j1157n418m222J1795j253J423j0418K0538j0412J6402j4634m510
3898h5930J126n318J6738l044n312J788l8r204Q306k737l009K09K859R24Q338
$$ plain form
3883 -74304 -77576 -71376 -79156 -88436 -91995 -102203 -88215 -82628 -87232 -78380 -70648 -83618 -83372 -87939
3869 -87939 -88573 -85687 -92587 -82931 -73384 -84093 -79542 -92052 -95917 -90139 -91495 -92077 -88059 -84834 -89953
3854 -89953 -91279 -75728 -94095 -92533 -100087 -90811 -93250 -100484 -81551 -78488 -79345 -92359 -84535 -81749
3840 -81749 -85507 -98002 -88346 -94940 -74422 -89815 -81829 -89381 -85441 -94730 -95311 -99878 -83574 -85074
3826 -85074 -101583 -82996 -75088 -82489 -89585 -95516 -110790 -99182 -95005 -91541 -71103 -95673 -80458
3813 -80458 -96574 -87036 -86795 -80814 -86567 -75923 -83557 -84233 -87220 -84559 -85736 -84372 -85770 -98770
3799 -98770 -106438 -90714 -84813 -104684 -96954 -80951 -101133 -83670 -108255 -101135 -99682 -100053 -89425
3786 -89425 -86895 -84056 -88649 -95283 -85742 -104656 -97812 -87115 -91632 -85422 -84485 -90236 -90991 -98858 -100970
$$ packed form
3883g4304l272O200p780r280l559j0208J3988N587m604Q852P732j2970K46m567
3869h7939o34K886o900R656R547j0709M551j2510l865N778j356n82M018L225n119
3854h9953j326J5551j8367J562p554R276k439p234J8933L063q57j3014P824K786
3840h1749l758j2495R656o594K0518j5393P986p552L940r289n81m567J6304j500
3826h5074j6509J8587P908p401p096n931j5274J1608M177L464K0438k4570J5215
3813h0458j6116R538K41N981n753J0644p634o76k987K661j177J364j398j3000
3799i8770p668J5724N901j9871P730J6003k0182J7463k4585P120J453l71J0628
3786h9425K530K839m593o634R541j8914O844J0697m517O210R37n751p55p867k112
$$ plain form
3771 -100970 -92955 -94197 -98290 -93832 -88055 -85508 -76026 -88122 -99090 -94268 -108293 -106881 -92933
3758 -92933 -102593 -98724 -88183 -99209 -91905 -109709 -95188 -93641 -101112 -91324 -90088 -84471 -93134 -98806
3744 -98806 -89376 -92842 -103987 -86072 -100765 -94345 -82456 -95022 -87397 -80496 -88010 -98061 -91321
3731 -91321 -104022 -86901 -98305 -89435 -93081 -96360 -93517 -90591 -98850 -113494 -87919 -99308 -92333
3718 -92333 -80965 -95370 -93998 -92404 -89593 -102826 -101808 -91632 -100106 -89732 -84352 -86295 -78738
3705 -78738 -92833 -83246 -98638 -99515 -91928 -98321 -88460 -92770 -97828 -94996 -96812 -94716 -97593 -107162
3691 -107162 -111755 -91437 -105369 -100218 -87037 -101947 -89050 -106179 -94439 -93329 -91966 -89724 -100484
3678 -100484 -86279 -91661 -78074 -87543 -103317 -98272 -98526 -91915 -91192 -92649 -104600 -104949 -89928 -104582
$$ packed form
3771a00970Q015j242m093M458N777K547R482j2096j0968M822j4025J412J3948
3758i2933r660L869J0541j1026P304j7804J4521J547p471R788J236N617q663n672
3744i8806R430l466j1145J7915j4693O420J1889j2566P625O901p514j0051O740
3731i1321j2701J7121j1404Q870l646l279K843K926q259j4644K5575j1389O975
3718i2333J1368j4405J372J594K811j3233J018J0176q474J0374N380j943P557
3705g8738j4095R587j5392q77P587o393R861m310n058K832j816K096k877r569
3691a07162m593K0318j3932N151J3181j4910J2897j7129J1740J110J363K242j0760
3678a00484J4205n382J3587r469j5774N045k54O611P23j457j1951l49J5021j4654
$$ plain form
3664 -104582 -108570 -119364 -108403 -104698 -89313 -81107 -87227 -89562 -95937 -84962 -93459 -100531 -97405
3651 -97405 -109687 -85320 -90656 -94529 -88537 -97052 -97015 -104836 -90924 -90849 -96415 -111303 -91016 -100005
3637 -100005 -98611 -86511 -96159 -87752 -94275 -107683 -96476 -98914 -111288 -88630 -93537 -92858 -104448
3624 -104448 -109041 -107324 -100966 -105435 -90087 -77805 -75262 -91156 -95145 -93125 -80729 -95078 -89193
3611 -89193 -88275 -74094 -71934 -65298 -81154 -70610 -72506 -88004 -77920 -94336 -95027 -84010 -86662
3598 -86662 -90702 -90581 -92707 -100931 -98070 -104645 -102147 -104035 -93167 -102414 -97167 -104526 -108837 -94649
3584 -94649 -120817 -106587 -106525 -103725 -92932 -105224 -95228 -90654 -110626 -100707 -102137 -97953 -92179 -104036
3570 -104036 -100667 -86080 -91013 -103575 -96480 -107012 -105058 -112767 -107598 -88266 -106100 -98408 -97581
$$ packed form
3664a04582l988j0794J0961L705J5385Q206o120k335o375J0975q497p072L126
3651i7405j2282K4367n336l873N992q515L7p821J3912P5n566j4888K0287q989
3637a00005J394J2100r648Q407o523j3408J1207k438j2374K2658m907O79j1590
3624a04448m593J717O358m469J5348J2282K543j5894l989K020J2396j4349N885
3611h9193R18J4181K160O636j5856J0544j896j5498J0084j6416o91J1017k652
3598h6662m040J21k126q224K861o575K498j888J0868r247N247p359m311J4188
3584i4649k6168J4230O2K800J0793j2292R996M574j9972R919j430M184N774j1857
3570a04036L369J4587m933j2562P095j0532J954p709N169J9332j7834P692Q27
$$ plain form
3557 -97581 -112916 -104703 -104435 -110438 -114070 -114569 -97386 -96597 -86351 -97988 -97062 -101630 -111944 -112297 -113361
3542 -113361 -102941 -97434 -102754 -102140 -86604 -86468 -101283 -111461 -99126 -110942 -111504 -99257 -98276 -95508
3528 -95508 -89567 -104731 -112146 -122841 -112476 -108524 -103594 -109113 -110170 -102801 -110137 -99664 -121820
3515 -121820 -107131 -103192 -125200 -110022 -108265 -98554 -105759 -86330 -110299 -105383 -113263 -108069 -101397
3502 -101397 -115829 -106886 -101180 -117515 -91188 -105472 -133265 -111454 -129211 -110069 -105724 -93211
3490 -93211 -107522 -98033 -105526 -118119 -101969 -116302 -112754 -98095 -107313 -100601 -101500 -102520 -109439 -117143
3476 -117143 -102043 -110590 -119457 -107252 -100335 -95430 -88917 -115255 -110406 -104433 -120056 -109589 -109918
3463 -109918 -116399 -113985 -97014 -83664 -90766 -101807 -128364 -103160 -117207 -126403 -107443 -116803 -109179
$$ packed form
3557i7581j5335Q213K68o003l632m99J7183P89J0246j1637R26m568j0314l53j064
3542a13361J0420N507n320O14J5536J36j4815j0178J2335j1816n62J2247R81K768
3528i5508N941j5164p415j0695J0365L952M930n519j057P369p336J0473k2156
3515a21820J4689L939k2008J5178J757R711p205J9429k3969M916p880N194O672
3502a01397j4432Q943N706j6335K6327j4284k7793K1811j7757J9142M345J2513
3490i3211j4311R489p493j2593J6150j4333L548J4659r218O712q99j020o919p704
3476a17143J5100q547q867J2205O917M905O513k6338M849N973j5623J0467l29
3463a09918o481K414J6971J3350p102j1041k6557K5204j4047r196J8960r360P624
$$ plain form
3450 -109179 -105052 -105876 -116122 -107587 -121644 -119570 -107305 -118262 -101042 -98194 -101724 -104087 -117683
3437 -117683 -127238 -112984 -110650 -127045 -108377 -106467 -105404 -97399 -121906 -103000 -121276 -127501 -111820
3424 -111820 -117059 -121230 -112394 -104378 -96762 -120208 -127496 -123540 -105038 -123257 -117443 -126985 -113071
3411 -113071 -99939 -113003 -112561 -126926 -117902 -120435 -115474 -118847 -111557 -105006 -102424 -105832 -113629 -124355
3397 -124355 -121608 -114441 -125497 -108359 -103135 -97326 -112019 -113430 -114471 -116193 -122124 -121768 -121785 -115529
3383 -115529 -112472 -119569 -109409 -116931 -115270 -115804 -117838 -116522 -120335 -113736 -111644 -111236 -112850 -109454 -123333
3368 -123333 -127467 -119229 -124627 -104020 -114318 -104393 -98887 -115127 -115159 -122008 -120367 -134963 -115011 -114445
3354 -114445 -130275 -119634 -105076 -120014 -119054 -129636 -130071 -126836 -123279 -114719 -128505 -115533 -110240
$$ packed form
3450a09179M127q24j0246Q535j4057K074J2265j0957J7220K848l530k363j3596
3437a17683r555J4254K334j6395J8668J910J063Q005k4507J8906j8276o225J5681
3424a11820n239m171Q836Q016P616k3446p288L956J8502j8219N814r542J3914
3411a13071J3132j3064M42j4365R024k533M961l373P290O551K582l408p797j0726
3397a24355K747P167j1056J7138N224N809j4693j411j041j722n931L56j7O256
3383a15529L057p097J0160p522J661n34k034J316l813O599K092M08j614L396j3879
3368a23333m134Q238n398K0607j0298R925N506j6240l2o849J641j4596J9952N66
3354a14445j5830J0641J4558j4938R60j0582m35L235L557Q560j3786J2972N293
$$ plain form
3341 -110240 -105161 -121093 -116595 -122546 -118931 -115031 -118481 -110603 -120322 -120535 -122983 -118802 -125410 -141672
3327 -141672 -136189 -130828 -120986 -121828 -103178 -124522 -119526 -125124 -119991 -124927 -131518 -141655 -115676 -101160
3313 -101160 -121347 -127207 -126031 -133752 -125825 -131947 -130041 -119817 -121147 -117819 -110783 -123233 -129252 -137249
3299 -137249 -142304 -134571 -133204 -121032 -115299 -112213 -109110 -119345 -110346 -126834 -135573 -127489 -134209 -117404
3285 -117404 -107472 -126968 -114068 -116135 -109306 -131906 -130775 -133707 -123602 -112957 -127597 -116050 -109448
3272 -109448 -117978 -126669 -129107 -135572 -129518 -126018 -114749 -115301 -118127 -110258 -112372 -133282 -136414 -140498
3258 -140498 -125589 -133541 -113593 -116557 -117898 -109878 -121497 -115063 -126909 -134953 -122355 -122981 -124183
3245 -124183 -117544 -114815 -107228 -132087 -126186 -132792 -131755 -144770 -120231 -111866 -111095 -102966 -130612 -127073
$$ packed form
3341a10240N079j5932M498n951L615L900l450P878r719k13k448M181o608j6262
3327a41672N483N361R842q42J8650k1344M996n598N133m936o591j0137K5979J4516
3313a01160k0187n860J176p721P927o122J906J0224j330L328P036j2450o019p997
3299a37249n055P733J367J2172N733L086L103j0235Q999j6488q739Q084o720J6805
3285a17404R932j9496J2900k067O829k2600J131k932J0105J0645j4640J1547O602
3272a09448q530q691k438o465O054L500J1269n52k826P869k114k0910l132m084
3258a40498J4909p952J9948k964j341Q020j1619O434j1846q044J2598o26j202
3245a24183O639K729P587k4859N901o606J037j3015K4539Q365P71Q129k7646L539
$$ plain form
3231 -127073 -123880 -134433 -127682 -118783 -116153 -111069 -121606 -124518 -111849 -122173 -131679 -122258 -130432
3218 -130432 -132037 -120093 -109911 -107203 -115990 -122756 -111152 -122195 -119946 -125572 -114277 -104640 -104905
3205 -104905 -113766 -104648 -116597 -121307 -128295 -112565 -122458 -121880 -106631 -107573 -113450 -114573 -114291 -114179 -129876
3190 -129876 -120425 -120400 -118035 -114274 -114517 -117647 -120304 -106710 -106133 -123646 -102611 -118253 -112545 -89579
3176 -89579 -105656 -102109 -103355 -116496 -116671 -128416 -122930 -112128 -114691 -111807 -102057 -97580 -114432 -108830
3162 -108830 -117521 -115242 -108365 -114903 -115904 -95699 -99761 -102419 -111439 -111770 -123059 -127318 -103216 -99180
3148 -99180 -103690 -92885 -92830 -83971 -97184 -125741 -119334 -116178 -121180 -116473 -97651 -94899 -95797 -92130
3134 -92130 -96139 -105359 -108040 -122035 -111714 -112560 -103667 -83843 -86137 -92958 -116637 -105927 -109199 -115298
$$ packed form
3231a27073L193j0553O751Q899K630N084j0537k912J2669j0324r506R421q174
3218a30432j605J1944J0182K708q787o766J1604j1043K249n626J1295R637k65
3205a04905q861R118j1949m710o988J5730r893N78J5249r42n877j123K82J12j5697
3190a29876R451K5K365L761k43l130k657J3594N77j7513K1035j5642N708K2966
3176h9579j6077L547j246j3141j75j1745N486J0802k563K884R750M477j6852N602
3162a08830q691K279O877o538j001K0205m062k658r020l31j1289m259K4102M036
3148i9180m510J0805N5Q859j3213k8557O407L156n002M707J8822K752q98L667
3134i2130m009r220k681j3995J0321q46Q893J9824k294o821k3679J0710l272o099
$$ plain form
3120 -115298 -104885 -100541 -95607 -107721 -107433 -102442 -109794 -109482 -110632 -100874 -101916 -91316 -90608 -92048
3106 -92048 -89888 -85514 -82697 -95374 -106555 -94811 -107605 -93056 -86360 -68505 -73222 -88308 -83127
3093 -83127 -106739 -108990 -104629 -104156 -94562 -97341 -90995 -85446 -97456 -106666 -119247 -97862 -101900 -91433
3079 -91433 -73738 -66174 -71575 -73403 -77389 -87133 -88876 -82964 -82717 -87181 -72877 -67966 -66708 -67073 -85341
3064 -85341 -93841 -100616 -95171 -78602 -71631 -64831 -61748 -63361 -71373 -71877 -80799 -76461 -86616 -78994
3050 -78994 -71313 -75323 -65279 -56984 -53676 -56420 -79601 -70349 -71437 -78945 -61390 -49699 -50885 -46580
3036 -46580 -50474 -65498 -59852 -76855 -56211 -53860 -35014 -36943 -25659 -22238 -38297 -49116 -61792
3023 -61792 -64934 -65333 -47690 -52700 -29287 -20225 -27702 -30990 -45117 -41713 -53710 -43730 -32035 -30443
$$ packed form
3120a15298J0413M344M934j2114K88M991p352L12j150R758j042J0600P08j440
3106i2048K160M374K817j2677j1181J1744j2794J4549O696J7855m717j5086N181
3093h3127k3612k251M361M73R594k779O346N549j2010r210j2581K1385m038J0467
3079i1433J7695P564n401j828l986r744j743N912K47m464J4304M911J258l65j8268
3064h5341q500o775N445J6569O971O800L083j613q012n04q922M338j0155P622
3050g8994P681m010J0044Q295L308k744k3181R252j088p508J7555J1691j186M305
3036d6580l894j5024N646j7003K0644K351J8846j929J1284L421j6059j0819j2676
3023f1792l142l99J7643n010K3413R062p477l288j4127L404j1997R980J1695J592
$$ plain form
3009 -30443 -15340 6831 10006 -1468 -28715 -20245 -8069 -13089 -933 27196 21248 28177 20470
2996 20470 3014 4105 -566 11354 27231 31496 46658 53250 72167 78889 65453 70952 81570
2983 81570 95685 139978 207885 308635 479460 739421 942967 1072621 1104807 1113716 1041944
2972 1041944 934303 807367 671908 558136 479203 397317 349347 307887 286328 269370 275787
2961 275787 272589 288209 305036 293936 288168 308568 328931 371413 477148 690240 1063845
2950 1063845 1561789 1972011 2166191 2205438 2204358 2035296 1781130 1467948 1208281 1027498
2940 1027498 888829 754936 663561 599098 536468 492102 479006 462061 456010 438528 435146
2929 435146 421800 415462 418275 436445 484960 580410 774822 1000954 1195443 1290396 1292498 1281213
$$ packed form
3009c0443J5103K2171L175j1474k7247Q470J2176n020J2156K8129n948O929p707
2996B0470j7456J091m671J1920J5877M265J5162O592J8917O722j3436N499J0618
2983H1570J4115M4293O7907J00750J70825K59961K03546J29654L2186Q909p1772
2972A041944j07641j26936j35459j13772p8933q1886m7970m1460k1559j6958O417
2961B75787l198J5620J6827j1100n768K0400K0363M2482J05735K13092L73605
2950A063845M97944M10222J94180L9247j080j69062k54166l13182k59667j80783
2940A027498j38669j33893r1375o4463o2630m4366j3096j6945o051j7482l382
2929D35146j3346o338K813J8170M8515R5450J94412K26132J94489R4953K102j1285
$$ plain form
2917 1281213 1192735 1057716 896529 778926 702490 638709 596248 555694 532262 501049 471109
2906 471109 440550 439050 440879 446374 470227 486720 468975 455816 456760 439454 442936 435043 448807
2893 448807 470038 490836 491264 489838 481408 451568 435877 422606 400956 426424 447062 499019
2881 499019 526870 535604 540574 557440 539404 537462 544000 574243 604746 640362 661155 679372
2869 679372 660040 663319 666417 673116 702909 705931 724025 734207 734914 715539 706568 687312 691826
2856 691826 698579 731200 759204 804605 833876 854507 873799 874984 863605 857606 879995 890073
2844 890073 922587 980951 1023022 1035621 1053160 1061462 1076322 1074271 1081621 1118708 1156172 1205281
2832 1205281 1221619 1244040 1249730 1241046 1244797 1285601 1260290 1293116 1340434 1391697 1445643 1460650
$$ packed form
2917A281213q8478j35019j61187j17603p6436o3781m2461m0554k3432l1213k9940
2906D71109l0559j500J829N495K3853J6493j7745j3159R44j7306L482p893J3764
2893D48807K1231K0798M28j426q430k9840j5691j3271k1650K5468K0638N1957
2881D99019K7851Q734M970J6866j8036j942O538L0243L0503L5616K0793J8217
2869F79372j9332L279L098O699K9793L022J8094J0182P07j9375q971j9256M514
2856F91826O753L2621K8004M5401K9271K0631J9292J185j1379n999K2389J0078
2844H90073L2514N8364M2071J2599J7539Q302J4860k051P350L7087L7464M9109
2832A205281J6338K2421N690q684L751M0804k5311L2826M7318N1263N3946J5007
$$ plain form
2820 1460650 1474162 1487037 1501052 1496752 1532173 1582240 1624832 1697290 1750442 1793477 1846914 1839885
2808 1839885 1869122 1880582 1915182 1977189 2047853 2128358 2152781 2185795 2209376 2230152 2247392
2797 2247392 2279058 2337030 2403450 2511174 2575627 2634368 2665816 2690770 2717149 2763736 2828333
2786 2828333 2891945 2972588 3096293 3216263 3292490 3353566 3423817 3470212 3519505 3582447 3678955
2775 3678955 3779346 3912104 4029864 4145620 4232929 4276878 4328881 4430444 4509692 4642400
2765 4642400 4787323 5009985 5258606 5446658 5625053 5747658 5889773 6083422 6320448 6581731
2755 6581731 6821728 7078384 7347795 7608665 7824807 7986752 8198384 8468272 8796176 9165368
2745 9165368 9722837 10362928 11058577 11855233 12811659 13953831 15345154 17180624 20160699
$$ packed form
2820A460650J3512J2875J4015m300L5421N0067M2592P2458N3152M3035N3437p029
2808A839885K9237J1460L4600O2007P0664Q0505K4423L3014K3581K0776J7240
2797B247392L1666N7972O6420J07724O4453N8741L1448K4954K6379M6587O4597
2786B828333O3612Q0643J23705J19970P6227O1076P0251M6395M9293O2942R6508
2775C678955J00391J32758J17760J15756Q7309M3949N2003J01563P9248J32708
2765D642400J44923K22662K48621J88052J78395J22605J42115J93649K37026K61283
2755F581731K39997K56656K69411K60870K16142J61945K11632K69888L27904L69192
2745I165368N57469O40091O95649P96656R56426J142172J391323J835470K980075
$$ plain form
2736 20160699 25026515 33438911 49001961 78188389 122311453 164186114 191548896
2729 191548896 201041135 202303855 195857002 177521638 151066371 122836245 100000110
2722 100000110 82562936 69779444 60109017 52954555 48182939 44910438 42536209 40768663
2714 40768663 39632622 39199142 39493172 40649300 43138327 48356498 58069617 76298940
2706 76298940 111039020 174217771 255162422 319320885 354297974 364116842 365279223
2699 365279223 353826533 323721087 279623749 230827041 189351506 155848488 130404392
2692 130404392 110045388 94565034 83540498 75109500 68234956 62374320 57388413 53127749
2684 53127749 49746663 47205083 45492525 45164973 47166146 53246553 67222939 95600722
$$ packed form
2736B0160699M865816Q412396J5563050K9186428M4123064M1874661K7362782
2729A91548896R492239J262720o446853j8335364k6455267k8230126k2836135
2722A00000110j7437174j2783492r670427p154462m771616l272501k374229j767546
2714D0768663j136041m33480K94030J156128K489027N218171R713119J8229323
2706G6298940L4740080O3178751Q0944651O4158463L4977089R818868J162381
2699C65279223j1452690l0105446m4097338m8796708m1475535l3503018k5444096
2692A30404392k0359004j5480354j1024536q430998o874544n860636m985907m260664
2684E3127749l381086k541580j712558l27552K001173O080407J3976386K8377783
$$ plain form
2676 95600722 136438547 173034614 195060254 201637527 201716776 193505142 174129094 147733685
2668 147733685 121056401 99666042 83043875 70561725 60691178 53228661 47784542
2661 47784542 43461399 39811481 36590318 33677839 31016973 28685209 26700626 24950628
2653 24950628 23408411 22117735 21058927 20189081 19420945 18680148 18005059 17351233 16803634
2644 16803634 16326995 15865208 15404767 14980027 14545848 14095958 13648062 13200299 12818931
2635 12818931 12475778 12169556 11875228 11614839 11354562 11102009 10829930 10554506 10279669
2626 10279669 9998896 9746947 9528616 9325912 9114517 8923901 8741222 8531102 8285990
2617 8285990 8043246 7832367 7644057 7481404 7355553 7241070 7109784 6948937 6773393 6602640
$$ packed form
2676I5600722M0837825L6596067K2025640O577273P9249q211634j9376048k6395409
2668A47733685k6677284k1390359j6622167j2482150r870547p462517n444119
2661D7784542m323143l649918l221163k912479k660866k331764j984583j749998
2653B4950628j542217j290676j058808q69846p68136p40797o75089o53826n47599
2644A6803634m76639m61787m60441m24740m34179m49890m47896m47763l81368
2635A2818931l43153l06222k94328k60389k60277k52553k72079k75424k74837
2626A0279669k80773k51949k18331k02704k11395j90616j82679k10120k45112
2617H285990k42744k10879j88310j62653j25851j14483j31286j60847j75544j70753
$$ plain form
2607 6602640 6417607 6263760 6143585 6049897 5946632 5819790 5718797 5620637 5506496 5339535
2597 5339535 5217831 5074757 4956546 4871524 4792379 4719064 4626443 4540959 4439484 4358901 4236930
2586 4236930 4156776 4087017 4015783 3951647 3878936 3816069 3727042 3638579 3543845 3474627 3421709
2575 3421709 3382771 3339325 3304818 3246616 3189362 3097643 3018573 2918796 2831199 2770036 2733812
2564 2733812 2696101 2648883 2628000 2589583 2532891 2471787 2393981 2352690 2300786 2273663 2239389
2553 2239389 2210100 2190301 2158104 2123467 2087410 2033090 1989994 1959147 1950657 1939452 1908167 1870949
2541 1870949 1836961 1749071 1675897 1629585 1597025 1539615 1515870 1505057 1496625 1469376 1424926 1380821
2529 1380821 1338542 1298003 1268215 1250197 1252613 1236794 1237267 1224317 1226144 1184845 1144326 1124299
$$ packed form
2607F602640j85033j53847j20175r3688j03265j26842j00993r8160j14141j66961
2597E339535j21704j43074j18211q5022p9145p3315r2621q5484j01475q0583j21971
2586D236930q0154o9759p1234o4136p2711o2867q9027q8463r4734o9218n2918
2575C421709l8938m3446l4507n8202n7254r1719p9070r9777q7597o1163l6224
2564B733812l7711m7218k0883l8417n6692o1104p7806m1291n1904k7123l4274
2553B239389k9289j9799l2197l4637l6057n4320m3096l0847q490j1205l1285l7218
2541A870949l3988q7890p3174m6312l2560n7410k3745j0813q432k7249m4450m4105
2529A380821m2279m0539k9788j8018K416j5819M73j2950J827m1299m0519k0027
$$ plain form
2517 1124299 1089905 1071281 1071481 1065108 1051810 1039416 1025663 984351 931146 893778 874487 866820
2505 866820 864749 852144 863799 837163 817727 793437 773959 752006 733919 731687 727805 723508
2493 723508 715402 709818 712417 691197 680383 658378 667472 712816 762557 886535 1104974 1340859
2481 1340859 1511693 1571477 1558338 1528744 1448170 1310704 1150575 1026744 923698 842153
2471 842153 780120 731883 668937 633266 621706 603864 591756 584060 568752 559990 558535 567352
2459 567352 569419 615660 749243 1002154 1462745 1916010 2243589 2361686 2373076 2311099 2086085
2448 2086085 1797664 1497516 1257141 1069929 928714 820018 721214 660594 592815 567856
2438 567856 530601 507642 474483 471882 445767 429519 423996 418044 436081 468195 598790 809299
$$ packed form
2517A124299l4394j8624K00o373j3298j2394j3753m1312n3205l7368j9291p667
2505H66820k071j2605J1655k6636j9436k4290j9478k1953j8087k232l882m297
2493G23508q106n584K599k1220j0814k2005R094M5344M9741J23978K18439K35885
2481A340859J70834N9784j3139k9594q0574j37466j60129j23831j03046q1545
2471H42153o2033m8237o2946l5671j1560j7842j2108p696j5308q762j455Q817
2459E67352K067M6241J33583K52911M60591M53265L27579J18097J1390o1977k25014
2448B086085k88421l00148k40375j87212j41215j08696r8804o0620o7779k4959
2438E67856l7255k2959l3159k601k6115j6248n523n952J8037L2114J30595K10509
$$ plain form
2426 809299 1013029 1165312 1208519 1217885 1173422 1070188 894036 734271 618171 523321 483287
2415 483287 430547 395729 343841 327580 296877 261253 244526 233658 232823 222144 206352 205218
2403 205218 201922 185177 158569 142312 133361 134281 120932 135795 135871 127437 98502 111443 95850
2390 95850 77956 76956 77913 85745 107762 89458 87898 98640 75316 67918 39634 50431 52277
2377 52277 59286 66521 77922 71931 74012 57436 56015 41363 33915 43623 35529 54961 59933 51426
2363 51426 49320 37982 25921 13377 10917 11226 14232 26752 26460 31158 28698 6644 -1926 -8117
2349 -8117 -1337 -1492 18245 18600 21338 13697 7897 -7313 1489 -8898 -13924 14632 3143 15156
2335 15156 11021 1922 11259 -14753 -14591 -22832 -15609 -6257 -5331 1003 10855 848 -6330 -18283
$$ packed form
2426H09299K03730J52283M3207R366m4463j03234j76152j59765j16100r4850m0034
2415D83287n2740l4818n1888j6261l0703l5624j6727j0868q35j0679j5792j134
2403B05218l296j6745k6608j6257q951R20j3349J4863P6q434k8935J2941j5593
2390I5850j7894j000R57P832K2017j8304j560J0742k3324p398k8284J0797J846
2377E2277P009P235J1401n991K081j6576j421j4652p448R708q094J9432M972q507
2363E1426k106j1338j2061j2544k460L09L006J2520k92M698k460k2054q570o191
2349h117O780j55J9737L55K738p641n800j5210Q802j0387n026K8556j1489J2013
2335A5156m135r099R337k6012J62q241P223R352R26O334R852j0007p178j1953
$$ plain form
2321 -18283 -32093 -35277 -33581 -23039 -5068 5874 -15482 2204 -14547 -32562 -34203 -35148 -32522
2308 -32522 -18281 -29809 -17008 -12708 -22668 -25604 -41798 -30110 -37515 -37886 -25410 -26814 -14313
2295 -14313 -20048 -28934 -17786 -34329 -49378 -36953 -42435 -41432 -16642 -28390 -17564 -38794 -44949
2282 -44949 -32923 -47306 -43265 -45762 -34185 -21716 -34937 -33998 -33578 -37894 -41928 -51099 -35224 -45798
2268 -45798 -34863 -30254 -35167 -31254 -33508 -44873 -47345 -53049 -38980 -46790 -42453 -20855 -39354
2255 -39354 -39679 -39153 -42510 -51843 -45123 -43585 -30638 -40279 -36103 -35875 -34675 -48790 -42950 -42065 -52150
2240 -52150 -40566 -50113 -44769 -32418 -37069 -50192 -37097 -56458 -47700 -56542 -53373 -36171 -47558
2227 -47558 -34771 -38304 -38324 -45931 -53251 -71266 -64933 -54891 -42517 -39895 -33453 -38729 -48828 -43612
$$ packed form
2321a8283j3810l184J696J0542J7971J0942k1356J7686j6751j8015j641r45K626
2308c2522J4241j1528J2801M300r960k936j6194J1688p405l71J2476j404J2501
2295a4313n735q886J1148j6543j5049J2425n482J003K4790j1748J0826k1230o155
2282d4949J2026j4383M041k497J1577J2469j3221R39M20m316m034r171J5875j0574
2268d5798J0935M609m913L913k254j1365k472n704J4069p810M337K1598j8499
2255c9354l25N26l357r333O720J538J2947r641M176K28J200j4115N840Q85j0085
2240e2150J1584r547N344J2351m651j3123J3095j9361Q758q842L169J7202j1387
2227d7558J2787l533k0p607p320j8015O333J0042J2374K622O442n276j0099N216
$$ plain form
2213 -43612 -65366 -59161 -58398 -57469 -44705 -45252 -52028 -46787 -44589 -62749 -74221 -74387 -57513 -54129
2199 -54129 -56272 -48829 -63680 -53381 -50166 -55024 -63872 -59389 -59959 -62213 -48406 -46825 -44070 -42997
2185 -42997 -49803 -64587 -56604 -68352 -56409 -63412 -58009 -54383 -62052 -54372 -57437 -74070 -65245 -59741
2171 -59741 -69039 -69623 -57641 -54873 -60434 -66609 -70961 -67928 -69931 -75296 -67118 -67665 -63367 -60949 -57102
2156 -57102 -59150 -69227 -73694 -66131 -71033 -69095 -53164 -62658 -52249 -62604 -62486 -49649 -68972
2143 -68972 -59586 -77815 -75502 -72770 -61983 -66004 -65723 -66261 -72821 -60530 -64340 -78036 -64641 -67219
2129 -67219 -73547 -56358 -74396 -57675 -63488 -75859 -80802 -65825 -66060 -52450 -60388 -63148 -58001
2116 -58001 -65040 -80564 -78223 -70801 -76322 -60640 -65274 -57260 -61924 -60546 -58381 -72693 -74821 -59881
$$ packed form
2213d3612k1754O205P63R29J2764n47o776N241K198j8160j1472j66J6874L384
2199e4129k143P443j4851J0299L215m858q848M483n70k254J3807J581K755J073
2185d2997o806j4784P983j1748J1943p003N403L626p669P680l065j6633Q825N504
2171e9741r298n84J1982K768n561o175m352L033k003n365Q178n47M298K418L847
2156e7102k048j0077m467P563m902J938J5931r494J0409j0355J18J2837j9323
2143f8972R386j8229K313K732J0787m021K81n38o560J2291l810j3696J3395k578
2129f7219o328J7189j8038J6721n813j2371m943J4977k35J3610p938k760N147
2116e8001p039j5524K341P422n521J5682m634Q014m664J378K165j4312k128J4940
$$ plain form
2102 -59881 -68126 -50875 -75084 -49344 -58403 -58805 -68813 -76189 -78954 -71297 -69299 -57201 -59348 -50187
2088 -50187 -63610 -52173 -75871 -73842 -89637 -78920 -75315 -58858 -64953 -67207 -61120 -61429 -66158
2075 -66158 -72493 -68908 -72453 -63415 -57075 -48768 -54365 -66360 -64739 -67472 -61115 -81614 -59612 -59725
2061 -59725 -63035 -63669 -70994 -61398 -72842 -65706 -69534 -77997 -66774 -73074 -63728 -56361 -59045 -69106
2047 -69106 -65205 -79985 -73566 -73905 -63763 -66452 -57275 -43158 -60486 -64189 -76071 -86239 -72177
2034 -72177 -75559 -73107 -69139 -58348 -53343 -54823 -67589 -66421 -75049 -78344 -77224 -71679 -64535 -54491
2020 -54491 -61088 -62060 -76097 -67757 -74787 -81859 -72536 -77831 -72398 -55195 -61631 -72537 -74850 -83217
2006 -83217 -64709 -74350 -70042 -67926 -58812 -62534 -67209 -58216 -75859 -62915 -65920 -88624 -78786 -73577
$$ packed form
2102e9881q245J7251k4209K5740r059m02j0008p376k765P657J998J2098k147R161
2088e0187j3423J1437k3698K029j5795J0717L605J6457o095k254O087l09m729
2075f6158o335L585l545R038O340Q307n597j1995J621k733O357k0499K2002j13
2061e9725l310o34p325R596j1444P136l828q463J1223o300R346P367k684j0061
2047f9106L901j4780O419l39J0142k689R177J4117j7328l703j1882j0168J4062
2034g2177l382K452L968J0791N005j480j2766J168q628l295J120N545P144J0044
2020e4491o597r72j4037Q340p030p072R323n295N433J7203o436j0906k313q367
2006h3217J8508r641M308K116R114l722m675Q993j7643J2944l005k2704R838N209
$$ plain form
1992 -73577 -72427 -55075 -62739 -81832 -67844 -77626 -80180 -77525 -73162 -78030 -73105 -63094 -74784
1979 -74784 -78696 -80591 -70859 -81545 -70891 -81763 -70439 -67381 -65359 -70647 -79552 -77627 -67539
1966 -67539 -78230 -72358 -82143 -70505 -72329 -73882 -70942 -71866 -74655 -84037 -87975 -67386 -84832 -61750
1952 -61750 -73258 -81954 -67328 -72213 -87833 -84218 -74863 -83278 -71172 -80328 -70833 -70910 -80137 -65887
1938 -65887 -76357 -82527 -80868 -72330 -67992 -80702 -72269 -68308 -63976 -60127 -77397 -79998 -71035 -74068
1924 -74068 -80800 -79612 -72439 -71953 -75995 -78384 -73238 -81492 -91083 -74861 -70503 -96389 -65694 -66004
1910 -66004 -86815 -76368 -79618 -83492 -82763 -64225 -70769 -63743 -66859 -73365 -70584 -72895 -73014 -76743
1896 -76743 -92369 -71848 -70304 -65171 -77103 -72111 -74871 -79770 -74511 -82142 -71853 -86178 -69777
$$ packed form
1992g3577J150J7352p664j9093J3988r782k554K655M363m868M925J0011j1690
1979g4784l912j895R732j0686J0654j0872J1324L058K022n288q905J925J0088
1966f7539j0691N872r785J1638j824j553K940r24k789r382l938K0589j7446K3082
1952f1750j1508q696J4626m885j5620L615R355q415J2106r156R495p7r227J4250
1938f5887j0470o170J659Q538M338j2710Q433L961M332L849j7270k601Q963l033
1924g4068o732J188P173M86m042k389N146q254r591J6222M358k5886L0695l10
1910f6004k0811J0447l250l874P29J8538o544P026l116o506K781k311j19l729
1896g6743j5626K0521J544N133j1932M992k760m899N259p631J0289j4325J6401
$$ plain form
1883 -69777 -70751 -76332 -56933 -86782 -85605 -70333 -77710 -77586 -61506 -69751 -74577 -65463 -71362 -72184
1869 -72184 -72253 -68982 -58121 -68056 -56421 -76117 -62959 -79251 -66126 -68487 -65224 -70884 -82233
1856 -82233 -62760 -61563 -61700 -59665 -65443 -72121 -74823 -67574 -80090 -69838 -70115 -69670 -62168 -69287 -79317
1841 -79317 -67073 -69146 -66708 -78090 -85704 -73640 -70421 -78320 -75358 -79877 -77794 -72169 -79245 -82654
1827 -82654 -80242 -67287 -64744 -74118 -60860 -70590 -72481 -74137 -83634 -80850 -73264 -70852 -67404 -68906
1813 -68906 -66386 -75006 -91612 -76649 -89482 -84233 -69943 -71375 -70956 -69991 -80678 -72247 -73344 -80251
1799 -80251 -79830 -71191 -84961 -74213 -81528 -64009 -72148 -76918 -92971 -83282 -71876 -87478 -68789
1786 -68789 -64419 -77586 -66912 -75292 -81545 -76611 -86846 -95840 -76762 -77970 -74807 -80804 -68750
$$ packed form
1883f9777r74n581J9399k9849J177J5272p377J24J6080q245m826R114n899q22
1869g2184o9L271J0861r935J1635j9696J3158j6292J3125k361L263n660j1349
1856h2233J9473J197j37K035n778o678k702P249j2516J0252k77M45P502p119j0030
1841g9317J2244k073K438j1382p614J2064L219p899K962m519K083N625p076l409
1827h2654K412J2955K543r374J3258r730j891j656r497K784P586K412L448j502
1813f8906K520q620j6606J4963j2833N249J4290j432M19R65j0687Q431j097o907
1799h0251M21Q639j3770J0748p315J7519q139m770j6053R689J1406j5602J8689
1786f8789M370j3167J0674q380o253M934j0235q994J9078j208L163n997J2054
$$ plain form
1773 -68750 -77745 -72873 -73112 -78777 -77784 -79154 -67333 -72567 -76186 -71271 -68261 -75550 -78154 -78471 -72181
1758 -72181 -62457 -70056 -83524 -71477 -74618 -73000 -67507 -87994 -73617 -77661 -77699 -81514 -81337 -68232
1744 -68232 -86310 -73776 -71275 -85215 -90790 -85183 -75164 -82046 -79641 -85183 -68348 -79386 -84010
1731 -84010 -74185 -82423 -83843 -59029 -74991 -71695 -77084 -72104 -65120 -80720 -76922 -75000 -69661 -73622
1717 -73622 -78555 -81540 -88093 -78914 -66655 -79683 -65939 -89854 -89613 -62268 -78440 -72472 -69224
1704 -69224 -74911 -77920 -82181 -78686 -74955 -80553 -77989 -69170 -66294 -75191 -82666 -74272 -83777 -74212 -82800
1689 -82800 -73295 -89885 -75299 -85985 -85486 -76977 -79585 -91658 -75238 -88459 -80868 -80649 -84116 -77560
1675 -77560 -80728 -80967 -79997 -81095 -83149 -84322 -93285 -91799 -71611 -71753 -86554 -82085 -80634 -85487 -79761
$$ packed form
1773f8750q995M872k39n665R93j370J1821n234l619M915L010p289k604l17O290
1758g2181R724p599j3468J2047l141J618N493k0487J4377m044l8l815J77J3105
1744f8232j8078J2534K501j3940n575N607J0019o882K405n542J6835j1038m624
1731h4010R825q238j420K4814j5962L296n389M980O984j5600L798J922N339l961
1717g3622m933k985o553R179J2259j3028J3744k3915K41K7345j6172N968L248
1704f9224n687l009m261L495L731n598K564Q819K876q897p475Q394r505R565q588
1689h2800R505j6590J4586j0686M99Q509k608j2073J6420j3221P591K19l467O556
1675g7560l168k39R70j098k054j173q963J486K0188j42j4801M469J451m853N726
$$ plain form
1660 -79761 -87075 -85452 -68139 -70222 -78857 -66131 -77463 -92901 -83171 -84973 -89943 -79467 -83860
1647 -83860 -86807 -80456 -90833 -83716 -83315 -94363 -90439 -82571 -86186 -82193 -70024 -79700 -92767 -86155
1633 -86155 -76960 -83262 -87751 -86889 -81872 -77850 -78245 -78285 -78696 -85950 -83339 -80817 -81948 -77179 -87348 -77781
1617 -77781 -78756 -86903 -78077 -85805 -79032 -81015 -94152 -85415 -67821 -76335 -73395 -77263 -87881 -87841 -87185
1602 -87185 -96167 -89146 -76080 -83872 -78147 -78171 -84358 -85081 -89717 -81928 -83881 -78136 -84137 -83499 -88369
1587 -88369 -83159 -83317 -87226 -91928 -82103 -84413 -79497 -88290 -87611 -80004 -87980 -77499 -90398 -105841
1573 -105841 -86218 -88582 -76741 -75968 -91806 -90283 -95724 -82969 -85429 -85764 -90259 -88995 -94373 -85200
1559 -85200 -70842 -81486 -83594 -78056 -83856 -84208 -102553 -94441 -86754 -86762 -83368 -95542 -79512 -81617
$$ packed form
1660g9761p314J623J7313k083q635J2726j1332j5438R730j802m970J0476m393
1647h3860k947O351j0377P117M01j1048L924P868l615L993J2169r676j3067O612
1633h6155R195o302m489Q62N017M022l95m0m11p254K611K522j131M769j0169R567
1617g7781r75q147Q826p728O773j983j3137Q737J7594q514K940l868j0618M0O56
1602h7185q982P021J3066p792N725k4o187p23m636P789j953N745o001O38m870
1587h8369N210j58l909m702R825k310M916q793O79P607p976J0481j2899j5443
1573a05841J9623k364J1841P73j5838J523n441J2755k460l35m495J264n378R173
1559h5200J4358j0644k108N538n800l52j8345Q112P687qL394j2174J6030k105
$$ plain form
1545 -81617 -87928 -77113 -80848 -87025 -83482 -91769 -87098 -78670 -78200 -80449 -69737 -86125 -86154 -77402 -88769
1530 -88769 -84437 -87536 -85120 -87394 -83470 -86670 -79470 -95811 -93363 -86708 -77629 -81155 -87359 -89888
1516 -89888 -86779 -86636 -85149 -85922 -90077 -80222 -90909 -77729 -85507 -88058 -86388 -88314 -87500 -89598 -74130
1501 -74130 -79215 -80044 -89640 -81937 -81800 -88413 -83530 -108259 -75113 -82054 -85345 -74520 -84492 -74849
1487 -74849 -84654 -97974 -102251 -94122 -80112 -98296 -83155 -73366 -82700 -79829 -82747 -92414 -85048 -77865
1473 -77865 -89771 -85917 -86099 -92443 -82792 -78969 -93323 -99105 -83817 -87055 -96940 -87863 -77485 -77930
1459 -77930 -82179 -89616 -78912 -94306 -89764 -87959 -86425 -77607 -74656 -75661 -85701 -89909 -87558 -83063
1445 -83063 -83083 -83534 -86888 -93324 -95658 -79870 -87103 -88442 -96128 -91834 -89671 -104217 -88968 -96321 -87247
$$ packed form
1545h1617o311J0815l735o177L543q287M671Q428M70k249J0712j6388k9Q752j1367
1530h8769M332l099K416k274L924l200P200j6341K448O655R079l526o204k529
1516h9888L109J43J487p73m155R855j0687J3180p778k551J670j926Q14k098J5468
1501g4130n085q29r596P703J37o613M883k4729L3146o941l291J0825r972R643
1487g4849r805j3320m277Q129J4010j8184J5141R789r334K871k918r667P366P183
1473g7865j1906L854j82o344R651L823j4354n782J5288l238r885R077J0378m45
1459g7930m249p437J0704j5394M542J805J534Q818K951j005j0040m208K351M495
1445h3063k0m51l354o436k334J5788p233j339p686M294K163j4546J5249p353R074
$$ plain form
1430 -87247 -98371 -74392 -87928 -89932 -98938 -100918 -92401 -86582 -86211 -80299 -77059 -99964 -84821 -94557
1416 -94557 -94558 -87566 -89030 -88831 -92218 -82564 -90144 -93947 -103602 -87733 -83316 -97393 -98824 -92532 -81348
1401 -81348 -84635 -94889 -91763 -91268 -86181 -86407 -81918 -85800 -85147 -98014 -87001 -81775 -93777 -91945
1387 -91945 -98494 -93249 -84017 -101909 -84652 -87204 -83578 -83042 -88135 -96104 -94943 -88143 -88789 -86456 -86732
1372 -86732 -93825 -80207 -89187 -82137 -89152 -101424 -104748 -103076 -94975 -98805 -100119 -79765 -89930 -96402
1358 -96402 -101954 -97961 -94835 -91472 -87075 -86740 -94750 -89339 -95634 -91822 -91647 -102130 -93500 -90067 -92334
1343 -92334 -94491 -97816 -89472 -99855 -99426 -98075 -93044 -93947 -92297 -100263 -102245 -89765 -97877 -101900 -87514
1328 -87514 -99822 -119002 -102288 -108959 -99276 -93044 -97771 -91240 -100197 -96886 -97125 -111287 -96010 -104779
$$ packed form
1430h7247j1124K3979j3536k004r006j980Q517N819L71N912L240k2905J5143r736
1416i4557jO992j464J99l387R654p580l803r655J5869M417j4077j431O292J1184
1401h1348l287j0254L126M95N087k26M489l882O53j2867J1013N226j2002J832
1387i1945o549N245R232j7892J7257k552L626N36n093p969J161O800o46K333k76
1372h6732p093J3618q980P050p015j2272l324J672Q101l830j314K0354j0165o472
1358i6402n552L993L126L363M397L35q010N411o295L812J75j0483Q630L433k267
1343i2334k157l325Q344j0383M29J351N031r03J650p966j982J2480q112m023J4386
1328h7514j2308j9180J6714o671R683O232m727O531q957L311k39j4162J5277q769
$$ plain form
1314 -104779 -91479 -84955 -100922 -89634 -87132 -86319 -105337 -96456 -88656 -94914 -95698 -87777 -90636 -89478
1300 -89478 -89546 -85126 -91273 -103789 -84700 -79753 -104025 -95977 -99571 -87756 -79553 -95271 -102365 -93221
1286 -93221 -81664 -95035 -85140 -89747 -81226 -74236 -92210 -84667 -83001 -89587 -89542 -88237 -89478 -73923
1272 -73923 -78799 -96473 -86488 -85537 -99282 -73131 -91771 -88817 -90138 -85974 -78753 -78758 -93636 -90626
1258 -90626 -86960 -96592 -83948 -80240 -85461 -85947 -91133 -83906 -101481 -97426 -87330 -87259 -82232 -95584
1244 -95584 -85644 -80330 -86101 -90061 -88874 -95394 -83948 -86061 -83408 -96979 -83888 -81721 -74841 -75491
1230 -75491 -87970 -92507 -78158 -84403 -89549 -81859 -84957 -79837 -75578 -94425 -90085 -82773 -88003 -79888
1216 -79888 -78234 -82412 -69100 -85785 -78690 -87920 -84563 -95001 -81607 -93982 -97524 -78199 -84411
$$ packed form
1314a04779J3300O524j5967J1288K502Q13j9018Q881P800o258p84P921k859J158
1300h9478o8M420o147j2516J9089M947k4272Q048l594J1815Q203j5718p094R144
1286i3221J1557j3371R895m607Q521O990j7974P543J666o586M5J305j241J5555
1272g3923m876j7674R985R51j3745K6151j8640K954j321M164P221nj4878L010
1258i0626L666r632J2644L708n221m86n186P227j7575M055J0096P1N027j3352
1244i5584R940N314n771l960J187o520J1446k113K653j3571J3091K167O880o50
1230g5491j2479m537J4349o245n146P690l098N120M259j8847M340P312n230Q115
1216g9888J654m178J3312j6685P095r230L357j0438J3394j2375l542J9325o212
$$ plain form
1203 -84411 -78501 -83060 -87297 -92182 -90594 -78370 -78361 -78924 -87993 -94909 -88587 -88715 -85954 -80928 -94111
1188 -94111 -97246 -69583 -94068 -84871 -89585 -80178 -87138 -81784 -88992 -87411 -74944 -92461 -90961 -66435
1174 -66435 -85197 -76401 -74117 -83234 -91234 -80387 -82664 -81323 -93013 -96818 -68276 -93004 -106235
1161 -106235 -97985 -100456 -85045 -90602 -86257 -86590 -80429 -73687 -90140 -81835 -88267 -92873 -92945 -80009
1147 -80009 -89114 -85030 -91233 -86030 -99601 -79442 -87868 -84543 -85878 -80056 -86875 -79041 -79056 -100987
1133 -100987 -89609 -86055 -97459 -91202 -95477 -90247 -75865 -91554 -81002 -82358 -103227 -89656 -98548
1120 -98548 -94621 -83423 -93827 -90141 -78905 -95003 -82787 -80757 -85837 -82673 -95053 -96649 -82454
1107 -82454 -84433 -82026 -83899 -87673 -75456 -88501 -83006 -78261 -93427 -92580 -77563 -77126 -76816 -95989
$$ packed form
1203h4411N910m559m237m885J588J2224Rn63r069o916O322j28K761N026j3183
1188i4111l135K7663k4485R197m714R407o960N354p208J581J2467j7517J500K4526
1174f6435j8762Q796K284r117q000J0847k277J341j1690l805K8542k4728j3231
1161a06235Q250k471J5411n557M345l33O161O742j6453Q305o432m606p2J2936
1147h0009r105M084o203N203j3571K0159q426L325j335N822o819P834j5k1931
1133a00987J1378L554j1404O257m275N230J4382j5689J0552j356k0869J3571q892
1120i8548L927J1198j0404L686J1236j6098J2216K030n080L164j2380j596J4195
1107h2454j979K407j873l774J2217j3045N495M745j5166Q47J5017M37L10j9173
$$ plain form
1093 -95989 -89527 -87289 -98516 -97525 -96847 -84007 -80410 -92652 -91550 -98106 -95866 -96792 -79814 -92927
1079 -92927 -95212 -87984 -88600 -78266 -87598 -89214 -89931 -97142 -80689 -86950 -96424 -98098 -85729 -93140
1065 -93140 -88857 -94952 -111493 -91534 -87244 -106133 -84202 -97804 -96587 -81392 -94466 -91111 -79547
1052 -79547 -95036 -98691 -86045 -94287 -95398 -75887 -95301 -90765 -94569 -97583 -90911 -90431 -92102 -97195
1038 -97195 -86347 -91592 -78725 -80335 -80776 -85611 -92731 -93777 -88621 -80397 -90293 -84990 -78712 -85756
1024 -85756 -91737 -95228 -94227 -76773 -72013 -90209 -89477 -80650 -88664 -88651 -93648 -95616 -82052 -80846 -74423
1009 -74423 -91704 -93017 -80750 -86478 -72997 -83276 -92808 -87319 -86065 -92787 -87490 -82843 -83346 -86785
995 -86785 -84371 -87977 -89030 -91437 -86869 -96656 -82610 -81998 -97327 -83642 -79683 -91033 -83310 -99961
$$ packed form
1093i5989O462K238j1227R91O78J2840L597j2242J102o556K240r26J6978j3113
1079i2927k285P228o16J0334r332j616p17p211J6453o261r474j674J2369p411
1065i3140M283o095j6541J9959M290j8889K1931j3602J217J5195j3074L355J1564
1052g9547j5489l655J2646q242j111J9511j9414M536l804l014O672M80j671n093
1038i7195J0848n245J2867j610m41m835p120j046N156Q224r896N303O278p044
1024h5756n981l491J001J7454M760j8196P32Q827q014J3m997j968J3564J206O423
1009g4423j7281j313J2267n728J3481j0279r532N489J254o722N297M647n03l439
995h6785K414l606j053k407M568r787J4046O12j5329J3685L959j1350P723j6651
$$ plain form
981 -99961 -91350 -73667 -85022 -83557 -99192 -87982 -86965 -77867 -95213 -93192 -90580 -93543 -75979
968 -75979 -90694 -94926 -104160 -85093 -74208 -95581 -91298 -87694 -92634 -90124 -89133 -89597 -82601 -97235
954 -97235 -86224 -99147 -88906 -98135 -86166 -84943 -94770 -81437 -94934 -85901 -105215 -108686 -96248
941 -96248 -94870 -91908 -83413 -85846 -96289 -96460 -79811 -94909 -91142 -95422 -102471 -89805 -92408 -92949
927 -92949 -78952 -93407 -89650 -87306 -101624 -95192 -97055 -90990 -80292 -79452 -90728 -95031 -90568 -93717
913 -93717 -87223 -102780 -89334 -83160 -88974 -92105 -97396 -92956 -99776 -106386 -85721 -87873 -71373 -73525
899 -73525 -78108 -101166 -92716 -101485 -91639 -88312 -95854 -98595 -90348 -87101 -102287 -73922 -116662 -101342
885 -101342 -100610 -101117 -86501 -109317 -84655 -90475 -96181 -88015 -93851 -91034 -97993 -96099 -98954 -97732
$$ packed form
981i9961Q611J7683j1355J465j5635J1210J017R098j7346K021K612k963J7564
968g5979j4715m232r234J9067J0885k1373M283L604m940K510R91m64O996j4634
954i7235J1011j2923J0241r229J1969J223r827J3333j3497R033j9314l471J2438
941i6248J378K962Q495k433j0443j71J6649j5098L767m280p049J2666k603n41
927i2949J3997j4455L757K344j4318O432j863O065J0698Q40j1276m303M463l149
913i3717O494j5557J3446O174n814l131n291M440o820o610K0665k152J6500k152
899g3525m583k3058Q450q769R846L327p542k741Q247L247j5186K8365m2740J5320
885a01342P32n07J4616k2816K4662n820n706Q166n836K817o959J894k855J222
$$ plain form
871 -97732 -91546 -81944 -90034 -94399 -85791 -108015 -85568 -95674 -95779 -88338 -98396 -103996 -96356 -99593
857 -99593 -98658 -105255 -115339 -113456 -97839 -111720 -99487 -97613 -111448 -100281 -113683 -108994 -104316
844 -104316 -109216 -95367 -95717 -112947 -93779 -90907 -104069 -99320 -94760 -114091 -90616 -92911 -90122
831 -90122 -95980 -102275 -94496 -91343 -109319 -117061 -97358 -114150 -101716 -108227 -107761 -101969 -85418 -109763
817 -109763 -106426 -104546 -121231 -101818 -95750 -109974 -101566 -107547 -96244 -104763 -94422 -96705 -99127
804 -99127 -96918 -100605 -88648 -95102 -108250 -101818 -107897 -106952 -113055 -104658 -92003 -100533 -109240 -91437
790 -91437 -90822 -95668 -101286 -100864 -95985 -94108 -101926 -106387 -98419 -90713 -108817 -88564 -101807 -104779 -96551
775 -96551 -93145 -97446 -101430 -102660 -96527 -91354 -97899 -92246 -88857 -105275 -108279 -99872 -91644 -90896 -93893
$$ packed form
871i7732O186R602q090m365Q608k2224K2447j0106j05P441j0058n600P640l237
857i9593R35o597j0084J883J5617j3881J2233J874j3835J1167j3402M689M678
844a04316m900J3849l50j7230J9168K872j3162M749M560j9331K3475k295K789
831i0122n858o295P779L153j7976p742J9703j6792J2434o511M66N792J6551k4345
817a09763L337J880j6685J9413O068j4224Q408n981J1303q519J0341k283k422
804i9127K209l687J1957o454j3148O432o079R45o103Q397J2655q530q707J7803
790i1437O15m846n618M22M879J877p818m461P968P706j8104K0253j3243k972Q228
775i6551L406m301l984j230O133N173o545N653L389j6418l004Q407Q228P48k997
$$ plain form
760 -93893 -99155 -93627 -91735 -103027 -89920 -86656 -84486 -89815 -91735 -89557 -91914 -100009 -80690 -86809
746 -86809 -100969 -91804 -93903 -83920 -89902 -90848 -95337 -90408 -78895 -104675 -103901 -85868 -100322 -95821
732 -95821 -83832 -97282 -85770 -85455 -106631 -90878 -84112 -88322 -77843 -78970 -78583 -78208 -91078 -88394
718 -88394 -96392 -77846 -91330 -88658 -71580 -79739 -83428 -81611 -80328 -84984 -77156 -97226 -87151 -74553
704 -74553 -91557 -85665 -85178 -86095 -89001 -90574 -91729 -82131 -82263 -89113 -87971 -86865 -83519 -81080 -70378
689 -70378 -91096 -88286 -83506 -86017 -84943 -81288 -72518 -77568 -65745 -97367 -96242 -88168 -92840 -77387
675 -77387 -95153 -80839 -85800 -79695 -86516 -85995 -88483 -97302 -83445 -84846 -70523 -87290 -91142 -80333
661 -80333 -90492 -77532 -97290 -78830 -87478 -89415 -77151 -85370 -72038 -78874 -88257 -85822 -82204
$$ packed form
760i3893n262N528J892j1292J3107L264K170n329j920K178k357q095J9319o119
746h6809j4160R165k099R983n982r46m489M929J1513k5780P74J8033j4454M501
732i5821J1989j3450J1512L15k1176J5753O766m210J0479j127L87L75j2870K684
718h8394p998J8546j3484K672J7078q159l689J817J283m656P828k0070J0075J2598
704g4553j7004N892M87r17k906j573j155R598j32o850J142J106L346K439J0702
689g0378k0718K810M780k511J074L655Q770n050J1823l1622J125Q074m672J5453
675g7387j7766J4314m961O105o821N21k488q819J3857j401J4323j6767l852J0809
661h0333j0159J2960j9758J8460q648j937J2264q219J3332o836r383K435L618
$$ plain form
648 -82204 -88280 -99285 -76957 -99816 -74961 -75777 -90247 -88350 -88472 -97069 -84346 -87773 -87920 -84359
634 -84359 -92547 -83154 -77697 -87961 -87595 -94418 -81793 -91244 -88242 -93126 -88759 -74930 -90078 -80890
620 -80890 -91977 -86202 -79621 -99256 -85629 -85629 -87892 -91785 -92517 -96205 -94064 -86500 -90315 -88662 -82141
605 -82141 -86428 -83104 -91324 -91926 -98404 -87507 -92288 -93242 -85956 -85687 -84773 -77363 -88941 -84136 -94565
590 -94565 -102276 -80809 -82426 -93636 -86538 -90446 -85199 -86915 -83095 -85573 -87531 -79288 -86618 -83007
576 -83007 -84727 -83881 -83194 -78547 -90106 -94603 -78203 -97673 -83911 -80849 -89126 -82668 -78589 -79442 -83638
561 -83638 -94376 -87671 -86250 -92905 -84959 -90304 -88651 -80308 -80010 -87509 -76823 -105511 -91210 -94408
547 -94408 -80010 -77773 -92611 -89454 -93224 -81675 -97193 -87880 -90322 -96914 -87084 -82076 -87589 -88985
$$ packed form
648h2204o076j1005K2328k2859K4855q16j4470J897j22q597J2723l427j47L561
634h4359q188R393N457j0264L66o823J2625r451L002m884M367J3829j5148R188
620h0890j1087N775O581j9635J3627%k263l893p32l688K141P564l815J653O521
605h2141m287L324q220o02o478J0897m781r54P286K69R14P410j1578M805j0429
590i4565p711K1467j617j1210P098l908N247j716L820k478j958Q243p330L611
576h3007j720Q46O87M647j1559m497J6400j9470J3762L062q277O458M079q53m196
561h3638j0738O705J421o655P946n345J653Q343K98p499J0686k8688J4301l198
547i4408J4398K237j4838L157l770J1549j5518R313k442o592R830N008n513j396
$$ plain form
533 -88985 -88021 -78063 -93295 -85584 -94898 -87738 -87993 -91396 -81711 -87883 -91104 -90454 -67156 -71676 -94851
518 -94851 -82391 -96936 -77123 -79320 -80111 -79443 -90078 -95787 -90850 -82818 -91513 -80388 -99045 -96769
504 -96769 -86630 -90382 -80494 -82470 -97116 -96295 -95005 -80639 -87084 -82378 -86345 -92254 -87664 -83989
490 -83989 -88544 -90424 -73162 -88958 -79889 -91650 -86997 -86589 -81418 -81788 -91381 -90250 -78506 -72628
476 -72628 -77045 -86313 -81843 -90346 -97524 -95610 -78610 -83667 -91100 -98996 -86217 -81954 -91112 -94139
462 -94139 -93960 -87921 -90413 -90477 -85794 -89920 -92967 -88761 -72262 -90598 -87401 -92179 -91485 -79231 -94202
447 -94202 -85442 -89372 -85188 -83535 -93140 -90592 -78942 -84903 -87776 -79563 -86333 -77767 -81091 -83031 -92192
432 -92192 -97159 -93860 -87608 -96675 -97839 -91790 -88999 -98819 -88567 -87480 -92034 -80223 -93379 -80646
$$ packed form
533h8985R64R958j5232P711r314P160k55l403R685o172l221O50K3298m520k3175
518i4851J2460j4545J9813k197p91O68j0635n709M937Q032q695J1125j8657K276
504i6769J0139l752R888j976j4646Q21J290J4366o445M706l967n909M590L675
490h3989m555j880J7262j5796R069j1761M653M08N171l70r593J131J1744N878
476g2628m417r268M470q503p178J914J7000n057p433p896J2779M263r158l027
462i4139J79O039k492o4M683m126l047M206J6499j8336L197m778O94J2254j4971
447i4202Q760l930M184J653r605K548J1650n961k873Q213o770Q566l324j940r161
432i2192m967L299O252r067j164O049K791r820J0252J087m554J1811j3156J2733
$$ plain form
418 -80646 -88365 -95976 -81747 -92271 -95940 -80438 -92963 -77647 -87347 -92794 -71803 -84523 -94517
405 -94517 -89132 -87523 -75644 -91328 -87186 -91856 -89002 -97994 -89273 -88084 -81721 -71345 -90801 -82824
391 -82824 -82288 -90244 -77472 -79262 -77766 -84920 -81988 -85333 -100330 -80740 -95992 -75881 -70662 -91169
377 -91169 -85097 -87305 -93756 -86091 -88131 -84696 -86153 -85614 -89639 -95841 -90870 -94004 -94636 -77565 -79561
362 -79561 -91544 -92103 -79563 -94848 -83915 -78937 -91642 -97771 -93125 -88111 -88732 -82265 -93720 -80457
348 -80457 -75917 -86463 -96311 -96368 -82457 -101782 -86070 -90639 -80703 -96747 -78596 -96982 -88937 -95419
334 -95419 -104545 -89239 -89430 -91311 -95974 -84617 -84808 -79916 -89995 -83710 -88777 -96300 -94167 -96723 -78448
319 -78448 -84229 -97699 -90936 -87572 -90615 -92149 -91911 -92499 -91309 -83585 -89994 -93333 -89675 -91775 -101083
$$ packed form
418h0646p719p611J4229j0524l669J5502j2525J5316r700n447K0991j2720r994
405i4517N385J609J1879j5684M142m670K854q992Q721J189O363J0376j9456P977
391h2824N36p956J2772j790J496p154K932l345j4997J9590j5252K0111N219k0507
377i1169O072k208o451P665k040L435j457N39m025o202M971l134o32J7071j996
362g9561j1983n59J2540j5285J0933M978j2705o129M646N014o21O467j1455J3263
348h0457M540j0546r848n7J3911j9325J5712m569R936j6044J8151j8386Q045o482
334i5419r126J5306j91j881m663J1357j91M892j0079O285n067p523K133k556J8275
319g8448n781j3470O763L364l043j534K38n88J190P724o409l339L658k100r308
$$ plain form
304 -101083 -86343 -93516 -96561 -90597 -92681 -93816 -95590 -94419 -95495 -87381 -90575 -92118 -94985 -92815
290 -92815 -82693 -82073 -100643 -84411 -91022 -93851 -95752 -93022 -103701 -95477 -79648 -84384 -90148 -104052
276 -104052 -96311 -95399 -94319 -91547 -88413 -79030 -96363 -90024 -84723 -91786 -83921 -94655 -95092 -87018 -88256
261 -88256 -96032 -96716 -96362 -95326 -76925 -84743 -101294 -93858 -92620 -88561 -95280 -87814 -85746 -98071 -92272
246 -92272 -107021 -89131 -92589 -89398 -98482 -95387 -91467 -94570 -91567 -101835 -91348 -89836 -97822 -99112
232 -99112 -98038 -87286 -99774 -100665 -101272 -92931 -90351 -92976 -104217 -97179 -85380 -96654 -82116 -96411
218 -96411 -90714 -93247 -99485 -88802 -110803 -97902 -99045 -93896 -95048 -96645 -95578 -92446 -94474 -96433
204 -96433 -99897 -86914 -97593 -100542 -104566 -97888 -95493 -96467 -101374 -94618 -97520 -105321 -93449 -96590
$$ packed form
304a01083J4740p173l045N964k084j135j774J171j076Q114l194j543k867K170
290i2815J0122O20j8570J6232o611k829j901K730j0679Q224J5829m736n764j3904
276a04052P741R12J080K772L134R383j7333O339N301p063P865j0734m37Q074j238
261h8256p776o84L54J036J8401p818j6551P436J238M059o719P466K068j2325N799
246i2272j4749J7890l458L191r084L095L920l103L003j0268J0487J512p986j290
232i9112J074J0752j2488q91o07Q341K580k625j1241P038J1799j1274J4538j4295
218i6411N697k533o238J0683k2001J2901j143N149j152j597J067L132k028j959
204i6433l464J2983j0679k949m024O678K395r74m907O756k902p801J1872l141
$$ plain form
190 -96590 -97771 -107481 -112600 -98226 -104907 -110034 -109983 -109672 -96576 -92193 -95402 -103941 -99899 -99004 -108196
175 -108196 -91223 -101656 -95717 -99161 -90122 -100601 -92040 -103253 -104872 -100558 -90758 -102777 -97651
162 -97651 -111262 -107989 -94229 -99590 -104366 -106534 -111268 -106928 -107017 -110327 -116127 -107823 -113173 -107656 -110352
147 -110352 -117272 -110934 -99763 -109646 -116084 -108036 -106871 -108599 -110230 -117820 -114146 -104056 -105365 -105414 -106601
132 -106601 -111417 -93515 -109412 -109971 -114166 -121138 -114923 -112210 -122217 -107780 -116579 -102968 -108091 -102454
118 -102454 -115259 -114197 -120074 -117874 -117677 -110771 -107818 -107984 -109498 -120322 -116762 -131567 -117327 -125236
104 -125236 -119669 -131479 -122925 -112279 -121276 -126029 -129393 -124966 -120846 -118706 -122848 -117970 -126460 -112665
90 -112665 -123255 -115293 -124765 -122017 -128825 -128434 -125165 -129118 -110165 -127354 -129820 -120814 -124618 -117547
$$ packed form
190i6590j181r710n119J4374o681n127N1L11J3096M383l209q539M042Q95r192
175a08196J6973j0433N939l444R039j0479Q561j1213j619M314R800j2019N126
162i7651j3611L273J3760n361m776k168m734M340q9l310n800Q304n350N517k696
147a10352o920O338J1171r883o438Q048J165j728j631p590L674J0090j309m9j187
132a06601m816J7902j5897n59m195o972O215K713j0007J4437q799J3611n123N637
118a02454j2805J062n877K200J97O906K953j66j514j0824L560j4805J4240p909
104a25236N567j1810Q554J0646q997m753l364M427M120K140m142M878q490J3795
90a12665j0590P962r472K748o808L91L269l953J8953j7189k466R006l804P071
$$ plain form
76 -117547 -121157 -127159 -122493 -127764 -121441 -117180 -120703 -133763 -129412 -137580 -124177 -124691 -144834 -123920
62 -123920 -131043 -136918 -118406 -142360 -128669 -138858 -141224 -135428 -134368 -139369 -131918 -134759 -143453 -133158
48 -133158 -138833 -142773 -135270 -138938 -140732 -136988 -141129 -139436 -142023 -145661 -139713 -144017 -140292 -142073 -149183
33 -149183 -141098 -150385 -145988 -139531 -141499 -148358 -153768 -138676 -149965 -146265 -144920 -138680 -143911 -145932
19 -145932 -138180 -153085 -148064 -145062 -160825 -142537 -151225 -153295 -146382 -161935 -157451 -156373 -153885 -153718
5 -153718 -148344 -151625 -144577 -156469 -154364
0 -154364
$$ packed form
76a17547l610o002M666n271O323M261l523j3060M351q168J3403n14k0143K0914
62a23920p123n875J8512k3954J3691j0189k366N796J060n001P451k841q694J0295
48a33158n675l940P503l668j794L744m141J693k587l638N948m304L725j781p110
33a49183Q085r287M397O457j968o859n410J5092j1289L700J345O240n231k021
19a45932P752j4905N021L002j5763J8288q688k070O913j5553M484J078K488J67
5a53718N374l281P048j1892K105
0a54364
$$ Imaginary data points
##PAGE= N=2
##DATA TABLE= (X++(I..I)), XYDATA
$$ plain form
16383 -705697 -700372 -685689 -685802 -670861 -655239 -660571 -654367 -630901 -633062 -622830 -601283 -604855 -587923
16370 -587923 -589493 -576225 -572737 -568477 -565919 -547749 -543309 -533319 -522211 -511241 -502145 -500823 -502426
16357 -502426 -478901 -471683 -464428 -458014 -445885 -446169 -438701 -427130 -410811 -404725 -411423 -393737 -389000
16344 -389000 -379652 -377709 -364291 -352122 -349227 -349585 -329817 -329069 -315125 -311351 -299877 -292538 -285051
16331 -285051 -281184 -261280 -259495 -269669 -253793 -242391 -230660 -223927 -217834 -209441 -201828 -197764 -198524
16318 -198524 -178634 -170462 -167752 -161080 -144885 -138914 -135708 -131631 -133312 -124209 -110219 -113032 -103415
16305 -103415 -91407 -81330 -82405 -80343 -71261 -56243 -58194 -47750 -43851 -41735 -27022 -18135 -16735
16292 -16735 -8289 -8328 5953 10371 12375 16903 24232 41056 35772 51117 54686 59951 66066 68868
$$ packed form
16383g05697N325J4683j13J4941J5622n332O204K3466k161J0232K1547l572J6932
16370e87923j570J3268L488M260K558J8170M440R990J1108J0970R096J322j603
16357e02426K3525P218P255O414J2129k84P468J1571J6319O086o698J7686M737
16344c89000R348J943J3418J2169K895l58J9768P48J3944L774J1474P339P487
16331b85051L867J9904J785j0174J5876J1402J1731O733O093Q393P613M064p60
16318a98524J9890Q172K710O672J6195N971L206M077j681R103J3990k813R617
16305a03415J2008J0077j075K062R082J5018j951J0444L899K116J4713Q887J400
16292a6735Q446l9J4281M418K004M528P329J6824n284J5345L569N265O115K802
$$ plain form
16278 68868 81913 79116 85414 88501 95186 102790 116413 120849 121544 121774 123247 126473 136048 142418
16264 142418 152773 164950 163710 165116 180004 175679 181067 183452 186902 197713 204560 208166 219294
16251 219294 215437 215960 234438 237270 236984 234248 244291 246959 261291 262118 269017 271224 271153 272119 271047
16236 271047 284606 287290 296460 299294 309651 305081 311017 315471 310440 318787 332850 322121 330261
16223 330261 329191 339082 344433 341219 346694 369803 359534 358261 367817 363925 376433 383428 372530
16210 372530 390558 376018 390032 388709 388887 397996 401761 399298 410993 404124 410524 401313 411259
16197 411259 412934 418185 417774 439628 431515 437528 437873 437509 444342 441444 444806 458796 453182 446848
16183 446848 448353 448117 457738 465219 472231 471741 465787 481750 482657 477832 477954 477777 493047 488575 493808
$$ packed form
16278F8868J3045k797O298L087O685P604J3623M436O95K30J473L226R575O370
16264A42418J0355J2177j240J406J4888m325N388K385L450J0811O847L606J1128
16251B19294l857N23J8478K832k86k736J0043K668J4332Q27O899K207p1R66j072
16236B71047J3559K684R170K834J0357m570N936M454n031Q347J4063j0729Q140
16223C30261j070R891N351l214N475K3109j0269j273R556l892J2508O995j0898
16210C72530J8028j4540J4014j323J78R109L765k463J1695o869O400r211R946
16197D11259J675N251m11K1854q113O013L45l64O833k898L362J3990n614o334
16183D46848J505k36R621P481P012m90n954J5963R07m825J22j77J5270m472N233
$$ plain form
16168 493808 484724 499378 494130 496498 501332 496381 515583 497172 504510 492153 503970 500946 503390
16155 503390 505601 510019 518889 518142 506378 515388 525155 529874 529047 517733 522917 535313 530425 534433
16141 534433 529300 531780 547068 533456 527662 534383 543385 545353 543731 545091 550686 545243 545613 548403
16127 548403 555173 542827 548711 556976 553422 539649 556080 563794 560894 564832 556108 554592 565440
16114 565440 561679 562678 555247 573724 574758 554801 562572 558512 572219 575221 569296 563267 564147 556583
16100 556583 565160 567086 569344 576072 571113 582068 574809 578454 572426 572692 568970 573204 592724 591512
16086 591512 576519 589505 574233 575553 580076 584382 586327 588084 575035 581200 586150 578624 574546
16073 574546 573899 576335 585806 577662 582161 576014 575913 589064 574902 576750 584720 584095 588810 580290
$$ packed form
16168D93808r084J4654n248K368M834m951J9202j8411P338j2357J1817l024K444
16155E03390K211M418Q870p47j1764R010R767M719q27j1314N184J2396m888M008
16141E34433n133K480J5288j3612n794O721R002J968j622J360N595n443L70K790
16127E48403O770j2346N884Q265l554j3773J6431P714k900L938q724j516J0848
16114E65440l761R99p431J8477J034j9957P771m060J3707L002n925o029Q80p564
16100E56583Q577J926K258O728m959J0955p259L645o028K66l722M234J9520j212
16086E91512j4993J2986j5272J320M523M306J945J757j3049O165M950p526m078
16073E74546o47K436R471q144M499o147j01J3151j4162J848P970o25M715q520
$$ plain form
16059 580290 605133 599311 588616 582216 595748 585639 582197 574282 581604 589699 585320 594930 598184
16046 598184 602834 589873 586274 590892 589821 589449 584121 590366 590967 600665 586088 577901 589882 590217
16032 590217 588473 590727 587145 597483 597929 586116 590514 595412 586479 597414 584231 590004 595407
16019 595407 593504 598587 603681 589467 592588 603236 602499 584423 596931 603785 587890 601116 600558
16006 600558 608074 596931 588410 593611 585637 595172 612863 603454 589547 580541 597469 595318 576786
15993 576786 586487 582582 594087 605246 596077 594117 605556 588893 608269 588924 599177 592603
15981 592603 585578 598456 600861 589507 597932 590642 593099 592677 604140 590656 592418 584076 593484
15968 593484 594123 597448 591889 594545 601455 589613 597647 602759 579729 596841 593645 584899 596742
$$ packed form
16059E80290K4843n822j0695o400J3532j0109l442p915P322Q095m379R610L254
16046E98184M650j2961l599M618j071l72n328O245O01R698j4577q187J1981L35
16032E90217j744K254l582J0338M46j1813M398M898q933J0935j3183N773N403
16019E95407j903N083N094j4214L121J0648p37j8076J2508O854j5895J3226n58
16006F00558P516j1143q521N201p974R535J7691r409j3907r006J6928k151j8532
15993E76786R701l905J1505J1159r169j960J1439j6663J9376j9345J0253o574
15981E92603p025J2878K405j1354Q425p290K457m22J1463j3484J762q342R408
15968E93484O39L325n559K656O910j1842Q034N112k3030J7112l196q746J1843
$$ plain form
15955 596742 597925 595451 602073 586692 589663 604561 594008 596133 596221 590926 605894 592776 597381
15942 597381 597232 585530 584998 587330 603286 604540 601394 595274 594581 599125 583371 584625 596172 590011
15928 590011 596404 597669 596654 595623 590104 606172 605733 591484 596611 589276 586565 594587 612274 589392
15914 589392 598802 606228 587075 609355 600503 586324 586164 603368 595922 609794 604909 596855 590971
15901 590971 600277 608445 606241 596470 608397 596992 595268 598893 594750 594556 602541 599541 599722 607035
15887 607035 597810 584820 607056 598473 602163 595549 604878 605353 596323 599112 600852 587838 599488
15874 599488 604078 606562 600069 607481 603196 596130 605977 587388 603970 607368 589844 607275 603684
15861 603684 592817 601772 609885 595931 596061 594402 603963 607832 594432 608190 606226 594605 604535
$$ packed form
15955E96742J183k474O622j5381K971J4898j0553K125Q8n295J4968j3118M605
15942E97381j49j1702n32K332J5956J254l146o120o93M544j5754J254J1547o161
15928E90011O393J265j015j031n519J6068m39j4249N127p335k711Q022J7687k2882
15914E89392R410P426j9153K2280q852j4179j60J7204p446J3872m885q054n884
15901E90971R306Q168k204r771J1927j1405j724L625m143j94P985l000J81P313
15887F07035r225j2990K2236q583L690o614R329M75r030K789J740j3014J1650
15874E99488M590K484o493P412m285p066R847j8589J6582L398j7524J7431l591
15861F03684j0867Q955Q113j3954J30j659R561L869j3400J3758j964j1621R930
$$ plain form
15848 604535 614953 600861 599734 589062 601589 613785 607300 593572 604933 602853 600400 604573
15836 604573 588705 596974 600874 605308 599505 601714 601623 610607 595441 597145 605376 598153 598799 603901
15822 603901 602026 602919 597666 613921 599240 593625 604298 608055 602355 595644 607468 605816 606908
15809 606908 606663 585861 597343 604000 589428 605075 609701 604694 608541 608003 605050 601452 601148 608063
15795 608063 594770 599776 598275 610092 617512 608184 609082 597125 606769 603471 609282 598786 605977
15782 605977 603467 597602 609675 600730 608917 611653 598309 609154 618150 613458 611350 604244 592067
15769 592067 611135 594869 611112 611537 597425 606892 604518 611854 606380 595277 616593 603127 599049
15756 599049 607844 607998 611117 610960 610995 609044 613335 612578 612651 605951 599118 614792 616027 614130 611063 617526
$$ packed form
15848F04535J0418j4092j127j0672J2527J2196o485j3728J1361k080k453M173
15836F04573j5868Q269L900M434n803K209r1Q984j5166J704Q231p223O46N102
15822F03901j875Q93n253J6255j4681n615J0673L757n700o711J1824j652J092
15809F06908k45k0802J1482O657j4572J5647M626n007L847n38k953l598l04O915
15795F08063j3293N006j501J1817P420r328Q98j1957R644l298N811j0496P191
15782F05977k510n865J2073q945Q187K736j3344J0845Q996m692k108p106j2177
15769E92067J9068j6266J6243M25j4112R467k374P336n474j1103K1316j3466m078
15756E99049Q795J54L119j57L5j951M291p57P3o700o833J5674J235j897l067O463
$$ plain form
15740 617526 615638 614064 598134 596890 611690 621469 610926 609992 599049 607493 602503 606041 602114
15727 602114 608656 602862 611364 608112 605561 609439 617252 598833 599843 600495 606101 602098 606494 609590
15713 609590 616374 620613 606161 612563 605334 604030 609199 613886 613681 610881 615256 617594 617900 608225
15699 608225 595551 612418 601835 614463 611981 616112 613802 604788 615839 605721 607477 600280 605244
15686 605244 601583 605186 606741 617576 616442 611502 609422 609212 608427 612479 616431 609857 611621 618952
15672 618952 612385 600314 624639 602121 604066 614415 621731 602421 615745 621009 610367 624085
15660 624085 611092 607351 610035 601699 621185 605194 606770 609342 615056 623267 621558 607243 618190
15647 618190 603161 614921 617903 620590 613753 608499 615176 606511 615992 619839 621679 610146 617300
$$ packed form
15740F17526j888j574j5930j244J4800R779j0543r34j0943Q444m990L538l927
15727F02114O542n794Q502l252k551L878P813j8419J010O52N606m003M396L096
15713F09590O784M239j4452O402p229j304N169M687k05k800M375K338L06r675
15699F08225j2674J6867j0583J2628k482M131k310r014J1051j0118J756p197M964
15686F05244l661L603J555J0835j134m940k080k10p85M052L952o574J764P331
15672F18952o567j2071K4325k2518J945J0349P316j9310J3324N264j0642J3718
15660F24085j2993l741K684q336J9486j5991J576K572N714Q211j709j4315J0947
15647F18190j5029J1760K982K687o837n254O677q665R481L847J840j1533P154
$$ plain form
15634 617300 621163 628144 615708 610904 615938 608997 613250 618477 613684 609676 624747 616068 610993 608716
15620 608716 614707 611586 619433 606194 604871 619388 617373 608206 624633 606701 621324 619808 618170
15607 618170 624892 610835 612681 607330 619421 609582 607110 612802 601452 612759 621500 622239 609432
15594 609432 612000 621019 619786 619201 616755 624933 622267 618560 607253 620817 617607 618105 608071 611031
15580 611031 629372 591171 619653 611021 619750 621302 613302 623424 614273 609136 614523 617619 614914
15567 614914 614408 604547 617461 619047 601290 634495 619842 615631 613275 607514 617636 610405 625045
15554 625045 611916 609479 629682 618556 617839 615513 612848 625566 613845 618865 633141 623466 614071
15541 614071 623227 615151 621063 617204 621679 619034 613882 627986 626691 620388 618337 619702 618180 634347
$$ packed form
15634F17300L863O981j2436m804N034o941M253N227m793m008J5071q679n075k277
15620F08716N991l121P847j3239j323J4517k015r167J6427j7932J4623j516j638
15607F18170O722j4057J846n351J2091r839k472N692j1350J1307Q741P39j2807
15594F09432K568R019j233n85k446Q178k666l707j1307J3564l210M98j0034K960
15580F11031J8341l8201K8482q632Q729J552q000J0122r151n137N387L096k705
15567F14914n06r861J2914J586j7757L3205j4653m211k356n761J0122p231J4640
15554F25045j3129k437K0203j1126p17k326k665J2718j1721N020J4276r675r395
15541F14071R156q076N912l859M475k645n152J4104j295o303k051J365j522J6167
$$ plain form
15527 634347 619225 619143 613498 618461 619537 631808 618567 603454 620096 629584 621435 608225 622450
$$ packed form
15527F34347j5122q2n645M963J076J2271j3241j5113J6642R488q149j3210J4225
$$ [...]
##END NTUPLES=NMR SPECTRUM
##END=
