##TITLE=abcd
##JCAMPDX= 6.0         $$ Bruker NMR JCAMP-DX V2.0
##DATA TYPE= NMR SPECTRUM
##DATA CLASS= NTUPLES
##ORIGIN= UXNMR, Bruker Analytische Messtechnik GmbH
##OWNER= root
$$ XWIN-NMR		Version 3.5
$$ Fri Jan 23 18:58:16 2026 Russian Standard Time (UT+4h)  servis@DPX200
##.OBSERVE FREQUENCY= 200.131235884673
##.OBSERVE NUCLEUS= ^1H
##.ACQUISITION MODE= SIMULTANEOUS
##.ACQUISITION SCHEME= undefined
##.AVERAGES= 32
##.DIGITISER RES= 18
##SPECTROMETER/DATA SYSTEM= spect
##.PULSE SEQUENCE= zg
##.SOLVENT NAME= CDCl3
##.SHIFT REFERENCE= (INTERNAL, CDCl3, 0, 16.4885)
##AUDIT TRAIL= $$ (NUMBER, WHEN, WHO, WHERE, WHAT)
$$ ##TITLE= Audit trail, XWIN-NMR		Version 3.5
$$ ##JCAMPDX= 5.01
$$ ##ORIGIN= Bruker BioSpin GmbH
$$ ##OWNER= servis
$$ F:\spectra/data/av/nmr/H1/1/pdata/1/auditp.txt
$$ ##AUDIT TRAIL=  $$ (NUMBER, WHEN, WHO, WHERE, WHAT)
(   1,<2026-01-23 18:56:04.32 +0400>,<servis>,<DPX200>,
      <created by zg, POWCHK disabled, PULCHK disabled
       configuration hash MD5:
       00 E9 B6 7A A2 85 ED C7 34 08 36 98 17 FE 4E 26
       data hash MD5: 32K
       3D 8D 86 79 85 A7 E9 76 C6 A8 29 89 08 37 84 DC>)
(   2,<2026-01-23 18:57:51.67 +0400>,<servis>,<DPX200>,
      <Start of raw data processing
       efp BC_mod = 2 LB = 0.05 FT_mod = 6 PKNL = 1 PHC0 = -258.2463 PHC1 = 6.301564 SI = 16K 
       data hash MD5: 16K
       EF 99 88 F7 54 F9 7A C2 84 34 47 70 DF 15 66 0F>)
$$ ##END=
$$ 
$$ hash MD5
$$ 3E 79 D3 E5 D7 29 AE BF 4C 77 F4 24 EE F9 A5 D7
##$RELAX= 
##$RELAX= 
##$RELAX= 
##$RELAX= 
##$RELAX= 
##$RELAX= 
##$RELAX= 
##$RELAX= 
$$ Bruker specific parameters
$$ --------------------------
##$DU= <F:\spectra>
##$EXPNO= 1
##$NAME= <H1>
##$PROCNO= 1
##$TYPE= <nmr>
##$USER= <av>
##$AMP= (0..31)
100 100 100 100 100 100 100 100 100 100 100 100 100 100 100 100 100 100 
100 100 100 100 100 100 100 100 100 100 100 100 100 100 
##$AQSEQ= 0
##$AQ_mod= 1
##$AUNM= <au_zg>
##$AUTOPOS= <>
##$BF1= 200.13
##$BF2= 200.13
##$BF3= 200.13
##$BF4= 200.13
##$BF5= 500.13
##$BF6= 500.13
##$BF7= 500.13
##$BF8= 500.13
##$BYTORDA= 1
##$CFDGTYP= 0
##$CFRGTYP= 5
##$CHEMSTR= <none>
##$CNST= (0..31)
1 1 145 1 1 1 1 1 1 1 1 1 1 1 1 1 1 1 1 1 1 1 1 1 1 1 1 1 1 1 1 1 
##$CPDPRG= <>
##$CPDPRG1= <>
##$CPDPRG2= <>
##$CPDPRG3= <>
##$CPDPRG4= <mlev>
##$CPDPRG5= <mlev>
##$CPDPRG6= <mlev>
##$CPDPRG7= <mlev>
##$CPDPRG8= <mlev>
##$CPDPRGB= <>
##$CPDPRGT= <>
##$D= (0..31)
0 2 0 0 0 0 0 0 0 0.06 0 0 0 0 0 0 0.0002 0 0 0 0 0 0 0 0 0 0 0 0 0 0 
0 
##$DATE= 1769180163
##$DBL= (0..7)
120 120 120 120 120 120 120 120 
##$DBP= (0..7)
150 150 150 150 150 150 150 150 
##$DBP07= 0
##$DBPNAM0= <>
##$DBPNAM1= <>
##$DBPNAM2= <>
##$DBPNAM3= <>
##$DBPNAM4= <>
##$DBPNAM5= <>
##$DBPNAM6= <>
##$DBPNAM7= <>
##$DBPOAL= (0..7)
0.5 0.5 0.5 0.5 0.5 0.5 0.5 0.5 
##$DBPOFFS= (0..7)
0 0 0 0 0 0 0 0 
##$DE= 6
##$DECBNUC= <off>
##$DECIM= 32
##$DECNUC= <off>
##$DECSTAT= 4
##$DIGMOD= 1
##$DIGTYP= 9
##$DL= (0..7)
0 120 120 120 120 120 120 120 
##$DP= (0..7)
150 150 150 150 150 150 150 150 
##$DP07= 0
##$DPNAME0= <>
$$ [...]
##$SUBNAM4= <"">
##$SUBNAM5= <"">
##$SUBNAM6= <"">
##$SUBNAM7= <"">
##$SUBNAM8= <"">
##$SUBNAM9= <"">
##$SW= 20.6817932712277
##$SWIBOX= (0..15)
0 0 3 0 0 0 0 0 0 0 0 0 0 0 0 0 
##$SW_h= 4139.07284768212
##$TD= 32768
##$TD0= 1
##$TE= 0
##$TE2= 300
##$TE3= 300
##$TEG= 300
##$TL= (0..7)
0 120 120 120 120 120 120 120 
##$TP= (0..7)
150 150 150 150 150 150 150 150 
##$TP07= 0
##$TPNAME0= <>
##$TPNAME1= <>
##$TPNAME2= <>
##$TPNAME3= <>
##$TPNAME4= <>
##$TPNAME5= <>
##$TPNAME6= <>
##$TPNAME7= <>
##$TPOAL= (0..7)
0.5 0.5 0.5 0.5 0.5 0.5 0.5 0.5 
##$TPOFFS= (0..7)
0 0 0 0 0 0 0 0 
##$TUNHIN= 0
##$TUNHOUT= 0
##$TUNXOUT= 0
##$USERA1= <user>
##$USERA2= <user>
##$USERA3= <user>
##$USERA4= <user>
##$USERA5= <user>
##$V9= 5
##$VALIST= <valist>
##$VCLIST= <CCCCCCCCCCCCCCC>
##$VD= 0
##$VDLIST= <DDDDDDDDDDDDDDD>
##$VPLIST= <PPPPPPPPPPPPPPP>
##$VTLIST= <TTTTTTTTTTTTTTT>
##$WBST= 1024
##$WBSW= 30
##$XGAIN= (0..3)
0 0 0 0 
##$XL= 0
##$YL= 0
##$YMAX_a= 298819
##$YMIN_a= -182469
##$ZGOPTNS= <>
##$ZL1= 120
##$ZL2= 120
##$ZL3= 120
##$ZL4= 120
##$ABSF1= 0
##$ABSF2= 0
##$ABSG= 0
##$ABSL= 0
##$ALPHA= 0
##$AQORDER= 0
##$ASSFAC= 0
##$ASSFACI= 0
##$ASSFACX= 0
##$ASSWID= 0
##$AUNMP= <proc_1d>
##$AZFE= 0.1
##$AZFW= 0.1
##$BCFW= 0
##$BC_mod= 2
##$BYTORDP= 0
##$COROFFS= 0
##$CY= 18.4799938201904
##$DATMOD= 1
##$DC= 0
##$DFILT= <>
##$DTYPP= 0
##$F1P= 9.9274215381318
##$F2P= -0.165520771350173
##$FCOR= 1
##$FTSIZE= 16384
##$FT_mod= 6
##$GAMMA= 0
##$GB= 0
##$INTBC= 1
##$INTSCL= 4.127829e-11
##$ISEN= 128
##$LB= 0.05
##$LEV0= 0
##$LPBIN= 0
##$MAXI= 10000
##$MC2= 0
##$MEAN= 0
##$ME_mod= 0
##$MI= 50
##$NCOEF= 0
##$NC_proc= -6
##$NLEV= 6
##$NOISF1= 3.799351
##$NOISF2= 2.8
##$NSP= 0
##$NTH_PI= 0
##$NZP= 0
##$OFFSET= 16.48848
##$PC= 4
##$PHC0= -258.2463
##$PHC1= 6.301564
##$PH_mod= 1
##$PKNL= yes
##$PPARMOD= 0
##$PSCAL= 4
##$PSIGN= 0
##$REVERSE= no
##$SF= 200.130005582386
##$SI= 16384
##$SIGF1= 3
##$SIGF2= 2
##$SINO= 400
##$SIOLD= 16384
##$SREGLST= <1H.CDCl3>
##$SSB= 0
##$STSI= 16384
##$STSR= 0
##$SW_p= 4139.07284768211
##$SYMM= 0
##$S_DEV= 0
##$TDeff= 32768
##$TDoff= 0
##$TI= <>
##$TILT= no
##$TM1= 0
##$TM2= 0
##$TOPLEV= 0
##$USERP1= <user>
##$USERP2= <user>
##$USERP3= <user>
##$USERP4= <user>
##$USERP5= <user>
##$WDW= 1
##$XDIM= 16384
##$YMAX_p= 477028201
##$YMIN_p= -3318536
$$ End of Bruker specific parameters
$$ ---------------------------------
##NTUPLES= NMR SPECTRUM
##VAR_NAME=  FREQUENCY,     SPECTRUM/REAL,   SPECTRUM/IMAG
##SYMBOL=    X,             R,               I
##VAR_TYPE=  INDEPENDENT,   DEPENDENT,       DEPENDENT
##VAR_FORM=  AFFN,          ASDF,            ASDF
##VAR_DIM=   16384,         16384,           16384
##UNITS=     HZ,            ARBITRARY UNITS, ARBITRARY UNITS
##FACTOR=    0.252644378177508, 1,           1
##FIRST=     3299.83951724647, 0,            0
##LAST=      -839.233330435636, 0,           0
##MIN=       -839.233330435636, -3318536,    0
##MAX=       3299.83951724647, 477028201,    0
$$ Real data points
##PAGE= N=1
##DATA TABLE= (X++(R..R)), XYDATA
$$ [...]
12482 -41891 -111256 -9667 -30546 217510 -54417 -15049 -140206 -104007 -105283 224009 -249244
12471 -249244 68725 57122 -151070 7165 -86452 -280557 65238 -188061 -9511 57833
12461 57833 -14950 -12657 -176438 -246262 -80132 -18192 19178 -62714 -154914 -144179 -126064
12450 -126064 -158328 -196124 -380481 -1341 -46298 49902 -157865 -159572 -113003 -10853 49996
12439 49996 -179622 -143158 48397 151068 -201834 -4593 -33419 -320943 -140277 -45217
12429 -45217 -127366 63954 -130107 -250598 -36276 96578 -155840 -12728 -238786 -5390
12419 -5390 -88671 188337 -91366 48113 -163574 -31306 71320 8762 -162263 -8200
12409 -8200 -91162 -57377 -110311 -37678 7721 -60660 8350 -118081 -143585 -2565 15684
12398 15684 -34824 -157917 -236544 -178711 -171969 -126262 7840 -119564 8988 -237487 -156800
12387 -156800 59595 -35930 -195447 -280188 -243196 -300057 51254 -172452 -57359 -54090 19328
12376 19328 -103648 61099 33767 57915 -144773 -54126 -43543 -358723 -209047 -114500 -31260
12365 -31260 62333 -147415 -39104 -165364 -35368 -300117 -222352 -35734 52934 -71284
12355 -71284 -193715 -224533 165987 2354 23207 -49831 77566 59325 82034 184274 -34948
12344 -34948 65343 34632 213043 165876 -10703 -121410 -121001 -66984 -155158 35373 -325513
12333 -325513 -178018 -174252 -80165 -16766 -120933 -47829 -66629 -166319 -228143 -124698 21409
12322 21409 -256237 -78710 167560 -10987 -59892 -304715 -106932 69220 -182083 -201906
12312 -201906 -175679 -126148 -106380 -157548 -95889 -201500 -75150 -147139 43778 64937 119517
12301 119517 -162174 -91975 -60384 110458 -263026 -286325 -58999 -87406 -245224 -39510
12291 -39510 -205735 -238430 -516516 -519195 -148761 -125849 -450328 -424910 -21720 -333998 -315179
12280 -315179 -336162 -90262 -86565 8909 -172577 21906 -7757 -4514 170690 -34885 34545
12269 34545 137635 111912 104103 -109700 205223 -69841 -38855 14641 273092 -180170 -59963
12258 -59963 -174883 -64942 -19146 38496 21400 -76872 -80744 221151 132108 69897 -124070
12247 -124070 121887 -40623 292634 -102371 46124 -125090 19657 27375 227512 -31605
12237 -31605 55552 136292 97284 -26200 91836 -86302 -164975 46839 151046 -61462
12227 -61462 -139648 -64986 -5582 37671 -337660 -274371 -432444 -135437 -256024 -256331 -342765
12216 -342765 -243106 -15097 -117117 111258 -230189 -92475 -172174 -188398 -15571 -297326
12206 -297326 -144225 -188235 -142981 -128099 -41806 -414716 -23882 -200937 -110969 -125489 -270834
12195 -270834 -150411 -148786 -92046 -27238 -142123 -184129 -33139 -77564 120255 -50493 -87681
12184 -87681 -155639 265346 115566 -180994 -185876 -141220 74037 -215907 -175349 -253949 4277
12173 4277 -175185 -195170 -288701 -227446 -96233 -45450 -162204 10845 -198868 -15743 -196868
12162 -196868 -51618 -7355 -62807 -88940 -180604 12149 187470 -40359 -60527 -237772
12152 -237772 155238 54623 140469 31480 -221800 -6356 112858 -44273 -100098 60576
12142 60576 -62081 -47475 9026 -157756 -117399 -157295 -134864 -183736 -15090 -111365 -95861
12131 -95861 -163116 -41309 -86313 -43006 -270874 -94302 -17122 -55525 -221576 -86232 -134856
12120 -134856 -134548 53077 -73510 -100313 -346718 -278352 42675 1749 -51178 10159 -36336
12109 -36336 18178 -41370 -37144 27902 123494 37285 -206953 -59571 -50558 20850 -256721
12098 -256721 -129994 -232081 32233 3604 26235 -121091 -142029 -146303 -34872 -175116
12088 -175116 -77153 -178604 -99990 115809 219700 -175282 -93225 71792 28339 14855
12078 14855 -147190 -191178 -101933 76220 -216788 30613 -41123 -191750 -23642 18202
12068 18202 170977 99017 33853 65897 17330 -145707 42534 -70740 39398 44799 72303
12057 72303 -208079 23791 81637 64382 -35339 41511 96427 -243357 -182701 -207714 -73390
12046 -73390 -123313 -75871 -214685 -140390 -206878 -213855 -137335 -195068 -59631 -14148 -192715
12035 -192715 19390 23985 89118 -120573 -248890 -113330 -7 160828 -138097 -15134
12025 -15134 42393 -62245 -141898 -88948 74525 -262895 -154667 -39434 -97308 -124064 -84295
12014 -84295 4117 -173900 64668 -14684 56839 -131784 -28380 -233934 -231134 -28749 -34974
12003 -34974 -67285 -127691 116368 -207592 -151193 -291323 -118039 4627 -37334 -116899 -233880
11992 -233880 -47934 253677 -73660 -245196 -192398 16215 162612 23481 -53941 -181032
11982 -181032 -348110 -225182 -243731 -76221 -133118 -125417 -84387 23738 -294685 -33076
11972 -33076 -92990 54571 -163916 -133889 -100965 -70152 -168486 38160 -46707 11707 -133403
11961 -133403 59128 -12871 -118333 -238198 -221649 -84484 -35598 -159815 -149056 -308201
11951 -308201 46461 -136728 -50589 -112618 -83142 -37401 -91513 -130917 67558 -82448 -48595
11940 -48595 22322 -111210 -294237 -565042 -330433 -112618 64309 -136690 -120705 -141340
11930 -141340 14121 159058 -14413 -44302 -121430 96257 132811 502 75988 -308464
11920 -308464 -188129 -91339 -171735 172943 -186238 -304041 -7811 -140939 -191254 -367810
11910 -367810 103835 150630 -151108 -12391 196940 166429 -64854 -150514 -48158 185589
11900 185589 -12192 13851 -5086 -107884 166839 109337 -56175 193304 139750 141462 251051
11889 251051 347085 56783 5965 105135 116592 157835 -28469 -107136 -178872 -188969 -50889
11878 -50889 -89354 -128489 -374527 -42879 -211143 60832 -187530 -96481 -155281 -188043 -158273
11867 -158273 -169874 -130852 -278278 -89842 -6231 -130548 69051 -239320 112429 92892
11857 92892 222190 69707 357241 -87157 -69167 -8744 -23204 -196225 -133194 23406
11847 23406 -79325 -78383 -97420 65326 87182 75159 58613 219464 158008 144033 200108
11836 200108 -5734 72757 154946 -15768 -28682 -131972 52750 112614 -91797 33890
11826 33890 -281900 137638 -77737 23924 -90477 -309051 36973 -29922 62845 -254918
11816 -254918 -15101 -252313 58542 213929 -38245 4467 90288 81076 18631 164917
11806 164917 -49487 101552 -215325 2153 -43686 -46229 -129726 -345392 135493 -38163
11796 -38163 98978 -227434 -253238 -72975 95423 -132140 -54082 -71832 -225081 -213258
11786 -213258 -203694 -171000 -26797 -228032 -231772 188424 21790 42316 -38633 1588 -222060
11775 -222060 162975 25181 179026 81131 -17295 39813 148679 161213 -99702 67661
11765 67661 -100734 126591 -282 25723 62370 -132675 88923 -78677 -56663 -232195
11755 -232195 222851 -362444 38086 -122456 72164 -223496 -398004 -75361 105365 297031
11745 297031 -58579 -68386 -313644 -14879 145267 20706 -135804 -197745 22897 135096
11735 135096 -123757 -118841 -213051 -4316 -27883 -53758 108858 -51285 75760 77139 20768
11724 20768 -98208 148263 19441 -191878 19221 -79859 48968 -218741 -274228 -352812
11714 -352812 -175758 -74079 -38326 -30874 -155569 91810 -260114 67536 -215570 23000
11704 23000 -81319 -160238 -144044 -147170 3859 -89543 -149898 -283749 -142136 -84117 -129039
11693 -129039 32144 -172450 -324540 126871 67961 38554 -12924 -132585 -299453 -8115
11683 -8115 16976 -122244 85705 69282 33359 -23731 62494 94362 13258 116618 -141522
11672 -141522 59185 104617 5193 -69445 212436 25425 25798 -247574 -80163 -50921 163489
11661 163489 -111162 21347 -42056 -194747 -168160 -125880 -311606 -180636 -152390 15957
11651 15957 -100312 -317913 -425199 -83576 -73906 -162454 -150241 -135030 -37656 -57285 8048
11640 8048 -26353 53281 -58905 -93525 -126983 13271 -143986 -102805 -281618 -70131 -56949
11629 -56949 -88037 -108728 -254196 -298558 -55860 -77224 -124924 -191223 56561 -189551 -122680
11618 -122680 -157322 -114682 -66064 -1623 74494 30244 -150359 -69838 -89374 60320 -199334
11607 -199334 7969 33697 -25192 54571 -41011 174915 183265 224309 23625 256964 296008
11596 296008 23604 -61336 -68121 -12460 -38084 -176496 91485 -215884 31122 86911 -87931
11585 -87931 -257007 -99637 -249275 -41268 -252434 94290 -232102 -175483 -311933 -172482
11575 -172482 -93921 -51084 -243804 -157935 -170226 -98046 -47676 -68647 23932 -243355 -248852
11564 -248852 -128519 -186160 -150086 -285620 89899 -216379 14222 11538 -181487 -30115
11554 -30115 -441267 -96952 26030 19070 -88777 120820 -34683 -74454 -180021 -187598 -176107
11543 -176107 -213284 -202294 61529 -93532 42341 -120727 -76898 -152235 302256 111371
11533 111371 3126 165855 138246 48494 7558 -32695 -348715 176674 -13221 -111997
11523 -111997 -77639 -125801 -136151 -174921 -84220 -333552 -66649 -133114 -25911 -4276 -84630
11512 -84630 9810 -164728 -31484 -109182 -37439 -17972 -174767 -190965 -266404 29998 -245818
11501 -245818 -90144 -55706 -72758 19201 -126709 -43587 -72418 312089 21354 35707 -164177
11490 -164177 217472 121134 23982 -68412 144902 16717 49064 -35339 -17098 199243 96709
11479 96709 -127733 -55130 -216197 -62684 -277744 -90042 -212606 -199640 -251737 -159709
11469 -159709 -80256 -48229 -229694 -162326 -68644 -6323 -129795 -169681 -851 225557 85972
11458 85972 -177895 -52509 67285 114740 -64258 66596 70046 -78330 14207 -55865 -49339
11447 -49339 -266752 -228124 51372 168600 -33955 42688 -322640 -110874 -23133 -10735
11437 -10735 -27809 -199250 -164969 -274447 124798 -313674 83792 -197593 -192095 -127447 -418761
11426 -418761 -167462 -361871 -297745 -111285 -132805 -235870 -245254 -16951 -366007 -116352
11416 -116352 -233020 -22552 -115695 67968 6181 196026 -75746 86854 76360 -50372
11406 -50372 135135 -140837 126020 32409 -47312 -178274 -106578 -115739 -42361 35308 -113804
11395 -113804 49740 4509 -97783 -47805 -140608 98179 16336 -66887 82847 -63756
11385 -63756 -68063 -74261 82839 -23113 237768 -21395 73527 123122 69508 100141 80940
11374 80940 55676 -325429 73629 25762 57817 -177406 -52589 -235559 -66539 -28031
11364 -28031 -97998 51997 -1856 165792 -186152 -228890 19309 66337 52385 -256393 181005
11353 181005 -322864 67391 -217509 118172 -28430 -79386 95621 -92931 -83375 -295831
11343 -295831 -36049 -296641 127022 143185 69136 -125347 38220 -163673 -233908 -15965
11333 -15965 -32228 6366 -156718 -35950 119534 32431 -126804 108686 72554 42329 155241
11322 155241 -30992 56851 -12886 -112956 -21167 -76435 -79418 -56913 -294423 11926 -63309
11311 -63309 82627 -325205 -20686 -247845 -113110 -160342 -70093 -130652 -438655 -326259
11301 -326259 -262691 -212223 -527582 -361742 -361239 -140971 93472 -343628 15530 -147241
11291 -147241 164384 -123516 169180 191504 15716 197660 -74283 357872 -182193 144751
11281 144751 2111 142111 49883 -49886 -241258 -73333 -214777 -339900 -145714 64853
11271 64853 -269740 -196307 -109624 112023 181184 -73276 -22098 -51490 150352 141881 176141
11260 176141 -60793 -181670 -79809 13648 58335 -116741 -36502 -128846 29900 -269323
11250 -269323 -20626 -416650 -141751 -31026 142275 -27446 -27794 56684 -262220 -61437
11240 -61437 -41947 -140684 -37325 22416 -73921 123325 139930 -241631 -53403 -77205 -15960
11229 -15960 -144080 8077 -214515 -220175 -13727 -86599 -70787 -64319 -187779 -197005 -66952
11218 -66952 -260207 -127271 -311753 -209522 -67356 -183613 43071 -164400 -158905 -138803
11208 -138803 -71769 -110833 136070 -31496 1689 99001 -61581 53182 -124407 -32621
11198 -32621 -170844 201959 247297 68856 -75830 70419 -75465 -73196 64111 -241787
11188 -241787 -53010 -146097 -33584 -253875 -149604 -145197 -80069 9392 -29436 229948 -52783
11177 -52783 -7244 -56439 -189833 -91065 75599 -64647 -71916 -150702 21640 -4188 39471
11166 39471 -152494 -171291 38270 -215297 238488 -172207 -153550 -5568 -12131 -68576 85993
11155 85993 92851 -178678 -28775 -83016 -109653 -368449 141730 -409228 -290502 -480445
11145 -480445 -115638 -215511 -349025 -240301 -420305 -83658 -148124 -46398 -65557 -32618
11135 -32618 12898 -73407 156864 35172 176547 -84861 -105579 55103 119578 -67876
11125 -67876 -24451 158441 -44773 145263 9195 41933 -19717 208194 -77870 -11256
11115 -11256 -44953 -338672 -218689 95543 298619 -134963 -246795 -252393 123547 -42559
11105 -42559 -158482 17929 61837 -34817 -66001 -149344 92964 -117917 15609 121205
11095 121205 157515 9658 22574 127332 -166564 14156 10481 39430 -66562 -84820 14484
11084 14484 66657 66043 -119490 147130 67560 313529 62461 128275 92810 514810 864021
11073 864021 1372983 1710152 1465490 1387262 773646 554199 268600 511180 93587 -27504
11063 -27504 -4490 -28033 55766 33845 57315 -78907 18726 -23660 -38491 -32297 66586 -12601
11051 -12601 -193596 -23232 139318 -220028 208409 -250899 83020 -127648 -128200 -77759
11041 -77759 78478 -28589 -71883 -223501 -106631 1789 -217115 -100849 -24317 59022
11031 59022 189847 -93792 -24745 -106034 158458 50585 57600 -23984 135278 17472 -173884
11020 -173884 48300 79583 -528 -208579 -64021 26283 128550 -123598 -175081 -229957
11010 -229957 40243 -34146 -113080 -229912 -137322 -1675 18246 -91918 -2601 -206647
11000 -206647 54271 -18482 1303 4812 161223 18749 -60255 -107498 62475 -43163 62752
10989 62752 -53918 -64158 -15056 -11534 80466 -239272 -514895 -94372 -159253 -318662 -283598
10978 -283598 -224904 -130116 -128654 -265795 178033 -200479 -159012 -170901 21766 131934 254749
10967 254749 -66992 -264872 -120579 39965 53113 -85235 -149402 -324300 -107066 -119613
10957 -119613 48859 63033 -181540 263555 113251 147606 -10386 61959 87239 -34653
10947 -34653 -229314 -5986 50869 187865 -30745 -84534 93396 313272 77732 59101
10937 59101 25209 111807 166930 64399 -199552 -58743 -9004 -79044 -309111 -113378 -267259
10926 -267259 -403390 -226300 -149410 -365609 -413019 -146356 -130567 -153099 -285508 -141833
10916 -141833 -151185 -71837 -194361 -34746 -142705 -112814 -68598 -111102 117228 12235 -49045
10905 -49045 -233943 119775 204549 361097 -74429 111007 27880 11984 -74198 -115193 -128883
10894 -128883 -144463 -144006 -197887 -53335 138926 35645 105424 -9969 291893 253849 59310
10883 59310 59041 203715 -70167 -93316 36347 55789 11983 -131989 -37772 -142316 -146449
10872 -146449 18359 22588 -76620 15965 38847 5383 182865 162920 41740 -112002 59700
10861 59700 -84560 -13533 -221880 5280 38615 -51053 -166261 -101802 -241750 -233388 92079
10850 92079 8066 115984 -10025 -168004 -45455 42521 58677 -75123 25495 106056
10840 106056 233156 22630 -71579 -130456 23161 -23971 47338 87134 -1793 4180 200513
10829 200513 -82468 36688 83383 -247801 66156 -129881 -132571 -27416 113590 24342
10819 24342 -241420 -91063 52891 47381 -125336 -79434 92897 -117028 -40703 -122953 37798
10808 37798 269634 -327 17585 281519 -94266 -103825 -355488 112236 54429 -83616
10798 -83616 167238 -9519 82051 149682 -196144 -82481 -159303 -74137 -57373 -232016 -10830
10787 -10830 -145733 -89210 -68129 -116104 -145683 23380 -27707 -137820 -4683 -248741 -33017
10776 -33017 -12994 -39866 -148050 -133257 175555 -147607 -89511 -262117 -93622 24506
10766 24506 260608 2118 -225387 6148 179320 12873 -121272 24355 273921 117033
10756 117033 28069 -52518 -210399 -55350 -77552 -161987 3418 -179590 -198630 -184067 29317
10745 29317 -104864 13080 -101290 -143016 -183674 161540 -74750 196056 -32514 -98309
10735 -98309 -102999 -82550 173306 -42856 263026 -55997 231941 29054 125384 -175352
10725 -175352 3726 29329 119200 -13441 69658 115957 -15646 13232 46859 -69740 106110
10714 106110 86747 157703 -44740 72009 -74879 -46945 9910 -68171 -82291 -216123 -145256
10703 -145256 38386 -127147 -260212 -422337 -159263 250939 10393 -96360 -63685 -99681
10693 -99681 -22281 -12017 17017 170281 63446 -59317 175930 -85135 -2919 104622
10683 104622 -8598 132415 191031 139986 71320 -253925 21866 -529 26332 274150
10673 274150 100224 65337 -16003 145617 -191105 4100 72223 -37959 65821 201597
10663 201597 55398 -38295 -126928 128138 209011 89970 -67297 -146545 91475 26397
10653 26397 20542 46078 -59409 168098 105589 212014 -8452 54433 -108448 4882 315864
10642 315864 133709 -159675 -155260 62234 257909 183345 -42291 162597 377875 328149
10632 328149 114728 -54573 388798 320027 171215 131307 172946 303351 247458 338175
10622 338175 159893 201370 315618 187996 238775 216247 224299 128277 364386 305377 126145
10611 126145 81406 226335 260766 418939 308099 209446 230648 195752 371997 392685 371547
10600 371547 358878 292342 243073 420757 299548 2407 258696 519459 677379 506710
10590 506710 339664 359538 297225 291612 446327 627534 625740 279281 418666 428821 372329
10579 372329 180455 332575 515536 355895 595446 463725 423023 354188 122590 143149
10569 143149 192767 441006 230216 205179 -46558 463729 299213 250660 275059 358212
10559 358212 422972 286244 188721 90470 391510 230164 27567 257847 142357 186848
10549 186848 116728 -33202 171565 241132 119304 200040 244261 175031 117462 6601 1644
10538 1644 66728 -176927 230210 -74839 365542 41943 50719 106018 211182 126558 115002
10527 115002 106084 -53342 242462 122853 177954 -74324 79363 -10546 106649 76436
10517 76436 -162221 40123 65335 186681 -181931 -111651 -74162 91039 -41816 -121898
10507 -121898 -163182 -160319 87677 -58330 71360 53043 132854 94896 -98434 -126192 188193
10496 188193 208464 208864 214417 238421 249919 97739 11885 161959 -125432 -147088 -236960
10485 -236960 -23767 31979 -321551 -68756 -242924 -108412 -156726 -32184 -41059 -175424
10475 -175424 -174516 -344414 33443 -39750 4407 -57032 -61855 -68904 -95464 -146213 23389 212306
10463 212306 -44905 85904 65762 68725 264648 -27636 73840 30108 172943 78482
10453 78482 106297 -12015 29616 161290 -187535 48404 17054 233910 -10860 234339
10443 234339 23652 -82375 -107651 -37003 -220646 -175348 88226 -168607 79576 -119646
10433 -119646 12158 160997 -176276 -183996 -408024 67561 -69908 -136384 -165521 -178967
10423 -178967 -141641 72048 147343 47185 -176163 -113784 -34390 77307 -44964 -17872
10413 -17872 62004 179173 240140 114056 62863 139012 238842 -168544 278059 164775 381061
10402 381061 269025 116319 376698 76836 264891 -2167 -361 -3280 -11960 -15104 58540
10391 58540 -29642 71351 -155724 -141016 -95641 -221326 -41009 -301758 -51295 -166545
10381 -166545 -244633 -318175 -416260 -174383 -1883 -80662 -52916 -141739 -225164 -115416 -49360
10370 -49360 -97675 29054 -16303 -89879 -121436 -86760 -55041 54331 -180614 -131689 -142194
10359 -142194 -292337 -185984 -282830 -114102 -217695 -253783 -77218 -22839 182177 -187687
10349 -187687 -264430 120538 272628 70846 299 -18561 188270 115351 -118612 -126638 -40692
10338 -40692 51011 -197619 -102075 -93347 23022 -77100 -220115 210 273772 25385
10328 25385 -35490 -23957 278659 118973 88486 -32390 88670 -37008 229923 -22251
10318 -22251 164684 -94130 -332298 93103 31962 72518 -377651 -220802 -85801 -53365
10308 -53365 -177192 -114120 -261493 -50383 -29049 -122433 -69961 93774 -170491 -163774 15848
10297 15848 -158997 47950 -74540 -74788 137403 48255 -77420 50017 96226 28783 -137348
10286 -137348 -34901 -47374 -253546 5354 -24733 -62157 -128168 -139526 -96069 -34821 -184149
10275 -184149 -144566 -52719 229637 103743 -101244 -132015 162062 261317 -97745 -155247
10265 -155247 118152 178933 9213 -48150 -303426 100964 -42410 -813 28927 155043
10255 155043 -25477 -43429 -178988 -21951 -28477 -82467 -156178 70785 65933 -28333 19094
10244 19094 219426 38967 -164154 51654 139986 6102 -124229 -255498 -39728 -169212
10234 -169212 -225056 -413170 -58824 33354 -222734 -334726 48246 85133 -58626 -208358
10224 -208358 -244773 252342 100260 -135684 -198618 49243 25634 -295144 -187557 -80757
10214 -80757 15719 -22765 -151602 -75827 77490 162763 -217380 -85112 175341 64516
10204 64516 -279785 -207250 -519 88787 -240272 -105475 -98594 -65143 -72312 -387549 -124945
10193 -124945 -64637 -254436 -350675 -127804 101579 -365883 -217482 -26986 146923 196051
10183 196051 -211000 -33152 -112946 89645 -102910 -273834 85345 40828 9493 -161558
10173 -161558 153321 83329 44039 -81528 58312 202810 -88676 -115929 -151815 -977
10163 -977 -107717 -235555 -131992 83924 -132395 -294684 -361598 -149235 -153522 119869 -186723
10152 -186723 -162281 -30445 -57103 -54419 -159706 108974 108231 -70247 -62645 69889 -66498
10141 -66498 192908 -64845 -4825 73204 138317 339636 144209 165175 45120 -95357
10131 -95357 -28617 16155 -155380 28966 -50025 -108926 -171577 -2499 -116020 -160894 -132935
10120 -132935 -129580 -210775 -267346 -25982 -181667 -171488 -196712 91126 -128284 -174295 -11260
10109 -11260 -65637 5365 -61508 -117932 -4132 -31304 -282508 -209533 -37273 -74226 49813
10098 49813 -133012 -231522 -220776 -131969 -55539 297472 -55755 66743 11 -52021 263087
10087 263087 60960 -72637 -30674 -34338 -245710 20414 36389 -112269 80448 7502
10077 7502 84167 109172 125147 -323684 -86283 -192448 -59864 -19058 -189044 -305734 -56266
10066 -56266 -97386 -161843 -104475 -60814 -175837 -74315 -260040 -84275 -200115 85257
10056 85257 -60925 -259792 11876 -72324 56282 139369 -96643 -103349 -27766 192186 -164595
10045 -164595 36495 -170780 78385 37253 -143799 84813 37386 116546 170317 -123600
10035 -123600 -127738 139997 4011 157556 13610 120641 -49613 9805 -127963 -41674
10025 -41674 172042 -93522 102026 -185064 97269 -93170 -120136 -250078 -74678 160365
10015 160365 -225460 160823 232405 216510 -125722 -290758 -91367 -198435 -134531 -59403
10005 -59403 -121530 -23342 -25817 -78085 -138914 -219732 -149184 -170501 14519 20321 -34734 -463645
9993 -463645 -224780 27848 -116348 -114287 47182 62897 119079 -12284 67730 3464 205557
9982 205557 -48015 -100753 -31752 150110 -257299 135781 -161861 115946 -214902 -74761
9972 -74761 38929 -199521 -83887 39089 108113 -223249 -33829 -64476 147563 53820
9962 53820 116407 -21422 111044 33948 198705 -38937 -131483 46129 38439 -209692 -310701
9951 -310701 128766 -228270 102509 -31769 -216522 -215634 -33331 -10369 -83378 -63352 -9850
9940 -9850 132658 188696 136818 101946 199911 200403 72455 217662 82066 11769 36824 -210897
9928 -210897 -229133 -76425 -174657 -255506 -85067 -340306 -133890 -69907 -234106 -118369
9918 -118369 -52228 -199545 -154059 -183305 -127874 -141410 -73017 -297180 -237096 -349881 -206135
9907 -206135 16451 -183811 -150647 -79396 52368 -158390 157856 58432 49024 171184 126463
9896 126463 116200 47560 69415 -54571 -106460 13484 194269 88784 -59328 -245801
9886 -245801 -105186 105678 -64338 -75744 -28299 62926 -164888 15578 -89734 -192654
9876 -192654 10944 -192428 8553 -225904 -82793 -174874 -178519 -31534 59011 -105030
9866 -105030 170019 128439 86384 123898 63207 350641 -82822 -4484 -14264 137000 -6997
9855 -6997 79817 -159672 -20274 -243918 -252299 -107443 -112332 7875 -442592 -208961 -215428
9844 -215428 -106625 -212753 9522 -295811 -284748 -7799 -254328 -339894 -125387 -108354
9834 -108354 20277 -16994 -91493 60879 -87901 -87145 -14362 33634 352016 -26121 161559
9823 161559 152934 85357 32440 53664 -56123 -144058 30881 -235312 83274 -276592 63732
9812 63732 -130112 -143961 -148646 -14682 -241005 -72659 -56524 1429 173373 -148327 -166562
9801 -166562 53583 401755 104106 42097 -159945 -55693 258778 101933 105861 65764
9791 65764 310156 -13051 43906 -77252 100596 -137723 -28503 -23490 -114317 -65672 14209
9780 14209 -88331 -276872 -60756 -231886 9180 156147 20097 -141243 75934 -35772
9770 -35772 -66808 -61484 42941 8785 174315 132239 -83378 172630 -15651 241899 207030
9759 207030 -48213 89979 121708 333696 92807 320833 -7204 398652 209149 624246
9749 624246 554471 745072 589329 454210 31579 -503 173223 -24411 -175874 -52437
9739 -52437 -214315 -20396 -23526 -74786 -83143 -128701 -352128 -149311 -204692 63165 -47227
9728 -47227 -70795 114850 257636 194 -80714 2552 274786 278935 26810 -12248 223336
9717 223336 334293 123871 112186 -132906 -2875 102538 -110122 132303 145476 -36091
9707 -36091 -310005 -13883 40451 22957 78224 52691 112547 -97819 15424 100549 417857
9696 417857 280043 262649 -75405 24438 30243 138066 155134 123258 -211 48667 -47416
9685 -47416 -128544 -34443 -136190 -182294 -122227 -53190 -143226 -75441 -127315 -244212 -410524
9674 -410524 -189476 -65170 -95731 -97115 7193 161871 -40916 -87974 -196279 -90128
9664 -90128 -23014 17855 -125651 -15731 -69609 -118637 -138311 -32375 -17904 -132196 -21933
9653 -21933 -97608 6729 -105333 -180135 -149648 58274 -172530 -179843 -7615 35890 94035
9642 94035 -340095 -303998 -41804 26388 111795 -87345 -6439 69026 295752 -68226 -99251
9631 -99251 -61670 64255 -59169 -227845 -40652 -185890 -91023 -138375 56139 -49016
9621 -49016 -3590 79710 22595 16177 -35984 -196963 -207616 -130637 132355 -22268 -90880
9610 -90880 7538 30898 76676 196234 139364 -55948 171400 -98794 28313 1254 -301963
9599 -301963 -50439 -122640 10308 -38367 329663 -41596 23171 89767 34096 33704 81172
9588 81172 192152 -115036 205481 -179621 -65822 -3558 15608 62801 55616 218523 78324
9577 78324 351583 -368 117701 193933 -88027 -62936 -29492 38605 23767 65885 -86855
9566 -86855 -70053 -100305 8198 13794 -54437 72994 -25419 5545 -51608 -32319 -6900 -15300
9554 -15300 25876 155687 38390 197530 95640 171313 116567 241048 -16625 254989
9544 254989 150882 64018 23420 -65850 -7238 9475 39599 -34847 167950 -77449 -140225
9533 -140225 -110326 -200329 -118011 -83401 77347 -135650 69799 -171718 -44353 -220209
9523 -220209 -130597 -199916 25900 -75742 -253356 -169765 -221503 64074 -256829 -303566 -213173
9512 -213173 -23414 270121 159642 -63084 -94699 -43475 2160 167722 -8795 -31068
9502 -31068 46439 266807 418380 768994 502734 416313 453513 151024 116977 155724 177796
9491 177796 327826 102482 69592 12905 -96821 56042 -90727 85213 -51688 34299
9481 34299 -194879 70533 -12309 -31368 24864 -99560 -58853 88644 -3089 54405 95450
9470 95450 302502 92044 199195 113878 330086 92751 52372 67959 86031 246152 195591
9459 195591 -883 -17564 221899 98721 208314 149654 338486 305059 94734 288043
9449 288043 -110794 61196 2672 -49604 9765 63221 35164 -123462 -100272 151767 36881
9438 36881 -252487 -11973 47360 27517 -14662 161444 -2388 211986 1780 129801
9428 129801 -44498 104621 326643 57880 174574 261514 132260 -51991 200857 180904
9418 180904 232452 365505 190940 230281 211841 181292 236631 208731 60920 220987 211336
9407 211336 74000 35797 13436 -246556 227617 46396 207927 42344 -39767 -46611 89444
9396 89444 165020 263564 31422 165700 272490 263079 50256 117048 398286 485156 477683
9385 477683 444217 510777 346760 673660 518843 538576 1132655 1548028 2153783 3344870
9375 3344870 4208677 4180903 3325176 2414293 1851273 1588808 979577 565472 469245 457880
9365 457880 382914 -35323 49715 352905 287147 222542 50210 230774 418264 182645
9355 182645 -8650 56300 260001 296098 38168 21240 290159 298261 14870 49214 237428
9344 237428 10217 -232608 192381 72067 127831 -18760 -73447 54053 126018 135807 155893
9333 155893 -4149 250073 -65253 75034 28511 147519 61503 16635 234446 196274
9323 196274 119176 42822 229959 -32319 142948 81974 119494 222225 138426 141891 29540
9312 29540 45993 235708 94047 21056 -200613 17809 -114349 -80787 131410 184908 -73591
9301 -73591 287665 -43082 76085 52173 336013 143762 57211 216599 131533 27243
9291 27243 252775 116027 189613 257294 395714 232318 82531 226617 246466 76512
9281 76512 89875 201933 387575 92005 88130 46638 123964 106301 262071 -28453 110813
9270 110813 221468 -50822 -81225 -211508 93951 97885 100355 -36582 -12146 24456 222079
9259 222079 -33224 208951 385713 122938 192725 228284 98524 273664 65731 234277
9249 234277 18278 221689 42721 170026 -226651 -40572 -191635 51997 79023 -170858
9239 -170858 141619 110364 43220 4879 -208311 -59200 42293 81803 91788 355812 73268
9228 73268 172885 237358 -33950 167293 38351 35426 37029 164916 190922 197976 99025 91507
9216 91507 -23336 222220 390813 169392 11566 -71540 433571 365329 86015 200152
9206 200152 265516 168709 373082 197555 113423 245774 253713 73289 267700 296111 205251
9195 205251 172830 103698 184519 167368 -24990 284354 212037 228232 311151 297552 294048
9184 294048 278892 318700 354685 91693 -26404 -116649 121718 213234 221079 130437 257662
9173 257662 345996 221841 111676 267326 355384 93214 259597 186189 473047 193302
9163 193302 383515 257251 423813 393881 195516 194707 351914 299752 350999 383470 393587
9152 393587 448429 209680 308181 387294 577689 244212 386447 535885 450332 354220 361329
9141 361329 645812 687596 431775 293299 466802 372030 544044 452054 699275 904989
9131 904989 782250 591606 565692 923645 910949 658895 756386 867927 870914 800554 636083
9120 636083 790274 846415 863046 927382 909280 1156871 1180713 968587 1042897 1238034 1461669
9109 1461669 1359956 1592394 1504261 1711238 1769483 1846684 1967407 2062163 2513107 2632607
9099 2632607 3047027 3493334 3366801 3634010 4217276 4944777 5554979 6201969 7460605
9090 7460605 9311087 13242797 27307286 51393850 71459476 58770667 41928635 28019416
9082 28019416 19002919 13236841 9461612 6991443 5366498 4135392 3399473 2992880
9074 2992880 2914056 2360002 2060719 2108323 1916834 1828868 1597022 1788326 1643566 1661631
9064 1661631 1500919 1353091 1485282 1431915 1378876 1311128 1203556 1465077 1356579 1156691
9054 1156691 1470586 1330193 952274 708615 1061444 1003479 937290 1056544 1038407 1148019
9044 1148019 823537 861376 999404 851176 894183 754767 617595 904998 765070 531568
9034 531568 481834 932844 606350 767940 610439 579925 605854 562582 406263 742910
9024 742910 543822 503712 360754 358810 520261 706011 227662 405294 281412 485644
9014 485644 296228 315962 262779 221433 259962 395655 275134 110198 -59390 92567
9004 92567 106087 246045 -33325 1406 355068 147252 274304 342385 350472 216297 114945
8993 114945 231976 290668 85740 -157008 200330 66751 183311 15817 -16219 234867
8983 234867 218384 192223 231457 274421 621693 241035 283605 283625 324665 167530 154475 217270
8971 217270 81606 -90193 151426 138140 275737 289989 123714 238544 276568 89739
8961 89739 151766 270049 210192 -39205 -285652 58770 33543 147763 -261866 -295841 113863
8950 113863 246611 12550 460268 443372 299613 42777 66049 137564 157169 97537 -97858
8939 -97858 162892 58828 -41043 -66208 8042 255181 215189 158919 178785 439617 227510
8928 227510 320837 437869 224723 -42921 13657 138003 280473 89536 -136403 194798
8918 194798 190824 456778 -4240 -165903 85313 -33292 -159137 -107308 207332 259325
8908 259325 -20010 -66325 166032 160871 -162448 -238028 -126927 261370 -22225 -170113
8898 -170113 -84153 -52334 209066 -115460 -70876 212056 -57876 60865 -104214 35009
8888 35009 -244838 -106971 -70967 154121 -26381 -27320 -97109 -196407 41306 -108363 3983
8877 3983 30450 203941 199738 79454 131005 93212 134864 -3525 17595 46376 145287 18738
8865 18738 1833 -65055 -56355 132164 12040 166042 86487 -121334 47163 -337044 26413
8854 26413 -49764 -141609 -48468 495 81892 1304 -76020 -277707 -111874 -55512 -66604
8843 -66604 -293243 -311388 -202120 -250762 -200899 -326031 -41842 -57962 -196852 -23160 -117628
8832 -117628 -69850 -38534 -250423 -146486 64594 -7531 -12110 -170059 -32260 184378 103921
8821 103921 -202091 -26287 30656 150521 258396 196240 75450 18040 179784 248015
8811 248015 163250 185481 108824 -7046 -40727 -19614 49196 137115 -138905 -193163 46284
8800 46284 208194 -94550 -149796 -57411 69320 -101964 -204450 -189654 -106453 82944 -243708
8789 -243708 -68249 -10101 -72820 -367750 -55596 19694 -81943 -366810 63822 -98269
8779 -98269 -36596 5506 -133513 2457 -47256 -201514 46295 -1438 396715 -100223 -39379
8768 -39379 -88925 190157 245741 19836 83993 79832 323672 -141733 -226820 72499 -53700
8757 -53700 -39772 -463133 -67766 -55589 7411 -101428 -105856 -555 7299 -72347 -89873
8746 -89873 212871 233251 -91501 -87055 -56216 -5583 -32147 -120005 -72148 71644 91763
8735 91763 -194169 64755 -27327 -257468 -334740 -274785 -95762 -89109 -68740 -77199 51967
8724 51967 -86486 -161914 -161599 -24025 124832 427 -193391 -49588 -54908 -295364 -84740
8713 -84740 -193996 -149344 -292253 -178476 -177905 -6513 -113565 -66750 43066 63139 60124
8702 60124 -151459 110082 141970 50583 133605 300162 438433 133936 124176 266459 269689
8691 269689 170515 -59449 -106903 91022 288136 -82324 -140047 -37947 234995 47885
8681 47885 69280 136286 50041 117218 -23931 18520 -23631 -110334 -39247 179960 337230
8670 337230 511667 262157 332507 176781 34452 -140926 172052 79073 -29115 5444
8660 5444 -62143 -164834 -45398 -71032 12086 644 23845 49489 -202075 -159847 -140866
8649 -140866 -69217 114561 51810 179615 -412133 -82495 -194547 43614 -107209 -157668
8639 -157668 -192363 -125403 -112672 -130217 -113786 -101519 -30905 -171174 -40909 -221706 -93153
8628 -93153 -139401 -10024 -44226 -119442 121206 -74913 -172968 -218606 -55854 -13267 -31617
8617 -31617 140661 -72950 7684 36607 53418 32108 -13654 -136271 -1275 28995 -76046
8606 -76046 -111889 83280 -70489 80019 38039 185211 -132000 42661 55216 31301 51626
8595 51626 -160698 -43225 119053 21784 -14117 -114117 121532 87652 32277 -145158 70303
8584 70303 95741 93823 -157890 -58126 -12102 107293 -38869 -113529 111557 172997 104765
8573 104765 -121085 -15428 -7870 86453 524 -124866 148257 99365 -26667 -94154 -134901
8562 -134901 -304776 -320929 -207943 -84149 -49771 -84925 44922 -229502 -44015 -213104
8552 -213104 -297261 112783 96287 -59510 -186101 -97399 160585 -163242 -87085 -17307 234179
8541 234179 -43720 96842 188472 125045 164329 -69196 235611 -60721 34319 312600
8531 312600 -77760 202587 240373 85830 -100700 34199 -161256 -147093 -220677 -197168
8521 -197168 -205857 -299679 39109 58990 -97674 -251260 -30737 -72296 101078 -85964 -147586
8510 -147586 21695 346314 318285 -74906 -59643 248786 241572 283802 130542 150456 95591
8499 95591 77965 120034 155000 -8659 186978 -8420 80458 16707 70341 -94027 -78072
8488 -78072 68820 -167293 -63795 29668 22751 102274 -336677 -116493 15584 33393 -194163
8477 -194163 -18541 -193890 52010 -31693 -140927 -3372 58069 85186 -146458 69557
8467 69557 38842 21721 85372 -16478 373852 92784 4152 -151615 154404 -5898 -67858
8456 -67858 -38694 -120273 70460 -109985 49639 -42891 -980 -107300 -13792 233291 10395
8445 10395 -14901 -141877 65173 41869 -84514 54454 -15629 63319 -87800 116673 -78175
8434 -78175 186790 -133553 -30111 -66608 -68891 -48601 -207016 -87303 34127 -194051 -137416
8423 -137416 -151983 186072 -3438 -24268 -79304 -166431 -153225 51838 24313 50561 98679
8412 98679 79338 75843 -9999 400 178296 184052 189446 223738 207795 321074 98438 30064
8400 30064 -139315 11300 -59330 -18095 96748 -87927 -59437 -233714 114839 77909 55089
8389 55089 -118401 15226 218934 -32134 55355 -226993 -119639 -236327 120051 21844
8379 21844 23027 -101736 -22579 -8982 3936 113909 -102636 -120177 194314 88388 4389
8368 4389 -201837 -37761 -258602 100195 -95060 -249872 -5100 18706 10331 -223738 -70090
8357 -70090 30041 16387 93138 259463 54106 70367 -189394 -84700 -15934 -107941 -49089
8346 -49089 21022 103379 249558 -151891 23314 84398 56509 43449 88150 147794 173797
8335 173797 65026 82924 39017 -171720 -6919 -168623 -66210 9416 -45080 -26749 -108535
8324 -108535 40806 -9595 -124991 -42453 61641 26438 -88304 -102095 607 -200197
8314 -200197 19552 76513 201726 157621 -100840 -14652 34227 7724 59148 -46988 121593
8303 121593 94413 6261 89417 146306 251443 -24606 -1871 115361 29126 129039 -35594
8292 -35594 38956 101556 -75442 49671 -60986 53416 39056 -67817 -227441 241469
8282 241469 62172 -57644 -148094 92365 -6289 113770 80421 253553 200757 41840
8272 41840 198347 145084 231179 -121950 1815 -101351 -38545 58359 8502 35293 245354
8261 245354 259840 -160609 151115 158797 177460 81250 161958 79816 -79007 -41432 -172289
8250 -172289 291269 17346 63959 -223468 -216273 -16061 59312 -150633 22033 45546 6485
8239 6485 30661 -13392 62914 346363 47563 -94404 127544 255091 156266 79754 -1322
8228 -1322 229611 28028 60679 4504 119843 48476 119133 -13051 207837 20508 68563
8217 68563 -162644 126265 12520 49838 -92632 51792 103243 -92658 -26244 -102386 108140
8206 108140 41131 10289 114559 -50181 -131071 -89702 7223 113770 298214 -90672 13891
8195 13891 345180 245126 545485 -3318536 -276246 -468206 150443 1743 46781 87807
8185 87807 -126441 -137747 145018 73106 -191707 104418 -143408 137519 179208 -18172
8175 -18172 211920 89984 194097 -264317 -33888 331743 302572 124247 143674 -73862
8165 -73862 174447 91472 43016 193919 -91179 -210260 251387 59697 232536 -86060
8155 -86060 -207337 -222535 5477 -197829 -102947 -139460 -304323 120526 -261517 -127124
8145 -127124 -206805 -74021 -46493 43523 -152810 -144528 -151000 -133836 57667 -18875 -142630
8134 -142630 60457 187551 124588 140707 166824 99085 -137380 -115613 134875 149948 211265
8123 211265 -66679 209322 79250 117802 60635 -8475 188311 -44350 -47417 -134056 -141769
8112 -141769 31097 73418 102160 -30512 69910 -217 -63356 -101292 -2909 106037 38536
8101 38536 216979 103410 195362 269549 -187642 -75882 -57797 27733 -144945 23935 -81981
8090 -81981 199227 -19456 -36768 -110922 51351 224986 245026 75619 -133391 -132470 -80317
8079 -80317 33253 -210827 -186207 -215525 -79088 -183897 -101637 -122301 -13667 -203647 -93693
8068 -93693 -123254 116252 -106092 35290 -20568 132803 -26603 79129 37291 207168
8058 207168 64652 111753 262656 285456 188615 96063 138268 104879 25794 129324 -51103
8047 -51103 309974 169364 -25804 -36155 201703 280804 -31514 90333 248809 170346
8037 170346 -177375 -15596 189743 182449 100670 -29228 174525 144602 -131743 -100934 97916
8026 97916 121390 162345 -179201 -150403 74953 47016 -170641 -44770 169191 15470 -207024
8015 -207024 -54543 231535 81908 -25201 -161140 214519 69043 -116014 -170668 -74235
8005 -74235 81026 59433 -109658 -20490 26460 73462 -135642 -11636 -86136 117671 -25493
7994 -25493 169852 -12049 -211487 -161357 12238 182822 103111 4663 -105768 -136717 123499
7983 123499 127264 -175032 -42226 300434 309513 -20324 193923 -44885 145063 -201188
7973 -201188 187042 212700 342992 44850 22562 100691 364789 327524 -42761 184268
7963 184268 290784 230693 248338 63378 -33926 276094 389700 172750 168036 -45253 87836
7952 87836 89556 249720 72855 156330 224303 80129 336966 106825 74987 237681 -8026
7941 -8026 -52640 -141610 77020 181481 -1870 101624 179254 -16055 -38662 -40329 21609
7930 21609 100915 -85652 116600 -47864 18539 -103718 -33990 -100236 164052 127395 -4643
7919 -4643 -118248 64961 -87707 188987 164920 170339 254501 303253 289021 242615 10025
7908 10025 188812 231119 360703 140739 84532 231022 398449 161198 73995 -28213
7898 -28213 165560 129464 147369 31607 60701 118558 254659 58810 36494 275957 164126
7887 164126 138631 8947 114217 59694 969 -170220 -133898 95688 -106183 72000
7877 72000 120399 144914 64000 107169 -30281 -72955 194563 128961 174770 93013 173446
7866 173446 -50086 84790 167927 189651 112073 -12884 35386 212966 77615 39904 132022
7855 132022 62203 219117 10058 92885 177787 305494 1778203 -94823 -187908 103120
7845 103120 -54002 67285 231734 37417 50094 95812 372364 430848 306823 72132
7835 72132 204045 298694 284293 285738 254364 67887 126560 274167 23559 334989 138489
7824 138489 36305 15951 172371 154561 97135 -129821 -1091 205427 207778 -35714 82677
7813 82677 264469 333300 136750 -139050 130576 130075 242760 297647 199312 414917 281207
7802 281207 449212 374164 352001 516252 461705 855717 802409 579173 629683 513709 493495
7791 493495 361265 143387 331065 377859 214001 262090 418963 292781 299061 277984 322575
7780 322575 314234 239452 315611 639728 435863 548675 554325 412463 366681 480967 522326
7769 522326 660618 370227 649515 500526 726558 761789 430287 386450 838521 702546
7759 702546 973660 930081 945861 893366 1003582 966644 735149 743311 755949 799777 778231
7748 778231 857805 786636 682341 740081 690541 888491 793242 1046743 1095385 1279113 1240710
7737 1240710 1058916 1087018 825472 823254 899409 917354 1101611 1172991 1283119 1522827 1506449
7726 1506449 1672952 1566401 1504403 1307733 1362411 1112169 1108654 1209608 1197295 1223604 1337013
7715 1337013 1097314 1099884 1108259 1115993 997074 1223229 1201799 1230222 1199852 1183876 1121838
7704 1121838 1269739 1231447 1330187 1041634 1261927 1113802 1244632 1135004 1146083 1033074
7694 1033074 1075465 981337 1154374 1093452 864439 939812 836390 917767 1106025 904326
7684 904326 1028406 942607 1055453 990816 986742 991934 712171 877961 995239 1211819 1013300
7673 1013300 1286072 1143970 1379534 1301660 1407572 1308925 1287943 1043615 940853 888449
7663 888449 942563 794891 1043326 659262 853622 786385 821793 566310 906891 1117064
7653 1117064 1116943 845458 812110 981163 1123553 1131115 1041247 1122123 1165837 1386416 1293043
7642 1293043 1204735 1524951 1215443 1482337 1374246 1460026 1747881 1768255 1718627 1696249
7632 1696249 1881423 1827727 1966760 1696644 1688750 1600059 1693305 1540557 1539059 1697566 1606878
7621 1606878 1797328 1838878 1825366 1946462 2401215 2581087 2743502 2933999 3148888 3746805
7611 3746805 4567821 5634405 6856953 7887335 8115570 7814588 6842869 5728823 5031385
7602 5031385 4271050 3391612 3141162 2783170 1869006 2217028 2376973 2117113 1975954 1770965
7592 1770965 1913676 1642413 1556655 1723215 1369595 1082305 1112119 1146118 1182335 991879
7582 991879 1202359 1077170 1265580 1172621 1613014 1398875 1480893 1362931 1475012 1491440
7572 1491440 1388118 1430296 1332765 1296745 1408138 993975 1201424 1104475 1120380 1188463 1219478
7561 1219478 1380766 1296201 1570683 1376539 1399988 1400452 1388430 1276744 1150758 1253853 1297361
7550 1297361 987914 1039306 1364228 1287420 1122618 1402116 1532319 1646735 1436268 1531272
7540 1531272 1143421 1358041 1123020 1329478 1203209 1132624 950704 992753 1140346 1327148
7530 1327148 1437947 1314528 1262963 1372162 1219228 1358867 1582202 1536406 1390021 1376226
7520 1376226 1395811 1307255 1061374 1229296 1094184 1067812 1233715 1181047 1355839 1438819
7510 1438819 1533990 1542715 1735000 1561036 1202220 1348067 1354660 1397047 1276017 1166374 1314751
7499 1314751 1565165 1736280 1801690 1592235 1449256 1529394 1241764 1395053 1331048 1408867
7489 1408867 1191612 1359256 1434325 1465436 1187062 1376959 1444287 1650726 1471978 1298638
7479 1298638 1032165 1048665 852041 780536 782842 706807 835174 732052 797317 628577 569680
7468 569680 543269 749280 748214 855438 932337 820583 741849 659510 533761 767514 818206
7457 818206 766585 789830 785969 723598 638876 553617 835632 693024 759548 575020 1010996
7446 1010996 1003223 871176 828980 771582 858596 995057 753824 820976 871045 850888 881049
7435 881049 1055547 874484 1030075 893194 1360226 1112569 1179714 1014115 1372817 1271283
7425 1271283 1526690 1407692 1347782 1435437 1439679 1572589 1698133 1743570 2017030 2109081 2020952
7414 2020952 2092617 1888892 2057936 1961663 2090655 2333232 2519830 2754380 2628042 2997545
7404 2997545 3546937 3523456 4013351 4843449 5718735 6485420 7878088 9305659 10317679
7395 10317679 11010543 11430182 12106572 12471499 12599156 11934634 10293950 8646667 7273226
7386 7273226 6174534 5292983 4733906 4087121 4051506 3657250 3356381 3026015 2675672 2710344
7376 2710344 2607286 2364289 2391837 2419170 2652236 2528257 2628096 2719282 3061460 2665762
7366 2665762 3435404 3748028 3881149 3788696 3640959 3186515 3157997 3334357 3681090 4140387
7356 4140387 4396148 4188846 3784095 3149790 3070255 2758935 2547404 2537143 2529971 2573412
7346 2573412 2839571 3137985 3353188 3554208 3051704 3156156 2819060 2890844 3057511 3051974
7336 3051974 2751545 2851520 2843676 3366821 4188378 4818775 5443154 4993054 4540482 4035259
7326 4035259 3457032 2946720 2658236 2690622 2339375 2529925 2647601 3006285 3379092 3386707
7316 3386707 3298906 3140737 2913904 2586927 2429299 2391504 2263815 2378064 2424116 2769551
7306 2769551 3161663 3746292 3853434 3990524 3580787 2922607 2732578 2607784 2556430 2343569
7296 2343569 2358786 2014317 2194734 2175026 2232747 2424572 2285708 2293739 2020796 2259265
7286 2259265 2210729 2348378 2285898 2454651 2556742 2464885 2206972 2164605 2432812 2648076
7276 2648076 2532356 2110670 2156065 2313453 2768932 2949789 3165524 3139924 3010948 2489325
7266 2489325 2629812 2483658 2499263 2373549 2715424 2606090 2828545 2949393 3455986 3662790
7256 3662790 4354490 4656437 4497073 4673593 4855480 5077650 5256523 5446416 6047816 6542713
7246 6542713 6298845 6044386 5371058 4662944 4253204 3862873 4126603 4023424 4078192 4095933
7236 4095933 4057963 4148586 4353293 4542470 4152834 3647586 3211250 2972372 2722822 2501824
7226 2501824 2381033 2197819 1947535 2079234 2232450 2265983 2099318 2162501 2265016 2163750
7216 2163750 2150430 2202972 2318521 2227745 2485429 2481981 1957413 2236462 2353404 2088796
7206 2088796 2230391 2262438 2308740 2286684 2535071 2336164 2176322 2555158 2305451 2492221
7196 2492221 2360677 2525706 2530009 2578215 2554142 2849897 3266043 3287181 3944775 3678393
7186 3678393 4035157 3892698 3610031 3186975 3336389 3341459 2942913 3145356 2669345 2795413
7176 2795413 2651020 2736910 2950022 3048125 2926056 3065795 3575648 3264841 3102863 2976206
7166 2976206 3181255 2974227 3039445 2916805 2877467 3069297 3085367 3201196 3243694 3160160
7156 3160160 3651836 3501223 3358939 3404970 3314398 3521653 3628632 3766988 3781216 4282644
7146 4282644 4395245 4681278 4705677 4572629 4705438 4737006 5083885 4930073 4852261 4860074
7136 4860074 4794605 4841217 4641787 4656801 4934042 5073918 4912557 5433814 5530353 5770694
7126 5770694 5543156 5745482 5909245 6015547 5950169 5957598 6174472 6159853 5987147 5854709
7116 5854709 5947770 5942910 5775092 5657958 5766016 5839968 5862811 5977691 5757337 5957123
7106 5957123 5880919 5856725 6032175 6163053 6295116 6509652 6664599 6576673 6526586 6587716
7096 6587716 6448619 6749224 6624305 6470515 6444969 6637544 6842117 6661502 6587711 6986154
7086 6986154 7233523 7134089 7319163 7116698 7534443 7427934 7896229 7857968 8031404 8194814
7076 8194814 8187810 8543830 8841121 8949974 9127680 9324906 9450074 9212865 9135526 9118997
7066 9118997 9174222 9158881 9352157 9185704 9223187 9261676 9685938 9980952 10041605 10169931
7056 10169931 10048967 10179744 10265348 10361944 10554916 10507503 10760919 11055171 11081282 11422826
7046 11422826 11849147 12473780 12462841 12792260 12946399 13447578 13856599 14559845 15029068 15228726
7036 15228726 15488452 15649767 15452139 15967882 16197596 16967216 17555687 18438433 19122603
7027 19122603 20074224 21543339 23837386 27137965 32685519 41035949 50949702 57223645
7019 57223645 55576648 49255383 42268660 36726964 33207745 30709813 29515311 28606691
7011 28606691 28338641 28641702 29315129 30402671 32133902 34667446 39169373 47361730 61100750
7002 61100750 75647872 80254630 73294433 62451282 52811110 46108597 41302800 38787815
6994 38787815 37449098 36617688 36563116 37360480 38643112 39738016 41501801 43404452 46065902
6985 46065902 48898478 52487007 56587365 62005449 69123048 77902652 90808873 112361197
6977 112361197 148905805 202296343 259033408 291413725 285980787 252308352 212002093
6970 212002093 177956822 154113178 139076257 130911238 128679765 131930627 142232262
6963 142232262 161524598 197647192 253900863 321761888 379965789 421145498 455928983
6956 455928983 477028201 454870410 390163252 314780889 249351674 200287096 166009274
6949 166009274 142533282 126403939 116546684 111563780 109564104 109928438 113071241 119287215
6941 119287215 130129177 148322598 182174624 239411613 305034480 339787571 320771622
6934 320771622 269213623 214519916 169294057 135816282 111615814 94656881 83079266
6927 83079266 75799111 70384921 65497811 60979612 56679289 53411902 50853902 50280779
6919 50280779 51139786 52378002 54322099 56432681 60323646 65168335 67570367 64545209
6911 64545209 57861931 50753434 44702230 39959166 37152286 35091818 33123598 31911216
6903 31911216 30766822 29995225 29419708 29306507 29424752 30028177 30645869 32118292 34539130
6894 34539130 38428073 45980361 59373635 74648543 82010834 76206390 64336421 52220422
6886 52220422 43077129 36172939 31206453 27577779 25147782 23456835 21692175 20732363
6878 20732363 20123379 19326879 18447205 17947283 17578939 17303374 16794056 16472152 16036030
6869 16036030 15962695 15514790 15286346 14955442 15086651 15270437 15227398 15317112 14610345 14243404
6859 14243404 13735888 13587434 13544034 12851061 12492858 12324435 11918780 11957925 11690860 11555188
6849 11555188 12089129 12571728 14048952 16158054 17821175 19029070 18584384 17297629 15673673
6840 15673673 13566891 11557169 10639839 9772085 9351098 8814814 8396383 8244909 8147934
6831 8147934 7767031 7784315 7898806 7588397 7666202 7455853 7427937 7449414 7264932 6956504
6821 6956504 6995480 6991113 7028265 6889138 6851143 6943248 7328043 7195455 7505143 7393085 7158317
6810 7158317 7272236 7382975 7756943 7625324 7778592 7770607 8027460 8284768 8311686 8250970
6800 8250970 8265964 8631791 8822990 9105530 9422782 9975582 10357998 11037359 11392787 12189016
6790 12189016 13423384 15704279 19079604 24736530 31759919 37073378 36796641 33278912
6782 33278912 28573233 24548623 21645296 19935401 18944643 18395228 18122757 18532329 19454942
6773 19454942 21056010 23319900 26687502 32247259 39715252 48565812 55656701 61200935
6765 61200935 66376008 71114470 75455056 74924171 68536400 58757909 48911974 41389286
6757 41389286 35941036 32134809 29791544 28306774 28401148 29487706 31607447 35455194
6749 35455194 41615581 48889538 55808828 64742041 78626400 92337276 95296578 87479988
6741 87479988 77331572 69018076 61178838 52349310 43530672 36648371 31272950 28161104
6733 28161104 25779712 24651374 24725572 25851427 28372660 31817292 35977956 39165091
6725 39165091 41993940 43801021 46791586 51050332 53912771 51907279 44802185 36550320
6717 36550320 29750572 24624929 20992083 18184302 16308052 14569282 13611458 12986178
6709 12986178 12332012 11994607 12154933 12587423 13736900 15945378 18480731 20492003 19600256
6700 19600256 17327366 15083038 12932770 11233484 10001870 9111952 8479372 7934972 7422879
6691 7422879 7111939 6754820 6568492 6367040 6250725 6111388 5987467 5762905 5707730 5784547
6681 5784547 5711647 5597080 5673553 5703077 5478038 5418992 5808387 5779901 6308569 6769020
6671 6769020 6802548 6609395 6475372 6117738 5885512 5456791 5571459 5555293 5480049 5632598
6661 5632598 5726890 5783415 6262662 6442065 7258026 7738329 8038871 7414789 6945185 6755460
6651 6755460 6570632 6271616 6223079 6349293 6553136 6103172 6299969 6267004 6605630 6915573
6641 6915573 7634827 8134218 8820468 10575030 14754503 21540023 27625156 28814941 25028053
6632 25028053 20691458 16801517 13741280 11636640 10315086 9125247 8658420 8201915
6624 8201915 8009134 8080970 8001675 8259342 8546857 8554070 8930657 9341028 9927322 10497386
6614 10497386 11541359 12727555 14481948 16696313 20656179 29920314 47748796 68870148
6606 68870148 78295758 70060731 53994820 39984374 30246753 23632473 19725571 16533096
6598 16533096 14804899 13294577 12363023 11690614 11327024 10872593 10678441 10834863 11012657
6589 11012657 11279512 11738274 12274676 13288331 14900807 16515905 18775686 21831488 29267735
6580 29267735 45173237 67173182 82215144 78935174 63245328 47230444 35383119
6573 35383119 27577898 21919676 17871724 14971715 13293577 12067081 11593174 11214393
6565 11214393 11284259 11615814 11843748 12039224 12603460 12865577 13066214 13072191 13320739 13462589
6555 13462589 13764169 14341836 15935178 20075640 26694558 31898667 31687098 26716795 21191272
6546 21191272 16337170 13389018 11823638 10670246 10164104 9589571 9225185 9199844 8506675
6537 8506675 8427537 8045340 7936858 7348023 6816497 6619359 6362516 5721637 5396070 5253766
6527 5253766 5083585 5054444 4679988 4384475 4537977 4533495 4548362 4781985 5068673 5432797
6517 5432797 5182636 4988702 4800338 4482993 4106538 4109198 4364247 4364273 4123702 4059168 3926695
6506 3926695 3828809 3619790 3213134 3131704 3108788 2972836 3166963 3057768 2919082 3147922
6496 3147922 3170537 3171068 3383024 3515674 3258621 3287295 3300886 3388433 3019947 2876113 3033809
6485 3033809 3066987 3048299 3231302 3130608 3211235 3113164 3187420 2867745 3026008 3137454
6475 3137454 3174619 3295443 3217762 3460826 3310268 3257327 3178164 3083779 3002076 3447305 3591242
6464 3591242 3840256 3548315 3357796 3472832 3378217 3312963 3164901 3141798 3223680 3325581
6454 3325581 3192276 3355309 3283179 2890373 2688762 2866642 3084002 3047659 3076554 3243494
6444 3243494 3415688 3544794 3101452 3167280 2880556 3074768 2849611 2962055 2865866 2842973
6434 2842973 2757823 3169410 2776726 2760878 2715752 2595514 2388182 2650556 2356395 2514522
6424 2514522 2337132 2585553 2497568 2650060 2471128 2777782 2959803 2864392 2931712 2707100
6414 2707100 2561593 2457604 2450761 2823377 2513303 2533728 2425571 2584651 2637197 2678511
6404 2678511 2320517 2427283 2344310 2483268 2443283 2586521 2736995 2906553 3019921 3018704
6394 3018704 2677653 2707082 2623886 2898191 2829499 2840546 2751044 2980344 2779261 2960854
6384 2960854 3125573 3365141 3609816 4227486 4861137 5653568 5987377 5573874 5241121 4772807
6374 4772807 4430948 4093434 3885907 3785482 3633794 3763243 4011008 4065873 4395617 4860379
6364 4860379 5697490 5721669 5493087 4836522 4327752 4007853 3645829 3412063 3200205 3115260
6354 3115260 3163972 3348758 3132399 3185054 2845795 3062840 2937252 3104902 3170912 3154075
6344 3154075 3330955 3665640 3791626 4067812 4444486 4977453 5290678 5806530 7226491
6335 7226491 8786314 10265872 10945251 10303579 8992152 7725480 6898440 5940675 5770687
6326 5770687 5352615 5129974 5282699 5617254 5883388 6772383 8150778 9452260 10048213
6317 10048213 9338951 8258143 7099402 6394133 6030036 5864893 5177283 4609457 4428801
6308 4428801 4207348 4295227 3671837 3628646 3026798 3282939 3215817 3252186 3055180 2932965
6298 2932965 3062905 2937329 3038087 2983254 3102530 3431301 3547278 3469454 3567557 3825169
6288 3825169 3859012 4277487 4458867 5018156 5831956 6374749 7837583 9642651 10861394
6279 10861394 10785446 9443398 8352743 7177404 6262677 5496136 5157790 5074465 4932676
6270 4932676 4672542 4362926 4309793 4160060 4139581 4269868 4718110 4934516 5629020 6099926
6260 6099926 7436050 8626718 9315846 9571894 8465160 7111971 6158560 5376207 4651109
6251 4651109 4588678 4035590 3667181 3729299 3520981 3419259 3157612 3244506 3224875 3235276
6241 3235276 3260964 3456744 3743061 4156898 4808442 5217880 5883528 5790504 5396181 4455440
6231 4455440 4040270 3585582 3597928 3365490 3148663 2902924 2979360 3115353 3184584 3001269
6221 3001269 2904567 2959938 3231412 3393629 3379724 3500960 4008205 4694691 5088089 5054703
6211 5054703 4423464 4110904 3822784 3469647 3418075 3049576 2963500 2679980 2593998 2310948
6201 2310948 2629182 2459510 2388339 2322291 2202017 1931392 2267859 2238135 2127252 2344547
6191 2344547 2400498 2199799 2301190 2109404 2058139 1952454 1967857 1642074 1944563 1747846
6181 1747846 1825395 1841924 1937452 2233563 2069331 2078161 2160826 2486563 2282967 2240340 2602314
6170 2602314 2378778 2162916 2138170 2310120 2041702 2066030 2012768 2003325 2003333 2019771 1841549
6159 1841549 1941792 1773320 1621675 1841374 1606872 1650246 1748805 1682306 1707297 1551942
6149 1551942 1643353 1821977 1651496 1624638 1446498 1582696 1517670 1626413 1791765 1818844
6139 1818844 1755567 1435675 1626963 1569407 2000091 1872052 1991576 1874258 1764999 1783954
6129 1783954 1778074 1788622 1637334 1822962 1797873 1834312 2114573 1812321 1763080 1704143 1793328
6118 1793328 1619198 1460116 1462852 1645093 1384674 1539960 1209242 1504983 1382540 1353350
6108 1353350 1443719 1359052 1429642 1618576 1602991 1480301 1771133 1691229 1774146 1656497 1412440
6097 1412440 1591943 1461083 1605535 1409941 1400685 1528003 1696876 1403237 1581347 1417949
6087 1417949 1586767 1381427 1621134 1434919 1408256 1129574 1329992 1468046 1285573 1384842
6077 1384842 1299641 1398258 1385763 1612841 1352158 1471529 1479632 1487868 1411608 1208409 1116249
6066 1116249 1246007 1355590 1422891 1233366 1569853 1294622 1105279 1175307 1240932 1129376
6056 1129376 1409533 1018422 1182588 1168109 1345644 1273969 1342560 1197827 1201978 1192006 1429518
6045 1429518 1351177 1481964 1126268 1275820 1572901 1307888 1346498 1323464 1182595 1406124
6035 1406124 1233762 1176042 1097144 1424956 1041258 1294108 1213133 1386736 1273839 1189614
6025 1189614 1205441 1230668 1202041 1267601 1105575 1033314 1255388 1047964 1121357 1123681 924230
6014 924230 1278734 1159275 1213254 968649 859884 1021573 968306 925206 946915 1137973
6004 1137973 918323 976968 1152617 1150317 1183884 1377394 1152951 1294518 1219284 1435083
5994 1435083 1210946 1159115 1266846 1376976 1398124 1323621 1222500 1286334 1178479 1245313
5984 1245313 1246115 1264816 1129786 1275025 1130844 1254666 1102384 1262789 1241484 1143257 1023722
5973 1023722 1443010 1316013 1180787 1014124 1236376 1203074 1329419 1258668 1267649 1402890
5963 1402890 1427205 1193599 1331372 1124065 1111580 1449937 1313389 1364124 1193732 965222
5953 965222 849089 967460 1154779 1021046 1212673 1016823 1093936 912468 989554 1116566
5943 1116566 1235930 1099522 1191437 1320371 1055269 1245518 961065 1049556 1231012 1300209
5933 1300209 1164274 1022703 1123208 1103283 1082623 964983 1021319 1029232 1119718 1125444 1020404
5922 1020404 1197575 988128 1153977 1086842 1143063 1177384 1242125 1397449 1281901 1501157
5912 1501157 1140903 1057253 1226722 1204439 1324349 1327358 1162992 1066894 1092960 913693 1229263
5901 1229263 1142642 988235 1068472 1288032 1293257 1081834 917403 910939 1193735 1077213 946475
5890 946475 1143875 1007647 1066159 969031 1171385 1345359 1211905 1328866 1099145 1453698
5880 1453698 1168933 1364177 1334616 1089850 1102864 1321658 1378500 1118927 1019155 1075840
5870 1075840 1116698 1065842 1135049 1105267 1009275 1162654 913784 1120096 1300320 1102807
5860 1102807 1170388 1333317 1073730 1368386 1298942 1170839 1099900 1273709 1031255 1252495
5850 1252495 1209803 1166818 1062480 1158976 1227608 1165373 1028791 1119918 1249684 1172488 1231753
5839 1231753 970579 1032165 1029298 1538118 1320933 1146806 1323734 1317169 1478537 1158312
5829 1158312 1172932 1249280 1098389 1454293 1262770 1241277 1369039 1254934 1269556 1181476
5819 1181476 1258921 1257167 1290419 1397847 1138861 1299387 1246808 1259092 1174186 1537531 1416983
5808 1416983 1308051 1235954 1410051 1529914 1458276 1375476 1486498 1277443 1341209 1380097
5798 1380097 1332245 1414490 1484979 1262608 1535636 1427888 1477612 1307317 1372018 1560451
5788 1560451 1439992 1592462 1454412 1776297 1693274 1395352 1324764 1506600 1552450 1400250
5778 1400250 1423314 1664632 1538429 1412527 1472856 1418283 1641047 1585911 1271615 1503062
5768 1503062 1472066 1762095 1638854 1519036 1407369 1679422 1486980 1590477 1647791 1715946
5758 1715946 1818916 1667442 1463552 1479707 1438414 1492193 1795023 1719593 1643475 1772114
5748 1772114 1752599 1816911 1630067 1559454 1562510 1958520 1861558 1914624 1739188 1916439 1914537
5737 1914537 1779279 1757712 1881717 1997889 1832064 1777975 1774644 2045755 1901351 1933366
5727 1933366 1802438 2004980 2007486 1829562 1828440 1976800 1847326 1849147 1879087 2115087 2257456
5716 2257456 2124163 2105127 2144278 2598130 2132054 2232212 1977284 2372902 2228075 2191902
5706 2191902 2327162 1765308 2506372 2408958 2332855 2296619 2323940 2175553 2188184 2513425
5696 2513425 2427605 2340896 2012681 2447095 2400991 2461380 2345847 2314257 2385596 2511893 2478912
5685 2478912 2445925 2666098 2606379 2624595 2506470 2488241 2606784 2684360 2797427 2572083
5675 2572083 2477537 2705839 2720276 2613616 2595204 2537058 2647954 2645336 2958959 2875349 2901038
5664 2901038 2822888 3054125 2836906 3138408 2801507 3164943 2991813 3067820 3114331 3165636
5654 3165636 3146077 3138873 3338697 3479099 3281646 3187583 3347276 3457194 3148746 3385000
5644 3385000 3342830 3425401 3216698 3581118 3409836 3304453 3554366 3456243 3669688 3569574
5634 3569574 3582987 3647643 3833702 3647673 3645179 3699676 3790597 3900128 3920488 4064163 4101065
5623 4101065 4223577 4230096 4304070 4319468 4379739 4465529 4429513 4675080 4512151 4468661 4455643
5612 4455643 4712588 4284592 4692357 4661912 4772832 4818414 4796660 4794927 4953848 4763536
5602 4763536 4979747 4848465 4948128 5076655 4996357 4859619 5264212 5181379 5490887 5303871
5592 5303871 5612599 5649277 5893942 5789465 5844351 5705815 5609199 5864721 6010351 6224267
5582 6224267 5998997 6129250 6443343 6602034 6397391 6582795 6658792 6893064 6802685 6731221
5572 6731221 6733616 7040017 7257531 7172508 7192804 7210291 7514998 7410790 7519888 7288753
5562 7288753 7697441 7825333 7721961 7696945 7728386 7902360 7917541 8086666 8206215 8349220
5552 8349220 8405165 8401834 8289075 8799885 8829928 8747371 8816565 9068845 9360809 9037702 9287589
5541 9287589 9255636 9685554 9485443 9590742 10170335 9973662 10381451 10439707 10608425 10865574
5531 10865574 11135005 10837344 11240429 11133917 11150388 11381303 11387508 11684102 11677366 12040000
5521 12040000 12020976 12212765 12472917 12529400 12415295 12711910 13232612 12954648 13335845 13766073
5511 13766073 13638143 13721161 13648341 13976562 14362475 14514279 14666919 14551079 14886608 15204691
5501 15204691 15231358 15130281 15453905 15686371 15887398 16212761 16217455 16495990 16352086 16743458
5491 16743458 16983731 17212345 17466697 17689026 17743104 18001657 18144253 18399872 18335011 18658118
5481 18658118 19039204 19181227 19368706 19376476 19715141 19927050 19949203 20093263 20252114 20338614
5471 20338614 20570697 20684068 20984318 20909613 21042233 21247273 21525613 21565191 21800181 21800266
5461 21800266 22090540 22099032 22147109 22290849 22265662 22596239 22503621 23013166 22772722 22856026
5451 22856026 23116430 22969545 22950487 23150096 23260163 23493038 23660626 23348653 23577839 23464490
5441 23464490 23765602 23595348 23909190 23857153 23962267 24355315 24772646 25158017 25403128 25636673
5431 25636673 25636163 25328737 25115578 24569021 24133726 23898476 23384403 23421147 23138226 22799507
5421 22799507 22885341 22542036 22159924 22282485 21936272 21910862 21655129 21513761 21405146 21386208
5411 21386208 21309476 20925286 20875931 20900491 20692211 20477139 20379243 20144628 19965717 19966632 19482229
5400 19482229 19446612 19122940 18987823 18974206 18699251 18614113 18257635 18299617 18051398 17845683
5390 17845683 17681797 17457718 17114191 17151494 17216667 16799323 16602177 16232137 16205479 16085435
5380 16085435 16276381 15873622 15606279 15497324 15405188 15198401 15014487 14770549 14422877 14369377
5370 14369377 14459948 14205173 14039745 13675700 13715657 13546580 13567570 13342253 13269572 13061404
5360 13061404 13005641 12837928 12914029 12534543 12488114 12158472 12120101 11764986 12049811 11949572
5350 11949572 11784508 11485072 11462668 11594612 11222517 11004712 10901454 10839693 10819252 10774749
5340 10774749 10525056 10452996 10253789 10177017 9933827 9920584 9628630 9720844 9474556 9492850
5330 9492850 9552267 9283273 9283822 8926204 8807500 8919149 8584210 8862185 8428043 8627828
5320 8627828 8528705 8568610 8516072 8281339 8326209 8178381 7952421 8184361 8027070 7941781
5310 7941781 7699174 7910431 7806804 7624675 7521608 7604127 7250987 7198476 7129058 7309887
5300 7309887 6936670 6881254 6893763 6921851 6833206 6833885 6731323 6687484 6731703 6581774 6673773
5289 6673773 6417853 6290110 6320282 6188436 6227916 6144057 6131266 6171393 6022632 5767074
5279 5767074 5898474 5649235 5789686 5802485 5553836 5638599 5518673 5487374 5618176 5425174
5269 5425174 5291963 5385949 5323069 5485811 5105395 5154693 5175062 4767134 4903913 4955522
5259 4955522 5079475 4588605 4872763 4777386 4810322 4689055 4703574 4676656 4784787 4906774
5249 4906774 4414066 4594201 4625520 4627958 4402950 4443494 4385255 4454198 4541905 4456727 4389668
5238 4389668 4300445 4235172 3991001 4238634 4179136 4372628 4084726 4207898 3975453 4090733
5228 4090733 3935693 4014614 3712215 3830783 3704646 3946057 3850238 3787177 4155463 3728943
5218 3728943 3921029 4096330 4162817 4249380 4769631 5495018 5823173 5467022 4674696 4625345
5208 4625345 4362901 4320667 4011995 3839324 3837468 3839216 3864918 3541032 3535398 3596423 3636110
5197 3636110 3526404 3604358 3600623 3683948 3243051 3111196 3403528 3527540 3218846 3097757
5187 3097757 3324859 3173916 3308996 3228993 3170394 3095169 3107021 2990040 3097362 3281602
5177 3281602 2955406 3163653 2917707 3045279 3079990 3194043 3090222 3081547 3007234 3182036
5167 3182036 2930639 2824777 2969916 3148307 3000144 2936749 3203220 2842148 3163359 2662066
5157 2662066 2843056 2841570 2817831 2792315 2994039 2786083 2544263 2792863 2625642 2873896
5147 2873896 2736492 2814027 2685855 2772811 2727618 2489742 2492750 2747992 2403780 2390922 2754409
5136 2754409 2559171 2701988 2552356 2766324 2684340 2489793 2808024 2720369 2959374 2516792
5126 2516792 2349105 2456758 2443906 2674584 2354037 2266175 2526108 2731106 2306391 2263418
5116 2263418 2103420 2495032 2192682 2435327 2377569 2418382 2440718 2555055 2663989 2648144
5106 2648144 2443025 2488137 2568828 2814894 2832652 2526301 2532107 2624614 2700240 2599328 2513732
5095 2513732 2506165 2563381 2583494 2645465 2711137 2692635 2497846 2545083 2518169 2633398 2754394
5084 2754394 2431721 2601744 2601755 2641409 2651636 2635952 2947105 2773213 2891997 2879190 3143204
5073 3143204 3238941 3768592 4265932 5621870 6866060 7044605 6959193 7225817 7053565 6160902
5063 6160902 5239526 4276770 3633268 3431476 3260701 3309517 3142813 3177496 2998214 3026349
5053 3026349 2966895 2901157 2970039 2953428 2916674 3080226 3072123 3080914 3060734 2921411 3013964
5042 3013964 3241131 3381975 3389886 3250132 3245662 3168014 3617470 3259865 3268792 3333056 3473323
5031 3473323 3675518 3354526 3416686 3412596 3581738 3315164 3706524 3857686 3928916 3929064 4188823
5020 4188823 4564781 4338733 4168467 4214293 3818179 4107711 3929135 3753098 3853514 3842680
5010 3842680 4047473 3937233 4113487 4527172 4478588 4513427 4673639 4959994 4999177 5243088
5000 5243088 5298635 5755745 6039444 7382633 9485384 11653243 11160940 9920968 8510513
4991 8510513 7695210 7155390 6956719 6979222 6930246 6967239 7028924 7246329 7534734 7988960
4981 7988960 8214669 8437999 8940761 9167359 9656641 10494983 11310822 12286623 13664703
4972 13664703 15407678 17123674 18525582 19352510 20825666 22326911 24854111 27741382
4964 27741382 31574518 36902928 45559047 65517006 122040270 230151079 332932601
4957 332932601 335329511 259100659 181474624 123889004 86310389 62342959 46452664
4950 46452664 35321107 28496184 24022454 20792730 18619129 17464414 16546303 15527518
4942 15527518 14019329 13039530 12706226 11701129 11313981 10673232 10446492 9921405 9588455
4933 9588455 9414338 9002826 8719165 8026899 7901204 7980707 7593753 7190024 6943837 6987570
4923 6987570 6670957 6364138 6254874 6241291 6101579 6083364 5481462 5741584 5647077 5507465
4913 5507465 5087996 4936232 4773031 4691180 4715410 4807543 4516825 4359809 4444713 4611202
4903 4611202 4462086 4185313 4132827 4103538 4064803 4200686 3787860 3740589 3496149 3483630
4893 3483630 3333426 3368032 3148135 2980290 3069495 2993929 2970315 2840183 2883753 2737082
4883 2737082 2815347 2621941 2651428 2661537 2613706 2484451 2589893 2582468 2474419 2534067 2483469
4872 2483469 2349745 2335043 2424302 2239486 2421200 2234932 2170174 2505711 1930931 2183583
4862 2183583 1824359 2130673 1876280 1961385 2082347 1847104 1655534 1935289 2006153 2049187
4852 2049187 1937598 1954152 2088697 1938188 1922153 1676110 1849168 1708707 1394370 1583659
4842 1583659 1743086 1664131 1114069 1643881 1250161 1604046 1583324 1662979 1348965 1832573
4832 1832573 1487536 1601418 1415258 1487872 1509588 1255318 1527544 1596234 1547662 1284666
4822 1284666 1302146 1710825 1567001 1511661 1458497 1339495 1292187 1330295 1272386 1347390 1165712
4811 1165712 1429685 1383861 1557042 1388022 1200183 936803 1198719 1504662 1394241 1420440
4801 1420440 943041 1202047 1100670 1403172 1073862 1095367 1016716 1137090 1037876 1122057
4791 1122057 1345191 917239 1002327 838236 1143704 1039971 1124772 898630 996631 1220177
4781 1220177 1063867 1125772 769437 1117137 1007451 1239615 888351 1016285 813612 979986
4771 979986 983955 1060606 1157171 1066303 1148256 1028899 1104260 1073718 1141725 1211441 1229420 1298988
4759 1298988 1222878 1233530 1193036 1198087 924806 928764 972097 1082054 1047949 1006960 1251923
4748 1251923 1068624 1178879 1124255 1149937 993720 1197852 1126682 1093322 1055788 1240374
4738 1240374 1122828 1256591 1279208 1136366 1302767 1201607 1421538 1388708 1461324 1334602
4728 1334602 1543893 1432147 1535348 1351786 1543087 1584207 1573287 1735254 1704308 1727843
4718 1727843 1722123 1791370 2027832 1987618 1765299 2111736 2268759 2287965 2192523 2533782 2571995
4707 2571995 2863544 3023554 3269000 3790557 4607234 6565541 9833335 13371608 13447569
4698 13447569 11327433 9187469 6974013 6144646 5450796 4624385 4388322 4754673 4735388
4689 4735388 5431474 6982978 9291272 11157239 10810829 9293976 7185285 6264263 5436046
4680 5436046 5104859 4780426 5173317 5685542 6549905 9086784 11923663 12817113 11099419
4671 11099419 9349531 7439277 6446527 5674801 5163586 4805321 4714955 5131380 5383130
4662 5383130 6824766 9003155 11049762 10433748 8860348 6998427 5619832 4605342
4654 4605342 4036987 3597775 3383579 3002979 2917404 2851391 2889346 2901680 3133512 2951880
4644 2951880 2985792 3044289 3044243 2849129 2845918 2678561 2619927 2383712 2623271 2401194 2586621
4633 2586621 2557472 2649512 2526600 2414393 2521202 2812401 3055685 2958917 2913548 2662146
4623 2662146 2808428 2725931 2760055 2760952 2737524 2727103 2914984 2770979 2868371 3135938 2764427
4612 2764427 3066360 3430776 3513828 3853982 4080958 4383337 4163146 4530656 4644330 5248745
4602 5248745 6031834 7648690 10491813 13752657 15421296 15743655 16115357 15359991 13357623
4593 13357623 10435141 8390409 6978732 6142104 5435117 4830578 4571861 4518204 4485095
4584 4485095 4346593 4553331 4536094 4662933 5219764 5296286 5742070 5811670 6114452 7414027
4574 7414027 9685788 12684363 14398269 14960909 15557710 15114592 13351193 10664027 8742167
4565 8742167 6798513 6153758 4928281 4737915 4337144 3998540 3501208 3349569 3187349
4556 3187349 2995274 3139159 3009950 3193804 3172627 3043460 3005812 2728904 2595836 2295001
4546 2295001 2304608 2158968 2385315 2153489 2333546 2207820 2221834 2074271 2099901 2240806
4536 2240806 2356368 2113530 2034387 2237721 2159727 2106920 2054290 1827466 2176005 1936167
4526 1936167 1993936 1899786 1878568 1727400 1582154 1798486 1989008 2144422 1956667 2127914
4516 2127914 1838580 1797075 1822070 1615884 1767370 1419326 1425404 1625848 1762329 1572347
4506 1572347 1383334 1621902 1643067 1570167 1546546 1545217 1652347 1879749 1858774 1780839 1943638
4495 1943638 1964708 1598982 1759141 1950307 2157022 2046912 1723256 1978469 2044687 1863798
4485 1863798 1891855 1860966 1896933 1866039 1717856 1897535 1781071 2034827 1984714 2127114
4475 2127114 1671348 2066046 1883796 1739774 2016262 1846651 2145794 2014859 1765478 1924413
4465 1924413 2112647 2176810 2175792 2235624 2161232 2158390 2147425 2430834 1968815 2232342 2325345
4454 2325345 2353624 2322570 2021037 2371535 2277771 2366492 2193770 2246333 2425854 2426875 2326335
4443 2326335 2084297 2178943 2249130 2067718 2184888 2052265 1974846 2157704 2048674 1982733
4433 1982733 2031489 2257463 2379650 2523694 2380705 2474495 2414009 2498954 2619092 2625243 2733051
4422 2733051 2674482 2822958 2715113 2707892 2731334 2788954 2476428 2753410 2802969 2735380 2817902
4411 2817902 2643974 2477157 2589399 2811204 3043231 2938931 3005010 3273883 3359855 2972573
4401 2972573 3133505 3338433 3762521 3702476 3685403 3633670 3874220 3865056 3924333 3711772 3867492
4390 3867492 4011726 4119610 4071603 4275132 4326898 4397547 4216633 4722664 4903317 5216671
4380 5216671 5177206 5317686 5326509 5843451 6037085 6321420 6651823 7039679 7858133 8167927
4370 8167927 8514525 9236697 9651929 10493281 11536692 12550792 13946896 15301153 18007590
4361 18007590 23196651 37660031 66339891 94510650 92624506 72433946 53328454
4354 53328454 38810324 29705556 23856381 19801868 17125289 16059432 15325103 15178592
4346 15178592 14922762 14870695 14969339 15189917 15764149 16223842 17389638 18408236 20179426
4337 20179426 21998209 24177538 26448203 30521961 37989386 57884013 108733994 170456660
4329 170456660 187545545 152456175 115237969 87007983 67628606 53311187 42624044
4322 42624044 35133877 30665138 28499706 26560321 24390341 22179754 20191146 18689081
4314 18689081 17730927 17062385 16427191 16323987 16382248 16449775 17205274 18205107 19951743 22328380
4304 22328380 29191048 48184049 76716100 95054692 81797416 61555815 44150753
4297 44150753 32306345 24543275 19766174 16274767 14172079 12436871 11704554 10550059
4289 10550059 9716656 8538392 8380939 7764837 7768598 7251262 7349874 7696516 7358371 6880384
4279 6880384 6551345 6083479 5854378 5637920 5296765 5103348 5106594 4789870 4452722 4772290
4269 4772290 4474113 4539070 4182731 4314250 4111122 3904939 3945380 3958146 3753493 3688161
4259 3688161 3702602 3670701 3585220 3504027 3526806 3127289 3125334 3324861 3066239 2817828 2628618
4248 2628618 2627174 2808989 2698362 2336904 2371210 2353025 2457153 2099602 2144189 2070653 2253147
4237 2253147 1979700 2089364 1872028 2096046 1754343 2100417 1836838 1820841 1954929 2003216
4227 2003216 1891223 1998886 1900033 1734218 1589367 1886439 1789447 1716824 1683559 1651131
4217 1651131 1526746 1451925 1627038 1471528 1555209 1332958 1344969 1514053 1394615 1479897
4207 1479897 1369157 1359008 1107148 1288887 1005831 1039954 1033127 1043593 1178705 1392747
4197 1392747 1005392 1068590 1202480 1131693 1296403 1250081 1085065 1066190 975232 944422 1167286
4186 1167286 935629 993644 796575 878836 1064077 959921 951660 817290 981342 923144
4176 923144 816556 769005 624993 834484 772637 727740 662278 749347 680431 721447 564455
4165 564455 801417 497801 733751 484010 843806 708146 854366 720667 752860 675074
4155 675074 666683 646993 709525 1129437 811081 771034 778437 818311 1112685 870456 725621
4144 725621 718057 687772 853471 802856 672613 754247 595235 609267 854149 805433 605647
4133 605647 587612 793799 591617 691407 493098 695471 754538 733758 499673 715920
4123 715920 768108 544308 770332 686839 708825 828380 639334 724546 687225 1004074 769828
4112 769828 755039 953329 1180604 911812 941062 838048 1138511 1200606 1391597 935826
4102 935826 1146244 711498 681128 618100 602335 601509 597014 686669 600422 920184 711143
4091 711143 771127 746129 853509 826866 849540 830676 802623 1235538 1114373 1299437 963506
4080 963506 1405058 1204682 1877800 2158345 1953079 1768253 1477536 1395906 1141245 1124829
4070 1124829 858801 1155624 989412 901145 653905 789049 953027 882718 870770 717016
4060 717016 881424 902653 770641 728350 1021715 950272 991121 1156717 1303678 1121443
4050 1121443 1110546 1188902 1431233 1397317 1153953 1174464 1042513 1248919 1108180 974792
4040 974792 764402 996170 877594 845015 939686 994170 902252 922099 1008447 1090644 1237783
4029 1237783 874595 1215748 957066 1370087 1176502 1137970 1467802 1144559 1180036 1043586
4019 1043586 1016490 859869 885277 700822 631847 723043 606475 732151 716963 879115
4009 879115 729305 851102 594171 925879 1066892 964003 1153754 1077345 1092695 871751
3999 871751 1135981 1151216 1176172 1094152 854601 1065504 1120527 1101134 888089 551829 773340
3988 773340 994304 886989 395679 715167 672379 690459 680818 688847 804466 611802 653658
3977 653658 516765 711572 675696 362448 388419 326957 520618 332299 564681 179849
3967 179849 444772 256459 325212 285277 240072 127703 124814 512313 230501 290716 60971
3956 60971 326417 414886 210038 208621 235065 253988 266554 370145 105552 302999 37523
3945 37523 311723 195518 122462 83075 -9611 -28382 51783 89072 344706 -46868 207389
3934 207389 -70549 138657 35799 206475 190136 190975 160640 225082 287045 102523 393267
3923 393267 223245 135286 31992 92614 306133 167822 168921 50614 97603 199034 149307
3912 149307 247785 215239 468559 344016 292723 215793 300208 368719 505630 393338 320631
3901 320631 411345 242904 326103 385869 464154 236256 539721 425392 62387 159156 44280
3890 44280 387614 50472 -49188 -164989 135441 16476 119413 -24976 22220 44643
3880 44643 147686 120336 171312 170647 181135 231192 194545 209177 226632 169039 212975 175005
3868 175005 288591 181429 41444 207845 383749 50513 251018 207633 -26469 38060
3858 38060 69287 -117795 -121098 24111 42805 -238163 -196761 -7823 -1687 77989 130785
3847 130785 8644 123089 106204 121546 -24141 5355 -40520 88657 258304 223347 277450
3836 277450 235039 330352 213002 130587 195071 275350 53116 178725 348743 256735 327169
3825 327169 96987 180627 147101 -74117 246015 297126 342758 -79068 -120746 212323 302717
3814 302717 206096 -105063 81369 180933 16779 34067 -75647 64842 86252 -150176
3804 -150176 -160925 5799 -274663 -365499 -285854 -92548 161223 -18218 -167250 -108816
3794 -108816 -98375 48111 -31405 103243 114817 79784 85169 165761 129330 140045 -3729
3783 -3729 165109 47294 -127935 -149982 -158979 125459 106902 170842 49449 118797 104510
3772 104510 267611 229653 146481 275198 70326 308511 346054 288322 241911 277953 190956
3761 190956 6085 326861 133991 55127 27098 -17495 -92702 85174 100977 107734 161131
3750 161131 -312 16784 163650 84136 248117 40289 248619 86969 370042 146121
3740 146121 66554 78501 225432 147047 135520 -16993 86090 94201 49033 -231151 14040
3729 14040 54528 -76853 -27437 -55927 -5141 174199 234901 142434 277294 185654 172701
3718 172701 282064 358089 50450 33156 328782 365995 295413 180146 301402 318682 55021
3707 55021 64351 178992 -33175 -164421 62576 114785 67102 -171165 -22401 -296510 -96942
3696 -96942 -205111 49844 -71817 -11561 -45752 117105 -122695 139832 38700 -92437
3686 -92437 -27477 -96251 79110 155072 169747 -145147 106003 168564 60950 231451 127137
3675 127137 87237 -117734 -76547 -8831 39851 194971 231698 262481 216530 148197 38072
3664 38072 67721 167215 358566 -18571 176644 -43440 181817 17126 91665 51824 169477
3653 169477 8400 55747 117634 110106 -13865 -76972 -272112 92624 314641 120350 223718
3642 223718 -116579 94376 39679 -42580 5054 -56984 125694 -76581 135921 -3614
3632 -3614 165165 44229 66669 -166017 -154896 -97663 5972 -123166 -158242 31561 75681
3621 75681 -123266 163660 -48277 158129 -18428 31119 96173 340955 221891 163309
3611 163309 120586 246905 364762 289001 246836 146552 321561 280524 285966 136150 -28462
3600 -28462 165837 237472 -21239 -108648 -131641 70711 178878 383601 -91549 -63449 -30675
3589 -30675 144542 28299 114636 -100251 -32419 62511 -53304 -56342 -59419 48723 230531
3578 230531 -134092 -200864 69807 -51915 -121662 24730 77618 20677 -406 -53945 -53519
3567 -53519 282026 272755 -125380 114629 -11208 367121 225384 156330 158126 25285 65166
3556 65166 -7420 148351 89095 91005 168982 27865 121202 13511 45278 128133 116003
3545 116003 -27968 46590 -97612 22539 29658 128367 142179 16425 221266 100858 83191
3534 83191 191628 131196 71600 114488 176222 114778 115488 88542 136072 131090 339029 258562
3522 258562 183285 -75497 38089 -69212 20067 -94628 156594 55427 -280049 -327839
3512 -327839 -4169 -58262 -35491 -144640 66761 169807 260514 147516 184039 -16878
3502 -16878 63405 24504 243248 -88596 -87532 110957 41095 31732 -64804 -57436 169148 271913
3490 271913 75902 131995 169692 56543 8688 20006 171425 74901 367973 127269 68423
3479 68423 51114 204617 250519 -2123 343524 66172 99454 140095 -14006 -49669 -140355
3468 -140355 -59931 73415 58506 -42201 -44621 -12632 -50083 125373 -6828 -87149 -63224
3457 -63224 -134393 -40530 -35886 156115 24848 -56996 -26130 160096 104889 -32926 -154853
3446 -154853 9129 384207 535 79303 -126754 54351 143433 77065 -23559 -118484
3436 -118484 232420 74691 77179 187170 -107433 32892 -115598 52264 -83353 -26555
3426 -26555 293334 76090 145380 54861 33308 73596 242664 76180 -64683 45044 174940
3415 174940 175424 23730 95806 137231 268210 139612 44299 38448 -132813 101281 -36016
3404 -36016 117819 94340 226233 -187852 170454 60642 158177 122009 184618 87691 233522
3393 233522 228219 231939 56762 63429 -51426 256546 132118 250684 65433 298025 257318
3382 257318 285654 -34333 205280 127675 31645 87444 -105521 52471 -37857 201403 -14624
3371 -14624 64576 107746 156037 172161 -32871 93555 98274 165244 -135775 -21815 349305
3360 349305 66915 93172 -67412 134357 45045 254701 6465 186149 122995 125022 38751
3349 38751 92866 140338 267547 109211 275246 239574 313779 10208 350122 167816 492915
3338 492915 208414 120346 188263 412650 319313 548752 425716 822723 593985 709423
3328 709423 1675128 3456809 4018438 3042510 2212663 1518083 1298813 728161 688268 499076
3318 499076 221192 146403 276851 102223 426371 322374 211656 123321 21905 85966
3308 85966 150886 180063 113805 137356 102346 203490 35511 94182 149233 156865 173023 -103164
3296 -103164 128816 51836 139425 13110 41060 -12325 226332 289516 100475 155072 82420
3285 82420 127622 263229 -66408 201923 183977 48006 66753 151149 98233 78372 -136746
3274 -136746 227395 172444 315934 2912 -8445 292591 226450 227496 166048 249920 203488
3263 203488 42991 -13284 111948 75465 204343 51515 160685 78728 199495 104802
3253 104802 36339 35307 101509 45590 -19148 49478 31431 -18483 7503 110854 -135901
3242 -135901 -47533 47181 245272 285055 -39604 320 -241173 274819 -119657 -125043 -218166
3231 -218166 -55776 43299 -42438 -43019 82032 71372 149657 -32771 174725 102576 89455
3220 89455 -23134 -5607 -7122 34153 -91520 -229189 -45585 79063 -130383 -40991 -98371
3209 -98371 34995 -163268 -60946 -41578 10151 47890 -160705 48722 122130 447604 39867
3198 39867 -54512 -230969 19623 275879 141117 149888 87178 203648 261794 48633 25055
3187 25055 1567 322030 95281 216433 115370 165053 80477 96183 71361 -11041 53159
3176 53159 66238 22640 333611 115008 166744 118149 -103275 -65676 64223 1867 -126322
3165 -126322 -166496 -1831 -177690 -66900 -53537 -29076 -51850 134808 30074 301391
3155 301391 -194355 -28523 190035 -108042 -86513 -135510 13738 -108692 -35316 -90900
3145 -90900 -5788 26186 68838 -202219 -241499 -13177 84473 55887 -25066 227935 221230
3134 221230 199536 26206 60238 252660 274241 56430 22379 176105 374968 154468
3124 154468 97248 151477 1181 254047 38935 46160 164451 203086 107337 142613 -5132
3113 -5132 -41479 -56287 -143997 31371 93003 -106717 -13307 -8376 -119891 72864 377576
3102 377576 225379 111368 202113 -125607 -783 246965 296758 162358 319191 112052
3092 112052 235507 -4923 93621 61535 -72018 68244 236425 -24161 21400 -158282
3082 -158282 -152169 -16055 -186969 178549 172245 79755 105368 -56484 -62612 -152901 -118315
3071 -118315 -120898 108888 20986 -147209 -71319 2186 -72735 -158459 -188794 244475 124028
3060 124028 -14138 -88112 60495 201600 -70239 24742 -135462 232810 117532 -2640
3050 -2640 -162751 171753 19388 -52720 -90254 125193 138996 18364 -174350 -124041 -125081
3039 -125081 28829 -131644 -17196 -85774 62086 -27805 76842 23772 -67361 -204048
3029 -204048 -152426 -120243 144698 -100456 -95768 -189943 -214897 237133 41112 111523 -2702
3018 -2702 -74850 56605 -32386 1375 -26040 300737 9606 173341 -53308 -124596 -31239
3007 -31239 205933 90176 -58526 -114797 -68011 66483 55734 -107530 -282028 -43418
2997 -43418 -35875 -121460 -140863 59208 -69818 -126651 -174552 49628 -213235 -33046 -25207
2986 -25207 210967 60511 240810 205246 -41512 87173 -173360 -69936 8168 143992
2976 143992 254762 99537 905 35815 108844 -36996 -8763 -111991 -115527 50626 -75751
2965 -75751 38576 55051 -5031 159497 216373 -5596 -160236 -199443 -97552 -28575 -290475
2954 -290475 -168599 81063 121825 96661 4918 38959 136763 117482 71277 111529 132253
2943 132253 137911 173636 115708 81552 113881 161028 236295 171321 110431 147071 170495 91707
2931 91707 346584 -136702 -34367 68151 199941 61202 90113 16896 89542 103505 -59131
2920 -59131 -163979 -29479 25066 -191471 -255677 -11459 -257024 -103773 -46537 -136617 -302424
2909 -302424 -4929 -19 -52608 -240978 -234978 -283569 -286744 -120506 -79553 78982 17836
2898 17836 195155 50412 -181463 139236 135157 221237 -272526 121428 288210 261530 34601
2887 34601 -114130 178399 217940 208191 62950 51568 174301 -30927 -33495 -66772 56335
2876 56335 102983 153988 276415 -43015 8402 -80783 110738 15585 81369 -41937 85632
2865 85632 183118 105197 4439 191307 35775 3255 76712 -65122 111646 41037 -155611
2854 -155611 6448 -5059 205090 -251143 183101 237418 361306 -98607 -85630 70945
2844 70945 214444 37688 -164544 -6899 -20339 113891 -48076 -90139 -98019 -157010 99764
2833 99764 28310 -44070 -21381 -118152 -268160 -176640 -102222 -129885 135715 28242 99884
2822 99884 58303 187277 -5734 155093 -7200 129161 109807 81988 161334 130137 218832
2811 218832 14784 25020 43100 -122542 45496 -45562 -68429 -41470 -37554 194850 162362
2800 162362 157136 277704 -71784 293246 -158649 -75109 -95231 41126 49642 170138 -124355
2789 -124355 211612 -41027 82403 52221 123826 57550 267617 61505 71792 122953 -22996
2778 -22996 -35234 -156492 40847 14576 -50405 -125640 -89487 -73661 -85569 -128593 -163326
2767 -163326 -165584 -201635 -155414 -88934 -172631 -178062 -79950 106254 -141196 -62813 -145907 94334
2755 94334 144931 96092 -81754 56936 -38513 155268 -79935 -53326 -107263 12663 -216448
2744 -216448 -44752 127036 14439 -2168 82216 -201119 6527 -258 2738 -36283 90457
2733 90457 -26131 -16298 -29931 33903 -153231 -121796 -97813 100195 46283 -18397 -11238 60513
2721 60513 -25415 -120028 -114087 -2592 208259 -42109 -75150 95735 332689 51246 26963
2710 26963 56112 217978 30845 41121 63782 155675 -97681 48043 264223 187053 95211
2699 95211 151445 -153395 144167 -101345 119672 -15967 -8602 167454 57126 133072 -43940
2688 -43940 -65897 31779 -12647 -42074 -204836 -214767 -166320 -245177 -213484 -219597 -80549 -79322
2676 -79322 -71736 28436 62514 -205891 10352 162508 67110 21053 -233934 97563 -101676
2665 -101676 99043 130079 136679 196300 20693 246017 49589 99615 -32992 -9457 -31415
2654 -31415 82494 -194664 -58074 18703 128921 -88819 106123 -32090 -152299 -138065
2644 -138065 -218411 154382 -184676 -97809 -145501 189241 343620 -67905 160704 -52692
2634 -52692 368128 9068 206555 85900 263045 -176602 -34774 -70092 87944 -266058
2624 -266058 -175852 -206996 68916 31647 -25318 -159690 107996 -44338 61809 -47940
2614 -47940 -127656 5690 136839 -80577 -163021 24550 -78357 -131485 -63740 191631 -54265
2603 -54265 -178429 -264522 -253694 128376 145561 -94732 -49038 -145094 48691 94378 91819
2592 91819 21792 72070 9379 81496 253234 83316 64477 301662 315631 179635 259875
2581 259875 165629 208115 333828 283543 35676 -122058 253700 20227 18293 -23118 -70389
2570 -70389 61446 -88549 -145368 -148637 132718 43017 82324 -66922 -12877 2975 -10036
2559 -10036 -19167 106527 -92279 -132710 173518 58065 124526 -103632 -179495 -69022 71561
2548 71561 -36216 46503 -12100 -268645 -132453 -155822 -122272 19385 -58657 -91574 -152100
2537 -152100 -291975 -355997 -292052 -18537 -22849 -205597 -201164 -132107 37786 430990 -134524
2526 -134524 -93675 -46771 -37230 101671 34730 82978 51620 16977 -22011 -9191 146769
2515 146769 -110901 -154909 29528 -64130 109926 47795 58242 -64083 -43284 -84511 74046
2504 74046 -106733 96548 -29652 78160 238855 198473 -52991 -65945 67025 54338
2494 54338 59325 -96561 168321 -109698 -3055 -67279 -59804 -96199 -38275 -4232 -254560
2483 -254560 -189236 157917 -98681 -58409 -167388 -116476 60688 -131835 59143 -43424
2473 -43424 117535 -101241 52376 -166127 -68631 92925 66743 145062 113838 155516 -110282
2462 -110282 112254 -19884 -85586 -105261 1853 -79104 125055 -6248 -71261 73335
2452 73335 -62200 -35132 38360 137671 -3545 206983 189539 122130 295302 118445 782
2441 782 136480 273128 75413 -26660 71048 -155883 80715 -204334 -177688 -299057 -160002
2430 -160002 -30360 -191372 -318322 -247891 -106162 -255516 -184568 -167097 219903 92873
2420 92873 135371 -8074 19159 -3540 19463 201083 111672 -16581 151676 236226 263450
2409 263450 -113164 175912 136584 -29727 96941 15351 33239 5495 -42854 166765 -123621
2398 -123621 -134208 -183653 162323 72118 -236114 -69264 -13998 -32394 35611 110264 -96475
2387 -96475 94868 -188537 1928 -17369 -131233 -73075 -179167 202968 92162 27439
2377 27439 -161748 -163302 -53564 143316 -70097 -153188 -184393 -104947 -186948 -64812 -198547
2366 -198547 -127990 -215317 -104313 -289146 -232902 108737 -306512 -295117 -180692 3584
2356 3584 -176946 -93694 -117077 -81570 -74441 -134076 201517 231320 281015 270395 430830 132389
2344 132389 376727 334232 -74538 136908 -17369 345151 55223 97073 234704 267654
2334 267654 396454 25778 114727 -174644 -107994 -238198 -204106 80117 -248558 -191897
2324 -191897 -231643 -243402 -242618 -98304 -280098 -197426 74277 -27237 -34825 -128582 -184251
2313 -184251 25429 -218 155095 211261 422553 354024 412991 308201 387998 416057 202465
2302 202465 73638 -19869 111389 -194249 62501 -173050 106915 8177 2615 -45510 -96722
2291 -96722 -92931 -78891 23686 -100457 -187053 -259306 -247160 186549 -73020 37767 -29975
2280 -29975 62878 55913 -8474 1682 -174838 -114287 -191604 -101716 -179409 26360 -172167
2269 -172167 -152045 -286080 17719 49151 17575 -229574 20159 63550 -114150 -165953 12010
2258 12010 -48525 -157217 -259059 34998 93927 -98815 -158523 -198175 -34198 -250377 -69222
2247 -69222 -62295 -35961 -168462 22227 8220 -112919 75444 -109747 49506 148444 58350
2236 58350 -34352 115049 161787 42293 258983 14415 357175 -4775 164203 75508
2226 75508 -28082 19528 134419 90984 -21170 101498 103908 93078 50876 73334 -87682
2215 -87682 -41875 258768 184793 312443 27357 52325 -120911 -11094 -53609 -279144 -221157
2204 -221157 -72350 -106487 -38619 -177053 -139002 -88170 -94977 -90869 37825 -29437 -18130
2193 -18130 -37989 -140618 -143420 51793 100162 -219306 -47372 -55561 2461 85621 88124 -114206
2181 -114206 -360580 183203 121062 178866 11700 -80068 -98908 -25928 132500 -13969 11802
2170 11802 2155 196215 18208 -55456 -137078 -210290 -43647 248806 -120403 -15075 -8244
2159 -8244 -19076 85990 134118 -41741 52609 56417 163630 21737 123411 -121362 -16844
2148 -16844 -173209 181400 127841 333316 30356 -56326 -42541 169356 37681 64015 -25131
2137 -25131 -35608 -103738 28217 24098 -51942 -196855 -36508 -46953 59152 -230905 -151649
2126 -151649 -170323 -9371 -127399 117753 -48145 -90992 13274 -75276 63592 115432
2116 115432 -115484 -246740 130749 -8227 125596 -146123 55796 -108357 106984 18290
2106 18290 -176127 3899 64698 -386322 29252 -257583 56559 -181340 -75179 -101113
2096 -101113 -129576 -198898 -111070 -75158 -297912 -3532 -109596 159405 146961 26520 38806
2085 38806 -147907 141088 154819 -180051 -155797 65236 -21896 -139844 -65384 -59750 158958
2074 158958 -52188 718 172449 -23451 160420 -91361 89478 86280 391777 82387
2064 82387 33175 152747 -4901 89706 65745 88184 -44132 78791 -33265 38680 -80743
2053 -80743 -154287 -109760 23753 -217831 -100227 -59110 51178 -48230 -132752 -153223 49580
2042 49580 -236028 41530 -156316 32271 68576 -38160 -94600 -19168 107402 121344 244883
2031 244883 132256 39772 -23268 -1255 231810 -207721 -5935 -87643 195449 -194706
2021 -194706 49170 -74249 128273 84872 47217 -53799 -350290 -92265 -265170 -96181
2011 -96181 -101259 33798 -232941 -126732 121499 -139426 -125035 -429366 -113477 108363
2001 108363 35561 -37969 -21107 -15585 305355 175404 -97771 15967 -55686 193692 330689
1990 330689 158236 -86038 -150398 183468 30503 -251891 -268833 -237736 -89946 -56516
1980 -56516 -154336 -224147 25013 -11606 55153 -75003 195157 -293918 -101858 76753 -282374
1969 -282374 84398 37021 -118019 -61798 41863 270108 -23459 269488 -91650 95949
1959 95949 73404 -6053 186642 34597 104346 -12318 231820 -213025 87552 31205 -105711
1948 -105711 24161 -124187 276597 -98316 38730 -274336 -189614 21897 -44250 -37235
1938 -37235 -135646 109518 48328 -11348 55401 -57840 -188844 -110978 -79278 -49590 -214898
1927 -214898 -111689 211430 -161206 -148249 -237196 -344796 -11934 -28020 2029 6911 -117290
1916 -117290 -314362 -289077 -263892 -180479 -60653 159680 -147228 -224153 59760 177403
1906 177403 135788 46997 146954 96504 177394 187246 -141245 143448 -15235 112258 -82242
1895 -82242 49042 8669 177554 32136 -19953 47750 -42651 -46025 -152670 -149765 -41322
1884 -41322 -50810 46978 -31305 -350681 -118004 -243910 -77651 -392809 -115587 -327365 -64431
1873 -64431 -106096 -140973 -114703 5352 -116209 -54685 177962 4414 -157154 -53678 90187
1862 90187 -43776 308597 96353 -91303 77955 -19200 12257 -184304 101502 246419
1852 246419 66433 -71329 -168322 7539 123854 37475 101242 165655 84989 128701 152512
1841 152512 -94673 89318 -131121 -64284 -98635 -192556 -76402 -14481 86323 -138698
1831 -138698 -152584 -205897 186180 109857 126838 66842 126410 270773 98575 -8422 -9698
1820 -9698 88814 -20620 71916 -105126 -1668 -241853 -97036 -143155 -138534 43652 -376944
1809 -376944 -255165 -199435 -141964 -261194 -124046 -210734 -41767 -24260 -30113 -62260 -215004
1798 -215004 2538 107162 -28601 -40226 -191099 -78665 65763 125464 -77628 113708
1788 113708 60114 18005 -1151 140251 47513 -736 -6304 68824 118551 109435 172385 -72750
1776 -72750 30225 196661 46027 -69766 -258451 -57158 175999 -7062 -166759 -173984
1766 -173984 60369 7044 -123549 -117824 -198128 -50583 -195536 -124932 -49698 -246078 -183527
1755 -183527 -31601 -206402 -121632 -11352 -154704 -341694 -53661 19981 -134637 -100197
1745 -100197 80593 66589 102043 22956 -63069 30332 51001 -93426 -92375 47973 132259
1734 132259 -173441 -137256 -135717 -181348 81296 -14612 71670 -60823 -30802 51299 108611
1723 108611 14966 -170672 -33921 22640 183471 330993 -36786 36484 -35023 21008 7230
1712 7230 -76370 91271 79024 -83771 -88861 -14722 -205220 84060 -107836 -119202 -99427
1701 -99427 -77353 -51517 -159368 -99127 -142061 147594 97930 125357 52742 217301 327205
1690 327205 26783 4009 -209745 120380 133950 3261 -142782 -3395 51529 -56879
1680 -56879 49681 49623 206874 175391 -142734 -49335 49039 -141737 -118630 -139042 -152546 59057
1668 59057 -132732 -3512 -36093 -216755 45856 -9150 -72143 -35681 -176879 36730 -159304
1657 -159304 -49420 -288102 -283855 -90516 67389 -91422 -237572 -136511 -20021 -238141
1647 -238141 -284438 -121222 -253403 -133315 -90665 -119372 116610 74623 -130827 150826
1637 150826 101241 50777 138161 37079 142747 331566 -8925 -44454 -134648 -58091 134018
1626 134018 -28345 43409 12016 -33858 -132278 4782 118504 154066 -150123 194168 -108599
1615 -108599 121592 -26362 -43901 40287 -179529 -105964 -85044 408 -45303 -133458 -65640
1604 -65640 -118074 -27222 94969 -145989 -192432 -153099 -136015 153051 -147873 -176688 -58338
1593 -58338 -152379 65446 -131007 61817 -113831 -67909 61049 -219219 46087 219290
1583 219290 195784 30330 62037 -200567 68353 144020 -145114 11204 46661 145565 -55112
1572 -55112 70837 57605 -224655 -4063 -64136 9898 6209 -202502 95676 3339 20590
1561 20590 -61450 128175 37642 204257 235946 -133451 -80945 83416 18965 -17136 230499
1550 230499 -62159 108883 86129 -92534 -64627 -71532 -274495 -208846 -101003 -126770 -160344
$$ [...]
##END NTUPLES=NMR SPECTRUM
##END=
