##TITLE=abcd
##JCAMPDX= 6.0         $$ Bruker NMR JCAMP-DX V2.0
##DATA TYPE= NMR SPECTRUM
##DATA CLASS= NTUPLES
##ORIGIN= UXNMR, Bruker Analytische Messtechnik GmbH
##OWNER= root
$$ XWIN-NMR		Version 3.5
$$ Wed Jan 21 18:57:51 2026 Russian Standard Time (UT+4h)  servis@DPX200
##.OBSERVE FREQUENCY= 200.131235884673
##.OBSERVE NUCLEUS= ^1H
##.ACQUISITION MODE= SIMULTANEOUS
##.ACQUISITION SCHEME= undefined
##.AVERAGES= 32
##.DIGITISER RES= 18
##SPECTROMETER/DATA SYSTEM= spect
##.PULSE SEQUENCE= zg
##.SOLVENT NAME= CDCl3
##.SHIFT REFERENCE= (INTERNAL, CDCl3, 0, 16.4885)
##AUDIT TRAIL= $$ (NUMBER, WHEN, WHO, WHERE, WHAT)
$$ ##TITLE= Audit trail, XWIN-NMR		Version 3.5
$$ ##JCAMPDX= 5.01
$$ ##ORIGIN= Bruker BioSpin GmbH
$$ ##OWNER= servis
$$ F:\spectra/data/av/nmr/H1/1/pdata/1/auditp.txt
$$ ##AUDIT TRAIL=  $$ (NUMBER, WHEN, WHO, WHERE, WHAT)
(   1,<2026-01-21 18:55:16.29 +0400>,<servis>,<DPX200>,
      <created by zg, POWCHK disabled, PULCHK disabled
       configuration hash MD5:
       00 E9 B6 7A A2 85 ED C7 34 08 36 98 17 FE 4E 26
       data hash MD5: 32K
       7F A5 0F AB 9D 16 A8 E3 8C 70 66 72 CB 97 7E A9>)
(   2,<2026-01-21 18:57:24.48 +0400>,<servis>,<DPX200>,
      <Start of raw data processing
       efp BC_mod = 2 LB = 0.05 FT_mod = 6 PKNL = 1 PHC0 = -258.2463 PHC1 = 6.301564 SI = 16K 
       data hash MD5: 16K
       A3 5D B3 B5 2A 54 12 21 22 AE AA 7A D8 16 2F D4>)
$$ ##END=
$$ 
$$ hash MD5
$$ BA 36 F6 F5 8C 82 5C ED E2 95 A0 AF 38 DF 6B C3
##$RELAX= 
##$RELAX= 
##$RELAX= 
##$RELAX= 
##$RELAX= 
##$RELAX= 
##$RELAX= 
##$RELAX= 
$$ Bruker specific parameters
$$ --------------------------
##$DU= <F:\spectra>
##$EXPNO= 1
##$NAME= <H1>
##$PROCNO= 1
##$TYPE= <nmr>
##$USER= <av>
##$AMP= (0..31)
100 100 100 100 100 100 100 100 100 100 100 100 100 100 100 100 100 100 
100 100 100 100 100 100 100 100 100 100 100 100 100 100 
##$AQSEQ= 0
##$AQ_mod= 1
##$AUNM= <au_zg>
##$AUTOPOS= <>
##$BF1= 200.13
##$BF2= 200.13
##$BF3= 200.13
##$BF4= 200.13
##$BF5= 500.13
##$BF6= 500.13
##$BF7= 500.13
##$BF8= 500.13
##$BYTORDA= 1
##$CFDGTYP= 0
##$CFRGTYP= 5
##$CHEMSTR= <none>
##$CNST= (0..31)
1 1 145 1 1 1 1 1 1 1 1 1 1 1 1 1 1 1 1 1 1 1 1 1 1 1 1 1 1 1 1 1 
##$CPDPRG= <>
##$CPDPRG1= <>
##$CPDPRG2= <>
##$CPDPRG3= <>
##$CPDPRG4= <mlev>
##$CPDPRG5= <mlev>
##$CPDPRG6= <mlev>
##$CPDPRG7= <mlev>
##$CPDPRG8= <mlev>
##$CPDPRGB= <>
##$CPDPRGT= <>
##$D= (0..31)
0 2 0 0 0 0 0 0 0 0.06 0 0 0 0 0 0 0.0002 0 0 0 0 0 0 0 0 0 0 0 0 0 0 
0 
##$DATE= 1769007315
##$DBL= (0..7)
120 120 120 120 120 120 120 120 
##$DBP= (0..7)
150 150 150 150 150 150 150 150 
##$DBP07= 0
##$DBPNAM0= <>
##$DBPNAM1= <>
##$DBPNAM2= <>
##$DBPNAM3= <>
##$DBPNAM4= <>
##$DBPNAM5= <>
##$DBPNAM6= <>
##$DBPNAM7= <>
##$DBPOAL= (0..7)
0.5 0.5 0.5 0.5 0.5 0.5 0.5 0.5 
##$DBPOFFS= (0..7)
0 0 0 0 0 0 0 0 
##$DE= 6
##$DECBNUC= <off>
##$DECIM= 32
##$DECNUC= <off>
##$DECSTAT= 4
##$DIGMOD= 1
##$DIGTYP= 9
##$DL= (0..7)
0 120 120 120 120 120 120 120 
##$DP= (0..7)
150 150 150 150 150 150 150 150 
##$DP07= 0
##$DPNAME0= <>
$$ [...]
##$SUBNAM4= <"">
##$SUBNAM5= <"">
##$SUBNAM6= <"">
##$SUBNAM7= <"">
##$SUBNAM8= <"">
##$SUBNAM9= <"">
##$SW= 20.6817932712277
##$SWIBOX= (0..15)
0 0 3 0 0 0 0 0 0 0 0 0 0 0 0 0 
##$SW_h= 4139.07284768212
##$TD= 32768
##$TD0= 1
##$TE= 0
##$TE2= 300
##$TE3= 300
##$TEG= 300
##$TL= (0..7)
0 120 120 120 120 120 120 120 
##$TP= (0..7)
150 150 150 150 150 150 150 150 
##$TP07= 0
##$TPNAME0= <>
##$TPNAME1= <>
##$TPNAME2= <>
##$TPNAME3= <>
##$TPNAME4= <>
##$TPNAME5= <>
##$TPNAME6= <>
##$TPNAME7= <>
##$TPOAL= (0..7)
0.5 0.5 0.5 0.5 0.5 0.5 0.5 0.5 
##$TPOFFS= (0..7)
0 0 0 0 0 0 0 0 
##$TUNHIN= 0
##$TUNHOUT= 0
##$TUNXOUT= 0
##$USERA1= <user>
##$USERA2= <user>
##$USERA3= <user>
##$USERA4= <user>
##$USERA5= <user>
##$V9= 5
##$VALIST= <valist>
##$VCLIST= <CCCCCCCCCCCCCCC>
##$VD= 0
##$VDLIST= <DDDDDDDDDDDDDDD>
##$VPLIST= <PPPPPPPPPPPPPPP>
##$VTLIST= <TTTTTTTTTTTTTTT>
##$WBST= 1024
##$WBSW= 30
##$XGAIN= (0..3)
0 0 0 0 
##$XL= 0
##$YL= 0
##$YMAX_a= 78860
##$YMIN_a= -34117
##$ZGOPTNS= <>
##$ZL1= 120
##$ZL2= 120
##$ZL3= 120
##$ZL4= 120
##$ABSF1= 0
##$ABSF2= 0
##$ABSG= 0
##$ABSL= 0
##$ALPHA= 0
##$AQORDER= 0
##$ASSFAC= 0
##$ASSFACI= 0
##$ASSFACX= 0
##$ASSWID= 0
##$AUNMP= <proc_1d>
##$AZFE= 0.1
##$AZFW= 0.1
##$BCFW= 0
##$BC_mod= 2
##$BYTORDP= 0
##$COROFFS= 0
##$CY= 18.4799938201904
##$DATMOD= 1
##$DC= 0
##$DFILT= <>
##$DTYPP= 0
##$F1P= 9.9274215381318
##$F2P= -0.165520771350173
##$FCOR= 1
##$FTSIZE= 16384
##$FT_mod= 6
##$GAMMA= 0
##$GB= 0
##$INTBC= 1
##$INTSCL= 4.127829e-11
##$ISEN= 128
##$LB= 0.05
##$LEV0= 0
##$LPBIN= 0
##$MAXI= 10000
##$MC2= 0
##$MEAN= 0
##$ME_mod= 0
##$MI= 50
##$NCOEF= 0
##$NC_proc= -8
##$NLEV= 6
##$NOISF1= 3.799351
##$NOISF2= 2.8
##$NSP= 0
##$NTH_PI= 0
##$NZP= 0
##$OFFSET= 16.48848
##$PC= 4
##$PHC0= -258.2463
##$PHC1= 6.301564
##$PH_mod= 1
##$PKNL= yes
##$PPARMOD= 0
##$PSCAL= 4
##$PSIGN= 0
##$REVERSE= no
##$SF= 200.130005582386
##$SI= 16384
##$SIGF1= 3
##$SIGF2= 2
##$SINO= 400
##$SIOLD= 16384
##$SREGLST= <1H.CDCl3>
##$SSB= 0
##$STSI= 16384
##$STSR= 0
##$SW_p= 4139.07284768211
##$SYMM= 0
##$S_DEV= 0
##$TDeff= 32768
##$TDoff= 0
##$TI= <>
##$TILT= no
##$TM1= 0
##$TM2= 0
##$TOPLEV= 0
##$USERP1= <user>
##$USERP2= <user>
##$USERP3= <user>
##$USERP4= <user>
##$USERP5= <user>
##$WDW= 1
##$XDIM= 16384
##$YMAX_p= 279897236
##$YMIN_p= -2795677
$$ End of Bruker specific parameters
$$ ---------------------------------
##NTUPLES= NMR SPECTRUM
##VAR_NAME=  FREQUENCY,     SPECTRUM/REAL,   SPECTRUM/IMAG
##SYMBOL=    X,             R,               I
##VAR_TYPE=  INDEPENDENT,   DEPENDENT,       DEPENDENT
##VAR_FORM=  AFFN,          ASDF,            ASDF
##VAR_DIM=   16384,         16384,           16384
##UNITS=     HZ,            ARBITRARY UNITS, ARBITRARY UNITS
##FACTOR=    0.252644378177508, 1,           1
##FIRST=     3299.83951724647, 0,            0
##LAST=      -839.233330435636, 0,           0
##MIN=       -839.233330435636, -2795677,    0
##MAX=       3299.83951724647, 279897236,    0
$$ Real data points
##PAGE= N=1
##DATA TABLE= (X++(R..R)), XYDATA
$$ [...]
$$ plain form
9704 708275 884470 904862 748462 307867 -134699 740956 -310423 1013279 204689 430182
9694 430182 563677 1033359 251260 1547744 -459910 -2221289 3276903 173656 1657954
9685 1657954 1171023 1195732 235886 183320 611624 125482 1397135 816575 1467895 1128307
9675 1128307 2187924 -645365 -950526 334990 115300 2002771 -731573 285843 394752
9666 394752 235852 715328 1263142 49513 208813 422686 721931 754979 -111311 1714620
9656 1714620 -580081 283334 293335 -950215 623538 1674073 -95912 -699710 469768
9647 469768 582071 33467 770669 -738670 -289857 -98913 901777 1373905 719850
9638 719850 -84672 -1078625 -9014 -697916 -1033792 1087980 -367065 1171020 648122
$$ packed form
9704G08275J76195K0392j56400m40595m42566Q75655j051379J323702q08590K25493
9694D30182J33495M69682p82099J296484k007654j761379N498192l103247J484298
9685A657954m86931K4709r59846n2566M28304m86142J271653n80560O51320l39588
9675A128307J059617k833289l05161J285516k19690J887471k734344J017416J08909
9666C94752j58900M79476N47814j213629J59300K13873K99245L3048q66290J825931
9656A714620k294701Q63415J0001j243550J573753J050535j769985o03798J169478
9647D69768J12303n48604P37202j509339M48813J90944J000690M72128o54055
9638G19850q04522r93953J069611o88902l35876K121772j455045J538085n22898
$$ plain form
9629 648122 928578 1854152 -289811 2479250 -706968 -1660122 124359 1018734 269804
9620 269804 1388902 -32895 -1501165 -375791 1794421 -45299 890308 1921095 913883
9611 913883 1558223 652693 -1102413 -1178718 510410 -1494803 108508 -696339 365511
9602 365511 1653306 2627092 1394433 1479449 1088838 -303620 -264165 526057 459978 2352300
9592 2352300 980566 1948405 -20726 -16694 -1969862 246502 874412 -1582420 2193572
9583 2193572 58560 393348 959833 -1005454 815499 295888 1195312 908964 -431794
9574 -431794 876361 1519416 388943 1112532 -895781 618031 -407487 214157 -906185
9565 -906185 -346500 823653 533718 1040427 365546 2099940 -40996 -825748 479856
$$ packed form
9629F48122K80456R25574k143963K769061l186218r53154J784481Q94375p48930
9620B69804J119098j421797j468270J125374K170212j839720R35607J030787j007212
9611I13883O44340r05530j755106p6305J689128k005213J603311q04847J061850
9602C65511J287795R73786j232659Q5016l90611j392458L9455P90222o6079J892322
9592B352300j371734R67839j969131M032j953168K216364O27910k456832L775992
9583B193572k135012L34788N66485j965287J820953n19611Q99424k86348j340758
9574d31794J308155O43055j130473P23589k008313J513812j025518O21644j120342
9565i06185N59685J170153k89935N06709o74881J734394k140936p84752J305604
$$ plain form
9556 479856 -746505 40975 1136390 -399080 -833552 1687092 -21863 133447 -350796
9547 -350796 619703 -613599 776468 852610 1376649 55454 581770 561169 1143504 -725943
9537 -725943 -1899571 -768027 50476 272298 -299904 1925003 466783 1146911 1486070
9528 1486070 -771148 368744 221429 1498072 1383355 284640 123555 -253255 703731
9519 703731 1108372 1415448 -795037 1074396 222026 -561958 2285089 760029 -166791
9510 -166791 1914699 52802 1186150 424656 1192779 -419795 2131695 603251 143699
9501 143699 688629 1851474 3809732 4747737 3365448 1514943 70795 1571098 1695232
9492 1695232 872218 2438500 1170855 985037 210917 146729 415251 1994526 1611405
$$ packed form
9556D79856j226361P87480J095415j535470m34472K520644j708955J55310m84243
9547c50796R70499j233302J390067P6142N24039j321195N26316k0601N82335j869447
9537g25943j173628J131544Q18503K21822n72202K224907j458220O80128L39159
9528A486070k257218J139892j47315J276643j14717j098715j61085l76810R56986
9519G03731M04641L07076k210485J869433q52370p83984K847047j525060r26820
9510a66791K081490j861897J133348p61494P68123j612574K551490j528444m59552
9501A43699N44930J162845J958258R38005j382289j850505j444148J500303J24134
9492A695232q23014J566282j267645j85818p74120o4188K68522J579275l83121
$$ plain form
9483 1611405 639062 733076 -1328613 -220160 2057487 203923 1767354 577927 1714610
9474 1714610 589619 -51906 576082 -932196 2844590 266274 1514096 -161603 1469663
9465 1469663 1577782 834279 2158756 -722066 1078619 -66892 -495668 13076 731747
9456 731747 1683484 1807485 2653662 2120002 -599663 524906 283372 -942436 -746990
9447 -746990 315360 775653 804649 1801816 978796 1763216 1133539 -158653 1603223
9438 1603223 381622 12173 1255193 105745 1383405 1361063 1673976 2210637 990884
9429 990884 716619 1076529 417942 227492 741322 1210713 660142 2088924 1035274
9420 1035274 2257023 1658110 416882 -1112159 570308 1295511 1114084 2368135 1510824
$$ packed form
9483A611405r72343R4014k061689J108453K277647j853564J563431j189427J136683
9474A714610j124991o41525O27988j508278L776786k578316J247822j675699J631266
9465A469663J08119p43503J324477k880822J800685j145511m28776N08744P18671
9456G31747R51737J24001Q46177n33660k719665J124569k41534j225808J95446
9447g46990J062350M60293K8996R97167q23020P84420o29677j292192J761876
9438A603223j221601l69449J243020j149448J277660k2342L12913N36661j219753
9429I90884k74265L59910o58587j90450N13830M69391n50571J428782j053650
9420A035274J221749n98913j241228j529041J682467P25203j81427J254051q57311
$$ plain form
9411 1510824 603155 736270 111557 1091819 2877042 1470698 1654918 145425 641610
9402 641610 1460943 583756 2682307 733232 1683736 1878523 1165512 -103995 -839892
9393 -839892 1047704 967282 620853 179814 971826 -811774 -71787 1855070 1413281
9384 1413281 1602348 600061 680741 1050934 -1090839 1247550 1209406 -61412 609415
9375 609415 1077307 12222 1075659 306238 37100 1393994 2052975 2408852 2122260
9366 2122260 1833774 -125795 1980065 -1052210 -139018 1181064 453739 583413 1068145
9357 1068145 1648372 715779 1611084 641788 757666 770678 1140010 1377963 969627 1202297
9347 1202297 1244523 721080 547316 2534921 694766 1251599 1655378 1698630 2262500 1606265
$$ packed form
9411A510824r07669J33115o24713R80262J785223j406344J84220j509493M96185
9402F41610Q19333q77187K098551j949075R50504J94787p13011j269507p35897
9393h39892J887596q0422l46429m41039P92012j783600P39987J926857m41789
9384A413281J89067j002287Q0680L70193k141773K338389l8144j270818O70827
9375F09415M67892j065085J063437p69421k69138J356894O58981L55877k86592
9366B122260k88486j959569K105860l032275R13192J320082p27325J29674M84732
9357A068145N80227r32593Q95305r69296J15878J3012L69332K37953m08336K32670
9347A202297M2226n23443j73764J987605j840155N56833M03779M3252N63870o56235
$$ plain form
9337 1606265 821340 645790 2724934 868899 1496971 1924618 686055 1830675 1326346
9328 1326346 2232236 2010025 1272963 -40252 111463 1594572 1699989 1340677 3483114
9319 3483114 -160823 2143294 770269 1265409 1559474 741053 811619 622494 860654
9310 860654 1685103 1915242 197026 2547322 1629705 1982554 859922 962080 -630682
9301 -630682 1681947 2472174 2933926 832358 2774216 884680 -115471 2114088 591051
9292 591051 2472993 1733756 1126661 514324 144996 1367327 2581590 2781595 1589149
9283 1589149 1882664 536053 1351735 366458 2017621 333741 2447142 339187 3299472
9274 3299472 3242004 2425739 2198578 1817870 493617 635764 2495068 632428 2848690
$$ packed form
9337A606265p84925j75550K079144j856035O28072M27647j238563J144620n04329
9328A326346R05890k22211p37062j313215J51715J483109J05417l59312K142437
9319C483114l643937K304117j373025M95140K94065q18421P0566j89125K38160
9310H60654Q24449K30139j718216K350296r17617L52849j122632J02158j592762
9301f30682K312629P90227M61752k101568J941858j889536j000151K229559j523037
9292E91051J881942p39237o07095o12337l69328J222331J214263K00005j192446
9283A589149K93515j346611Q15682r85277J651163j683880K113401k107955K960285
9274C299472n7468q16265k27161l80708j324253J42147J859304j862640K216262
$$ plain form
9265 2848690 1209727 2092121 2891410 705253 1451109 812467 1916358 1545835 678898
9256 678898 2658310 1591606 1625467 1213842 588407 1043047 1971255 862472 -107601
9247 -107601 1410916 795048 1808862 2586845 2922446 1425745 1052073 623702 1280996
9238 1280996 2394158 851746 1433013 2771227 4459330 218472 3617162 30867
9230 30867 2603112 1318646 2346183 1947088 1657401 1131659 3173323 1888168 464256
9221 464256 3144893 2092970 2860207 1920905 2726253 2175787 2314875 1944186 1570892
9212 1570892 2146697 1076947 2647545 1673095 3341970 1732597 1837632 1620456 2953451
9203 2953451 1712897 2274440 2196266 1012831 1317864 593268 618371 3225720 1509955
$$ packed form
9265B848690j638963Q82394P99289k186157P45856o38642J103891l70523q66937
9256F78898J979412j066704L3861m11625o25435M54640R28208j108783r70073
9247a07601J518517o15868J013814P77983L35601j496701l73672m28371O57294
9238A280996J113162j542412N81267J338214J688103m240858L398690l586295
9230C0867K572245j284466J027537l99095k89687n25742K041664j285155j423912
9221D64256K680637j051923P67237r39302Q05348n50466J39088l70689l73294
9212A570892N75805j069750J570598r74450J668875j609373J05035k17176J332995
9203B953451j240554N61543p8174j183435L05033p24596K5103K607349j715765
$$ plain form
9194 1509955 -476293 1485556 2901713 2732151 2581536 1518605 2064560 1185458 1712020
9185 1712020 1627336 1219441 634845 435202 4549020 2098534 2360708 3546147 1569916
9176 1569916 2759919 2868786 1748000 2168114 4236920 2320365 1604786 3122529 1192297
9167 1192297 3259164 2796570 1159096 582379 1771669 1873142 4032434 3690679 3034262
9158 3034262 2706358 2984052 2974778 1589664 2590091 1367016 2543287 3633445 2567444
9149 2567444 2111262 3159188 2195460 2343962 3131479 3403739 2157722 2259001 4015242
9140 4015242 2892435 3041695 4208809 4837596 2781266 4391553 3153145 3982908 5126665
9131 5126665 3307168 4643125 4034808 4733880 4244680 3819915 4155038 3740951 4029061
$$ packed form
9194A509955j986248J961849J416157j69562j50615j062931N45955q79102N26562
9185A712020q4684m07895n84596j99643M113818k450486K62174J185439j976231
9176A569916J190003J08867j120786M20114K068806j916555p15579J517743j930232
9167A192297K066867m62594j637474n76717J189290J01473K159292l41755o56417
9158C034262l27904K77694r274j385114J000427j223075J176271J090158j066001
9149B567444m56182J047926r63728J48502P87517K72260j246017J01279J756241
9140D015242j122807J49260J167114O28787k056330J610287j238408Q29763J143757
9131E126665j819497J335957o08317O99072m89200m24765L35123m14087K88110
$$ plain form
9122 4029061 4083576 4241002 4362702 5418817 4081169 5069201 5239791 4171137 8105328
9113 8105328 5507602 7387896 5536045 5527314 6703411 7154148 6108751 8464115 9050012
9104 9050012 8190872 9695470 11164188 11232391 13529081 10611875 13454315 12935102 17075764
9095 17075764 17917906 22385741 23031927 25760291 31189391 36725924 54789923 118766406
9087 118766406 216310516 279897236 260001607 171913551 108683226 74285413 51887978
9080 51887978 38930179 28549179 20372702 16674545 13888534 11511456 11292649 11103914
9072 11103914 11310167 9143524 9681214 7976772 6475430 8758943 7402210 8096094 6951484
9063 6951484 7134150 7292455 6302073 6398351 6161477 6535151 4210658 4688854 6540555
$$ packed form
9122D029061N4515J57426J21700J056115j337648R88032J70590j068654L934191
9113H105328k597726J880294j851851q731J176097M50737j045397K355364N85897
9104I050012q59140J504598J468718O8203K296690k917206K842440n19213M140662
9095A7075764Q42142M467835O46186K728364N429100N536533J8063999O3976483
9087A18766406R7544110O3586720j9895629q8088056o3230325l4397813k2397435
9080E1887978j2957799j0381000q176477l698157k786011k377078k18807j88735
9072A1103914K06253k166643N37690j704442j501342K283513j356733O93884j144610
9063F951484J82666J58305r90382R6278k36874L73674k324493M78196J851701
$$ plain form
9054 6540555 5526997 8319623 6063644 5001237 5609513 3332357 7103655 5073178
9046 5073178 6572604 5179655 4511345 5385197 3903261 4224899 2446849 4980872 4440259
9037 4440259 3484181 4076137 3132964 3722953 3700150 3951514 3891811 2695314 2860069 3032382
9027 3032382 3394484 3934648 4449742 3745197 3533841 3867072 1630586 2148298 2471828
9018 2471828 1433417 1856163 3728097 3480486 2059621 3058727 3492946 1377059 3878763
9009 3878763 2377059 1541978 2374109 2607489 4052760 3268020 2197709 1388526 3440282
9000 3440282 2506393 2900037 2109416 2280751 1692763 2726214 1936648 2278156 2349510 1967306
8990 1967306 2580435 1941553 3165999 1820410 2299527 1942550 -522787 1771094 1449430
$$ packed form
9054F540555j013558K792626k255979j062407O08276k277156L771298k030477
9046E073178J499426j392949o68310Q73852j481936L21638j778050K534023n40613
9037D440259r56078N91956r43173N89989k2803K51364n9703j196497J64755J72313
9027C032382L62102N40164N15094p04545k11356L33231k236486N17712L23530
9018B471828j038411M22746J871934k47611j420865R99106M34219k115887K501704
9009C878763j501704q35081Q32131K33380J445271p84740j070311q09183K051756
9000C440282r33889L93644p90621J71335n87988J033451p89566L41508P1354l82204
8990A967306O13129o38882J224446j345589M79117l56977k465337K293881l21664
$$ plain form
8981 1449430 2176533 3580380 750203 1516646 1902714 3204538 2448622 2643070 2434505
8972 2434505 -1136948 1831021 1048623 1686299 2595589 1706851 789002 564769 911301
8963 911301 -463674 2494312 2034264 517751 3583242 1700786 1765814 1369203 1482077
8954 1482077 -259305 1156393 869422 1144660 1775423 1250985 3223351 1423183 1541606
8945 1541606 -1069777 2638338 1190305 749341 1321814 2461279 2463240 1710599 2040992
8936 2040992 1299682 988872 1578297 1960324 2257272 2159009 1262832 2113396 2283416 1786670
8926 1786670 2619653 -899330 1271084 -563445 2771265 1493184 567336 1599463 987368
8917 987368 -100339 1015697 -230791 -1149283 2487939 691456 1468353 1971054 1060727
$$ packed form
8981A449430P27103J403847k830177P66443L86068J301824p55916J94448k08565
8972B434505l571453K967969p82398O37676R09290q88738r17849k24233L46532
8963I11301j374975K957986m60048j516513L065491j882456O5028l96611J12874
8954A482077j741382J415698k86971K75238O30763n24438J972366j800168J18423
8945A541606k611383L708115j448033m40964N72473J139465J961p52641L30393
8936B040992p41310l10810N89425L82027K96948r8263q96177Q50564J70020m96746
8926A786670Q32983l518983K170414j834529L334710j278081r25848J032127o12095
8917I87368j087707J116036j246488r18492L637222j796483P76897N02701r10327
$$ plain form
8908 1060727 656465 -588248 1665120 121451 2127537 1419232 661737 1719704 1638860
8899 1638860 2022916 539690 2530824 479198 1328961 1484469 2382356 1244875 631367
8890 631367 70944 898979 -859360 1539892 1764230 952020 2081218 1646752 1515766
8881 1515766 2242602 -186674 1684126 -569734 2324783 -144027 1846428 1660461 1141072
8872 1141072 2920062 2350978 1637199 1135888 1492215 1751219 1023847 1527513 482033
8863 482033 1968227 2055646 1296536 1241620 824581 19230 1396458 1018707 2445761 1238719
8853 1238719 1698025 1328754 1922842 -276007 774023 288799 4053807 2381152 1762818
8844 1762818 610391 1246853 1218862 313196 1152706 948943 476086 2498635 2757983
$$ packed form
8908A060727m04262j244713K253368j543669K006086p08305p57495J057967q0844
8899A638860L84056j483226J991134k051626Q49763J55508Q97887j137481o13508
8890F31367n60423Q28035j758339K399252K24338q12210J129198m34466j30986
8881A515766P26836k429276J870800k253860K894517k468810J990455j85967n19389
8872A141072J778990n69084p13779n01311L56327K59004p27372N03666j045480
8863D82033J486194Q7419p59110n4916m17039q05351J377228l77751J427054j207042
8853A238719M59306l69271N94088k198849J050030m85224L765008j672655o18334
8844A762818j152427O36462k7991r05666Q39510k03763m72857K022549K59348
$$ plain form
8835 2757983 1006535 191537 1234785 515951 2038934 979855 610968 4075181 720494
8826 720494 1813375 1291654 1391546 1457162 912229 2007989 293457 1960788 987536
8817 987536 2041347 2888734 1610754 847120 212820 1175932 1161901 1408437 1676947 2381374
8807 2381374 775198 1137330 2867114 1537907 990400 1900964 -584488 1636493 2748513
8798 2748513 1457909 2278218 930311 1448040 1879425 1126219 1261858 406205 3018702
8789 3018702 1183886 2323975 898739 1688144 490056 226078 401173 1213730 1161832
8780 1161832 2476578 1092728 2145748 210133 580241 2144899 1427236 1896852 217275
8771 217275 1967795 1628488 2895513 2149815 1100526 1377287 -951900 653477 1003152
$$ packed form
8835B757983j751448q14998J043248p18834J522983j059079l68887L464213l354687
8826G20494J092881n21721R9892O5616n44933J095760j714532J667331r73252
8817I87536J053811Q47387j277980p63634o34300R63112j4031K46536K68510P04427
8807B381374j606176L62132J729784j329207n47507R10564k485452K220981J112020
8798B748513j290604Q20309j347907N17729M31385p53206J35639q55653K612497
8789C018702j834816J140089j425236P89405j198088k63978J75095Q12557n1898
8780A161832J314746j383850J053020j935615L70108J564658p17663M69616j679577
8771B17275J750520l39307J267025p45698j049289K76761k329187J605377L49675
$$ plain form
8762 1003152 -439861 1685011 1781505 781728 1239358 777040 2254277 1801587 353087
8753 353087 81576 1154632 1312564 1700033 3672011 2144038 1879869 -7032 511191
8744 511191 548336 2348419 847770 2837178 1566440 -516899 707198 892682 1113263
8735 1113263 1296285 1961232 1274964 1685563 2265485 1483163 1622433 2890063 -78353
8726 -78353 682771 1215935 1412675 1957258 1723882 1354448 1995829 607670 485572 3214263
8716 3214263 1077286 2057784 572121 2001105 939661 2062438 -319927 2449013
8708 2449013 47181 215282 1481761 -113419 1198218 548544 2735517 1760025 1878073
8699 1878073 454003 749287 834978 1381469 365799 422726 991971 -703971 767760
$$ packed form
8762A003152j443013K124872R6494r99777M57630m62318J477237m52690j448500
8753C53087k71511J073056J57932L87469J971978j527973k64169j886901N18223
8744E11191L7145J800083j500649J989408j270738k083339J224097J85484K20581
8735A113263J83022O64947o86268M10599N79922p82322J39270J267630k968416
8726g8353P61124N33164J96740N44583k33376l69434O41381j388159j22098K728691
8716C214263k136977R80498j485663J428984j061444J122777k382365K768940
8708B449013k401832J68101J266479j595180J311637o49674K186973r75492J18048
8699A878073j424070K95284Q5691N46491j015670N6927N69245j695942J471731
$$ plain form
8690 767760 183672 2260180 233037 1718757 716086 1564431 1957657 1892339 -1383
8681 -1383 2161435 77310 1177604 1968515 -33812 3028117 -1789491 1813450 960789
8672 960789 22772 1291269 2315290 2084186 1816789 2295426 2300846 593261 2017625
8663 2017625 490794 1149247 700475 1830034 804325 109390 2225016 8632 1439484
8654 1439484 -96323 -262335 326686 -358868 2011048 1961317 1555361 1626436 1433999 578768
8644 578768 1621404 223588 1920082 738907 1820700 -629205 1748673 1135236 576961
8635 576961 3177319 -1810718 1476719 191514 244624 2370781 275178 1764018 575988
8626 575988 2637911 1957478 1335900 1425256 1071100 1095574 398376 -581859 514391 444250
$$ packed form
8690G67760n84088K076508k027143J485720j002671Q48345L93226o5318j893722
8681a383K162818k084125J100294P90911k002327L061929m817608L602941q52661
8672I60789r38017J268497J024021k31104k67397M78637N420j707585J424364
8663B017625j526831O58453m48772J129559j025709o94935K115626k216384J430852
8654A439484j535807j66012N89021o85554K369916m9731m05956P1075j92437q55231
8644E78768J042636j397816J696494j181175J081793k449905K377878o13437n58275
8635E76961K600358m988037L287437j285205N3110K126157k095603J488840j188030
8626E75988K061923o80433o21578Q9356l54156K4474o97198r80235J096250p0141
$$ plain form
8616 444250 2001376 760988 1131332 712104 2369116 1226763 2644217 3969105 1256513
8607 1256513 579842 780872 860139 1667294 400365 1042727 -980392 2140918 2838045
8598 2838045 2152113 249547 1011168 -209302 1038100 1996723 1345043 190271 1542915
8589 1542915 1111332 -316820 1261487 -89481 288638 98614 2541253 -472118 1721029
8580 1721029 1993916 382600 1437166 167832 1550474 1357913 916885 1653701 762354
8571 762354 1420354 2352784 725829 989547 920758 1286291 776029 805011 239080 111594
8561 111594 1771547 -215335 2193076 896518 -178542 1842667 376848 1067391 -581860
8552 -581860 1500052 584709 2199756 213012 1291620 -242934 774595 -54811 -14674
$$ packed form
8616D44250J557126j240388L70344m19228J657012j142353J417454J324888k712592
8607A256513o76671K01030P9267Q07155j266929O42362k023119L121310O97127
8598B838045o85932j902566P61621j220470J247402R58623o51680j154772J352644
8589A542915m31583j428152J578307j350968L78119j90024K442639l013371K193147
8580A721029K72887j611316J054566j269334J382642j92561m41028P36816q91347
8571G62354O58000R32430j626955K63718o8789L65533n10262K8982n65931j27486
8561A11594J659953j986882K408411j296558j075060K021209j465819O90543j649251
8552e81860K081912r15343J615047j986744J078608j534554J017529q29406M0137
$$ plain form
8543 -14674 1349923 165440 2489601 1358221 1584066 996454 1735345 1762915 450786
8534 450786 545610 76808 2595175 1442334 1173823 -489159 1733436 310720 1997859
8525 1997859 10705 -368062 954844 803574 1355934 2743478 1492262 971788 1030091
8516 1030091 1316417 107224 691247 656418 170812 1549315 -1380984 1115866 253309
8507 253309 1143335 1123303 1309468 1129330 -144288 1118569 -168215 1600421 817850
8498 817850 845067 268687 1548729 850552 1153347 1010746 1969682 1283567 1232814 -696507
8488 -696507 2306815 956853 1963268 1139032 596441 -1165471 -174346 526915 990540
8479 990540 1537466 1711441 324296 763959 825348 793212 3137818 -981274 1921584
$$ packed form
8543a4674J364597j184483K324161j131380K25845n87612P38891K7570j312129
8534D50786R4824m68802K518367j152841k68511j662982K222595j422716J687139
8525A997859j987154l78767J322906j51270N52360J387544j251216n20474N8303
8516A030091K86326j209193N84023l4829m85606J378503k930299K496850q62557
8507B53309Q90026k0032J86165j80138j273618J262857j286784J768636p82571
8498H17850K7217n76380J280042o98177L02795j42601R58936o86115n0753j929321
8488f96507L003322j349962J006415q24236n42591j761912R91125P01261M63625
8479I90540N46926J73975j387145M39663O1389l2136K344606m119092K902858
$$ plain form
8470 1921584 465656 1537437 342632 908261 382263 1005762 504962 922616 1762192
8461 1762192 1398760 484756 109562 2476021 362759 1411840 1232182 1750553 949054
8452 949054 323446 252385 -55911 605821 -565580 2687355 1396757 1026903 932601 1664794
8442 1664794 1261849 1226169 959105 870785 1592213 1798589 1565008 481788 1781742 134168
8432 134168 1489934 2861022 1709421 1233773 641754 820403 1240227 1195274 2661439
8423 2661439 2833718 630299 857947 1191933 304276 1683869 1557863 1278792 -135379
8414 -135379 2195854 484412 3081508 1389281 625808 287916 333801 494327 1510913
8405 1510913 1968960 -50840 1088739 -84524 494210 1012435 771765 2584658 149342
$$ packed form
8470A921584j455928J071781j194805N65629n25998O23499n00800M17654Q39576
8461A762192l63432r14004l75194K366459k113262J049081j79658N18371q01499
8452I49054o25608p1061l08296O61732j171401L252935j290598l69854r4302P32193
8442A664794m02945l5680k67064q8320P21428K06376k33581j083220J299954j647574
8432A34168J355766J371088j151601m75648n92019J78649M19824m4953J466165
8423B661439J72279k203419K27648L33986q87657J379593j26006k79071j414171
8414a35379K331233j711442K597096j692227p63473l37892M5885J60526J016586
8405A510913M58047k019800J139579j173263N78734N18225k40670J812893k435316
$$ plain form
8396 149342 2501305 1706975 -397700 1249607 -156845 266906 1688310 451697 2108330
8387 2108330 608398 2981457 492710 106142 2645928 -376262 1244263 604643 3738287
8378 3738287 491769 1067931 2524778 466670 -145092 799127 193578 814099 916103
8369 916103 1846948 1651293 2194038 2270382 297680 981777 2331621 1032330 669323
8360 669323 1041371 -307319 -990450 619787 -184038 2000706 1166602 1356665 1892843
8351 1892843 736035 1265965 -1168189 498733 741126 84361 1523423 -359834 -552539
8342 -552539 -75890 2321666 1696767 1593243 2461263 -1334865 -795719 612241 66202
8333 66202 1482675 494564 1181885 -843696 2124649 1569515 1609625 2226713 1537605 1493589
$$ packed form
8396A49342K351963p94330k104675J647307j406452M23751J421404j236613J656633
8387B108330j499932K373059k488747l86568K539786l022190J620525o39620L133644
8378C738287l246518N76162J456847k058108o11762R44219o05549O20521J02004
8369I16103R30845j95655N42745P6344j972702O84097J349844j299291l63007
8360F69323L72048j348690o83131J610237q03825K184744q34104J90063N36178
8351A892843j156808N29930k434154J666922K42393o56765J439062j883257j92705
8342e52539M76649K397556o24899j03524Q68020l796128N39146J407960n46039
8333F6202J416473r88111O87321k025581K968345n55134M0110O17088o89108m4016
$$ plain form
8323 1493589 443976 1722876 869517 1702513 199325 571087 712654 -263937 745839
8314 745839 -1152533 969833 2599825 1140086 1997948 694427 137097 141574 662439
8305 662439 280787 1053415 -22812 -672164 1276444 1618978 178759 425011 2150601
8296 2150601 971597 3897537 1892343 1083535 -250652 -381960 -245190 -285677 948465
8287 948465 1345073 2653348 2464303 -447705 1289220 -939598 419903 185281 786615
8278 786615 505898 1381640 796252 1453426 255946 -342480 840412 379446 306625 297696
8268 297696 1922110 -113814 3090731 896052 -1126077 1351406 -302413 817111
8260 817111 425527 471876 1979985 566144 3341038 702198 2977069 821436 216832
$$ packed form
8323A493589j049613J278900q53359Q32996j503188L71762J41567r76591J009776
8314G45839j898372K122366J629992j459739Q57862j303521n57330M477N20865
8305F62439l81652P72628j076227o49352J948608L42534j440219K46252J725590
8296B150601j179004K925940k005194q08808j334187j31308J36770m0487J234142
8287I48465L96608J308275j89045k912008J736925k228818J359501k34622O01334
8278G86615k80717Q75742n85388O57174j197480n98426J182892m60966p2821q929
8268B97696J624414k035924L204545k194679k022129K477483j653819J119524
8260H17111l91584M6349J508109j413841K774894k638840K274871k155633o04604
$$ plain form
8251 216832 1611713 -494370 1065878 1112397 2719065 1036552 392596 2013621 -662380
8242 -662380 3057913 -433432 1832386 794048 278456 76124 -20565 1604764 -702919
8233 -702919 3182893 128242 483458 -703499 645808 2442053 1085420 1097854 -213721
8224 -213721 -1486030 646811 -19108 1247036 1324909 1936155 1168374 2026105 424336
8215 424336 -867434 822346 -221014 1441492 785931 1128907 1117789 1815903 456610
8206 456610 175129 -998390 551404 1637581 -715752 2317692 276734 2817960 1330327
8197 1330327 2958219 -492960 363407 583115 333028 10490659 515090 22491 -151443
8188 -151443 1524894 -771768 1459085 320451 45234 1011328 697726 2542398 1449823
$$ packed form
8251B16832J394881k106083J560248M6519J606668j682513o43956J621025k676001
8242f62380L720293l491345K265818j038338n15592k02332r6689J625329k307683
8233g02919L885812l054651L55216j186957J349307J796245j356633J2434j311575
8224b13721j272309K132841o65919J266144P7873O11246p67781Q57731j601769
8215D24336j291770J689780j043360J662506o55561L42976j1118O98114j359293
8206D56610k81481j173519J549794J086177k353333L033444k040958K541226j487633
8197A330327J627892l451179Q56367K19708k50087J0157631r975569m92599j73934
8188a51443J676337k296662K230853j138634k75217R66094l13602J844672j092575
$$ plain form
8179 1449823 408237 -435234 8451 -185206 -86610 352645 440244 1112973 1876108 1045843
8169 1045843 2133982 1819093 984484 488238 380673 -594866 1003536 1275569 835799
8160 835799 1290625 506228 932276 1746498 277731 2417049 630365 746767 77323
8151 77323 -427126 916165 2129310 -534222 154325 625054 1057340 238828 1119076
8142 1119076 1499702 2635320 139133 929148 143421 772670 -1347386 -498340 2088762
8133 2088762 765699 2523457 -1149548 2139014 86858 1595944 760123 1913352
8125 1913352 -328304 573119 324280 1448855 797131 1848430 -382617 1175264 613747
8116 613747 -104775 -26376 558865 396829 -981090 1617807 886542 1265700 1308194 616874
$$ packed form
8179A449823j041586q43471M43685j93657R8596M39255Q7599O72729P63135q30265
8169A045843J088139l14889q34609m96246j07565r75539J598402K72033m39770
8160H35799M54826p84397M26048Q14222j468767K139318j786684J16402o69444
8151G7323n04449J343291J213145k663532O88547M70729M32286q18512Q80248
8142A119076L80626J135618k496187P90015p85727O29249k120056Q49046K587102
8133B088762j323063J757758l673005L288562k052156J509086q35821J153229
8125A913352k241656R01423k48839J124575o51724J051299k231047J557881n61517
8116F13747p18522P8399N85241j62036j377919K598897p31265L79158M2494o91320
$$ plain form
8106 616874 802190 717170 -665735 1528259 -3018 180431 479055 -747198 380829
8097 380829 347007 949685 636512 1244241 1231039 803140 1331508 -194553 839483 93843
8087 93843 825974 36173 2215958 114396 1850930 2149451 -160721 956578 1669515
8078 1669515 589839 42907 100177 -58247 454973 1388779 -173548 281499 280825 59318
8068 59318 873109 -156240 2120986 -447202 586076 139465 1314136 -163389 952834
8059 952834 1591772 390532 597269 -370359 -450343 745411 1439135 1299927 1025322 793970
8049 793970 1157878 582293 2129686 377722 2404127 14304 838500 350496 -44089
8040 -44089 1279384 265905 1061878 254109 -342560 -510220 -108096 280223 2203771
$$ packed form
8106F16874J85316q5020j382905K193994j531277J83449K98624j226253J128027
8097C80829l3822O02678l13173O07729j3202m27899N28368j526061J034036p45640
8087I3843P32131p89801K179785k101562J736534K98521k310172J117299P12937
8078A669515j079676n46932N7270j58424N13220R33806j562327M55047o74k21507
8068E9318Q13791j029349K277226k568188J033278m46611J174671j477525J116223
8059I52834O38938j201240K06737r67628p9984J195754O93724j39208k74605k31352
8049G93970L63908n75585J547393j751964K026405k389823Q24196m88004l94585
8040d4089J323473j013479P95973q07769n96669j67660M02124L88319J923548
$$ plain form
8031 2203771 3449643 506186 -447678 -42329 -620454 1627463 1837630 329198 317082
8022 317082 -677894 -70481 711720 1833641 1272687 -1394898 2248724 -126403 809636
8013 809636 485095 416215 507993 1298361 2108907 876970 1321794 -972848 266442 -151999
8003 -151999 194354 -284513 846489 1762715 2011020 615802 1396847 1567111 696795
7994 696795 1770700 -508471 1052516 867380 111001 137392 1049216 -1326210 720080
7985 720080 1178295 2553746 1032415 2515464 1243165 1487647 136498 145292 60406
7976 60406 482480 2972897 1139634 1297175 1485006 1366804 941506 2797255 783841
7967 783841 78093 241279 530582 55474 -23053 -731289 29413 4101497 1374019 1428894
$$ packed form
8031B203771J245872k943457r53864M05349n78125K247917K10167j508432j2116
8022C17082r94976O07413P82201J121921n60954k667585L643622k375127R36039
8013H09636l24541o8880R1778P90368Q10546j231937M44824k294642J239290m18441
8003a51999L46353m78867J131002R16226K48305j395218P81045J70264q70316
7994F96795J073905k279171J560987j85136p56379K6391R11824k375426K046290
7985G20080M58215J375451j521331J483049j272299K44482j351149Q794q4886
7976F0406M22074K490417j833263J57541J87831j18202m25298J855749k013414
7967G83841p05748J63186K89303m75108p8527p08236P60702M072084k727478N4875
$$ plain form
7957 1428894 142760 1615319 149544 2013264 1061289 -645152 1087367 1163225 168517
7948 168517 551380 -1134817 -457271 1195056 592128 995930 511871 1525148 1175129
7939 1175129 935946 -624945 1077140 -1158983 869592 2117408 1622298 240163 658924
7930 658924 250275 684579 1396968 314123 2018175 534224 1383557 651133 1554210
7921 1554210 892469 -248960 1757114 420809 1216516 1108783 1092381 1073187 231796
7912 231796 1427105 12880 1492651 2532684 880101 1807557 -9048 36097 553062
7903 553062 542164 -22278 -388100 1067461 1129830 426953 1622931 1525099 1760346 660013
7893 660013 -563772 309181 -152242 1782951 -208926 1981346 888287 1379224 1100243
$$ packed form
7957A428894j286134J472559j465775J863720r51975j706441J732519P5858r94708
7948A68517L82863j686197O77546J652327o02928M03802m84059J013277l50019
7939A175129k39183j560891J702085k236123K028575J247816m95110j382135M18761
7930F58924m08649M34304P12389j082845J704052j483951Q49333p32424R03077
7921A554210o61741j141429K006074j336305P95707j07733j6402j9194q41391
7912B31796J195309j414225J479771J040033j652583R27456j816605M5145N16965
7903E53062j0898n64442l65822J455561O2369p02877J195978r7832K35247j100333
7893F60013j223785Q72953m61423J935193j991877K190272j093059M90937k78981
$$ plain form
7884 1100243 991675 -469530 -801946 720909 1806506 2045870 2118342 947318 1402325
7875 1402325 496615 -97198 1623846 -344179 -466392 655911 179570 333287 537280
7866 537280 -633403 -299097 1998331 1091126 15185 114131 551581 -443135 -122690
7857 -122690 1216826 383940 -1508054 958949 240523 -127466 -680448 -822113 113682
7848 113682 5532564 890493 387477 963970 1399199 684156 1276389 1004112 1803503
7839 1803503 744615 1720285 1252447 1325193 1640541 473069 560810 2465884 -824679
7830 -824679 213065 1067124 -392617 -528991 489577 -1392475 1297573 990535 1575214
7821 1575214 3107769 2220433 -960009 194774 389030 -99457 909722 -1457741 1652631
$$ packed form
7884A100243j08568j461205l32416J522855J085597K39364P2472j171024M55007
7875A402325r05710n93813J721044j968025j22213J122303m76341J53717K03993
7866E37280j170683L34306K297428r07205j075941R8946M37450r94716L20445
7857a22690J339516q32886j891994K467003p18426l67989n52982j41665R35795
7848A13682N418882m642071n03016N76493M35229p15043N92233k72277P99391
7839A803503j058888R75670m67838P2746L15348j167472Q7741J905074l290563
7830h24679J037744Q54059j459741j36374J018568j882052K690048l07038N84679
7821A575214J532555q87336l180442J154783J94256m88487J009179k367463L110372
$$ plain form
7812 1652631 -224886 1033870 2306912 2110394 1162437 -2268676 1302873 1997878 305201
7803 305201 1366411 685721 705908 1161496 1243008 2009711 1282912 -81377 -236933 908883
7793 908883 1756561 1375997 -1186592 2707208 361626 1271469 -151055 1769936 1152903
7784 1152903 189603 1791734 1518992 737307 356291 -698247 446301 1002147 482181
7775 482181 1800425 1571734 2355262 315101 784133 -493422 -182828 943250 857541
7766 857541 525360 2104210 369924 1923204 995091 474108 152131 -429748 1230211
7757 1230211 811729 -413760 231766 639664 2167298 -74316 3455063 1703575 1268665
7748 1268665 1045406 -426742 797581 -1439015 694667 142056 2045026 370001 1568902
$$ packed form
7812A652631j877517J258756J273042j96518r47957l431113L571549O95005j692677
7803C05201J061210o80690K0187M55588Q1512P66703p26799j364289j55556J145816
7793I08883Q47678l80564k562589L893800k345582R09843j422524J920991o17033
7784A152903r63300J602131k72742p81685l81016j054538J144548N55846n19966
7775D82181J318244k28691P83528k040161M69032j277555L10594J126078q5709
7766H57541l32181J578850j734286J553280r28113n20983l21977n81879J659959
7757A230211m18482j225489O45526M07898J527634k241614L529379j751488m34910
7748A268665k23259j472148J224323k236596K133682n52611J902970j675025J198901
$$ plain form
7739 1568902 2207050 823380 1390587 -218512 2253797 1920265 604358 580681 1026911
7730 1026911 1319859 -1062854 -602684 678109 44811 2868198 3200915 2577610 435244
7721 435244 -264435 -1077186 638650 -788101 -220595 1085733 78289 756148 1465024
7712 1465024 -418400 2780509 586362 -483005 1040617 584107 1469328 1224402 -706318
7703 -706318 -524534 -1137489 331544 -71403 1489380 -15111 521251 2039233 -945258
7694 -945258 2431890 394257 1592132 -100941 111657 -172546 -713453 -475825 480799
7685 480799 1986861 1769916 1406314 1534183 3450951 1671347 699793 720174 2121519
7676 2121519 -570978 788987 -303632 -245047 1421364 45681 130375 1149823 2034347
$$ packed form
7739A568902O38148j383670N67207j609099K472309l33532j315907k3677M46230
7730A026911K92948k382713M60170J280793o33298K823387L32717o23305k142366
7721D35244o99679q12751J715836j426751N67506J306328j007444O77859P08876
7712A465024j883424L198909k194147j069367J523622m56510Q85221k44926j930720
7703g06318J81784o12955J469033m02947J560783j504491N36362J517982k984491
7694i45258L377148k037633J197875j693073K12598k84203n40907K37628R56624
7685D80799J506062k16945l63602J27869J916768j779604r71554K0381J401345
7676B121519k692497J359965j092619N8585J666411j375683Q4694J019448Q84524
$$ plain form
7667 2034347 383157 1651797 1877963 1694641 676233 63129 1308341 -695213 1013166
7658 1013166 556889 715615 828650 623504 1319720 1885581 637629 257899 1684840
7649 1684840 62051 964452 -223406 1666663 12465 1632230 213246 918480 613329
7640 613329 429374 1560100 -488594 2612915 -1440512 1329525 149014 1413635 943797
7631 943797 1107414 964152 2935814 290633 2136232 835576 -255398 164919 979731
7622 979731 1726263 1897535 -965 1105045 -702924 1500945 981344 1072745 -529002
7613 -529002 -375919 135559 1636828 1459430 1510713 2144335 2267463 751048 1205814 1822851
7603 1822851 1405752 796957 991845 1282063 1449069 1327656 2317273 1774973 1131806 806423
$$ packed form
7667B034347j651190J268640K26166j83322j018408o13104J245212k003554J708379
7658A013166m56277J58726J13035k05146O96216N65861j247952l79730J426941
7649A684840j622789R02401j187858J890069j654198J619765j418984P05234l05151
7640F13329j83955J130726k048694L101509m053427K770037j180511J264621m69838
7631I43797J63617j43262J971662k645181J845599j300656j090974M20317Q14812
7622I79731P46532J71272j898500J106010j807969K203869n19601R1401j601747
7613e29002J53083N11478J501269j77398N1283O33622J23128j516415M54766O17037
7603A822851m17099o08795J94888K90218J67006j21413R89617n42300o43167l25383
$$ plain form
7593 806423 -323290 1446169 -57144 1462747 1449084 1001969 2351487 1556648 2229924
7584 2229924 -162180 2254332 -512721 1372640 -823460 1042707 294868 1485936
7576 1485936 1183152 138033 1838721 2033736 2551284 665572 2129048 1032150 1105124
7567 1105124 441598 2160785 690038 1541993 1173421 1490328 3234483 523646 1495821
7558 1495821 1075248 2611400 1834240 1600850 3163164 1116335 488586 1028847 762626
7549 762626 1014383 362389 1106645 1207428 1023195 736321 1318346 1234010 391271 920922
7539 920922 507483 1824974 1281018 1386768 586714 87871 1232377 1623836 752671
7530 752671 1697656 2214738 1443356 2808670 2034761 1620926 -161596 441270 -385875
$$ packed form
7593H06423j129713J769459j503313J519891j3663m47115J349518p94839O73276
7584B229924k392104K416512k767053J885361k196100J866167p47839J191068
7576A485936l02784j045119J700688J95015N17548j885712J463476j096898P2974
7567A105124o63526J719187j470747Q51955l68572L16907J744155k710837R72175
7558A495821m20573J536152p77160k33390J562314k046829o27749N40261k66221
7549G62626K51757o51994P44256J00783j84233k86874N82025q4336q42739N29651
7539I20922m13439J317491n43956J05750q00054m98843J144506L91459q71165
7530G52671R44985N17082p71382J365314p73909m13835j782522O02866q27145
$$ plain form
7521 -385875 1532119 188812 1573225 1266711 462049 2830339 -257556 1583249 1028108
7512 1028108 546430 1571054 1516012 2788623 1140899 1219976 938511 -472311 572926
7503 572926 255918 1870134 703953 1569582 574205 2649171 921429 1373007 1447907
7494 1447907 1375221 2299877 1433282 1344121 1089144 -832020 450109 295801 -827736
7485 -827736 2614378 2148095 2032676 2281948 892067 -80384 1131653 430840 1919144
7476 1919144 1063743 2332288 651460 -969821 2039450 -20317 1510955 129552
7468 129552 798709 644052 2694784 846387 920297 1398656 644624 1062214 -1104087
7459 -1104087 2196904 -680035 1077528 1788316 1411358 263634 -31670 97870 1140826
$$ packed form
7521c85875J917994j343307J384413l06514q04662K368290l087895J840805n55141
7512A028108m81678J024624n5042J272611j647724P9077k81465j410822J045237
7503E72926l17008J614216j166181Q65629r95377K074966j727742M51578P4900
7494A447907p2686R24656q66595q9161k54977j921164J282129j54308j123537
7485h27736L442114m66283j15419K49272j389881r72451J212037p00813J488304
7476A919144q55401J268545j680828j621281L009271k059767J531272j381403
7468A29552O69157j54657K050732j848397P3910M78359p54032M17590k166301
7459a104087L300991k876939J757563P10788l76958j147724k95304J29540J042956
$$ plain form
7450 1140826 2330565 1488735 1090891 359655 1865754 1263408 1785875 617910 389053
7441 389053 1203644 1136241 -102760 2393762 860929 218050 1580635 526968 1348849
7432 1348849 645210 2195918 186836 957110 2152917 2068674 2370291 1638345 1703287
7423 1703287 1864702 1373964 -122600 1121352 1278578 2556422 1641538 1567652 1037985
7414 1037985 -301788 -1035385 717961 1757648 1852197 3338386 1088662 2103959 1524155
7405 1524155 230849 1983494 2493201 2616955 1669948 2098949 2044434 3089754 3242857
7396 3242857 5348284 4809741 5909992 5192242 7406471 6636357 6172088 6725138 5930083
7387 5930083 4486443 1065663 3934996 3324409 4096212 3555625 2616178 1033849 1396389
$$ packed form
7450A140826J189739q41830l97844p31236J506099o02346N22467j167965k28857
7441C89053Q14591o7403j239001K496522j532833o42879J362585j053667Q21881
7432A348849p03639J550708k009082P70274J195807q4243L01617p31946O4942
7423A703287J61415m90738j496564J243952J57226J277844r14884p3886n29667
7414A037985j339773p33597J753346J039687R4549J486189k249724J015297n79804
7405A524155j293306J752645N09707J23754r47007M29001n4515J045320J53103
7396C242857K105427n38543J100251p17750K214229p70114m64269N53050p95055
7387E930083j443640l420780K869333o10587P71803n40587r39447j582329L62540
$$ plain form
7378 1396389 3031698 1140022 2153006 1097160 976999 1742197 2600381 -138896 707642
7369 707642 1549785 902088 1760090 1666386 1033566 2011277 1627391 2199046 1556376 724654
7359 724654 176632 490139 148496 1881985 567645 3129485 1510109 1329787 916491
7350 916491 925969 1372704 500270 636029 87824 360865 576104 993103 1922203 -6133
7340 -6133 1121801 -689935 848656 -875413 1316857 224099 1781693 2479862 -40516
7331 -40516 1928447 -100615 -56912 627809 -1021798 963024 2545000 2214575 949650
7322 949650 1185625 -1378536 386276 138490 -322718 575100 662988 1939702 1659482
7313 1659482 1249655 1032139 1839824 2683113 999550 1772407 -753828 1034874 1008966
$$ packed form
7378A396389J635309j891676J012984j055846j20161P65198Q58184k739277Q46538
7369G07642Q42143o47697Q58002r3704o32820R77711l83886N71655o42670q31722
7359G24654n48022L13507l41643J733489j314340K561840j619376j80322m13296
7350I16491R478M46735q72434J35759n48205K73041K15239M16999R29100j928336
7340f133J127934j811736J538591j724069K192270j092758J557594O98169k520378
7331d0516J968963k029062M3703O84721j649607J984822J581976l30425j264925
7322I49650K35975k564161J764812k47786m61208Q97818Q7888J276714k80220
7313A659482m09827k17516Q07685Q43289j683563P72857k526235J788702k5908
$$ plain form
7304 1008966 1349668 266127 691442 1482545 9557 1066061 -155703 1910854 -44816
7295 -44816 1387675 1833331 223285 1336016 582680 1004354 1774371 920111 115112
7286 115112 1144835 2739073 315505 869081 2540773 1276330 1343739 1290736 1639112
7277 1639112 191140 611919 1051935 745685 1894773 1766648 2036194 2755039 2112823
7268 2112823 395312 1312015 583570 2302918 69797 1138158 956007 1948391 2900883
7259 2900883 3685010 2510401 1504193 2557044 2466679 3295876 2590826 3113904 3642282
7250 3642282 5030523 3405978 3905072 5531505 2398788 2258247 2430028 1448738 2291922
7241 2291922 2502519 871855 2297132 4195944 3231079 3364190 3339932 2470654 -68661
$$ packed form
7304A008966L40702j083541M25315P91103j472988J056504j221764K066557j955670
7295d4816J432491M45656j610046J112731p53336M21674P70017q54260q04999
7286A15112J029723J594238k423568N53576J671692j264443O7409n3003L48376
7277A639112j447972M20779M40016l06250J149088j28125K69546P18845o42216
7268B112823j717511R16703p28445J719348k233121J068361j82151R92384R52492
7259B900883P84127j174609j006208J052851r0365Q29197p05050N23078N28378
7250C642282J388241j624545M99094J626433l132717j40541J71781r81290Q43184
7241B291922K10597j630664J425277J898812r64865J33111k4258q69278k539315
$$ plain form
7232 -68661 1479461 789079 1692806 1718599 3360586 2646311 1542054 1387488 1122698 2515596
7222 2515596 2265031 1322385 3180942 2092914 5163546 2882022 4542881 1627180 1862690
7213 1862690 2456633 2160292 2331659 2648395 1114334 1520347 2973190 789431 3067063
7204 3067063 3667656 4107709 2521911 1587492 2953562 1481123 2133142 1892152 2813943
7195 2813943 1452039 2752113 3059952 1663007 2936398 2977433 2725084 2186793 3141768
7186 3141768 2853419 2879269 3631825 3315025 2285421 3089229 2602373 1415064 1588982
7177 1588982 1780194 1832988 1486083 1752871 3621558 3172626 1959155 4102664 4826558
7168 4826558 4980622 4546841 2674938 1676769 1720059 2619517 2822773 3679003 2801011 3551902
$$ packed form
7232f8661J548122o90382R03727K5793J641987p14275j104257j54566k64790J392898
7222B515596k50565r42646J858557j088028L070632k281524J660859k915701K35510
7213A862690N93943k96341J71367L16736j534061M06013J452843k183759K277632
7204C067063O00593M40053j585798r34419J366070j472439O52019k40990R21791
7195B813943j361904J300074L07839j396945J273391M1035k52349n38291R54975
7186C141768k88349K5850P52556l16800j029604Q03808m86856j187309J73918
7177A588982J91212N2794l46905K66788J868687m48932j213471K143509P23894
7168D826558J54064m33781j871903r98169M3290Q99458K03256Q56230q77992P50891
$$ plain form
7158 3551902 2940755 3449955 2676657 2985650 2037498 2917821 2541094 1792155 4141599
7149 4141599 5088837 4346881 3908068 4793731 2728174 3515883 3727224 2782108 3375702
7140 3375702 3447989 2492349 2648109 2542541 1248115 3919483 3474419 3825773 5396436
7131 5396436 4462311 3933305 4760601 3325859 3311398 5080601 2579593 4747687 3225701
7122 3225701 3309021 3004265 3023276 2421514 3956474 3265965 1644662 4694378 2086070
7113 2086070 2033946 3821619 4408169 4260283 5095653 4999856 4597724 4082976 3333880 2774881
7103 2774881 2810690 3014346 3339108 4738654 4139476 6434763 5819677 6040387 6959512
7094 6959512 5148658 4711229 6365272 6750530 4987660 7238572 5792500 4936800 7036303
$$ packed form
7158C551902o11147N09200p73298L08993r48152Q80323l76727p48939K349444
7149D141599R47238p41956m38813Q85663k065557P87709K11341r45116N93594
7140C375702P2287r55640J55760j05568j294426K671368m45064L51354J570663
7131E396436r34125n29006Q27296j434742j4461J769203k501008K168094j521986
7122C225701Q3320l04756J9011o01762J534960o90509j621303L049716k608308
7113B086070n2124J787673N86550j47886Q35370r5797m02132n14748p49096n58999
7103B774881L5809K03656L24762J399546n99178K295287o15086K20710R19125
7094F959512j810854m37429J654043L85258j762870K250912j446072q55700K099503
$$ plain form
7085 7036303 5300160 6498188 6161678 6309004 6339838 6769610 5936578 6837093 6413667
7076 6413667 6603747 6753500 6394475 6561570 5163270 6757144 5443990 7827041 6319684
7067 6319684 7971140 7015540 6087436 6139065 6519098 6440024 6105074 6953966 6208403 7409575
7057 7409575 8657333 7364838 8006676 7533538 8003801 7681976 8507692 6509748 8546013
7048 8546013 7960729 9260831 9164336 8207827 8750183 8647736 11387313 10148567 10431041
7039 10431041 11500686 9494666 11109976 10118118 10382379 11572199 8886068 11353446
7031 11353446 12762621 11146162 14125689 14770483 15995423 18853334 21024760 23252657
7023 23252657 27901992 26961945 24602930 22633854 18856179 19471509 17400568 17161058 17553798
$$ packed form
7085G036303j736143J198028l36510J47326L0834M29772q33032R00515m23426
7076F413667J90080J49753l59025J67095j398300J593874j313154K383051j507357
7067F319684J651456r55600r28104N1629L80033p9074l34950Q48892p45563J201172
7057G409575J247758j292495O41838m73138M70263l21825Q25716j997944K036265
7048H546013n85284J300102r6495r56509N42356j02447K739577j238746K82474
7039A0431041J069645k006020J615310r91858K64261J189820k686131K467378
7031A1353446J409175j616459K979527O44794J224940K857911K171426K227897
7023B3252657M649335r40047k359015j969076l777675O15330k070941k39510L92740
$$ plain form
7014 17553798 17374687 18553651 18428538 18443399 21252957 20294155 22843120 25482082 29915236
7005 29915236 36501926 39730516 37855123 35698185 32178537 28567222 28505983 27743317 27962199
6996 27962199 28778241 26659531 29034433 27750549 27904216 27376685 26772901 26461178 29376986
6987 29376986 32110640 32802192 36975054 39631318 43521764 49288214 57523987 74191460
6979 74191460 93832699 118663600 133676166 133976998 122422290 104481707 92686990
6972 92686990 79445815 73825518 70146804 70632362 72983101 76850019 88159290 103140819
6964 103140819 128188216 153437615 173464222 185964675 196539258 208623240 209697738
6957 209697738 194907703 172788063 154537921 149358315 157374888 168670651 179141003
$$ packed form
7014A7553798j79111J178964j25113J4861K809558r58802K548965K638962M433154
7005B9915236O586690L228590j875393k156938l519648l611315o1239p62666K18882
6996B7962199Q16042k118710K374902j283884J53667n27531o03784l11723K915808
6987B9376986K733654O91552M172862K656264L890446N766450Q235773J6667473
6979G4191460J9641239K4830901J5012566L00832j1554708j7940583j1794717
6972I2686990j3241175n620297l678714M85558K350739L866918J1309271J4981529
6964A03140819K5047397K5249399K0026607J2500453J0574583J2083982J074498
6957B09697738j4790035k2119640j8250142n179606Q016573J1295763J0470352
$$ plain form
6950 179141003 180847545 185086038 185296274 179902648 166268442 150169572 136471875 132028510
6942 132028510 139120095 157924119 175646895 181167390 169346303 150840532 135813156
6935 135813156 126467225 128768383 136790904 146372897 149690840 141830812 127006149 115647629
6927 115647629 111917795 114694236 127768383 135312530 131225299 119306388 100775459 84571034
6919 84571034 72464951 66893231 59762902 56178042 51064453 45588001 42816950 38414942
6911 38414942 37277968 35904334 31780319 31331642 26063523 26613066 27077291 27184544 27378691
6902 27378691 26637106 26300484 25331209 26518392 26042428 28860499 30898241 35137552 39967443
6893 39967443 40169475 37029067 31931272 28534591 23060649 21159675 19139852 18511894
$$ packed form
6950A79141003J706542M238493K10236n393626j3634206j6098870j3697697m443365
6942A32028510P091585J8804024J7722776N520495j1821087j8505771j5027376
6935A35813156r345931K301158Q022521R581993L317943p860028j4824663j1358520
6927A15647629l729834K776441J3074147P544147m087231j1918911j8530929j6204425
6919H4571034j2106083n571720p130329l584860n113589n476452k771051m402008
6911C8414942j136974j373634m124015m48677n268119N49543M64225J07253J94147
6902B7378691p41585l36622r69275J187183m75964K818071K037742M239311M829891
6893C9967443K02032l140408n097795l396681n473942j900974k019823o27958
$$ plain form
6885 18511894 16327659 17781218 16764729 19283222 19141099 19007029 20281030 19484079 20507493
6876 20507493 17259894 16922926 14125379 13754673 14030297 12976150 12124643 11246065 9929918
6867 9929918 9369750 9525477 10640636 9045673 10415031 7983143 11146119 8499946 8257251
6858 8257251 9803999 7192138 10109847 9226328 8026506 6167601 8143107 8457455 7337822
6849 7337822 10988107 8036425 11572733 12644320 13008040 13634262 14155143 14485678 11064742
6840 11064742 9639775 10652891 8429982 6740525 5622222 6339348 7828883 7344091
6832 7344091 7751511 5269254 6306100 5641572 5261997 7685135 5412432 6022864 5963454
6823 5963454 6095754 7245887 5313991 6688722 5129753 6457441 5880371 4482358 6891929
$$ packed form
6885A8511894k184235J453559j016489K518493j42123j34070J274001p96951J023414
6876B0507493l247599l36968k797547l70706K75624j054147q51507q78578j316147
6867I929918n60168J55727J115159j594963J369358k431888L162976k646173k42695
6858H257251J546748k611861K917709q83519j199822j858905J975506L14348j119633
6849G337822L650285k951682L536308J071587L63720O26222N20881L30535l420936
6840A1064742j424967J013116k222909j689457j118303P17126J489535m84792
6832G344091M07420k482257J036846o64528l79575K423138k272703O10432n9410
6823E963454J32300J150133j931896J374731j558969J327688n77070j398013K409571
$$ plain form
6814 6891929 5106799 5944572 4980253 5425021 4880654 5823961 6305546 5179304 6045914
6805 6045914 4291060 5440988 6195700 5924347 5317549 6414052 5891955 5408423 6754890
6796 6754890 5268848 5979745 5985645 7331116 8911044 9376644 11762762 13715230 16235420
6787 16235420 18593825 16410216 13928353 12674722 9702471 10412708 9365582 10011696
6779 10011696 8492168 8218418 9120575 9496686 11133074 10839847 13077284 15940410 19914239
6770 19914239 24630492 27278618 29285454 31406903 33276341 33454716 29267053 27136279
6762 27136279 21630128 19333245 15510059 15268820 13348318 10792680 14160621 11044481
6754 11044481 14369329 14090135 16426492 20381664 22636990 27774129 30615895 39870347
$$ packed form
6814F891929j785130Q37773r64319M44768n44367R43307M81585j126242Q66610
6805F045914j754854J149928P54712k71353o06798J096503n22097m83532J346467
6796F754890j486042P10897N900J345471J579928M65600K386118J952468K520190
6787A6235420K358405k183609k481863j253631k972251P10237j047126O46114
6779A0011696j519528k73750R02157L76111J636388k93227K237437K863126L973829
6770A9914239M716253K648126K006836K121449J869438J78375m187663k130774
6762B7136279n506151k296883l823186k41239j920502k555638L367941l116140
6754A1044481L324848k79194K336357L955172K255326N137139K841766R254452
$$ plain form
6746 39870347 42590040 40529550 34565559 31837885 27725143 23849975 20018208 15444236
6738 15444236 14450299 12143301 12415865 12283126 12140362 11324396 10798203 15603772 16618947
6729 16618947 16511189 17975589 19976779 20976436 22286914 25672641 25509996 22307693 18054027
6720 18054027 14705294 11984435 11282155 10115565 9118092 8469880 7458908 5698587 7792555
6711 7792555 6663277 6236956 7413168 8540122 8869671 12686005 10848723 11887913 11170603
6702 11170603 8760999 6502128 7108797 6471747 7023101 6725006 5613027 3747052 4552017
6693 4552017 4397857 5497841 4520897 6118663 5484432 5971528 6797918 4745818 4789371
6684 4789371 5638587 5924190 3723983 4163139 5622355 2812610 6990578 7173363 7141235
$$ packed form
6746C9870347K719693k060490n963991k727674m112742l875168l831767m573972
6738A5444236r93937k306998K72564j32739j42764q15966n26193M805569J015175
6729A6618947j07758J464400K001190R99657J310478L385727j62645l202303m253666
6720A8054027l348733k720859p02280j166590r97473o48212j010972j760321K093968
6711G792555j129278m26321J176212J126954L29549L816334j837282J039190p17310
6702A1170603k409604k258871O06669o37050N51354k98095j111979j865975Q04965
6693D552017j54160J099984r76944J597766o34231M87096Q26390k052100M3553
6684D789371Q49216K85603k200207M39156J459216k809745M177968J82785l2128
$$ plain form
6675 7141235 4605097 5578948 5699456 6236758 7766418 6489528 8367909 7846377 5211786
6666 5211786 5096949 5932281 5825861 5159834 6628288 6267193 6401355 8281759 7175053
6657 7175053 6997188 7116176 7783838 5889871 7546428 7595426 8232766 7766238 6474869
6648 6474869 7375641 6276052 7031043 7416237 7643235 8367294 10028199 9286218 11276714
6639 11276714 12552749 10842089 12418719 11023220 9662175 8826051 9952716 6769314
6631 6769314 8523006 10006633 6276150 6717974 9293452 7596696 7536572 10726469 9823596
6622 9823596 9424454 9715737 10798859 9980591 9857592 10184763 10099410 12401531 15071881
6613 15071881 18109900 23550281 30097811 27893816 23490069 19470810 16953529 15178014
$$ packed form
6675G141235k536138R73851J20508N37302J529660j276890J878381n21532k634591
6666E211786j14837Q35332j06420o66027J468454l61095J34162J880404j106706
6657G175053j77865J18988O67662j893967J656557M8998O37340m66528j291369
6648F474869R00772j099589P54991L85194K26998P24059J660905p41981J990496
6639A1276714J276035j710660J576630j395499j361045q36124J126665l183402
6631F769314J753692J483627l730483M41824K575478j696756o0124L189897r02873
6622I823596l99142K91283J083122q18268j22999L27171q5353K302121K670350
6613A5071881L038019N440381O547530k203995m403747m019259k517281j775515
$$ plain form
6605 15178014 16126885 16062793 16795559 16561696 18481182 17824670 18838346 18168606 17595659
6596 17595659 18827557 18048861 19790819 19472530 20962255 20030200 20779183 20881886 20617141
6587 20617141 23775045 26451771 31591702 38057929 43913570 46366156 43650214 42085488
6579 42085488 38669152 36094309 37368297 33558226 34616332 31084625 29356905 27524127
6571 27524127 26971010 27817005 26115808 30521781 29358944 33023331 36382134 36995698 38268650
6562 38268650 39751623 40476593 40608944 40075317 41353246 41130633 43109019 45003215 42006257
6553 42006257 40760197 35353570 32629835 29813318 28368593 26177480 26304236 26984700
6545 26984700 24909126 30956729 29663193 30270645 32607647 34122180 32780830 31375588
$$ packed form
6605A5178014R48871o4092P32766k33863J919486o56512J013676o69740n72947
6596A7595659J231898p78696J741958l18289J489725r32055P48983J02703k64745
6587B0617141L157904K676726N139931O466227N855641K452586k715942j564726
6579D2085488l416336k574843J273988l810071J058106l531707j727720j832778
6571B7524127n53117Q45995j701197M405973j162837L664387L358803O13564J272952
6562C8268650J482973P24970J32351n33627J277929k22613J978386J894196k996958
6553D2006257j246060n406627k723735k816517j444725k191113J26756O80464
6545B6984700k075574O047603j293536O07452K337002J514533j341350j405242
$$ plain form
6537 31375588 33036600 27040805 28303691 25805612 21641649 20902530 19993252 18193595
6529 18193595 18083779 17758472 16283333 13922927 15635455 13069999 15439040 15100982 15981483
6520 15981483 16225119 16811674 16012675 14581859 14851271 14054242 12757499 13922437 10500142
6511 10500142 9575995 10434409 8924542 8599640 9058679 7103406 7513779 9536080 8984987
6502 8984987 7388922 7896309 8005086 8609609 8632488 8671273 6673879 6867510 7140133 6686800
6492 6686800 7136258 5583672 7792846 8356864 8411600 6386149 6181458 4476418 6072878
6483 6072878 5256353 8343462 7487778 7216438 6786774 7866175 6346229 7251675 8042781
6474 8042781 6106856 7173508 7974389 6752852 6833472 6820122 6318739 6011601 8231423
$$ packed form
6537C1375588J661012n995795J262886k498079m163963p39119r09278j799657
6529A8193595j09816l25307j475139k360406J712528k565456K369041l38058Q80501
6520A5981483K43636N86555p98999j430816K69412p97029j296743J164938l422295
6511A0500142r24147Q58414j509867l24902M59039j955273M10373K022301n51093
6502H984987j596065N07387J08777O04523K2879L8785j997394J93631K72623m53333
6492F686800M49458j552586K209174N64018N4736k025451k04691j705040J596460
6483F072878q16525L087109q55684k71340m29664J079401j519946R05446P91106
6474H042781j935925J066652Q00881j221537Q0620j3350n01383l07138K219822
$$ plain form
6465 8231423 7658587 7161589 6892731 7558799 8472563 7647844 7272385 7912454 8415492 8400909
6455 8400909 6759233 7678490 6312746 6370096 7836481 7314487 6985419 4856974 6867481
6446 6867481 6767273 8467446 7914064 7363196 7195791 7735390 6187257 7371670 6274399
6437 6274399 5807092 5962068 7280907 7322968 9216010 6445526 7522797 7035629 6158758
6428 6158758 8196644 7980056 8164669 6840790 6890000 6454680 8094595 7023496 6853407
6419 6853407 6723285 7929428 9469015 6476855 8421228 9278173 7643619 8176154 7658745
6410 7658745 7756628 8294317 8942178 8044452 8990797 8488320 8604540 10725333 9701982
6401 9701982 9990558 7758581 10150835 8631943 9175463 10595429 11100137 11336153 11783874
$$ packed form
6465H231423n72836m96998k68858O66068R13764q24719l75459O40069N03038j4583
6455H400909j641676R19257j365744N7350J466385n21994l29068k128445K010507
6446F867481j00208J700173n53382n50868j67405N39599j548133J184413j097271
6437F274399m67307J54976J318839M2061J893042k770484J077271m87168q76871
6428F158758K037886k16588J84613j323879M9210m35320J639915j071099j70089
6419F853407j30122J206143J539587k992160J944373Q56945j634554N32535n17409
6410G658745R7883N37689O47861q97726R46345n02477J16220K120793j023351
6401I701982K88576k231977K392254j518892N43520J419966N04708K36016M47721
$$ plain form
6392 11783874 13056197 11889065 12831768 14531277 16748588 20186117 21328273 25006066
6384 25006066 25306343 27252083 25065119 26273265 21591786 21022968 19512293 18317976
6376 18317976 19302713 20932799 21291819 19442548 21917753 22071921 24696085 26372253 26142213
6367 26142213 27204874 25439151 23087888 21908388 19526617 18084352 16534562 18473805
6359 18473805 15329999 16163466 16136879 15868962 16801356 16144748 16049241 15913130 18593223
6350 18593223 19016883 19919814 24380016 24201447 25837682 28092868 30136419 34924167 39641610
6341 39641610 44976242 51362887 54955754 58180782 55777119 53273340 49375451 46032793
6333 46032793 41128095 39372301 37113265 35962512 37668341 36398680 39998688 44557991
$$ packed form
6392A1783874J272323j167132R42703J699509K217311L437529J142156L677793
6384B5006066L00277J945740k186964J208146m681479n68818j510675j194317
6376A8317976R84737J630086L59020j849271K475205J54168K624164J676168k30040
6367B6142213J062661j765723k351263j179500k381771j442265j549790J939243
6359A8473805l143806Q33467k6587k67917R32394o56608r5507j36111K680093
6350A8593223M23660R02931M460202j78569J636235K255186K043551M787748M717443
6341C9641610N334632O386645L592867L225028k403663k503779l897889l342658
6333D6032793m904698j755794k259036j150753J705829j269661L600008M559303
$$ plain form
6325 44557991 47608463 51579110 52916938 49664255 48007749 43554995 36720732 33126384
6317 33126384 30875591 26970140 23027482 21179499 19688987 20173956 21235771 20423583
6309 20423583 20567558 19549777 19923730 18919042 18011187 19478691 19307250 18884792 18380379
6300 18380379 17570059 16687739 19780126 19727555 19923317 21474858 21615766 22475891 25245564
6291 25245564 29610575 29138455 34230626 38210373 43737123 49681093 56798625 58556115
6283 58556115 57509485 56077120 48190959 45614740 41671082 37440746 34570878 32792281
6275 32792281 27902001 27346612 28740396 27547171 28147421 28632061 29839037 32583940 35029769
6266 35029769 39921987 41922837 47393685 50738459 50328094 48997609 46509543 39271444
$$ packed form
6325D4557991L050472L970647J337828l252683j656506m452754o834263l594348
6317C3126384k250793l905451l942658j847983j490512M84969J061815q12188
6309B0423583J43975j017781L73953j004688r07855J467504j71441m22458n04413
6300A8380379q10320q82320L092387n2571J95762J551541J40908Q60125K769673
6291B5245564M365011m72120N092171L979747N526750N943970P117532J757490
6283E8556115j046630j432365p886161k576219l943658m230336k869868j778597
6275C2792281m890280n55389J393784j193225O00250M84640J206976K744903K445829
6266C5029769M892218K000850N470848L344774m10365j330485k488066p238099
$$ plain form
6258 39271444 35253040 31938364 26903549 25774603 24115486 22439030 21689578 21310315
6250 21310315 18929315 20702404 19164371 17701592 20597017 20999846 21783337 24431164
6242 24431164 24291005 26910526 29336306 29780837 29663471 27649162 24771573 22965480 21390038
6233 21390038 18780901 18724527 17061771 15962475 16233251 15271078 15457709 16079639 16336962
6224 16336962 15911464 18233264 18483841 18724431 23199222 23055551 24793154 25729306 22912020
6215 22912020 21475688 19212017 17647616 16839631 14409646 13343586 11047777 11678886
6207 11678886 10033938 10307545 8637354 8848257 7375610 9147740 6530366 6881017 7463390
6198 7463390 7318101 8334575 8453245 8272119 5667974 7484251 7039095 7926220 6938821
$$ packed form
6258C9271444m018404l314676n034815j128946j659117j676456p49452l79263
6250B1310315k381000J773089j538033j462779K895425M02829P83491K647827
6242B4431164j40159K619521K425780M44531j17366k014309k877589j806093j575442
6233B1390038k609137n6374j662756j099296K70776r62173J86631O21930K57323
6224A6336962m25498K321800K50577K40590M474791j43671J737603R36152k817286
6215B2912020j436332k263671j564401q07985k429985j066060k295809O31109
6207A1678886j644948K73607j670191K10903j472647J772130k617374L50651N82373
6198G463390j45289J016474J18670j81126k604145J816277m45156Q87125r87399
$$ plain form
6189 6938821 5925207 5622480 6964802 7265717 7514672 6794697 5820165 7503418 6198620
6180 6198620 7397966 4912889 5254744 4792976 6860213 6764833 6741898 7514535 6564983
6171 6564983 6366446 4189559 5490046 4861399 5453775 4527462 4081845 6319750 4817281
6162 4817281 5853788 7256151 4956245 5602873 5151671 4860123 4183041 6637563 5535479
6153 5535479 3184332 5697037 2591876 6396896 5484974 5486887 3697321 4526453 4291861
6144 4291861 3698634 3726406 4936484 4564084 3490642 4186618 6364359 4485057 4218017
6135 4218017 4168495 3496665 4636161 4583524 4592970 6250244 4003621 4579176 3028559 4369412
6125 4369412 4007381 3732166 5716334 2762784 5080726 5896955 5209928 5201355 3921356
$$ packed form
6189F938821j013614l02727J342322L00915K48955p19975r74532J683253j304798
6180F198620J199346k485077L41855m61768K067237r5380k2935P72637r49552
6171F564983j98537k176887J300487o28647N92376r26313m45617K237905j502469
6162D817281J036507J402363k299906O46628m51202k91548o77082K454522j102084
6153E535479k351147K512705l105161L805020r11922J913j789566Q29132k34592
6144D291861n93227K7772J210078l72400j073442O95976K177741j879302k67040
6135D218017m9522o71830J139496n2637R446J657274k246623N75555j550617J340853
6125D369412l62031k75215J984168k953550K317942Q16229o87027q573j279999
$$ plain form
6116 3921356 4682162 3933857 5817892 2298122 3611225 5289031 5028638 4994823 3586236
6107 3586236 4499860 3910210 3022499 5350787 2992281 4836948 5454141 3469793 2957118
6098 2957118 4198597 3645136 4556182 5204417 2644633 3225777 3215493 5205512 4764371
6089 4764371 5209597 5252876 3146257 3801840 3962418 3243762 3405592 3732088 3561711 4513427
6079 4513427 4804182 4321918 3391742 5064377 3163539 4419863 3818927 4549476 2418800
6070 2418800 1840625 4086238 2116617 3784665 4238193 2991060 4127353 4115813 5044353
6061 5044353 4601250 3041437 4319512 1365652 5307162 4798538 3447278 5087730 3114432
6052 3114432 2890292 4056023 4601648 4478237 3435093 2097508 3375310 4686622 4921721
$$ packed form
6116C921356P60806p48305J884035l519770J313103J677806k60393l3815j408587
6107C586236R13624n89650q87711K328288k358506J844667O17193j984348n12675
6098B957118J241479n53461R11046O48235k559784N81144j0284J990019m41141
6089D764371M45226M3279k106619O55583J60578p18656J61830L26496j70377R51716
6079D513427K90755m82264r30176J672635j900838J256324o00936P30549k130676
6070B418800n78175K245613j969621J668048M53528j247133J136293j1540R28540
6061E044353m43103j559813J278075k953860L941510n08624j351260J640452j973298
6052C114432k24140J165731N45625j23411j043144j337585J277802J311312K35099
$$ plain form
6043 4921721 3383365 6234257 4458980 4453532 3425498 3013536 4269870 4364382 4745898
6034 4745898 3540972 2878714 3594880 4234209 4296448 3260764 2560097 3192580 4003030
6025 4003030 4726137 3918977 5177429 3813288 2156804 3425117 3972869 2719149 3878822
6016 3878822 4180807 2910174 4620321 3358998 2207572 3337690 4281232 2635093 4420348
6007 4420348 4987266 2525035 5282057 2028528 2754972 3752932 3578532 5134930 4009890
5998 4009890 3043991 2720729 2481644 1947529 3465364 3365545 3522703 4263614 3169794
5989 3169794 3881019 3299576 4797804 3766326 3264079 3298736 3187195 4335745 3222453
5980 3222453 3737237 5656112 4120099 4050495 4562563 3065384 2086959 3355858 2644682
$$ packed form
6043D921721j538356K850892j775277n448j028034m11962J256334R4512L81516
6034D745898j204926o62258P16166O39329O2239j035684p00667O32483Q10450
6025D003030P23107q07160J258452j364141j656484J268313N47752j253720J159673
6016C878822L01985j270633J710147j261323j151426J130118R43542j646139J785255
6007D420348N66918k462231K757022l253529P26444R97960j74400J556398j125040
5998D009890r65899l23262k39085n34115J517835r9819J57158P40911j093820
5989C169794P11225n81443J498228j031478n02247L4657j11541J148550j113292
5980C222453N14784J918875j536013o9604N12068j497179r78425J268899p11176
$$ plain form
5971 2644682 2760050 4169658 3200991 4089568 4819847 3485595 3698056 3980464 3015725
5962 3015725 4446192 3526249 4031252 3612273 2025548 2852672 2452129 4223015 3734263
5953 3734263 4293529 2234027 3803988 1837627 3492828 4671832 4166473 3853085 4430168
5944 4430168 3664256 5204450 2402832 3541796 3977399 4452457 4131069 3300322 3949769
5935 3949769 3188400 3378011 3352880 4379884 4062710 3977329 3759613 4520997 1929858 4284525
5925 4284525 3088274 3492470 3683637 3334770 3511232 3929662 4246758 4864784 5163370
5916 5163370 4511596 3344125 2964458 1535202 3709621 2660248 4560787 3688676 3913067
5907 3913067 5255877 2642329 4628767 3372643 2946422 4578814 3793128 3211991 3874952
$$ packed form
5971B644682J15368J409608r68667Q88577P30279j334252K12461K82408r64739
5962C015725J430467r19943N05003m18979j586725Q27124m00543J770886m88752
5953C734263N59266k059502J569961j966361J655201J179004n05359l13388N77083
5944D430168p65912J540194k801618J138964M35603M75058l21388q30747O49447
5935C949769p61369J89611k5131J027004l17174q5381k17716P61384k591139K354667
5925D284525j196251M04196J91167l48867J76462M18430L17096O18026K98586
5916E163370o51774j167471l79667j429256K174419j049373J900539q72111K24391
5907C913067J342810k613548J986438j256124m26221J632392p85686n81137O62961
$$ plain form
5898 3874952 3479994 3209341 4617515 3734832 3339278 2759424 3233104 4238721 4146961
5889 4146961 5395568 3756243 4481461 4687072 4748906 4979648 3556208 3877235 4756435
5880 4756435 2937751 3610021 3381996 2301806 4242882 4587644 3375764 4741840 4654813
5871 4654813 5110654 4421529 3555820 3805045 3423421 4097410 3590177 5229937 3305070
5862 3305070 3359429 5096421 3717013 3254618 3816050 4240538 3973218 4834996 3408969
5853 3408969 4171921 3699430 3760293 6367198 2865100 5946932 4690223 3809207 4515405
5844 4515405 3900521 3283927 3345500 4189294 3647930 3809305 4436786 3958436 5756175 5811294
5834 5811294 4211552 4526023 5639465 4546863 5148913 3951557 2967080 5030766 4160958
$$ packed form
5898C874952l94958k70653J408174q82683l95554n79854M73680J005617r1760
5889D146961J248607j639325P25218K05611O1834K30742j423440L21027Q79200
5880D756435j818684O72270k28025j080190J941076L44762j211880J366076q7027
5871D654813M55841o89125q65709K49225l81624O73989n07233J639760j924867
5862C305070N4359J736992j379408m62395N61432M24488k67320Q61778j426027
5853C408969P62952m72491O0863K606905l502098L081832j256709q81016P06198
5844D515405o14884o16594O1573Q43794n41364J61375O27481m78350J797739N5119
5834E811294j599742L14471J113442j092602O02050j197356r84477K063686q69808
$$ plain form
5825 4160958 4087026 5175980 3844799 4064225 5850998 5310702 4037858 4048878 4129155
5816 4129155 5437909 4293152 5539895 5217025 6128361 4613067 4500829 5017002 2618267
5807 2618267 4754188 5094993 4049764 4265716 4954922 6048941 4501505 6875765 4187762
5798 4187762 3373914 4513818 5032075 4153376 5726148 4074066 5496473 4329509 5375871
5789 5375871 4671660 5128788 4909671 5454307 6048834 5369767 5355970 4052736 6738423
5780 6738423 5262742 5370866 7098431 6198497 4692616 4903721 4285059 4793923 6067137
5771 6067137 8035282 5642223 6871066 5449581 3573520 5354525 4829964 6336445
5763 6336445 6533841 3300904 6562600 6337134 8191773 6518732 7527377 4618465 4097942
$$ packed form
5825D160958p3932J088954j331181K19426J786773n40296j272844J1020Q0277
5816D129155J308754j144757J246743l22870R11336j515294j12238N16173k398735
5807B618267K135921L40805j045229K15952O89206J094019j547436K374260k688003
5798D187762q13848J139904N18257q78699J572772j652082J422407j166964J046362
5789E375871p04211M57128k19117N44636N94527o79067j3797j303234K685687
5780F738423j475681J08124J727565q99934j505881K11105o18662N08864J273214
5771F067137J968145k393059J228843j421485j876061J781005n24561J506481
5763F336445J97396l232937L261696k25466J854639j673041J008645k908912n20523
$$ plain form
5754 4097942 6764991 6188602 7512211 4905969 5541139 4240454 5902664 7060350 5919124
5745 5919124 5609590 5062594 5631891 6897686 6180478 6092151 6238886 3038478 6907373
5736 6907373 5196786 5243015 6730057 5586811 4554303 5952925 6267253 5602545 8332857
5727 8332857 5304312 6290545 6615535 5523438 4505987 5289710 5402249 5723136 6693952
5718 6693952 6845456 6569692 6822808 5227838 4779554 5762400 5065412 6931994 6686201
5709 6686201 8335516 6398833 6834993 8312664 6404990 5968725 6279611 6293006 5460553
5700 5460553 7111100 6999909 6594651 5250186 5402071 6299361 7746881 9108581 7458353
5691 7458353 7968518 7183891 5148759 8549634 6831944 7131360 7833400 6550379 6630068
$$ packed form
5754D097942K667049n76389J323609k606242O35170j300685J662210J157686j141226
5745E919124l09534n46996N69297J265795p17208q8327J46735l200408L868895
5736F907373j710587M6229J487042j143246j032508J398622L14328o64708K730312
5727H332857l028545R86233L24990j092097j017451P83723J12539L20887R70816
5718F693952J51504k75764K53116j594970m48284R82846o96988J866582k45793
5709F686201J649315j936683M36160J477671j907674m36265L10886J3395q32453
5700E460553J650547j11191m05258j344465J51885Q97290J447520J361700j650228
5691G458353N10165p84627k035132L400875j717690K99416P02040j283021P9689
$$ plain form
5682 6630068 7786296 7375653 6996836 7550918 7206069 6437212 7532075 7250594 8085974
5673 8085974 6868317 8275158 5906115 7226790 7255310 7128051 7022954 6043578 7461392
5664 7461392 7774561 8481604 7876665 6912377 6055628 8826084 8404364 6927722 9161036
5655 9161036 6539806 6054648 6522786 7953147 6457548 7890035 7571224 6793194 7702497
5646 7702497 7262936 7266791 7226047 8801417 7664830 9301112 7295898 5871944 7825131
5637 7825131 6840193 7366699 6953324 8168548 8222599 8029726 9627270 7406727 8030137
5628 8030137 7330399 6699085 5259349 7597833 8017912 7332356 9815186 8123957 8415655
5619 8415655 6925388 8624444 7652422 7376937 9369286 8679068 9961280 8077598 5820883
$$ packed form
5682F630068J156228m10643l78817N54082l44849p68857J094863k81481Q35380
5673H085974j217657J406841k369043J320675K8520j27259j05097r79376J417814
5664G461392L13169P07043o04939r64288q56749K770456m21720j476642K233314
5655I161036k621230m85158M68138J430361j495599J432487l18811p78030R09303
5646G702497m39561L855m0744J575370j136587J636282k005214j423954J953187
5637G825131r84938N26506m13375J215224N4051j92873J597544k220543O23410
5628H030137o99738o31314j439736K338484M20079o85556K482830j691229K91698
5619H415655j490267J699056r72022k75485J992349o90218J282212j883682k256715
$$ plain form
5610 5820883 7369608 8819732 8233192 8479569 8741234 7706597 10155823 10364271 9034467
5601 9034467 8287544 7542986 7873193 7875689 8716123 7590837 8379715 9989010 9727900 8151750
5591 8151750 8698099 8931680 8356903 9642323 9455717 7131998 9008068 9931934 8774645
5582 8774645 8138487 7335492 8533808 9946913 8981643 10789692 9272038 10337294 9093937
5573 9093937 9526769 7951280 10595842 8726243 8261440 10959649 7618650 9442801 9837675
5564 9837675 8946714 9061588 10379569 10693378 8156852 10785465 7442292 9631206 11564608
5555 11564608 9058009 9375992 10139629 8798758 9444695 10048787 9487416 7637980 10453113
5546 10453113 9925801 9712988 12394425 8523155 8717793 9488440 10866885 9484303 10096449
$$ packed form
5610E820883J548725J450124n86540K46377K61665j034637K449226K08448j329804
5601I034467p46923p44558L30207K496Q40434j125286P88878J609295k61110j576150
5591H151750N46349K33581n74777J285420j86606k323719J876070R23866j157289
5582H774645o36158q02995J198316J413105r65270J808049j517654J065256j243357
5573I093937M32832j575489K644562j869599m64803K698209l340999J824151L94874
5564I837675q90961J14874J317981L13809k536526K628613l343173K188914J933402
5555A1564608k506599L17983P63637j340871O45937O04092n61371j849436K815133
5546A0453113n27312k12813K681437l871270J94638P70647J378445j382582O12146
$$ plain form
5537 10096449 11420420 10009894 10605590 10206014 9990661 9115619 9001540 10058417 9240679
5528 9240679 10421962 11042667 9336994 11398960 9509940 10048272 11111144 9714500 9064060
5519 9064060 9624084 9949401 10356711 11004325 11348622 10359502 11015061 10098834 8624333
5510 8624333 11100039 10495692 10903762 10637294 11692967 8095351 11075882 9826890 10118962
5501 10118962 11951240 9878257 9912933 9282103 10796734 10829895 10528100 10063344 10875511
5492 10875511 10264683 10059665 11580194 9741857 12094628 11867989 11759128 10581400 10607646
5483 10607646 9332902 10780391 9930764 10397815 10800947 11375328 11490885 10821077 11499528
5474 11499528 11121650 11158420 11530289 10180035 10442415 10364512 12204309 11666608 11210261
$$ packed form
5537A0096449J323971j410526N95696l99576k15353q75042j14079J056877q17738
5528I240679J181283O20705j705673K061966j889020N38332J062872j396644o50440
5519I064060N60024L25317M07310O47614L44297r89120O55559r16227j474501
5510H624333K475706o04347M08070k66468J055673l597616K980531j248992K92072
5501A0118962J832278k072983L4676o30830J514631L3161l01795m64756Q12167
5492A0875511o10828k05018J520529j838337K352771k26639j08861j177728K6246
5483A0607646j274744J447489q49627M67051M03132N74381J15557o69808O78451
5474A1499528l77878L6770L71869j350254K62380p7903J839797n37701m56347
$$ plain form
5465 11210261 10560798 9644179 11390150 10766287 10327115 12434879 11172345 11179260 10248075
5456 10248075 10035510 10745491 10191202 12524460 10222213 11534351 10990070 10607998 11412492
5447 11412492 11285228 12809852 11934719 11356727 11056608 9903922 10226470 11128755 12675719
5438 12675719 12379874 11758204 11314494 14145892 11677685 12312520 13248454 13185936 14835512
5429 14835512 17547445 20126307 19686153 22621633 21613843 19395138 18710842 16879840
5421 16879840 15021367 15031547 15100712 14727553 12675577 12180210 11432636 11436936 11361832 12385608
5411 12385608 11932406 12271295 13645643 11328273 10878094 11637954 11984785 11256773 11862155
5402 11862155 12532612 12090181 10478938 10921191 10326646 12431337 13012642 12219227 13996985
$$ packed form
5465A1210261o49463r16619J745971o23863m39172K107764j262534O915r31185
5456A0248075k12565P09981n54289K333258k302247J312138n44281l82072Q04494
5447A1412492j27264J524624q75133n77992l00119j152686L22548R02285J546964
5438A2675719k95845o21670m43710K831398k468207O34835R35934o2518J649576
5429A4835512K711933K578862m40154K935480j007790k218705o84296j831002
5421A6879840j858473J0180O9165l73159k051976m95367p47574M300p5104J023776
5411A2385608m53202L38889J374348k317370m50179P59860L46831p28012O05382
5402A1862155O70457m42431j611243M42253n94545K104691N81305p93415J777758
$$ plain form
5393 13996985 12426767 11814545 11432688 10712193 10755453 9513606 11616512 10793726 11864702
5384 11864702 11318962 12181919 11450624 12663383 10799781 10440177 10631517 10272642 10549951
5375 10549951 11843915 11311725 10061109 12772556 9807232 11159183 9913807 9661226
5367 9661226 11246200 11132815 9341492 10827028 12131050 10581444 11129274 11379626 10713642
5358 10713642 9780466 9817254 10317446 9955358 9090872 10192223 11727923 10001522 10532010
5349 10532010 8379122 11462697 10666888 9720872 10298890 10195852 10454830 10282753 10924117
5340 10924117 8867610 10794691 10307941 8930941 10233022 8710428 9891744 11336440
5332 11336440 11981413 12769864 10073046 9400710 11003061 9811153 9011823 10066220 9667073
$$ packed form
5393A3996985j570218o12222l81857p20495M3260j241847K102906q22786J070976
5384A1864702n45740Q62957p31295J212759j863602l59604J91340l58875K77309
5375A0549951J293964n32190j250616K711447k965324J351951j245376k52581
5367I661226J584974j13385j791323J485536J304022j549606N47830K50352o65984
5358A0713642r33176L6788N00192l62088q64486J101351J535700j726401N30488
5349A0532010k152888L083575p95809r46016N78018j03038K58978j72077O41364
5340A0924117k056507J927081m86750j377000J302081j522594J181316J444696
5332A1336440O44973P88451k696818o72336J602351j191908p99330J054397l99147
$$ plain form
5323 9667073 11009362 10195065 9707993 8915738 8319335 10255795 10050005 9452104 11008755
5314 11008755 8080988 11056062 10922006 10266772 8016237 9427036 8889346 10019918 9299957
5305 9299957 10105624 10303150 9020168 10114090 8781233 10684654 9028548 9947894 10857783
5296 10857783 9581601 9160463 9228792 8093840 9215797 9596709 9688107 9564473 10732184
5287 10732184 8330603 10838199 10487226 8919409 9416851 9350950 9196871 10410638 10794058
5278 10794058 7756210 9708485 9398186 10610292 9286514 10243454 8934302 7764293
5270 7764293 10205755 8663166 8848512 7142282 8791962 8738162 9189013 11236171 7935088
5261 7935088 8833614 10480271 9917852 10386638 8284888 9980558 9796742 11231930 9155802
$$ packed form
5323I667073J342289q14297m87072p92255n96403J936460k05790n97901J556651
5314A1008755k927767K975074j34056o55234k250535J410799n37690J130572p19961
5305I299957Q05667J97526j282982J093922j332857J903421j656106R19346R09889
5296A0857783j276182m21138O8329j134952J121957L80912R1398j23634J167711
5287A0732184k401581K507596l50973j567817M97442o5901j54079J213767L83420
5278A0794058l037848J952275l10299J212106j323778R56940j309152j170009
5270G764293K441462j542589J85346j706230J649680n3800M50851K047158l301083
5261G935088Q98526J646657n62419M68786k101750J695670j83816J435188k076128
$$ plain form
5252 9155802 10494294 9729520 9118512 9571163 9413930 9574175 9499253 8774943 9069239 8975581
5242 8975581 7266009 8071481 8883138 9375185 8304541 9036973 8523418 7861587 8788981
5233 8788981 7674643 9685487 8894398 9667990 8400303 8888737 8161070 8438998 9231207
5224 9231207 9475627 7310580 6705654 8709786 8833289 9248489 7884033 8780254 7796032
5215 7796032 10059270 8581647 9371906 7419574 9251535 8131176 7449912 7687987 6641424
5206 6641424 7362643 9824980 9025488 6474354 9418071 9526887 9511258 8929658 7369690
5197 7369690 8022192 6467203 6670907 8031827 8468446 8618411 8150603 9729945 10109873
5188 10109873 8346285 7232907 7480507 8144838 7857958 6815326 9928907 6545088 8244430
$$ packed form
5252I155802J338492p64774o11008M52651j57233J60245p4922p24310K94296r3658
5242H975581j709572Q05472Q11657M92047j070644P32432n13555o61831R27394
5233H788981j114338K010844p91089P73592j267687M88434p27667K77928P92209
5224I231207K44420k165047o04926K004132J23503M15200j364456Q96221r84222
5215G796032K263238j477623P90259j952332J831961j120359o81264K38075j046563
5206F641424P21219K462337p99492k551134K943717J08816j5629n81600j559968
5197G369690O52502j554989K03704J360920M36619J49965m67808J579342L79928
5188A0109873j763588j113378K47600O64331k86880j042632L113581l383819J699342
$$ plain form
5179 8244430 7466764 5495867 7982926 8360994 5970211 8917178 6489789 7603555 7140651
5170 7140651 7527215 8754826 5871027 8689482 7411442 5701881 6834791 6326157 7644018
5161 7644018 7542377 8818026 7471630 7101998 6999346 5205575 7339883 8188575 8253694
5152 8253694 6653738 6703687 7603431 6844545 6531064 7555780 7051466 7960661 6345265
5143 6345265 6705742 6108480 7057166 7920032 8260882 8361242 7547446 7020563 7609697 7285485
5133 7285485 4650894 6739232 6244048 6740341 9342749 7324049 8228495 7214188 7289029
5124 7289029 6264600 7132896 6683077 6932196 7243461 7371232 7634875 8558328 6496261
5115 6496261 6494425 7438463 5151780 8011665 5845047 6356873 6169436 6806149 7703572
$$ packed form
5179H244430p77666j970897K487059L78068k390783K946967k427389J113766m62904
5170G140651L86564J227611k883799K818455j278040j709561J132910n08634J317861
5161G644018j01641J275649j346396l69632j02652j793771K134308Q48692O5119
5152H253694j599956M9949Q99744p58886l13481J024716n04314R09195j615396
5143F345265L60477n97262R48686Q62866L40850J00360q13796n26883N89134l24212
5133G285485k634591K088338m95184M96293K602408k018700R04446j014307P4841
5124G289029j024429Q68296m49819K49119L11265J27771K63643R23453k062067
5115F496261j836R44038k286683K859885k166618N11826j87437O36713Q97423
$$ plain form
5106 7703572 7757997 8458517 5515466 5363642 8735685 5855657 7948114 7252624 5779552
5097 5779552 7710198 7019568 7357369 5981439 7075750 7206463 6489357 7714620 7372877
5088 7372877 7655923 7392928 8500597 7438626 7423969 6839532 5970336 8352856 5391215
5079 5391215 6406747 9104747 8927320 9151461 7571746 8591508 6740836 8565994 8682469
5070 8682469 8079799 8282736 10887971 13311231 16635431 21966076 25265346 27203466 24443172
5061 24443172 25635884 19020944 17008028 14904549 10580593 10216844 9541400 9340807 8699201
5052 8699201 10655204 7541022 8768734 6491746 8913922 7911099 10055111 6411934
5044 6411934 8076503 8344451 7940514 8792366 9310009 8606469 8019095 8595546 9749480
$$ packed form
5106G703572N4425P00520k943051j51824L372043k880028K092457o95490j473072
5097E779552J930646o90630L37801j375930J094311J30713p17106J225263l41743
5088G372877K83046k62995J107669j061971j4657n84437q69196K382520k961641
5079E391215J015532K698000j77427K24141j579715J019762j850672J825158J16475
5070H682469o02670K02937K605235K423260L324200N330645L299270J938120k760294
5061B4443172J192712o614940k012916k103479m323956l63749o75444k00593o41606
5052H699201J956003l114182J227712k276988K422176j002823K144012l643177
5044F411934J664569K67948m03937Q51852N17643p03540n87374N76451J153934
$$ plain form
5035 9749480 7503476 9127679 8629451 7824421 10044852 9385858 9940213 9269901 10149940
5026 10149940 8617633 8954616 9850384 11488372 10980977 12118595 10913840 12731161 10112908
5017 10112908 13434613 13975262 14121696 15303999 14720227 15882916 16126500 17300479 18401695
5008 18401695 21771163 20741122 26324034 29671479 34219683 46439517 80280511 156723866
5000 156723866 228413585 230749131 178911952 116996419 82081689 57441362 43668833
4993 43668833 33430292 25433781 21901428 18620212 16979898 16235928 13951499 14995908
4985 14995908 14786720 14253313 13580210 11259454 12888198 12502901 11792110 11231772 11603479
4976 11603479 11268532 11040333 13869057 12375310 11728567 12257049 13594639 12724638 13882426
$$ packed form
5035I749480k246004J624203m98228q05030K220431o58994N54355o70312Q80039
5026A0149940j532307L36983Q95768J637988n07395J137618j204755J817321k618253
5017A0112908L321705N40649J46434J182303n83772J162689K43584J173979J101216
5008A8401695L369468j030041N582912L347445M548204J2219834L3840994P6443355
5000A56723866P1689719K335546n1837179o1915533l4914730k4640327j3772529
4993D3668833j0238541p996511l532353l281216j640314p43970k284429J044409
4985A4995908k09188n33407o73103k320756J628744l85297p10791n60338L71707
4976A1603479l34947k28199K828724j493747o46743N28482J337590q70001J157788
$$ plain form
4967 13882426 13996093 13877502 15111534 15948976 13575900 16810704 22374003 36529630
4959 36529630 63911371 90214413 97756981 80810445 56972188 39937500 29199960
4952 29199960 22059348 17845692 15735539 11920522 12184678 12064077 11142229 11027511 10281020
4943 10281020 9940015 9200860 9296300 9033684 9278834 8512307 7945074 6547895 9122564
4934 9122564 8524322 8425757 9540588 7770832 8544115 7358711 7410916 8120929 8565606
4925 8565606 6725216 7216462 6920053 5976528 6551684 7178111 6735639 6172701 6695045
4916 6695045 6380668 7185017 6575197 5489104 7643354 6805938 6244101 5480737 4682658
4907 4682658 5993444 4776123 4860878 4484693 4776157 3968691 4566086 7128477 7546375
$$ packed form
4967A3882426J13667j18591J234032Q37442k373076L234804N563299J4155627
4959C6529630K7381741K6303042P542568j6946536k3838257j7034688j0737540
4952B9199960p140612m213656k110153l815017K64156j20601r21848j14718p46491
4943A0281020l41005p39155R5440k62616K45150p66527n67233j397179K574669
4934I122564n98242r8565J114831j769756P73283j185404N2205P10013M44677
4925H565606j840390M91246k96409r43525N75156O26427m42472n62938N22344
4916F695045l14377Q04349o09820j086093K154250q37416n61837p63364p98079
4907D682658J310786j217321Q4755l76185K91464q07466N97395K562391M17898
$$ plain form
4898 7546375 7118801 5660515 4590390 6163391 4287897 5202476 6972289 5350378 3967836
4889 3967836 4301935 3187544 5758128 4952768 5244567 5403666 4379535 3541996 5034534
4880 5034534 6446285 5713989 5657792 4739732 4822524 4236619 3025961 5069752 5457946
4871 5457946 5733416 4950879 4750381 5464036 3426230 5359136 5276117 5436438 5952617
4862 5952617 6037863 6564907 5787795 6657416 5534621 5986658 7726768 3956558 6417606
4853 6417606 6915150 5487984 3864648 5466431 3423660 5305375 6058499 5978803 6731830
4844 6731830 6257856 5780548 4896471 6006297 4268423 3844445 5642999 6965990 5842015
4835 5842015 7967746 6994919 6912741 7343549 5800353 5784359 2662510 3887019 4792444
$$ packed form
4898G546375m27574j458286j070125J573001j875494R14579J769813j621911j382542
4889C967836L34099j114391K570584q05360K91799J59099j024131q37539J492538
4880E034534J411751p32296n6197r18060Q2792n85905j210658K043791L88194
4871E457946K75470p82537k00498P13655k037806J932906q3019J60321N16179
4862E952617Q5246N27044p77112Q69621j122795M52037J740110l770210K461048
4853F417606M97544j427166j623336J601783k042771J881715P53124p9696P53027
4844F731830m73974m77308q84077J109826j737874m23978J798554J322991j123975
4835E842015K125731r72827q2178M30808j543196j5994l121849J224509R05425
$$ plain form
4826 4792444 4238605 4960407 3995604 4618084 3591393 5430689 4593985 2946182 5131678
4817 5131678 3379625 2613051 2301197 3503882 3081518 4390926 5648419 3976210 5743270
4808 5743270 2028407 4162985 4305847 2932299 4222900 2493886 6008029 3653647
4800 3653647 5674022 4248425 2244412 2421922 3540267 4085462 3893128 4738973 3226004
4791 3226004 3374894 4381391 4308973 3531928 4049344 4018712 3447583 3623545 5360413 2424641
4781 2424641 4397616 3289732 3627866 3803530 4099207 5276507 2140401 4338929 3042619
4772 3042619 2097036 3772002 2535396 3541984 4242095 4716258 5446502 4631994 3787684
4763 3787684 2923084 1815088 3084668 1696360 4791218 3528608 4699465 3815577 4237445
$$ packed form
4826D792444n53839P21802r64803O22480j026691J839296q36704j647803K185496
4817E131678j752053p66574l11854J202685m22364J309408J257493j672209J767060
4808E743270l714863K134578J42862j373548J290601j729014L514143k354382
4800C653647K020375j425597k004013J77510J118345N45195j92334Q45845j512969
4791C226004J48890J006497p2418p77045N17416l0632n71129J75962J736868k935772
4781B424641J972975j107884L38134J75664K95677J177300l136106K198528j296310
4772C042619r45583J674966j236606J006588P00111M74163P30244q14508q44310
4763C787684q64600j107996J269580j388308L094858j262610J170857q83888M21868
$$ plain form
4754 4237445 3304354 4165081 4928896 3511746 2623426 3822514 3585758 4441662 4917032
4745 4917032 4167166 2183255 3995171 3755168 4574018 5609253 4190685 4855865 4369473
4736 4369473 3977404 3041069 2147816 4042381 1764439 5092707 4703371 3639185 5341744
4727 5341744 3583048 2082631 3755955 2162005 2760864 2573945 3277474 2946447 3726073
4718 3726073 4435512 3755810 4832663 4477484 4239925 2874458 2667566 2296274 2621805
4709 2621805 3747951 2690986 3671088 3239246 3701916 3977241 5072658 4623936 4655934
4700 4655934 5655481 5193219 3461566 4974459 3703616 3259553 4320580 2553538 2430271
4691 2430271 3531448 2663826 3637981 3390495 3733536 3450323 3682990 3658178 4016499 1671764
$$ packed form
4754D237445r33091Q60727P63815j417150q88320J199088k36756Q55904M75370
4745D917032p49866j983911J811916k40003Q18850J035235j418568O65180m86392
4736D369473l92069r36335q93253J894565k277942L328268l89336j064186J702559
4727E341744j758696j500417J673324j593950N98859j86919P03529l31027P79626
4718C726073P09439o79702J076853l55179k37559j365467k06892l71292L25531
4709B621805J126146j056965R80102m31842M62670K75325J095417m48722L1998
4700D655934R99547m62262j731653J512893j270843m44063J061027j767042j23267
4691B430271J101177q67622R74155k47486L43041k83213K32667k4812L58321k344735
$$ plain form
4681 1671764 3544149 3778383 3423423 3797682 4014083 3374447 5124843 5413181 1712411
4672 1712411 4317658 3554676 2159588 4223369 4122400 2847964 5077535 3935188 3155097
4663 3155097 4651379 3442721 2796719 2907667 3023064 1628646 3179657 3141750 3563884
4654 3563884 2335011 2863106 3838682 4143749 3784594 4391316 3245973 2951077 3206106
4645 3206106 4656074 3562850 4046157 5061922 4151937 5533738 2365909 2214466 4847945
4636 4847945 4615563 4983402 3911729 4915617 4370234 4013792 4110408 3186745 3851670
4627 3851670 3775360 4003198 5436653 4801031 4168518 4975166 3761513 4519768 2909128
4618 2909128 4672220 5368281 5386340 3954198 3398983 4297797 2320002 5256231 3178565
$$ packed form
4681A671764J872385K34234l54960L74259K16401o39636J750396K88338l700770
4672A712411K605247p62982j395088K063781j00969j274436K229571j142347p80091
4663C155097J496282j208658o46002J10948J15397j394418J551011l7907M22134
4654C563884j228873N28095R75576L05067l59155O06722j145343k94896K55029
4645C206106J449968j093224M83307J015765r09985J381801l167829j51443K633479
4636D847945k32382L67839j071673J003888n45383l56442R6616r23663O64925
4627C851670p6310K27838J433455o35622o32513Q06648j213653P58255j610640
4618B909128J763092O96061J8059j432142n55215Q98814j977795K936229k077666
$$ plain form
4609 3178565 6579806 5484047 3540046 5618796 2642482 4041333 3994628 5826147 4775590
4600 4775590 4947020 5123660 3092146 5274765 2292060 4064512 3383361 4426420 5124576
4591 5124576 5141505 5277502 3843442 4441374 3541282 3711112 4014099 5020269 3788795
4582 3788795 5685747 2835688 5465518 3688759 4803603 4969098 2583135 4710572
4574 4710572 4206955 4161318 2574841 5613194 3333411 4350882 5526681 2922676 5016057
4565 5016057 4462758 6151560 4831513 4888367 3762566 3255938 1507221 4912151 2635025
4556 2635025 3425521 4272622 4211618 3144770 6428155 4063884 3696160 2515745 1349378
4547 1349378 4462787 3423721 4037341 4196727 3314570 3222538 3424906 3601926 3962191
$$ packed form
4609C178565L401241j095759j944001K078750k976314J398851m6705J831519j050557
4600D775590J71430J76640k031514K182619k982705J772452o81151J043059O98156
4591E124576J6929J35997j434060N97932r00092J69830L02987J006170j231474
4582C788795J896952k850059K629830j776759J114844J65495k385963K127437
4574D710572n03617m5637j586477L038353k279783J017471J175799k604005K093381
4565E016057n53299J688802j320047N6854j125801n06628j748717L404930k277126
4556B635025P90496Q47101o1004j066848L283385k364271l67724j180415j166367
4547A349378L113409j039066O13620J59386q82157r2032K02368J77020L60265
$$ plain form
4538 3962191 2408418 2717954 2722542 3206191 4404167 4415601 2755779 5091686 5166459 2615713
4528 2615713 4548557 3795357 2429942 2159855 3539878 4519336 4250701 5256275 3927437
4519 3927437 3636710 2940137 3976417 4126287 3486850 3859784 3476173 3987511 2929732
4510 2929732 3759110 3725312 4863685 4940986 4402079 3547861 4982302 3689335 5219483
4501 5219483 4364395 4641671 2411801 3498442 3789193 4920416 4425607 3134214 2955784
4492 2955784 4076147 3042733 3015016 4338823 3931191 2147129 1517050 2489464 3468157
4483 3468157 3919085 5185183 5717621 5149162 2893398 3234610 3344645 4230118 2008538
4474 2008538 3455001 3515976 4419206 2777873 4851888 5255767 3865388 4747051 5047335
$$ packed form
4538C962191j553773L09536M588M83649J197976J1434j659822K335907P4773k550746
4528B615713J932844p53200j365415k70087J380023R79458k68635J005574j328838
4519C927437k90727o96573J036280J49870o39437L72934l83611N11338j057779
4510B929732Q29378l3798J138373P7301n38907q54218J434441j292967J530148
4501E219483q55088K77276k229870J086641K90751J131223m94809j291393j78430
4492B955784J120363j033414k7717J323807m07632j784062o30079R72414R78693
4483C468157M50928J266098N32438n68459k255764L41212J10035Q85473k221580
4474B008538J446463O0975R03230j641333K074015M03879j390379Q81663L00284
$$ plain form
4465 5047335 3394219 5167398 3234471 3620948 3907456 5195012 3756522 5107618 5744421
4456 5744421 5684420 5070602 6123186 4765977 5255083 6308760 6788869 5662953 5184666
4447 5184666 5301787 6222949 5509780 4958216 4546522 4673387 4356033 6557703 5523765
4438 5523765 6487631 6492189 4190736 5724783 4911203 4091314 4132955 4460809 6406139 5643536
4428 5643536 5399352 3757860 6359434 6063695 4860450 6377162 4644372 4416654 4179964
4419 4179964 5321796 3397152 4776934 4693268 5487018 6395023 5060772 4782607 5479391
4410 5479391 4381030 5586363 6356650 6367503 4715555 4625878 4805039 5638010 3769287
4401 3769287 4681690 4524665 4829132 7239761 5650502 4432695 7432263 3107330 4570041
$$ packed form
4465E047335j653116J773179j932927L86477K86508J287556j438490J351096O36803
4456E744421o0001o13818J052584j357209M89106J053677M80109j125916m78287
4447E184666J17121R21162p13169n51564m11694J26865l17354K201670j033938
4438E523765R63866M558k301453J534047q13580q19889M1641L27854J945330p62603
4428E643536k44184j641492K601574k95739j203245J516712j732790k27718k36690
4419D179964J141832j924644J379782q3666P93750R08005j334251k78165O96784
4410E479391j098361J205333P70287J0853j651948q9677J79161Q32971j868723
4401C769287R12403j57025L04467K410629j589259j217807K999568m324933J462711
$$ plain form
4392 4570041 5946867 5275848 5331218 7595889 5254953 6264416 7007481 7003465 8066921
4383 8066921 8273913 6753112 5911090 8294813 7005842 7989019 7663019 9173691 8936222
4374 8936222 7555562 11904041 10252911 8960827 10160829 9917819 13192367 11990150
4366 11990150 13923571 13086236 17881546 19650531 23977536 31189733 37650416 37430032
4358 37430032 34719785 26362372 21035203 18777766 17103463 16107125 16452032 16267324 16581326
4349 16581326 22299605 23029096 21883778 20265605 19198958 18922038 17321089 17892593 17382080
4340 17382080 20053005 18983777 24449285 26770031 26605886 30321985 31956866 45339782
4332 45339782 62606622 75191855 82402115 84074966 85073892 78357524 68756834 56477908
$$ packed form
4392D570041J376826o71019N5370K264671k340936J009463P43065m016J063456
4383H066921K06992j520801q42022K383723j288971R83177l26000J510672k37469
4374H936222j380660M348479j651130j292084J200002k43010L274548j202217
4366A1990150J933421q37335M795310J768985M327005P212197O460683k20384
4358C7430032k710247q357413n327169k257437j674303r96338L44907j84708L14002
4349A6581326N718279P29491j145318j618173j066647k76920j600949N71504n10513
4340A7382080K670925j069228N465508K320746j64145L716099J634881J3382916
4332D5339782J7266840J2585233P210260J672851R98926o716368r600690j2278926
$$ plain form
4324 56477908 48348339 47100694 47940587 51195596 51354720 44916932 37458101 30212556
4316 30212556 26142075 21852102 21271251 18808367 16298716 18620469 17332002 19219469
4308 19219469 19665099 20601743 22957826 25068011 32622207 37257800 39412436 34299842
4300 34299842 25025222 24431839 20292995 20398083 16551149 15342134 16967673 20290617
4292 20290617 21079657 18966983 15435177 17310138 13893825 15286770 13253660 12574685
4284 12574685 12351255 15075973 16935889 14721094 14786664 11300364 12888713 12731436 12053107
4275 12053107 12251447 11826496 8837464 9041637 9097543 8168706 8700876 7861050 9044746
4266 9044746 7698082 7319063 8493541 7761068 6430130 7424895 6538858 6487194 7722067
$$ packed form
4324E6477908q129569j247645Q39893L255009J59124o437788p458831p245545
4316C0212556m070481m289973n80851k462884k509651K321753j288467J887467
4308A9219469M45630R36644K356083K110185P554196M635593K154636n112594
4300C4299842r274620n93383m138844J05088l846934j209015J625539L322944
4292B0290617P89040k112674l531806J874961l416313J392945k033110o78975
4284A2574685k23430K724718J859916k214795O5570l486300J588349j57277o78329
4275A2053107J98340m24951k989032K04173N5906r28837N32170q39826J183696
4266I044746j346664l79019J174478p32473j330938R94765q86037n1664J234873
$$ [...]
##END NTUPLES=NMR SPECTRUM
##END=
