##TITLE=abcd
##JCAMPDX= 6.0         $$ Bruker NMR JCAMP-DX V2.0
##DATA TYPE= NMR SPECTRUM
##DATA CLASS= NTUPLES
##ORIGIN= UXNMR, Bruker Analytische Messtechnik GmbH
##OWNER= root
$$ XWIN-NMR		Version 3.5
$$ Tue Jan 20 18:02:50 2026 Russian Standard Time (UT+4h)  servis@DPX200
##.OBSERVE FREQUENCY= 200.131235884673
##.OBSERVE NUCLEUS= ^1H
##.ACQUISITION MODE= SIMULTANEOUS
##.ACQUISITION SCHEME= undefined
##.AVERAGES= 32
##.DIGITISER RES= 18
##SPECTROMETER/DATA SYSTEM= spect
##.PULSE SEQUENCE= zg
##.SOLVENT NAME= CDCl3
##.SHIFT REFERENCE= (INTERNAL, CDCl3, 0, 16.4885)
##AUDIT TRAIL= $$ (NUMBER, WHEN, WHO, WHERE, WHAT)
$$ ##TITLE= Audit trail, XWIN-NMR		Version 3.5
$$ ##JCAMPDX= 5.01
$$ ##ORIGIN= Bruker BioSpin GmbH
$$ ##OWNER= servis
$$ F:\spectra/data/av/nmr/H1/1/pdata/1/auditp.txt
$$ ##AUDIT TRAIL=  $$ (NUMBER, WHEN, WHO, WHERE, WHAT)
(   1,<2026-01-20 18:01:03.40 +0400>,<servis>,<DPX200>,
      <created by zg, POWCHK disabled, PULCHK disabled
       configuration hash MD5:
       00 E9 B6 7A A2 85 ED C7 34 08 36 98 17 FE 4E 26
       data hash MD5: 32K
       6F 6F A2 46 14 4A 65 AA EA 7D D1 88 27 25 A0 04>)
(   2,<2026-01-20 18:02:09.70 +0400>,<servis>,<DPX200>,
      <Start of raw data processing
       efp BC_mod = 2 LB = 0.05 FT_mod = 6 PKNL = 1 PHC0 = -256.6463 PHC1 = 6.301564 SI = 16K 
       data hash MD5: 16K
       5B 4C 8D 8A A4 C8 C4 C9 8C 41 56 0B 80 48 6C 19>)
(   3,<2026-01-20 18:02:18.98 +0400>,<servis>,<DPX200>,
      <pk PHC0 = -1.6 PHC1 = 0 
       data hash MD5: 16K
       EA 30 9D DF F3 0C C5 AE 66 A2 7F 0C B0 A7 8B F8>)
$$ ##END=
$$ 
$$ hash MD5
$$ 65 FC 15 2F 9F BC 10 AA EA 32 FB 00 DA 3C 40 7A
##$RELAX= 
##$RELAX= 
##$RELAX= 
##$RELAX= 
##$RELAX= 
##$RELAX= 
##$RELAX= 
##$RELAX= 
$$ Bruker specific parameters
$$ --------------------------
##$DU= <F:\spectra>
##$EXPNO= 1
##$NAME= <H1>
##$PROCNO= 1
##$TYPE= <nmr>
##$USER= <av>
##$AMP= (0..31)
100 100 100 100 100 100 100 100 100 100 100 100 100 100 100 100 100 100 
100 100 100 100 100 100 100 100 100 100 100 100 100 100 
##$AQSEQ= 0
##$AQ_mod= 1
##$AUNM= <au_zg>
##$AUTOPOS= <>
##$BF1= 200.13
##$BF2= 200.13
##$BF3= 200.13
##$BF4= 200.13
##$BF5= 500.13
##$BF6= 500.13
##$BF7= 500.13
##$BF8= 500.13
##$BYTORDA= 1
##$CFDGTYP= 0
##$CFRGTYP= 5
##$CHEMSTR= <none>
##$CNST= (0..31)
1 1 145 1 1 1 1 1 1 1 1 1 1 1 1 1 1 1 1 1 1 1 1 1 1 1 1 1 1 1 1 1 
##$CPDPRG= <>
##$CPDPRG1= <>
##$CPDPRG2= <>
##$CPDPRG3= <>
##$CPDPRG4= <mlev>
##$CPDPRG5= <mlev>
##$CPDPRG6= <mlev>
##$CPDPRG7= <mlev>
##$CPDPRG8= <mlev>
##$CPDPRGB= <>
##$CPDPRGT= <>
##$D= (0..31)
0 2 0 0 0 0 0 0 0 0.06 0 0 0 0 0 0 0.0002 0 0 0 0 0 0 0 0 0 0 0 0 0 0 
0 
##$DATE= 1768917663
##$DBL= (0..7)
120 120 120 120 120 120 120 120 
##$DBP= (0..7)
150 150 150 150 150 150 150 150 
##$DBP07= 0
##$DBPNAM0= <>
##$DBPNAM1= <>
##$DBPNAM2= <>
##$DBPNAM3= <>
##$DBPNAM4= <>
##$DBPNAM5= <>
##$DBPNAM6= <>
##$DBPNAM7= <>
##$DBPOAL= (0..7)
0.5 0.5 0.5 0.5 0.5 0.5 0.5 0.5 
##$DBPOFFS= (0..7)
0 0 0 0 0 0 0 0 
##$DE= 6
##$DECBNUC= <off>
##$DECIM= 32
$$ [...]
##$SUBNAM4= <"">
##$SUBNAM5= <"">
##$SUBNAM6= <"">
##$SUBNAM7= <"">
##$SUBNAM8= <"">
##$SUBNAM9= <"">
##$SW= 20.6817932712277
##$SWIBOX= (0..15)
0 0 3 0 0 0 0 0 0 0 0 0 0 0 0 0 
##$SW_h= 4139.07284768212
##$TD= 32768
##$TD0= 1
##$TE= 0
##$TE2= 300
##$TE3= 300
##$TEG= 300
##$TL= (0..7)
0 120 120 120 120 120 120 120 
##$TP= (0..7)
150 150 150 150 150 150 150 150 
##$TP07= 0
##$TPNAME0= <>
##$TPNAME1= <>
##$TPNAME2= <>
##$TPNAME3= <>
##$TPNAME4= <>
##$TPNAME5= <>
##$TPNAME6= <>
##$TPNAME7= <>
##$TPOAL= (0..7)
0.5 0.5 0.5 0.5 0.5 0.5 0.5 0.5 
##$TPOFFS= (0..7)
0 0 0 0 0 0 0 0 
##$TUNHIN= 0
##$TUNHOUT= 0
##$TUNXOUT= 0
##$USERA1= <user>
##$USERA2= <user>
##$USERA3= <user>
##$USERA4= <user>
##$USERA5= <user>
##$V9= 5
##$VALIST= <valist>
##$VCLIST= <CCCCCCCCCCCCCCC>
##$VD= 0
##$VDLIST= <DDDDDDDDDDDDDDD>
##$VPLIST= <PPPPPPPPPPPPPPP>
##$VTLIST= <TTTTTTTTTTTTTTT>
##$WBST= 1024
##$WBSW= 30
##$XGAIN= (0..3)
0 0 0 0 
##$XL= 0
##$YL= 0
##$YMAX_a= 478876
##$YMIN_a= -257400
##$ZGOPTNS= <>
##$ZL1= 120
##$ZL2= 120
##$ZL3= 120
##$ZL4= 120
##$ABSF1= 0
##$ABSF2= 0
##$ABSG= 0
##$ABSL= 0
##$ALPHA= 0
##$AQORDER= 0
##$ASSFAC= 0
##$ASSFACI= 0
##$ASSFACX= 0
##$ASSWID= 0
##$AUNMP= <proc_1d>
##$AZFE= 0.1
##$AZFW= 0.1
##$BCFW= 0
##$BC_mod= 2
##$BYTORDP= 0
##$COROFFS= 0
##$CY= 18.4799938201904
##$DATMOD= 1
##$DC= 0
##$DFILT= <>
##$DTYPP= 0
##$F1P= 9.9274215381318
##$F2P= -0.165520771350173
##$FCOR= 1
##$FTSIZE= 16384
##$FT_mod= 6
##$GAMMA= 0
##$GB= 0
##$INTBC= 1
##$INTSCL= 4.127829e-11
##$ISEN= 128
##$LB= 0.05
##$LEV0= 0
##$LPBIN= 0
##$MAXI= 10000
##$MC2= 0
##$MEAN= 0
##$ME_mod= 0
##$MI= 50
##$NCOEF= 0
##$NC_proc= -5
##$NLEV= 6
##$NOISF1= 3.799351
##$NOISF2= 2.8
##$NSP= 0
##$NTH_PI= 0
##$NZP= 0
##$OFFSET= 16.48848
##$PC= 4
##$PHC0= -258.2463
##$PHC1= 6.301564
##$PH_mod= 1
##$PKNL= yes
##$PPARMOD= 0
##$PSCAL= 4
##$PSIGN= 0
##$REVERSE= no
##$SF= 200.130005582386
##$SI= 16384
##$SIGF1= 3
##$SIGF2= 2
##$SINO= 400
##$SIOLD= 16384
##$SREGLST= <1H.CDCl3>
##$SSB= 0
##$STSI= 16384
##$STSR= 0
##$SW_p= 4139.07284768211
##$SYMM= 0
##$S_DEV= 0
##$TDeff= 32768
##$TDoff= 0
##$TI= <>
##$TILT= no
##$TM1= 0
##$TM2= 0
##$TOPLEV= 0
##$USERP1= <user>
##$USERP2= <user>
##$USERP3= <user>
##$USERP4= <user>
##$USERP5= <user>
##$WDW= 1
##$XDIM= 16384
##$YMAX_p= 381540141
##$YMIN_p= -473109
$$ End of Bruker specific parameters
$$ ---------------------------------
##NTUPLES= NMR SPECTRUM
##VAR_NAME=  FREQUENCY,     SPECTRUM/REAL,   SPECTRUM/IMAG
##SYMBOL=    X,             R,               I
##VAR_TYPE=  INDEPENDENT,   DEPENDENT,       DEPENDENT
##VAR_FORM=  AFFN,          ASDF,            ASDF
##VAR_DIM=   16384,         16384,           16384
##UNITS=     HZ,            ARBITRARY UNITS, ARBITRARY UNITS
##FACTOR=    0.252644378177508, 1,           1
##FIRST=     3299.83951724647, 0,            0
##LAST=      -839.233330435636, 0,           0
##MIN=       -839.233330435636, -473109,     0
##MAX=       3299.83951724647, 381540141,    0
$$ Real data points
##PAGE= N=1
##DATA TABLE= (X++(R..R)), XYDATA
$$ [...]
10122A28576o2170j91648K76828p507l66149K67253m6791N7842O2990j7410j24541
10111b2727J52107j28307q7166J4225j4779k9928K31835n3268r2552K8286J31721
10100A29447r9068p7595j1315j47343J38834R2075J40262l5916j71907p8797J61525
10089D0202N2581j57655L19476j89590j03835P9038L6100l2898j32823O7502j16088
10078a37990K49369j04503K4743n5816N4454L0124M4077P5041j46441J86963R9432
10067C19453k19903j20646R785j40080K0186N9104N179N3638O6589q1633J37026
10056A08698Q3313o7076j26636q1111J10941m046R9404j75376j06210J68093j06192
10045i6198R5310N7957N8504j68378k478J64521k08481J67992k50785K09153M2251
$$ plain form
10122 128576 66406 -125242 151586 144079 -222070 45183 -1608 56234 119224 101814 -22727
10111 -22727 129380 1073 -86093 -71868 -86647 -116575 115260 61992 -30560 -2274 129447
10100 129447 30379 -47216 -58531 -205874 -67040 25035 165297 129381 -42526 -121323 40202
10089 40202 92783 -64872 254604 65014 -38821 40217 76317 43419 -89404 -21902 -137990
10078 -137990 111379 6876 31619 -24197 30257 60381 104458 179499 33058 220021 319453
10067 319453 99550 -21096 -11311 -151391 -131205 -72101 -66922 -13284 53305 -28328 108698
10056 108698 192011 124935 -1701 -82812 28129 24083 123487 -51889 -158099 9994 -96198
10045 -96198 -888 57069 115573 -52805 -55283 109238 -99243 68749 -182036 27117 69368
10034F9368J83875j57870k8637q7614j88999K31146R3323k01592j479J08594L0700
10023E0815P0639q1439N0868m0438k02701O1686J17620l5222Q1103r2547N4612
10012C4996K681j02860K254J32909J05989j32506q1916j14049K55771k28800q4599
10001b10130J85053J03911j43977J45573j6320m2443J27438l32580K44430l6011
9991B4944J2199n2313P3051j76343N5632P2855J29747j9658L7358j73953m3355
9980e9836N5964n6815p8011P1993M039r2460J04058R1519l2558L6272J19131k15045
9968e1749p1988J25406k7327n2768L9069k3458M866K4254k23389L85372k08755
9957h0467J96260j61627l3769J9460O3982P0211k87925J42018r0641K19174n5197
$$ plain form
10034 69368 253243 95373 66736 -20878 -209877 21269 114592 -87000 -88479 20115 50815
10023 50815 121454 40015 90883 50445 -152256 -90570 27050 -8172 72931 -19616 34996
10012 34996 37677 -65183 -62929 69980 175969 43463 -38453 -152502 103269 -125531 -210130
10001 -210130 -25077 78834 -65143 80430 64110 21667 149105 -183475 60955 24944
9991 24944 37143 -15170 57881 -118462 -62830 10025 139772 120114 157472 -16481 -59836
9980 -59836 -3872 -60687 -138698 -66705 -62666 -155126 -51068 40451 7893 44165 163296 -51749
9968 -51749 -123737 1669 -25658 -78426 -39357 -62815 -57949 -33695 -257084 128288 -80467
9957 -80467 115793 -45834 -79603 -60143 3839 74050 -213875 -71857 -162498 56676 1479
9946A479N1736p1018M9457R2353j65215j23810J48970j14755J10922M530J00121
9935H4770K11445j92007L0203o4581J98638k37661j33332L9467j7638J95170n6101
9924E8373j26836K48107k28035J46453L4851L4890l2477j67378j2197m8869J71384
9913G8266M0704l5257j10491N9309P6142j8353P9041k32615n53J73029j59681
9902e0459k3756J98531p5706J60144j03027L5204j43245Q7845N3403j18399K8603
9891D9138l3887n2684N0085m3266R465P7386J05787O6208j08531P957j2871p2645
9879D2142J9740p9186N4196p6749N2557j84999J57190Q0660J40210l44742K49103
9868A10122p6578m6691J65854j75581R5655j54141K41426j96173O863J31527l08849
$$ plain form
9946 1479 53215 -17803 31654 124007 -41208 -165018 -16048 -130803 -19881 -15351 84770
9935 84770 296215 104208 134411 69830 268468 30807 -102525 -63058 -80696 114474 58373
9924 58373 -68463 179644 -48391 98062 132913 167803 135326 -32052 -44249 -93118 78266
9913 78266 118970 83713 -26778 32531 108673 90320 169361 -63254 -63807 109222 -50459
9902 -50459 -74215 124316 48610 208754 105727 140931 -2314 85531 138934 20535 49138
9891 49138 15251 -37433 12652 -30614 -21149 56237 162024 228232 119701 127658 114787 42142
9879 42142 61882 -17304 36892 -39857 12700 -172299 -15109 65551 205761 -138981 110122
9868 110122 33544 -13147 152707 -22874 72781 -81360 160066 -36107 -29244 102283 -206566
9857b06566J58868l1334K39174j15022r2031P4269k83312K99757j41745q315J52412
9846D6155q7753O6388l5418J67507j24150R0872n757p7970N9395N0573l10054
9835a60212K06830p9761r90J61969j74075j96557K74587r4441K9477L5399N0978
9824E3204O9267R0331j07048q1764M0420k58637L6664n0349J79234J05460k6437
9813E0345k201q4821J74562P5878j74574o6578r9324K61030l19592K05280J21412
9802A41417K1331N2723o7222j45682L7047q8666q1768P8950q0153M8066J63005
9791G9048p7509N0027j00478j41764K30887o1536J08531j76057L6440L5344l2017
9780d9084J69394j08889R1009k7118j6279M5539J5823j89616L1828j8832J2942
$$ plain form
9857 -206566 -47698 -79032 160142 45120 -46911 27358 -255954 43803 -97942 -106257 46155
9846 46155 -41598 24790 -10628 156879 32729 123601 117844 39874 99269 149842 -160212
9835 -160212 46618 -33143 -34133 127836 -46239 -242796 31791 -62650 -33173 2226 53204
9824 53204 122471 212802 105754 23990 64410 -194227 -157563 -207912 -28678 76782 50345
9813 50345 48144 -36677 137885 213763 39189 -27389 -126713 134317 -185275 20005 141417
9802 141417 162748 215471 148249 2567 39614 -49052 -130820 -51870 -132023 -83957 79048
9791 79048 1539 51566 -48912 -190676 40211 -21325 87206 -88851 -52411 -17067 -49084
9780 -49084 120310 11421 102430 75312 59033 104572 120395 -69221 -37393 -56225 -43283
9769d3283J66390M848p5392P6344k9028J65644j9072j08537j94580N999K88482
9758B37815K5325r3473N7877j46675O2848N441O4164K06797l43683K08529J01155
9747C86120K49600l0094j80263j41479J9128J52964k35828K05676l00182P1969
9737A97611o0773K8675l341j18723J1196P1803K3047n9883q9118Q7813j96941
9726a08634K06384R9371n0561n1481J36677j76251k7061p0103l9013K57812P836
9715A84976k60233R9305K41211l23365j46242L0939L9580O1739L1997J14399J64649
9704B38955j76219l5212j66203L73525n0348q6116Q780j22485L2571O2544j35402
9693e5610l9632J89453j18346Q6413J33962p6866R3352p2237j65953P4415p0040
$$ plain form
9769 -43283 123107 127955 52563 128907 99879 265523 246451 137914 -56666 -50667 237815
9758 237815 263140 169667 227544 80869 143717 149158 213322 420119 76436 284965 386120
9747 386120 635720 605626 425363 283884 303012 455976 220148 425824 125642 197611
9737 197611 136838 165513 162172 43449 54645 126448 149495 89612 494 88307 -108634
9726 -108634 97750 197121 146560 95079 231756 55505 28444 -41659 -80672 177140 184976
9715 184976 -75257 24048 265259 -58106 -204348 -173409 -133829 -72090 -40093 74306 238955
9704 238955 62736 27524 -138679 234846 184498 98382 107162 -15323 17248 79792 -55610
9693 -55610 -95242 94211 -24135 62278 196240 119374 212726 140489 -25464 48951 -21089
9682b1089K35230p7574Q2477l8772k47823J33386K3666j99788J36674l6828K36825
9671B26384j94460O8260O6041j85823Q5539K5078j45610J19694j13755P2970j20564
9660i6246k1476R8190m4175m848J08843J74035P4495p0967j91002m3816J62204
9649A45237l53224J34654L2845l554n4228j22711J48823N5396P5732P214q1861
9638a5677j20570K56938L0408j40443j73011O2668K82094k32256O0931l6834O6198
9627D0446M1530n0143M6896K9479j86460Q6200O1245j57302K14753p0032r5592
9616c8980J85901j34570J84548j05309O017n2782J15414q5297M7543J369q0246
9605D3608m5017P4019k1929J2476j13049J31947n1515r8744j30077K95166p1114
$$ plain form
9682 -21089 214141 136567 219044 180272 -67551 65835 89501 -110287 26387 -10441 226384
9671 226384 31924 100184 166225 -19598 65941 91019 -54591 65103 -48652 24318 -96246
9660 -96246 -117722 -19532 -63707 -68555 40288 214323 288818 217851 26849 -16967 145237
9649 145237 -207987 -73333 -40488 -44042 -98270 -220981 -72158 -16762 58970 66184 -15677
9638 -15677 -136247 120691 151099 10656 -162355 -99687 182407 -49849 11082 -25752 40446
9627 40446 81976 31833 78729 108208 -78252 7948 69193 -88109 126644 56612 -38980
9616 -38980 146921 12351 196899 91590 97607 44825 160239 74942 122485 123854 43608
9605 43608 -1409 72610 50681 63157 -49892 82055 30540 -68204 -198281 96885 25771
9594B5771o6167n5948Q3020j820j3592J08989P2085j31852N3700o6484J35284
9583A42986n4794Q0247O7324j40027L421j20680k0815M6918R8506l2114j04940
9572c3968O2069K0413Q174q3165J69044j16718O1008j847R7858j56261J5216M6641
9560H8464k8329m5643m039r633J26908j682k14045O2300K34556k75934K13932
9549A46855M184J22894q082j72159J24520n4461M0699j55380J00641j1468k31750
9538i3507J75301q4887j9218J6507J12638j13502L6330L0945J92685j12530j18804
9527B1958j49134J35204N4263l5439m4063n5213R9144j64567p8275J91177r866
9516c4811o185P5515o8688l1104q121K33232Q8198j14807L7287p9726L6431k70738
$$ plain form
9594 25771 -40396 -96344 -13324 -15144 -28736 80253 152338 20486 74186 7702 142986
9583 142986 88192 168439 235763 95736 99157 -21523 -42338 4580 103086 70972 -33968
9572 -33968 28101 48514 56688 -26477 142567 25849 86857 85010 182868 26607 41823 88464
9560 88464 60135 14492 10453 820 127728 126046 -87999 -25699 208857 -67077 146855
9549 146855 151039 273933 265851 93692 218212 163751 204450 49070 149711 138243 -93507
9538 -93507 81794 -3093 -22311 -5804 106834 -6668 29662 60607 253292 140762 21958
9527 21958 -127176 8028 62291 26852 -17211 -72424 26720 -137847 -216122 -24945 -34811
9516 -34811 -40996 34519 -34169 -65273 -73394 159838 248036 133229 170516 90790 127221 -143517
9504a43517L52159k8323j77350j09644J15432J58150K12647l8067k90548J05775
9494A56714k3355l7340K24294j66257p1430Q5482j62012J46307j19378o7428m1269
9483g5672J2611L31927l49785K86050k6396j68029n2870K39258l408m6800k29394
9472h2508M1609J44181P8347k16313O8786L355L1775J38907J37590l22021R0412
9461A14120k27464K20703J21518K2122J12370k25505j2663j18129J88106n0978
9451A44200l09542K79231l56230L80322J24961j55170L3790j22824J06300n4575
9441G0463O8224J61160r5578q5012r1218P6112M9715N478r4736n0996J08070K4306
9429A45988l5169O9874j9101j4736m9862R7747J25488j73115j39932j7106j41312
$$ plain form
9504 -143517 208642 180319 2969 -106675 8757 166907 379554 341487 50939 156714
9494 156714 133359 96019 320313 154056 82626 168108 6096 152403 33025 -34403 -75672
9483 -75672 -63061 268866 -80919 205131 178735 10706 -42164 197094 193686 146886 -82508
9472 -82508 -40899 103282 181629 -34684 34102 37457 69232 208139 345729 23708 114120
9461 114120 -113344 107359 228877 250999 363369 137864 125201 7072 195178 144200
9451 144200 -165342 113889 -242341 137981 262942 107772 141562 18738 125038 70463
9441 70463 138687 299847 204269 119257 28039 104151 153866 159344 64608 13612 121682 145988
9429 145988 110819 180693 161592 146856 96994 194741 320229 147114 7182 -9924 -151236
9418a51236L76997j49385L18370k90164l7030J80754o8183j42094k18369K24401
9408D4061q9362J24833J12642k12147J69365j07041J40165j33776J73341j42746
9398G9335K9153Q3751j76529J04279K7427l33189K79618o0468J38070m6260J42455
9387B67642k28867P4394q8332j3912J52679J6753k20133Q7795k3744O8052J3687
9376A06014J40822j65178j3507k6601P9531N2345l7122J5894n396n0338O3392
9365A59856P2719r2181k12676J37972p1514O9579q8561J16602P3344j58595K9570
9354C6115K55750k08252O5489J6002o7153k3512J31613k03836J81235j51405j16313
9343h4267J14123N1055j24148J40902j04899K12568j5394K0316j39534M6463R1781
$$ plain form
9418 -151236 225761 76376 394746 104582 67552 248306 180123 38029 -180340 44061
9408 44061 -45301 79532 192174 -19973 149392 42351 182516 48740 222081 79335
9398 79335 108488 192239 15710 119989 147416 -185773 93845 33377 171447 125187 267642
9387 267642 38775 113169 24837 10925 163604 180357 -39776 48019 24275 92327 106014
9376 106014 246836 81658 68151 41550 121081 173426 136304 152198 146802 96464 159856
9365 159856 232575 140394 -72282 65690 -5824 63755 -24806 91796 165140 6545 36115
9354 36115 291865 83613 149102 165104 97951 74439 206052 2216 183451 32046 -84267
9343 -84267 29856 80911 -43237 97665 -7234 205334 189940 210256 70722 117185 208966
9332B08966j7810L9055q7570K7894J29336j31088J22087j72897O6380j4895j11762
9321E7696n4846N4444K935K48928j80816M4151M2339K81277k41687q5053K6455
9310A95823q153k6329l3055r3677J19719k44815J78703q990J52879j3949j22773
9299I5383O3071J3660K3471k7813m707l7608r5691J49624J92159o994n0799j39402
9287A74354k24034K68802j1298j59704j12635j6539K70694p7420j41149J00813
9277G1884J56395L0514o9576k3603k0368j21929p2851K41385j11797l5747K0626
9266F4933L1832J54358k17951J20138J0513j82124J80423m599k0008j5696k03021
9255h1202K42917J0117n1764m7351J83070k62512K81767j76480J08413J0955k01821
$$ plain form
9332 208966 191156 230211 142641 170535 299871 168783 290870 117973 184353 169458 57696
9321 57696 2850 57294 60229 309157 128341 172492 214831 496108 254421 169368 195823
9310 195823 187670 161341 128286 34609 154328 -90487 88216 79226 232105 218156 95383
9299 95383 158454 172114 195585 167772 163065 125457 29766 179390 371549 364555 313756 174354
9287 174354 -49680 219122 207824 48120 -64515 -81054 189640 112220 -28929 71884
9277 71884 228279 258793 189217 165614 145246 23317 -49534 191851 80054 44307 64933
9266 64933 96765 251123 33172 153310 163823 -18301 162122 157523 137515 121819 -81202
9255 -81202 161715 171832 120068 72717 255787 -6725 275042 98562 206975 217930 16109
9244A6109J42627J71611q6950O210j02153R7580m1214L9237j06134l113k6407
9233A07403J09587m7361N1436o7052K392K20583k22090J79433k15127j44294K16509
9222A91419j01426J98641j31539q6032R9828j36050J76736r5177J98832j95247
9212A19985o5574J30688J29484m0727k21071p7489Q8959M7116J36164k40361J05820
9201A12994N9252J0982J19539k03261Q0766j77325J86811j27023J05265J53907
9191C21907o7983P0559N3237j45270K9213J01019k27574P2883O5896K5372j15262
9180A83997P7411L360J28032j12196j0158J34724j9057j49890m6925r0912Q2941
9169A81327J24757j12997Q6440r3942J70107R7116l8685j07761P6323k44238L2125
$$ plain form
9244 16109 158736 330347 243397 249607 147454 245034 203820 243057 136923 133810 107403
9233 107403 216990 169629 221065 154013 156405 376988 154898 334331 119204 -25090 191419
9222 191419 89993 288634 157095 71063 170891 34841 211577 116400 315232 119985
9212 119985 54411 185099 314583 273856 52785 -24704 64255 111371 247535 7174 112994
9201 112994 172246 183228 302767 99506 180272 2947 189758 62735 168000 321907
9191 321907 253924 324483 377720 232450 261663 362682 135108 207991 273887 299259 183997
9180 183997 261408 264768 392800 280604 270446 405170 386113 236223 189298 98386 181327
9169 181327 306084 193087 279527 185585 355692 452808 414123 306362 382685 138447 170572
9158A70572J05677k7222j7140J60645n0438K26303j14260j29442r136J55483k47430
9147B23612J70079O2987k85605J72613J56288O4930j58908J71571p4044j87430
9137C16093P6214n3640N7554j3061Q5096r6018P7137P8421q8449J48467R2917
9126F80731n6742N4113m5985j45949J37999J18858k8339m33p6939J79445K07229
9115A023988N7758l03780O6510O9424p1026K08853N6112j50349K17189Q8566O8873
9104A332118J18104J25832L9214j73928R6213K61792K88001K84875q0123N6581
9094B348679N42893M70519L15910Q38472P69453K342164N045173J1446683R152691
9085C3272637m517448p800151o445685m360562k995464j894337j366292r69224
$$ plain form
9158 170572 276249 249027 231887 392532 342094 568397 454137 324695 315559 471042 223612
9147 223612 393691 456678 171073 343686 499974 564904 405996 577567 503523 316093
9137 316093 392307 338667 396221 383160 468256 372238 449375 527796 439347 587814 680731
9126 680731 623989 678102 632117 486168 624167 743025 714686 714253 637314 816759 1023988
9115 1023988 1081746 777966 844476 913900 842874 1051727 1107839 957490 1174679 1263245 1332118
9104 1332118 1450222 1576054 1615268 1441340 1537553 1799345 2087346 2372221 2292098 2348679
9094 2348679 2891572 3362091 3678001 4516473 5285926 7628090 12673263 24119946 33272637
9085 33272637 28755189 20955038 14509353 10148791 7153327 5258990 3892698 2923474
9077B923474m05224m90133l35910m32556j40046J35933j84384j44373L3561p7874
9067H82468J1866m3020j4878k79923N3406p4258j5129m4754o9091L3834R9084
9056E39605j02146J32725M5372j25524j54970N5469O0680m5823j24722o5759K54608
9045D69515j58862K3608j0706j33830k4124R3406K09810j2997k07625m1751m3921
9034A62523Q7825q2546J4347Q5459j29240K01531j22392J36077k03753m9263p02
9023I9866J58217j26321K06841k77728R1012P3990J8464j01163m8411O8662p1924
9012I1505J36581N0667k16305Q2312j67365J15547J35726j21850k4382J21644
9002B04080j22650K01172j54991l4628n2014M1377O94J01218k65497J75776O2451
$$ plain form
9077 2923474 2518250 2028117 1692207 1259651 1119605 1255538 1071154 926781 960342 882468
9067 882468 894334 851314 836436 556513 609919 535661 520532 475778 406687 440521 539605
9056 539605 437459 570184 615556 490032 335062 390531 451211 405388 280666 214907 469515
9045 469515 310653 334261 323555 189725 165601 259007 468817 455820 248195 206444 162523
9034 162523 250348 167802 182149 267608 138368 339899 217507 353584 149831 100568 99866
9023 99866 258083 131762 338603 60875 151887 225877 244341 143178 94767 163429 91505
9012 91505 228086 278753 62448 144760 -22605 92942 228668 106818 82436 204080
9002 204080 81430 282602 127611 92983 40969 82346 83040 184258 -81239 94537 156988
8991A56988j7007j40446J37686j39657J28703M6322j31897K30448k52665J13967
8981A32442J1098j4194M4680k25304Q9669q6644L10944j87426o8017J11854J03442
8970B22544J41705q5001j83532J59802r2284l979m5069J25029k39789K28424j43255
8959H4595L531j78957J15208j51651J29306k0008J49458k2911j70938L00116k6495
8948B11254j50383K11268k72046J9961J89288j99204Q6576R0274n0457p7425L9272
8937I8378K2786P4777j01802k16324K41142k2604L1777l5169r9681l8521K23292
8926A78051k03196K24974k06010n962j0833K41932j34595M1650l12999K79662
8916I2674J0548o9681M0790m2312j28986o7865J42382O0447P373P544j70090K50328
$$ plain form
8991 156988 139981 -465 137221 -2436 126267 172589 40692 271140 18475 132442
8981 132442 143540 129346 174026 -51278 38391 -48253 262691 75265 7248 119102 222544
8970 222544 364249 279248 95716 255518 163234 159255 114186 239215 -574 227850 84595
8959 84595 88126 -90831 24377 -127274 2032 -17976 131482 108571 -62367 237749 211254
8948 211254 60871 272139 93 20054 209342 10138 96714 186988 136531 59106 98378
8937 98378 121164 195941 94139 -122185 118957 96353 128130 92961 -6720 -45241 178051
8926 178051 -25145 199829 -6181 -12143 -22976 218956 84361 126011 -186988 92674
8916 92674 103222 33541 74331 32019 -96967 -164832 -22450 37997 45370 52914 -117176 133152
8904A33152r8335J59432m2070r5717k1681Q7424J35556k10628p3946J62843k37049
8893a01019J14574j33003M4162J69486q9830j28947K89198j09813J07273q9936
8883G2145K80970o9541r4351j699j02039l4403q0346o1233J97781l2363O3355
8872A38276k03592K33219J29346j02920j12305j0377J04277J67637r5746p393
8862B40422k8608j48365m6700J67156k12116J0870l1222o680K79893k73715L1346
8851a7719O6051P6471j16103n8885J86888n9966J81462k5318q8760K2426k06689
8840d0142n754R594K7342j12105N18J40409p1845o4158J60450J52285L0890j14587
8828A12897P4178r3097o9243K3570k47817J41095N1912P6238m1053n3649O5027
$$ plain form
8904 133152 34817 194249 152179 56462 34781 122205 257761 47133 -26813 136030 -101019
8893 -101019 13555 -119448 -75286 94200 4370 -124577 164621 54808 162081 72145
8883 72145 353115 283574 189223 187524 85485 51082 -29264 -90497 107284 74921 138276
8872 138276 -65316 167903 297249 194329 82024 71647 175924 343561 247815 240422
8862 240422 211814 63449 16749 183905 -28211 -17341 -48563 -55243 224650 -49065 -17719
8851 -17719 48332 124803 8700 -50185 136703 76737 258199 232881 144121 166547 -40142
8840 -40142 -45896 -36302 -8960 -121065 -120547 19862 -51983 -116141 44309 196594 227484 112897
8828 112897 187075 93978 24735 48305 -199512 -58417 -6505 69733 28680 -24969 40058
8817D0058j40231J23329O9144m6747J45158j26279M620J02681N1047q8230m4399
8806I0151q444k2563J62482k13999L4855J3087j70707K20549J2775R2777K0901
8795B31864J92514j83543k8364K7320j96643M7294j65899L277J10277j80532L46678
8784B04243l3326m3753j83909N9962Q2368J80274j12573J8977j23479L292j39067
8773h6991Q4329J40709j19727n1902J24383p0324Q7932j19613J65704j14771k8769
8762A0960J02235L1232j14944l6717L4528Q7000k21706J46788j21548J26333j35873
8751i1712j92846L43928o8845n258m8820Q397J60074j74723N9771n7503j660K62043
8739A92846j80873m1443l35L2296M7387o4510J92711k41381J57007o4806N069
$$ plain form
8817 40058 -100173 23156 92300 45553 190711 64432 69052 171733 222780 134550 90151
8806 90151 81707 59144 221626 7627 42482 55569 -115138 105411 118186 210963 231864
8795 231864 424378 240835 212471 239791 43148 90442 -75457 -72180 38097 -142435 204243
8784 204243 170917 127164 -56745 3217 85585 265859 153286 172263 48784 52076 -86991
8773 -86991 -2662 138047 18320 -33582 90801 20477 108409 -11204 154500 39729 10960
8762 10960 113195 144427 29483 -7234 27294 114294 -107412 39376 -82172 44161 -91712
8751 -91712 -284558 59370 -9475 -14733 -63553 -55156 104918 -69805 -10034 -67537 -69197 192846
8739 192846 11973 -29470 -29805 2491 49878 -14632 178079 -63302 93705 28899 33968
8728C3968Q6965j23897N5373j32483O1986K01002k00620J61195k02612J46032
8718H6909M391r3609Q3443q177P1695p783k19089K14522j46761O9509P7514j20090
8706A2474J57662m4356j57160n6979K7465P0519n3939J78238q9834N3939p0m0007
8694E7952J02625j13400j89134L33810q4793k606P9112M5496k64219P4133J8847
8683E7823j79909J12326K5099j5975J4454K5617p5156j33351L47657j63994L1140
8672D5731M8735K56923j79902k7891Q4930k45780K01907l19929p8400K63535p9214
8661b9355R0412k10079K05304K3556o9847Q1597j13756J90995p2905j77434R9665
8650A8153J08444J15135r6064L5740k71865R4474J5417p1750J9806l965l1079
$$ plain form
8728 33968 120933 -2964 52409 -80074 -18088 182914 -17706 143489 -59123 86909
8718 86909 91300 -2309 81134 72957 144652 136869 -82220 132302 -14459 55050 132564 12474
8706 12474 170136 125780 -31380 -88359 -60894 9625 -44314 133924 44090 98029 97959 57952
8694 57952 160577 47177 -141957 191853 107060 104454 183566 229062 -35157 38976 57823
8683 57823 -122086 -9760 15339 -636 13818 39435 -35721 -169072 178585 14591 45731
8672 45731 94466 351389 171487 143596 228526 -17254 184653 -135276 -213676 49859 -29355
8661 -29355 61057 -149022 56282 79838 9991 91588 -22168 168827 95922 -81512 18153
8650 18153 126597 241732 145668 181408 -90457 4017 19434 -52316 -32510 -36475 -67554
8639f7554J56549K7512j37813o2940Q5378J86615o1555m4476r524j24771M41P9840
8627B7702k1917K2905j9985o4610J56912k42385J55263M5505j47308O7740J44064
8616A23886L1123l1999M101n4824K0844J89964j72268O1822k23824L6986N7646
8605D3457k8910j0271M717R225o4659O6870p9622K64567k1240j69726j08649K69814
8593A75573L2122p6150m0266j99911K07504m4709k275r0630M3580K9908J06190
8582A40936j83801J8696k0299J64519j64392K14945j65127q2314J34092o2271
8572e016Q3366j08235J62302r963j52223R0687j37739L14945k28171j49559J99508
8561E9902j19467R4716l1970L4666j1701M8197j57788J10140J83444j93010l0997
$$ plain form
8639 -67554 88995 116507 -21306 -84246 1132 187747 126192 81716 72192 -52579 -52138 27702
8627 27702 5785 28690 8705 -55905 101007 -141378 13885 59390 -87918 -20178 123886
8616 123886 155009 123010 127111 72287 93131 283095 110827 172649 -51175 -14189 43457
8605 43457 14547 4276 8993 18218 -46441 20429 -59193 205374 184134 14408 -94241 175573
8593 175573 207695 131545 91279 -108632 98872 54163 51888 -38742 4838 34746 140936
8582 140936 -42865 -24169 -44468 120051 -44341 170604 5477 -76837 57255 -5016
8572 -5016 78350 -29885 132417 122454 -29769 60918 -76821 238124 9953 -139606 59902
8561 59902 -59565 35151 3181 37847 26146 74343 -83445 26695 210139 17129 -13868
8550a3868j00630J62796J2304J19653j78341J12300p2786j32407L4267N4487q370
8539a0595m3175k9545j0228r3499k55816O12061k14846J33787m5377j8188N1096
8528G5675r6623Q5014m2033N5751j13290J27164J16860r5376j7005k35431P0707
8517f8587R7988l941j37288K36405m7445L4145L3165p6025j558K5323P6295k33639
8505f5162r2754J43638m2827J91851l24615K2784J56803j10887K23268Q0380J57364
8494C39843k59908K315m0270k2872p3223n3135J01622k19524K09867O1089L6120
8483H1924k3901o8549K7507p2156J4862O3059J8241L7154j08968K0513J34143
8472A23829j30600O5218j6436R595J8997r138j68146j77122K45178q5020N4938
$$ plain form
8550 -13868 -114498 48298 60602 180255 1914 114214 41428 -90979 -56712 -2225 -10595
8539 -10595 -53770 -83315 -93543 -187042 -442858 169203 -45643 88144 42767 24579 75675
8528 75675 -20948 64066 22033 77784 -35506 91658 208518 113142 96137 -139294 -68587
8517 -68587 29401 25460 -111828 124577 77132 111277 144442 68417 66859 92182 168477 -65162
8505 -65162 -157916 -14278 -57105 134746 -189869 -167085 -10282 -121169 102099 182479 339843
8494 339843 79935 82250 41980 19108 -54115 -107250 -5628 -225152 -15285 45804 81924
8483 81924 58023 -10526 16981 -55175 -40313 22746 40987 78141 -30827 -10314 123829
8472 123829 -6771 58447 42011 51606 70603 61465 -106681 -283803 -38625 -123645 -68707
8461f8707J90179j01416K33872k10632K2659K6786l8048o6147j00563J39297n9075
8450c1795p4109K07951o6701n9991j4186P4823N4008l2622P7560j04393J0218
8439D0763L3987p3834J02549k16882k5804J12081j52677O7466O3706Q9712j1230
8428B9837l0714l926J15148J0693j4207J21254r9489L78r5025L5055j6290m765
8416D7949k21403N1272J09383j50114J81661j78055K79733J3112l5647L7854o0986
8405G4759J42903n4178Q3884k57341J13884j96447j7242K86967k11832J338j39030
8394a72335n038J33744Q6421K4619K7678k28094R1892J65009P615j08135O668
8383C0044N671L8408n5076P5827n0111J66392k91745P7299P7589n3435R8549K0849
$$ plain form
8461 -68707 121472 20056 253928 43296 65955 92741 54693 -11454 -112017 27280 -31795
8450 -31795 -105904 102047 35346 -24645 -38831 35992 90000 57378 134938 30545 40763
8439 40763 74750 916 103465 -113417 -139221 -27140 -179817 -112351 -48645 41067 29837
8428 29837 -877 -4803 110345 121038 106831 228085 128596 128974 33949 69004 52714 47949
8416 47949 -173454 -122182 -12799 -162913 18748 -159307 120426 133538 97891 135745 74759
8405 74759 217662 163484 247368 -9973 103911 -92536 -109778 177189 -34643 -33305 -172335
8394 -172335 -177373 -43629 42792 67411 95089 -133005 -41113 123896 131511 23376 30044
8383 30044 35715 74123 19047 94874 44763 211155 -80590 -3291 74298 20863 119412 140261
8371A40261l267q8055r8571O646J04078K3207r5680J24237r5129n5941O4326L208
8359B9320o5924J48247r0117r428j13108J77125j11371R1183J17161m1894m1957
8348H9237J9568k37094R0017k4865j48880J65830l0828O8009N1195J6661K46378
8337C05228j30130K1308j30250j09931p466N918m0313k18923K78468l5317O0004
8326a404J33617j33058K34020m6615j35306J4831l122p1595j0683N6799j30207
8315i2723K74019j91903p9613K14599j89672m3014l9582o8754L20357j32245j0723
8304c9254m5909K79312M1920o361j6157j53857J08528j56718p5736R8601r0399
8293e6030R2245j6065k07697L29386j51663n4101K51679j79816J89987k20059
$$ plain form
8371 140261 136994 48939 -49632 -42986 61092 84299 -11381 112856 17727 -38214 26112 29320
8359 29320 -36604 111643 21526 12098 -101010 76115 -35256 55927 173088 131194 89237
8348 89237 108805 -128289 -38272 -63137 -212017 -46187 -77015 -9006 42189 58850 305228
8337 305228 175098 196406 66156 -43775 -51241 -45323 -85636 -304559 -26091 -61408 -1404
8326 -1404 132213 -845 233175 186560 51254 66085 62963 -8632 -19315 37484 -92723
8315 -92723 181296 -10607 -90220 124379 -65293 -108307 -147889 -216643 103714 -28531 -39254
8304 -39254 -85163 194149 236069 229708 213551 59694 168222 11504 -64232 34369 -56030
8293 -56030 36215 20150 -187547 141839 -9824 -63925 187754 7938 197925 -22134
8283b2134m0308J42590J6107n3604q0677k9193M105J63969N8734k41134P6193
8272e352j49303J68308j09555J12693j11353o1902K16925k69986L30991J827j01242
8261B2051K8460l3969P6308J04957j40338q8948p3480J64010k40268K46126q3346
8250a8437j58959J09981P8628L2901J07706j58494j56566K83650J12747q8510
8240A44647k1357r2288K7874J1134o4505L007j22364n5199P0153K89592K723o2328
8228A31089r8687J20612K5252p6708J8407j14315J51143j70585k6751J98876k20523
8217f2190K64992j37907j50161L723J3294R7021q6929K436J04291N6190m7776
8206E6984J34304k30408j8287Q3749m0172M4199j79556J14612M2734k67059J29522
$$ plain form
8283 -22134 -62442 80148 96255 42651 -38026 -67219 -63114 100855 159589 -81545 -5352
8272 -5352 -154655 13653 -95902 16791 -94562 -156464 60461 -209525 121466 123293 22051
8261 22051 50511 16542 92850 197807 57469 -31479 -104959 59051 -181217 64909 -18437
8250 -18437 -177396 -67415 11213 44114 151820 -6674 -163240 120410 233157 144647
8240 144647 123290 31002 58876 70010 5505 8512 -113852 -169051 -98898 190694 193417 131089
8228 131089 32402 153014 178266 101558 119965 5650 156793 -13792 -40543 158333 -62190
8217 -62190 202802 64895 -85266 -81543 -68249 28772 -58157 -55721 48570 104760 56984
8206 56984 191288 -39120 -57407 26342 -13830 30369 -149187 -34575 8159 -258900 -129378
8195a29378j30301J42279O6927K31911K68468r8467l54180L0574M6584k89o0878
8184A3250J04779n2271J6309q2395j1711J02749L2585j50288L6574o356J33330
8173A36555o3909n9858J25123n8865J90740k29075o5311J02059J35328j03635
8163A09152k86191J67655J68315M9584r2303p0155R4684m7677j91205L43771l33448
8152h7818J58507j40820L7818J25447n0218p3259r7278J64923r5829Q749R7202
8141D7424M3153l3600J15573k83751N7466l6350l1737J69400j30837Q0085l9379
8130d2553N1669p5468J64235K3041o3137o092j1705P8264J83072j31885L602j90910
8118a7867J10089K1842j4933P5250k35850k5922m8417J27842K42472j11216l8198
$$ plain form
8195 -129378 -259679 -117400 -50473 181438 449906 351439 -2741 27833 74417 74128 13250
8184 13250 118029 65758 82067 -328 -12039 90710 123295 -26993 9581 3225 136555
8173 136555 72646 12788 137911 79046 269786 40711 -24600 77459 212787 109152
8163 109152 -177039 -9384 158931 208515 116212 46057 140741 93064 -98141 245630 -87818
8152 -87818 70689 -70131 -32313 93134 42916 -30343 -127621 37302 -58527 -49778 47424
8141 47424 90577 56977 172550 -111201 -53735 -90085 -121822 47578 -83259 -3174 -42553
8130 -42553 9116 -66352 97883 120924 57787 51695 39990 118254 301326 169441 173043 -17867
8118 -17867 92222 114064 99131 174381 -61469 -87391 -135808 -7966 234506 123290 85092
8107H5092N916l6273K1070q4358J7163n925j84Q6568O9342j32042J68744k27234
8095c2121M0304J34278j29597m0955j52830P4521o2036K24430J5308O392J45942
8084B23636j54690R2940q9404M3232j99698O294K2368j41450K44240l7564J0358
8073B0262Q7155N1397q5043J20365k42151O6253Q0984j9127r805P001n799k1636
8061D9856K0631n4792r520Q7542j70939N5096J16466n6543Q9072j80994J09625
8050E5500J21983j50189J12416k31869P9051j38477J79452n9359P9772r9136J19779
8039F8923O6242R259J41113k73132Q7357P667M8648P6628k08264K00350j95902
8028B8889R1964j77000K5096J67494p0899O403j04653K26155k93514K35402K4666
$$ plain form
8107 85092 91008 54735 75805 -8553 8610 2685 2501 89069 158411 26369 195113 -32121
8095 -32121 8183 142461 12864 -28091 -180921 -106400 -168436 55994 71302 77694 223636
8084 223636 68946 161886 72482 115714 -83984 -77690 -55322 -196772 47468 9904 20262
8073 20262 107417 158814 73771 194136 -48015 18238 99222 80095 70290 77291 71492 49856
8061 49856 70487 15695 6175 93717 -77222 -22126 94340 37797 126869 -54125 55500
8050 55500 177483 27294 139710 -92159 -13108 -151585 27867 -31492 48280 -50856 68923
8039 68923 135165 144424 285537 12405 99762 107429 156077 232705 24441 224791 28889
8028 28889 120853 -56147 -31051 136443 65544 71947 -32706 193449 -100065 135337 160003
8017A60003k04106K58782j13840p5103J38420j44045j18066K54814k17013L1373
8007b8781P2147Q2225l9168p4987l3313o2403O8250O1320L0971l1577j3443M4313
7995G5554R447j86849N5709J11271m0301J03983m1441j04429J76246l4672Q6744
7984B11262j80360k09238J53660J50688l06786K58711j35038J35056P2592p6649
7974G3898j72721Q5778k49918J53483K32578q9540O2657r9083J8867K32975J6274
7963B65248j30331j52506J09715r3442L3725j85418J06056J98861j82354J18592
7953H8146r909N0681J16567k64922P6212J43827j76353j21072O1215N3593k08955
7942a90970N24185j89847k35352K03284p293J48394j47875j4139k05841M223N3500
$$ plain form
8017 160003 -44103 214679 100839 25736 164156 20111 -97955 156859 -60154 -28781
8007 -28781 43366 125591 86423 11436 -21877 -84280 -16030 45290 76261 44684 31241 75554
7995 75554 85001 -101848 -46139 65132 24831 128814 87373 -17056 159190 124518 211262
7984 211262 30902 -178336 -24676 126012 -180774 77937 -57101 77955 150547 73898
7974 73898 -98823 -13045 -262963 -109480 123098 33558 96215 -2868 15999 248974 265248
7963 265248 134917 -17589 92126 -1316 32409 -153009 -46953 151908 -30446 88146
7953 88146 78237 128918 245485 -19437 56775 200602 24249 -96823 -35608 17985 -190970
7942 -190970 333215 143368 -91984 111300 104007 252401 104526 90387 -115454 -111231 -57731
7931e7731J2704J77791J9778j50729J75837P0680j63235J49898j59772k32667
7921a57446J10763J85061n3786P5610r4540j39816K16739K66819k53291K30492
7911C86605k52982j34609J59574O2237k50995m3406J50641p6435P2994P9914q2819
7900G0719J41539j47129O852r9087j8215R928n8657O8765K7653J97265n7323j58116
7888a5806M0880J1919J8752l1086o5146j7731j23493K84619j51530K14316j05580
7877F0114R8845R6115j04991N3559k35069P469P4411J5937k45558O8948J2041
7866i8179M1380K01425k30374j5780J42177K6546N9526l6595J12947n6238p8177
7855F8658J63424j23039N5317k81175J50202J26101N42212j007182L80791M4314
$$ plain form
7931 -57731 -45027 132764 152542 1813 177650 248330 85095 234993 75221 -157446
7921 -157446 -46683 138378 84592 160202 65662 -74154 142585 409404 156113 386605
7911 386605 133623 -986 158588 220825 -30170 -73576 77065 630 73624 153538 70719
7900 70719 212258 65129 71981 -27106 -45321 -35393 -94050 -25285 2368 199633 142310 -15806
7888 -15806 25074 36993 55745 24659 -40487 -58218 -181711 102908 -48622 165694 60114
7877 60114 158959 255074 150083 203642 -31427 -23958 50453 66390 -179168 -110220 -98179
7866 -98179 -56799 144626 -85748 -101528 40649 67195 126721 90126 203073 146835 68658
7855 68658 232082 109043 164360 -116815 33387 159488 701700 -305482 75309 119623
7845A19623m4446J82844l0193j10689l8131n4409q295J04146O3412j67214J62375
7834A79023k2910l1965q0236P8206j02364R4423n814l83815L21593o5251M3990
7823B4880K20523q1585J05748k32322J38900k39117Q1037J5721k2173J42625j98779
7812d4542l5290r5057L45503j39002p2873J3218J73830j91295M1845J10331N9293
7801A65961R5002j47556j06720Q1711K0947J7701p2254M9459q5569k1544J27389
7790A24527n7826R5526j86554J05301m3943J00029L0133j52209M8012N3980P3521
7779A90497Q9747L0900P9901o7057k00693j3558J2006K7456j40615n430K0394
7768B3548K61541K5505k11687K6131q7870O7301j27555K2541M1824r0992p7908
$$ plain form
7845 119623 75177 258021 227828 117139 79008 24599 16304 120450 183862 16648 179023
7834 179023 156113 124148 43912 122118 19754 114177 108363 -275452 46141 -19110 24880
7823 24880 245403 163818 269566 37244 176144 -62973 18064 33785 11612 154237 -44542
7812 -44542 -79832 -174889 170614 31612 -41261 -28043 145787 -45508 -3663 106668 165961
7801 165961 260963 113407 6687 88398 109345 127046 54792 104251 18682 -2862 124527
7790 124527 66701 162227 -24327 80974 37031 137060 167193 14984 62996 116976 190497
7779 190497 280244 311144 391045 323988 123295 109737 121743 149199 8584 3154 23548
7768 23548 285089 310594 98907 125038 37168 104469 -23086 -545 41279 -49713 -127621
7757a27621K63923j60945L8196K07068k4527J82257k62130j16720L5011O6751
7747A01263j15035j3957J04837o4787K50579k24268o0092J52535j40136K12329
7737B03268O5728m7050J15510k24294L0387k3426J17357k2173k8429n9133j10198
7726A7547J09946M8428k6765J13389j68732O0967O6933j57736P9325o658O9487
7715B06131J37207m9263L8984K0584j54033J04278p7475K9265l8364m5994j11927
7704E9393R9388l0906Q7932R6877j82854J74792r3298N9124N7562j27018l5554
7693A65438j49600J69416O8557j53579Q0940N8641j4154P452J38499j3395k24727
7682A33488J46611k08279K23121l501l5283q125o1317R1071O0071O3354j49000
$$ plain form
7757 -127621 136302 -24643 13553 220621 196094 378351 116221 -499 34512 101263
7747 101263 -13772 -27729 77108 12321 262900 38632 -21460 131075 -9061 203268
7737 203268 268996 221946 337456 113162 143549 120123 237480 215307 186878 127745 17547
7726 17547 127493 175921 149156 262545 93813 154780 221713 63977 143302 136644 206131
7715 206131 343338 294075 333059 353643 199610 303888 226413 255678 217314 171320 59393
7704 59393 158781 127875 215807 312684 129830 304622 211324 270448 328010 200992 165438
7693 165438 15838 185254 253811 100232 181172 239813 225659 233111 371610 358215 133488
7682 133488 280099 71820 294941 291440 256157 248032 186715 277786 337857 401211 252211
7671B52211j42196l9012K9832O6924P4763j1959r3516P5248j34572j3944Q5787
7660A49566l3906m8695J07817l6970k4471Q2081j10128J45371J79606j51771q8077
7649A70423k1742j40493J12999o8161J50610p3960l5675n4662K12631j4148Q8140
7638C25962r7776K25662j54840O9761j22996J20219n2043J89066o9669k18766
7628B14580L4312K0410J91901j06774J12934j76535m0184K38997k57270J04044
7618C36415j99500K1725R5376P6794J3854r51j82620J29709J749n9564O4466K8314
7606C25767n5253P0345j19060K03865j32212J02995N6812r3348N2709k0333j17947
7595B74340j10897J59325j7716o5662J42805q1871M2889M369N9632j71705j75392
$$ plain form
7671 252211 110015 71003 100835 167759 242522 230563 137047 212295 77723 63779 149566
7660 149566 115660 66965 174782 137812 113341 195422 85294 230665 410271 258500 170423
7649 170423 148681 8188 121187 53026 203636 129676 94001 39339 251970 237822 325962
7638 325962 228186 453848 299008 368769 245773 365992 313949 503015 433346 214580
7628 214580 248892 269302 461203 354429 467363 290828 250644 489641 232371 336415
7618 336415 136915 158640 254016 330810 344664 343713 161093 290802 292551 232987 297453 325767
7606 325767 270514 340859 221799 425664 293452 396447 453259 359911 412620 392287 274340
7595 274340 163443 322768 305052 239390 382195 300324 343213 347582 407214 235509 60117
7584F0117J60091J00827j1623J4962K6692J93941k2885p0124J3723Q7964j49135
7573D04550j65382N8970m8054l9969J70729o6930J49738o564r0246J76016j4002
7562E28856r1371K29717M7603q6490j34671j08923K69911q1621q6384l151R9017
7551E82493N4867J0054q9278j35407n91P916J8663K9523o2314K1963j64856K09177
7539D82210R1432q1571j48397K9476j4373P1296L3894j41538o0202J78588m5365
7528C95450Q0244j777Q583j95058K27635j30393q9750O5937M898N7184p7986k0103
7516C24864M3274J27403j9969l8933p2727j00626R3214O2500j76705O5412J00677
7505D08384o0923j16689J38247J19154j28671m0096o9826J56233q7909J43121
$$ plain form
7584 60117 220208 321035 309412 324374 351066 545007 522122 451998 465721 553685 404550
7573 404550 239168 298138 250084 210115 380844 313914 463652 457088 366842 542858 528856
7562 528856 437485 667202 714805 628315 493644 384721 654632 573011 486627 483476 582493
7551 582493 637360 647414 558136 422729 422138 430054 448717 478240 415926 437889 273033 482210
7539 482210 573642 492071 343674 373150 358777 430073 463967 322429 262227 440815 395450
7528 395450 475694 473917 482500 287442 515077 384684 294934 360871 365769 422953 344967 324864
7516 324864 368138 495541 475572 436639 363912 263286 356500 419000 242295 307707 408384
7505 408384 347461 230772 369019 488173 359502 319406 249580 405813 317904 461025
7495D61025j61705L1651M4793j29031p2510K90282r1592q6567K34367R355r9166
7484D30902P0580J55803j15074M3770k96807J23176K22895k71251R2943j18322
7474C38615P1597K16261L3794n4472J81853j88076j14939n9106K47108j64229
7464E08406o1248J0757L16461k24331J22982K0089j12279p8735r7887J24934K999
7453E32148j9388j71198n3472J53756M5687l9463Q8443o8806q446J04380p3524
7442D90117l9791k5315J9026J44212j05085R0471j16635j63806K26913J46516
7432F66623j91103r4040J98450n7240R64q2075K80180q9225o6727K47671j73086
7421F40392J00759j41051p621K17539k25476K0447N1315K5043j76967J75620j03932
$$ plain form
7495 461025 299320 330971 375764 246733 174223 464505 372913 286346 520713 530068 430902
7484 430902 501482 657285 542211 585981 289174 412350 635245 363994 456937 338615
7474 338615 410212 626473 660267 605795 787648 599572 484633 425527 672635 508406
7464 508406 447158 457915 774376 550045 673027 693116 580837 502102 404215 529149 532148
7453 532148 512760 341562 288090 441846 487533 448070 536513 467707 459261 563641 490117
7442 490117 450326 425011 444037 588249 483164 573635 457000 293194 520107 666623
7432 666623 475520 381480 579930 522690 523654 441579 721759 632534 565807 813478 640392
7421 640392 741151 600100 592479 810018 584542 604989 656304 681347 504380 680000 576068
7410E76068Q6262J69233J44142J52225n3816J93153l7171K09982n5749N7377J44316
7399A586022K70543N27707O71846M60202P41427M32387K97442M8707m81192o55582
7389C899509n87052n95021m25283m51310q2766q2149l95359j34924O015k12917
7379I38743K2569J141j87885o5470P1594l2515O8292j62431L1202R9899M0562
7368H25701n9434p8136j4468q7017K664J1077P0460j30156j09750P6351r7596
7357D09696J66010J10770j1426M8682q5350j01693R7853j32207N4327J1529J9467
7346E87658j43623R660M5852J2118J67609j676M8757j55411k10042K79182j44136
7335D95948m8219p0126L8830J62162J60398n3534N1245j81201L3517O0984k96525
$$ plain form
7410 576068 662330 831563 975705 1127930 1074114 1267267 1230096 1440078 1384329 1441706 1586022
7399 1586022 1856565 2384272 3056118 3516320 4257747 4690134 4987576 5036283 4555091 3899509
7389 3899509 3312457 2717436 2292153 1840843 1758077 1675928 1280569 1145645 1151660 938743
7379 938743 961312 962453 774568 709098 780692 748177 816469 654038 685240 785139 825701
7368 825701 766267 688131 673663 586646 589310 600387 670847 540691 430941 507292 409696
7357 409696 575706 686476 675050 723732 638382 536689 634542 502335 556662 568191 587658
7346 587658 444035 453695 499547 511665 679274 677598 726355 570944 360902 640084 495948
7335 495948 447729 377603 416433 578595 738993 685459 736704 555503 589020 650004 353479
7324C53479K25761r4250L5737N8624j68453J55251Q3799K01742j95560N748M2798
7313G04676P5095j7861n7525m9493K435K5833M0315o572n554L8154J973R8157
7301H49633j31876n3949J56103j07247K63943l4908p8833N7116j53207J26913
7291H93688k80568P4572J93469M7358k8494O9433r9080Q8874j38500j58925M2617
7280G04444O3743J22884j03309K60015k21527J84651J5661N4012N3148O9223L04584
7269A507529J29481K86526J3972j63826j53210J3498j52651n748j67176K25898
7259A534293m05804p6774K85356J35601K71026L39789J32712N54403j77196J0234
7249B603640r6652l60358j96360j43605k21328j31678m7951P2703m3557J54568
$$ plain form
7324 353479 579240 484990 520727 579351 410898 566149 649948 851690 656130 661878 704676
7313 704676 779771 761910 704385 654892 657327 683160 723475 716903 711349 749503 751476 849633
7301 849633 717757 663808 819911 712664 976607 941699 862866 919982 766775 893688
7291 893688 613120 687692 881161 928519 900025 969458 870378 959252 820752 661827 704444
7280 704444 768187 891071 787762 1047777 826250 1010901 1026562 1080574 1133722 1202945 1507529
7269 1507529 1637010 1923536 1937508 1773682 1620472 1633970 1481319 1475571 1308395 1534293
7259 1534293 1128489 1051715 1337071 1472672 1743698 2083487 2216199 2770602 2593406 2603640
7249 2603640 2506988 2146630 1950270 1806665 1585337 1453659 1405708 1478411 1434854 1589422
7239A589422P98Q8765L3286j40286J29190K32655o7900M4477K52910M31230k6450
7228B568097k15083l31810m6988o8161k97717K2126K8602r4581k4267J9005J81183
7217A740406l32734J78340j86385j10897K90798r5985m7450N792p317K25230O542
7206A666340J81123j27108J776o3473l67375K11101J16492j34857m9312N1479
7196A486186J75374Q029q5732j10044J0072K32963J0249L38033o1480J48713M8181
7185B200544Q0009n8891q1234j54758N3291l09123K09459j97987Q2984n9283J21539
7174A886550K55456Q9126K16494p5881K2371o3452k59598J26140j94513j0965
7164A991728J6293J14344l4636K25258j34613p3983n8537J56574p4841J11440
$$ plain form
7239 1589422 1590220 1678985 1712271 1571985 1701175 1933830 1865930 1910407 2163317 2594547 2568097
7228 2568097 2353014 2021204 1974216 1906055 1608338 1630464 1659066 1564485 1540218 1559223 1740406
7217 1740406 1407672 1586012 1399627 1288730 1579528 1483543 1436093 1441885 1434568 1659798 1666340
7206 1666340 1847463 1720355 1722131 1658658 1291283 1502384 1618876 1484019 1434707 1486186
7196 1486186 1661560 1669589 1583857 1473813 1483885 1716848 1727097 2065130 2003650 2152363 2200544
7185 2200544 2280553 2221662 2140428 1985670 2038961 1729838 1939297 1741310 1824294 1765011 1886550
7174 1886550 2142006 2231132 2447626 2371745 2394116 2330664 2071066 2197206 2002693 1991728
7164 1991728 2008021 2122365 2087729 2312987 2178374 2104391 2045854 2202428 2127587 2239027
7154B239027K0177J20285J21069m6923j10800K33474l3949J07942r6350K20184
7144B774136m1573J14724r6958J17135j7785K85533j54020o096M5989l0141R1150
7133C082094J47979k82562Q5833K39060q1231K14862J25206l5823K68964k30458
7123C533924Q1585l24961r7304K36512l3905J72997j53025j38006J24117M4059
7113C445993j4472O6809J06709j75495R0093L9428n4542k5916M1937l7136J15997
7102C599405Q8007J20634Q546Q2972Q215M28656q2829J47424q4025L62460J60437
7091D839902L45082J57721Q715J0147m0599O00932l6171r4482P9276k51918J20736
7080E739341N1319J11521J76043L8933Q1463K4987l6084J27472N2430J78480K97186
$$ plain form
7154 2239027 2259204 2379489 2500558 2453635 2342835 2576309 2542360 2650302 2553952 2774136
7144 2774136 2732563 2847287 2750329 2867464 2849679 3135212 2981192 2975096 3021085 2990944 3082094
7133 3082094 3230073 2947511 3033344 3272404 3191173 3406035 3531241 3495418 3764382 3533924
7123 3533924 3615509 3290548 3193244 3429756 3395851 3568848 3415823 3277817 3401934 3445993
7113 3445993 3431521 3498330 3605039 3429544 3519637 3559065 3504523 3478607 3520544 3483408 3599405
7102 3599405 3687412 3808046 3816592 3899564 3907779 4336435 4253606 4401030 4317005 4679465 4839902
7091 4839902 5184984 5342705 5351420 5361567 5320968 5921900 5885729 5791247 5870523 5618605 5739341
7080 5739341 5790660 5902181 6078224 6117157 6198620 6223607 6187523 6314995 6367425 6545905 6843091
7069F843091K38470l76Q2128P3528M3713K77189j44457K46548J68849J5778L49285
7058H193746j03426J53314k7411J69315J94316K91198m7057k437L04334J67406
7048I293298R0443N2686N13018J15640L81193K51420J59238K78928n7387P7038
7038A1155515L88990L13108J28983L44519J87202L00504K05486K85501M65056
7029A3774864M80919R25080N46951P60119M88676R74050J403408J866046K888187
7020B4108300M850704P042468O025696R01927l269011m494059m030227k938287
7012B8197511k210385r66525m19957k30119K37977P33351J336200J438971K055700
7003C0172724L332348N916893J0005082J0781452M175735l998110p340516o353470
$$ plain form
7069 6843091 7081561 7081185 7163313 7236841 7280554 7557743 7413286 7659834 7828683 7844461 8193746
7058 8193746 8090320 8243634 8216223 8385538 8579854 8871052 8823995 8821558 9125892 9293298
7048 9293298 9383741 9436427 9949445 10065085 10446278 10697698 10856936 11135864 11078477 11155515
7038 11155515 11544505 11857613 11986596 12331115 12518317 12818821 13024307 13309808 13774864
7029 13774864 14255783 15180863 15727814 16487933 16976609 17950659 19354067 21220113 24108300
7020 24108300 28959004 36001472 42027168 42929095 39660084 35166025 31135798 28197511
7012 28197511 25987126 25020601 24600644 24370525 24608502 25341853 26678053 28117024 30172724
7003 30172724 33505072 39421965 49427047 60208499 64384234 60386124 53045608 46692138
6995D6692138m698614k791950j671771o22438J55381Q69048J418964J389063J093391
6986D1833212J451973J558768J908791J757907J974788K693471L513089M678248
6978F1370247N508745P725068J2163834J9935448L2161590L8321743K8738997
6971B05925672M775513j7588179k6333086k4182067j7231359j0756360o639312
6964A07970822l612511n03238L043776P105604J2054221K0413365L4336588N1959758
6956B32768385O1738930N6048218L0984608j3971450n0174000n9461010n1763931
6949B06169750l8946010k8267977j9615782j3748789q821027m761602j258264
6942I0750299K295798P405834J3171086J3321903Q899055O825341J3702464K9060146
$$ plain form
6995 46692138 41993524 39201574 37529803 36907365 37062746 37931794 39350758 40739821 41833212
6986 41833212 43285185 44843953 46752744 48510651 50485439 53178910 56691999 61370247
6978 61370247 66878992 74604060 86767894 106703342 138864932 177186675 205925672
6971 205925672 210701185 193113006 166779920 142597853 125366494 114610134 107970822
6964 107970822 104358311 103855073 106898849 114004453 126058674 146472039 180808627 232768385
6956 232768385 294507315 350555533 381540141 367568691 317394691 257933681 206169750
6949 206169750 167223740 138955763 119339981 105591192 96770165 92008563 90750299
6942 90750299 93046097 100451931 113623017 126944920 135843975 142669316 156371780 185431926
6934A85431926M6796339M5940887J1113076k8356664m4549112m2700333l3661444
6927A40014675k4911109j7304691j1967655p122619k451729J916406O431096M745349
6919H9349723k312329q096698q743671p305986m950519k855825K51430M440545
6911E9776670R631921J3596890R940796k434289j1208440j3042699j1093687q383438
6903D6783724o354860n044518l597373k901105k112706j626182j378239r34033
6895B2834708o65124n0024J82950R04430J529103L325090O354079J0216500J0757115
6886E5388827K739631n795660r179718q175036o405886m761154l659753k631141
6878A7520110j881663j279425j094149p67536q26273q53776m34631n19242j85973
$$ plain form
6934 185431926 232228265 278169152 289282228 260925564 216376452 173676119 140014675
6927 140014675 115103566 97798875 85831220 78708601 76256872 78173278 84604374 89349723
6919 89349723 87037394 78940696 70197025 62891039 57940520 55084695 55336125 59776670
6911 59776670 69408591 83005481 92946277 90511988 79303548 66260849 55167162 46783724
6903 46783724 40428864 35384346 31786973 28885868 26773162 25146980 23768741 22834708
6895 22834708 22169584 22119560 22302510 23206940 24736043 28061133 34415212 44631712 55388827
6886 55388827 58128458 52332798 43153080 34978044 28572158 23811004 20151251 17520110
6878 17520110 15638447 14359022 13264873 12497337 11671064 10817288 10382657 9863415 9677442
6869I677442k67205j87200L27513M66470Q81574J288194O98186r39162j112210
6860A0833602j225634q51674o31747n15720j47285l88173k19877m9141k62832
6851F541519R3206J90398M35216O19548R89733O62338P0745k82813q84991j063991
6841G370908p71666p55607l93750k30954m13379l62184k4939j46126j08372r9479
6831D064452Q5759q3258k12167J719M1380L1130J25881j11735j11828R8228j08490
6820C821071J2879m4034j00488K35805l11312L8674J02045J95588K1097n5559
6810C915766j37698P6435L62020N7280J52995K21680K71143o916L66543j28976
6800E150272J64102l4956q0101K87084R419K45976J74890J40290L64434K90266
$$ plain form
6869 9677442 9410237 9223037 9550550 10017020 10898594 12186788 12884974 11945812 10833602
6860 10833602 9607968 8756294 8124547 7608827 7461542 7073369 6853492 6804351 6541519
6851 6541519 6634725 6825123 7260339 7879887 8869620 9531958 9602703 9319890 8434899 7370908
6841 7370908 6599242 5843635 5449885 5218931 4805552 4443368 4418429 4272303 4163931 4064452
6831 4064452 4150211 4066953 3854786 3856505 3897885 3929015 4054896 3943161 3831333 3929561 3821071
6820 3821071 3833950 3789916 3689428 3925233 3613921 3652595 3754640 3950228 3971325 3915766
6810 3915766 3778068 3854503 4216523 4273803 4426798 4648478 4919621 4912705 5279248 5150272
6800 5150272 5314374 5279418 5199317 5486401 5495820 5741796 5916686 6056976 6421410 6711676
6790F711676Q13896J28767Q75397P76701J250874J786028K858822M277218M753529
6781B4232908K347117j248278l021688l019542k487404j539731j033072m79105
6773A3751205k11738R7561M11932R52615J479943K151958L175846M821844N626703
6764C2257869N096489M078481K809867K409736K360743J659992o87255m508275
6756D5477647o257223o410300m561343l223488k145120j446122m12311K57552
6748B1279292J319608K409472L773720M297925L792895L953694P271366J0089648
6740E8187620O676750k273275p379989o627767m235512m437146n418514n404333
6732B9087834m470417l264784k005745j338550m41823K06260J306466K168583
$$ plain form
6790 6711676 7525572 7654339 8529736 9306437 10557311 12343339 15202161 19479379 24232908
6781 24232908 26580025 25331747 22310059 19290517 16803113 15263382 14230310 13751205
6773 13751205 13539467 13637028 14048960 15001575 16481518 18633476 21809322 26631166 32257869
6764 32257869 37354358 41432839 44242706 46652442 49013185 50673177 49985922 45477647
6756 45477647 39220424 32810124 28248781 25025293 22880173 21434051 21021740 21279292
6748 21279292 22598900 25008372 28782092 33080017 36872912 40826606 48097972 58187620
6740 58187620 64864370 62591095 55211106 48583339 44347827 39910681 34492167 29087834
6732 29087834 24617417 21352633 19346888 18008338 17566515 17772775 19079241 21247824
6724B1247824K628796J887088J518246J268522J066490J610449K493677J325366
6716C5046458k430877m978306m934736m282463l288854k218704j691572j352576
6708I868370q06330o26713m34786l53540p9587J49642M81602J019809J609850
6699A0828317J751701M03312j207450j649566j522183j187439j003392o28929
6691E784371n97390m64916l38088l43726J2359l73180j43473R8167j8283j80162
6681C435679P526j21611L7557L1962j08814Q3992P1545M7941K677K56954L78735
6670D124143P2148M59635j11330k78412o7053k53084j44659m2781K7556Q6328
6660C872491K28621j003J94193J18062M42995L1238N25140L86990j16333j35912
$$ plain form
6724 21247824 23876620 25763708 27281954 28550476 29616966 31227415 33721092 35046458
6716 35046458 32615581 27637275 22702539 18420076 15131222 12912518 11220946 9868370
6708 9868370 9062040 8435327 8000541 7647001 7567414 7717056 8198658 9218467 10828317
6699 10828317 12580018 12983330 11775880 10126314 8604131 7416692 6413300 5784371
6691 5784371 5186981 4722065 4383977 4040251 4052610 3679430 3535957 3634124 3615841 3435679
6681 3435679 3443205 3321594 3359151 3391113 3282299 3366291 3437836 3485777 3488454 3745408 4124143
6670 4124143 4196291 4655926 4544596 4266184 4199131 3946047 3801388 3758607 3786163 3872491
6660 3872491 4101112 4100109 4294302 4412364 4855359 4886597 5411737 5798727 5682394 5546482
6650E546482n53508k50052j64581M8265l64572K1767j01004j47963P5894j8580
6640D092148j15087K60170j54649J91440K33595K77606N16251K27551N48618K44247
6630F321890k64536L2025k50296q5059j20590k68930j8524j88106N98k53105O9040
6619D974407K2979M5042J37542J81977L377J49782K10930L21854K23113K01191
6609F472194N58425O25617L29053K45410O67919P40829L53794j3901n53003m47386
6599H978951j91529n325K24441l133L56044P23925Q17434M21802r1970J0889m04701
6588A0836828k86181l28223j65041M6657K93988L79523M57446O49157Q65464J148100
6578A3897718J230633J270130J520735J135595O88020J5465L7664N3085O13150
$$ plain form
6650 5546482 4992974 4742922 4578341 4626606 4262034 4283801 4182797 4034834 4110728 4092148
6640 4092148 3977061 4237231 4082582 4274022 4507617 4785223 5301474 5529025 6077643 6321890
6630 6321890 6057354 6089379 5839083 5754024 5633434 5364504 5345980 5157874 5158472 4905367 4974407
6619 4974407 4997386 5042428 5179970 5361947 5365324 5515106 5726036 6047890 6271003 6472194
6609 6472194 7030619 7656236 7985289 8230699 8898618 9639447 9993241 9979340 9426337 8978951
6599 8978951 8787422 8782097 9006538 9003405 9359449 10083374 10900808 11322610 11230640 11241529 10836828
6588 10836828 10550647 10222424 10057383 10104040 10398028 10777551 11234997 11884154 12749618 13897718
6578 13897718 15128351 16398481 17919216 19054811 19742831 19758296 19795960 19849045 20462195
6569B0462195J35251j56028r75083j158649q21824r98838k73333Q3574K33086
6560A6530351O75117P39360J131177J049283J173370J061723O31027N83558l0322
6551B3544644k45298n08707o08548q78809m18344q41774j017611j171165j600513
6542A6253875j107075q87005m42209J82704N17050J040060J036550N90780L42658
6533A7527388l85030j27909l44255m74791p66398j029997p70604o97191q95685
6524A2035528j188196j323652r46305p26367n40195m97609k47051j96638J83002
6515F552517K32651L67491N85428N39749K59736l95514p98573o13440p80684o33729
6505E315632l79185k19224l06634k75407j98415j46346p6329k24324K9259j79513
$$ plain form
6569 20462195 20597446 20441418 19466335 18307686 17485862 16487024 16213691 16297265 16530351
6560 16530351 17205468 17944828 19076005 20125288 21298658 22360381 22991408 23574966 23544644
6551 23544644 23299346 22790639 22182091 21303282 20884938 20043164 19025553 17854388 16253875
6542 16253875 15146800 14259795 13817586 14000290 14517340 15557400 16593950 17184730 17527388
6533 17527388 17142358 17014449 16670194 16195403 15429005 14399008 13628404 12931213 12035528
6524 12035528 10847332 9523680 8577375 7851008 7310813 6813204 6566153 6369515 6552517
6515 6552517 6785168 7152659 7738087 8277836 8537572 8142058 7343485 6730045 5949361 5315632
6505 5315632 4936447 4717223 4410589 4135182 3936767 3790421 3714092 3489768 3519027 3339514
6495C339514j88122J31740n8267M4339L0014j61456P9375L6495l5914j35380K783
6484C085121M6628m2389k1631l049N5342p1976r5164J69097L92210L7366j24761
6473C426794n0525K92068L66974J46381J23379j04653q5585j62986l3673j73498
6463C744676j40123J24452j01851L35888P3523j23410J18441n1915N4168M8902
6453D082751P1864p4455O6745L21087j53074k45951j13121k71785M7045Q2439
6443C813545l368o1082L04N9543J78260r7415k67226P1385K53856j03557p870
6432C836375K5260j30252M1396k39304J51077J04441J49460j47185j25062j80164
6422C486042q6497q7348k2702k2778J34371O4130p9103L26406J77080n2158L9025
$$ plain form
6495 3339514 3151392 3283132 3224865 3269204 3299218 3137762 3217137 3253632 3217718 3082338 3085121
6484 3085121 3131749 3089360 3067729 3064680 3120022 3048046 2952882 3121979 3514189 3551555 3426794
6473 3426794 3376269 3668337 4035311 4181692 4305071 4200418 4114833 3951847 3918174 3744676
6463 3744676 3604553 3729005 3627154 3963042 4036565 3913155 4031596 3979681 4033849 4082751
6453 4082751 4154615 4080160 4146905 4467992 4314918 4068967 3955846 3684061 3731106 3813545
6443 3813545 3810177 3749095 3749399 3808942 3987202 3889787 3622561 3693946 3947802 3844245 3836375
6432 3836375 3861635 3731383 3772779 3533475 3684552 3788993 3938453 3791268 3666206 3486042
6422 3486042 3399545 3312197 3289495 3266717 3401088 3465218 3386115 3712521 3889601 3837443 3876468
6411C876468j72790l3965j4651k6144J44745P6191L5588L3832J63509K2697j71569
6400C933911J88999j02817Q8615L1918j52943K00748r6646N5717P4594J51689
6390D373785O4824k01059K0268J7007K99057r7351o2166L01563q0530L57645K42718
6379E235761P3314K81554L73646M17678M83609N98846Q57766J219778J792080
6370A1334032K353795J983577O47270r08597j338707j286220j342980p71846p00126
6361I970198j63576K414L70638Q77588Q75755J567799J966978Q60876j76616j373542
6351A4778512j687828j395890j172810q42151r18566m60122l24594J26381p0708
6342H032224j3013M205K32781K77271N5917L29173K26266K47503O84054Q30209
$$ plain form
6411 3876468 3703678 3669713 3655062 3628918 3773663 3849854 3885442 3919274 4082783 4105480 3933911
6400 3933911 4122910 4020093 4108708 4140626 3987683 4188431 4091785 4147502 4222096 4373785
6390 4373785 4438609 4237550 4257818 4274825 4573882 4476531 4414365 4715928 4635398 4993043 5235761
6379 5235761 5309075 5590629 5964275 6381953 6865562 7464408 8322174 9541952 11334032
6370 11334032 13687827 15671404 16318674 15410077 14071370 12785150 11442170 10670324 9970198
6361 9970198 9806622 9809036 10179674 11057262 11933017 13500816 15467794 16328670 16152054 14778512
6351 14778512 13090684 11694794 10521984 9679833 8761267 8301145 7976551 8102932 8032224
6342 8032224 8019211 8023416 8256197 8533468 8589385 8918558 9144824 9392327 10076381 10906590
6332A0906590O47825R43530Q31823J464186J813224K553131M300608M894966N141596
6323C3497479K920480p02662k613590m036501l697244k740598k049718j297619
6315A9280027n37562J23038P43243K031420K912833M101645L353152J031359k242516
6306C0796639l391709l840515l428942k669834k181787j766023j283966q92182
6298A1341681p04921p10191k00223o43297o2570j93984q6357J637K34730J70968
6288I147473J17649M4420o0809J15914L32298l4147L07166O15592N25532O43207
6278A1754295P33385O99958J334219J787181K859054L292546M607320N387793
6270C2455751L849674Q97335k675369m025825m160319l585403k578760k235344
$$ plain form
6332 10906590 11554415 12497945 13329768 14793954 16607178 19160309 23460917 28355883 33497479
6323 33497479 36417959 35715297 33101707 29065206 25367962 22627364 20577646 19280027
6315 19280027 18742465 18865503 19608746 21640166 24552999 28654644 32007796 33039155 30796639
6306 30796639 27404930 23564415 20135473 17465639 15283852 13517829 12233863 11341681
6298 11341681 10636760 9926569 9726346 9083049 9020479 8826495 8740138 8741775 8976505 9147473
6288 9147473 9265122 9309542 9248733 9364647 9696945 9662798 9969964 10585556 11111088 11754295
6278 11754295 12487680 13187638 14521857 16309038 19168092 22460638 27067958 32455751
6270 32455751 36305425 37202760 34527391 30501566 26341247 22755844 20177084 17941740
6262A7941740j639048j329699o81446o79872l86730J3771o661N67839M98493R44964
6252A5243351J375950K123227K800779L970402M265362K291274q17430k909997
6244B8342918l956230l382671k840635k581461j735456j245206r77847o87230
6236A0936182m13999l51303l17691k73429J2481K40327K95712M10761R99600J574354
6226A3112995J948915J767961Q76276n15220j600044j842323j348504j271606
6218A1128450j091120r01189o73773j82436k19495l10689k62056k9652l06808
6209G151232L01305M62448L81302P41467Q73002J476862J953364J527977J44082
6200A5013041j260437j410086j849917j579104j369950j028208p02499n29682
$$ plain form
6262 17941740 16302692 14972993 14291547 13611675 13224945 13238716 13232055 13799894 14298387 15243351
6252 15243351 16619301 18742528 21543307 25513709 29779071 32070345 31252915 28342918
6244 28342918 24386688 21004017 18163382 15581921 13846465 12601259 11623412 10936182
6236 10936182 10522183 10170880 9853189 9579760 9592241 9832568 10128280 10539041 11538641 13112995
6226 13112995 15061910 16829871 17706147 17190927 15590883 13748560 12400056 11128450
6218 11128450 10037330 9136141 8462368 8279932 8060437 7749748 7487692 7458040 7151232
6209 7151232 7452537 7914985 8296287 9037754 9910756 11387618 13340982 14868959 15013041
6200 15013041 13752604 12342518 10492601 8913497 7543547 6515339 5812840 5283158
6192E283158m39726l15961k97530l32652j88749J99421j68004j28522N543k99535
6182C317443k3601k89278n2781p0228k20677J46062O4558J25223N342j18812M3977
6171B927228l7642J56309j79563J59180k22012K66551j0234j14638k7023j21296
6161B796860O13k59228p871j52183K70985k10714p8514j0867j17332m0509J37
6150B191377n2023j09651j80557j99155j34958Q838K10777N4222L7643K4578j95715
6139A655376J86349j46814N9681j7500j26521O8095n8324J32969j92551R0934
6129A651694J08839j47649J18866P9524m6235j16761m7451j62882J55679j0102
6119A583522j56587J10917l8615J2703K13774j21972j18286J9287L3856M5275
$$ plain form
6192 5283158 4843432 4527471 4229941 3897289 3708540 3907961 3739957 3611435 3616978 3317443
6182 3317443 3293842 3004564 2951783 2881555 2660878 2806940 2871498 2996721 3002063 2883251 2927228
6171 2927228 2889586 3045895 2866332 3025512 2803500 3070051 3059817 2945179 2918156 2796860
6161 2796860 2797473 2538245 2530374 2378191 2649176 2438462 2359948 2349081 2231749 2191240 2191377
6150 2191377 2139354 2029703 1849146 1649991 1515033 1523871 1734648 1788870 1826513 1851091 1655376
6139 1655376 1841725 1694911 1754592 1737092 1610571 1678666 1620342 1753311 1560760 1651694
6129 1651694 1760533 1612884 1731750 1811274 1765039 1648278 1600827 1437945 1593624 1583522
6119 1583522 1426935 1537852 1499237 1511940 1725714 1603742 1485456 1504743 1538599 1583874
6109A583874k92507J83819j98915p50J1447o5157m7780J72091L9438m3796L1041
6098A372805m814k0615J7900j32079l5158n1150J86684k10276R3108o644j56855
6087A052906O4604N4283O1335j2316k2263j15600k428J25635q2070O2586o1590
6076A125082J87116j42372p1074J6603J06716q5022j36602q6857M1810J46662
6066A102062J33889j21577o7878j04114K00443j28216J14811j15757J01281J50734
6056A265678k64370N0527j4275O5026n8221J14245p8971j37953J75884M0303o4016
6045A093857r3851N7171J40000r3376Q9672k6182L17091k1495j06313K4700o6790
6034A314484J36755r7370J1859J28478k8553n7331j94129Q6937m8832n871j02189
$$ plain form
6109 1583874 1291367 1475186 1276271 1275521 1286968 1221811 1174031 1346122 1385560 1341764 1372805
6098 1372805 1367991 1347376 1365276 1233197 1198039 1146889 1333573 1123297 1216405 1209761 1052906
6087 1052906 1117510 1171793 1233128 1220812 1198549 1082949 1080521 1206156 1124086 1186672 1125082
6076 1125082 1312198 1169826 1098752 1115355 1222071 1137049 1000447 913590 955400 1102062
6066 1102062 1235951 1114374 1046496 942382 1142825 1014609 1129420 1013663 1114944 1265678
6056 1265678 1001308 1051835 1037560 1102586 1044365 1158610 1079639 941686 1117570 1157873 1093857
6045 1093857 1000006 1057177 1197177 1103801 1193473 1167291 1484382 1462887 1356574 1381274 1314484
6034 1314484 1451239 1353869 1365728 1494206 1465653 1408322 1214193 1301130 1252298 1246427 1144238
6023A144238J97819Q060l7544J78210k50296L1591n1543j47097K71074j91714
6013A152798n5895O945J0962n5678K8605M0125M9565l0811j531J86578j61970
6002A169693J09318K3943r1837J43454l55262N1955J96576n3028M5223N8968k5069
5991A273934O9269P6195j6492j55281K21313k0868o8659p4196J218Q4983J92852
5980A584268j76323m3626J12435m9903J02823j3634j77007q8906L6070q03J92529
5969A477923J27730j01074P511Q4776n7764n4739J20880j05042P7030O6290r9564
5958A543957l8637j578k42603K17954K9443k8457j05224j22494M77900l136k53783
5947A473342j37667J10059P5173m3961k1301J90638J34507j29831n7595J02257
$$ plain form
6023 1144238 1342057 1350117 1312573 1490783 1240487 1272078 1220535 1073438 1344512 1152798
6013 1152798 1096903 1103848 1114810 1059132 1087737 1127862 1177427 1146616 1145085 1331663 1169693
6002 1169693 1279011 1302954 1211117 1354571 999309 1051264 1247840 1194812 1240035 1299003 1273934
5991 1273934 1343203 1419398 1402906 1247625 1468938 1448070 1379411 1305215 1306433 1391416 1584268
5980 1584268 1407945 1364319 1476754 1426851 1529674 1516040 1339033 1250127 1286197 1285394 1477923
5969 1477923 1605653 1504579 1512090 1596866 1539102 1484363 1605243 1500201 1577231 1643521 1543957
5958 1543957 1505320 1503742 1261139 1479093 1508536 1480079 1374855 1252361 1730261 1727125 1473342
5947 1473342 1335675 1445734 1520907 1476946 1455645 1646283 1780790 1650959 1593364 1695621
5937A695621j9837J65626k84552P8602q7278N4135J16660j34064n0487k1921K14482
5926A726987n2526K07586k75438M01318l60821J81498j25952M9523J68742j43101
5916A777816J45402n7771j45863J13594J29522j18587N4367K7713j97082J95947
5906A925058q3311j6600L44673k30097J36594O1564k02996K93114k78859O2115
5896B011255n9045j4395J5475J50449j12095J44486m9746M1028j43707J58665
5886B142370j44596K25785J3006j92634l6844J19807K7103L8615r4316O9185K5243
5875B192724m2564O1496J31656J65284j91436L3220P117J83605j66293J01717
5865B476526l2306p6270J547j3090J02998J35820k05100K06914j59243J01073
$$ plain form
5937 1695621 1675784 1841410 1556858 1635460 1548182 1602317 1718977 1584913 1534426 1512505 1726987
5926 1726987 1674461 1882047 1606609 2007927 1647106 1828604 1702652 1752175 1920917 1777816
5916 1777816 1923218 1865447 1719584 1833178 1962700 1844113 1898480 1926193 1729111 1925058
5906 1925058 1841747 1825147 2169820 1939723 2076317 2137881 1934885 2227999 1949140 2011255
5896 2011255 1952210 1937815 1953290 2103739 1991644 2136130 2086384 2127412 1983705 2142370
5886 2142370 1997774 2223559 2236565 2043931 2007087 2126894 2153997 2192612 2098296 2167481 2192724
5875 2192724 2150160 2211656 2343312 2508596 2317160 2350380 2357497 2541102 2374809 2476526
5865 2476526 2444220 2367950 2369497 2356407 2459405 2595225 2390125 2597039 2437796 2538869
5855B538869J67770j42936l2405J65458Q8433p7406k9292J17422q6604J70733
5845B880042j78898R5258p6877J00964k5589L751L10609k50834J52087P1860J13645
5834C196018q1340J11708m2487K5690J00785l1732p4692m7318K30073p1520J07744
5823C422929N1851j34905Q8455J58602l2789J51576j27623j22625J98472K76167
5813C930110k80362N8187M3810K821O9514R4375J14549J01230O2028j26434J64764
5802D234592J24069p7475l3347p2266j12640J78538J73482O8819K10908j18151
5792D576529N4757k3135M6414l1192Q2830p148K14063q4838J16774j13374J50705
5781D982385J77044l9250K02933q3605l2456P7418N0414J84680K2589K4911n086
$$ plain form
5855 2538869 2706639 2563703 2531298 2696756 2785189 2707783 2678491 2795913 2709309 2880042
5845 2880042 2701144 2796402 2719525 2820489 2794900 2798651 3109260 2858426 3010513 3082373 3196018
5834 3196018 3114678 3226386 3183899 3209589 3310374 3278642 3203950 3156632 3386705 3315185 3422929
5823 3422929 3474780 3339875 3428330 3586932 3554143 3705719 3578096 3455471 3653943 3930110
5813 3930110 3649748 3707935 3751745 3754566 3824080 3918455 4033004 4134234 4196262 4069828 4234592
5802 4234592 4358661 4281186 4247839 4175573 4062933 4241471 4414953 4483772 4694680 4576529
5792 4576529 4631286 4608151 4654565 4623373 4706203 4699055 4913118 4828280 4945054 4831680 4982385
5781 4982385 5159429 5120179 5323112 5239507 5207051 5284469 5334883 5519563 5542152 5567063 5561977
5770E561977R5609P3071K00269M8145l4810R3636o1165J94798j7355N4937O3881
5759F272993J19741Q7414P8543J47505L1835N2691J17990O3667P7184J47785k8686
5748G168662J0510J15109m5938K72898M5665J62444j27441J32615J58477K87296
5738H180297J27920j8888P4786o8301L48623l3778R0121L2824K03420K76904N8426
5727I272354M0661J87677K29959P007k5295K23248j06808L33481L1395K71157
5717A0464836R1074K12163L8076K7906J47142J21775J73368J26481J21566K46542
5707A1770929M5225K06209K94581J45406n118l7700K59873K28725J94563L3872
5697A3136565J817L28648J83120K24715K89041p2214J98926K33952J44281J56177
$$ plain form
5770 5561977 5657586 5730657 5930926 5979071 5944261 6037897 5976732 6171530 6154175 6209112 6272993
5759 6272993 6392734 6480148 6558691 6706196 6738031 6790722 6908712 6972379 7049563 7197348 7168662
5748 7168662 7179172 7294281 7248343 7521241 7566906 7729350 7601909 7734524 7893001 8180297
5738 8180297 8308217 8289329 8364115 8295814 8644437 8610659 8700780 8733604 8937024 9213928 9272354
5727 9272354 9313015 9500692 9730651 9737658 9712363 9935611 9828803 10162284 10193679 10464836
5717 10464836 10555910 10768073 10806149 10834055 10981197 11102972 11276340 11402821 11524387 11770929
5707 11770929 11816154 12022363 12316944 12462350 12457232 12419532 12679405 12908130 13102693 13136565
5697 13136565 13138382 13467030 13650150 13874865 14163906 14091692 14290618 14524570 14668851 14825028
5687A4825028K35270J96248K1409L58742Q6784J94824J25305M0927J82380M22754
5677A6689671j945K70482K06681m3294L73119Q6586J14611K71283J18462L63621
5667A8449277r143K20443L44403L24395k03617J92880J16322K77959J74849K6810
5657A9914578J94878J85166Q925K86830J77922J59216K73767L61J97007J33673
5647B1532323J8209J07615n094N2318K32891J20675J72317J71650j55404K98380
5637B2545880j08574J40669O3738j00730m4224M7142j6885q3655J69636J83610
5627B2796607q4101K2504j25211K11730j89978L4326j99881Q4318j91918J90650
5617B2549046j90152j60278J63979j91340p5652q980l01874p1143K6367k88012
$$ plain form
5687 14825028 15060298 15256546 15277955 15636697 15723481 15918305 16043610 16084537 16266917 16689671
5677 16689671 16687726 16958208 17164889 17121595 17494714 17581300 17695911 17967194 18085656 18449277
5667 18449277 18440134 18660577 19004980 19329375 19125758 19318638 19434960 19712919 19887768 19914578
5657 19914578 20109456 20294622 20303547 20590377 20768299 20927515 21201282 21201643 21398650 21532323
5647 21532323 21550532 21658147 21653053 21705371 21938262 22058937 22231254 22402904 22247500 22545880
5637 22545880 22437306 22577975 22641713 22540983 22496759 22543901 22527016 22443361 22612997 22796607
5627 22796607 22712506 22735010 22609799 22821529 22631551 22665877 22465996 22550314 22358396 22549046
5617 22549046 22358894 22198616 22362595 22171255 22095603 22086623 21784749 21713606 21739973 21451961
5607B1451961R8729k08653j98265n401n0171K6957j36747l33658r2628l05290
5597B0246834k9438l36485q8079j94169p3658j48867J539j45741k03928N278l76813
5586A8656473k41015j55063j44243k13707r3927q4931j82051l4698k92496j19491
5576A7094851k23880q8037m05662o1503j83409k62159p792m09432p7315k63688
5566A5111974O3526l7459j94745j89907k97060j06048j82148r6329l07622j24246
5556A3639936j43683q8149j0902j40642j84463k93404L1665l49770n2721m4091
5546A2363776k32088l5238r7520k48526r8723N2446m23650j4891o2763m3477j31316
5535A1028030k98832O8828l63764M330j93944j72008N4998k24383r3039R2823
$$ plain form
5607 21451961 21550690 21342037 21143772 21138371 21088200 21115157 20978410 20644752 20552124 20246834
5597 20246834 20217396 19880911 19792832 19598663 19525005 19376138 19377677 19231936 19028008 19033286 18656473
5586 18656473 18415458 18260395 18116152 17902445 17808518 17723587 17541536 17506838 17214342 17094851
5576 17094851 16870971 16782934 16377272 16315769 16132360 15870201 15862409 15452977 15375662 15111974
5566 15111974 15175500 15138041 14943296 14753389 14456329 14350281 14168133 14071804 13764182 13639936
5556 13639936 13496253 13408104 13397202 13256560 13072097 12778693 12810358 12460588 12407867 12363776
5546 12363776 12131688 12096450 11998930 11750404 11651681 11704127 11280477 11265586 11202823 11159346 11028030
5535 11028030 10729198 10798026 10434262 10438592 10244648 10072640 10127638 9903255 9810216 9903039
5525I903039j58592o6707k96073L5883k3271L1586k61231k05649J20904k58595
5515H821294j3241j02957j19170K7437j2807j81873j37585j15649n4422k61692
5505G849335R3980J69616j28631J907m33454J04397m6558N0971k25649j15813
5495G320101j10460l2967j09669J13384j99147j31898j66417m667j10064N2573
5485F620769k1912j11654k9891m084p4076J45124l70420l5031n2729K8543r2357
5474F002282L3277j96124k43229J88126l1026m9718K47441j72125j02789j33485
5464E542630P078m811r0426j57878N1136R183j62239N2180M6786M5840k66593
5453E072886P9537j44863K14594q4352k0734Q3449k28500Q1459O2322K52446k05575
$$ plain form
5525 9903039 9744447 9677740 9381667 9417550 9394279 9425865 9164634 8958985 9079889 8821294
5515 8821294 8808053 8705096 8585926 8613363 8600556 8418683 8281098 8165449 8111027 7849335
5505 7849335 7943315 8112931 7984300 7986207 7552753 7657150 7610592 7661563 7435914 7320101
5495 7320101 7209641 7176674 7067005 7180389 6981242 6849344 6682927 6678260 6568196 6620769
5485 6620769 6598857 6487203 6457312 6453228 6379152 6524276 6153856 6118825 6066096 6094639 6002282
5474 6002282 6035559 5839435 5596206 5784332 5753306 5703588 5951029 5778904 5676115 5542630
5464 5542630 5549708 5544897 5454471 5296593 5347729 5356912 5194673 5246853 5293639 5339479 5072886
5453 5072886 5152423 5007560 5222154 5137802 5117068 5200517 4972017 5053476 5115798 5368244 5162669
5442E162669n3167J2300J74137J96506j99115K89128M26634N22438Q92869J010368
5432H434767J114161M52095L27599l13832q04034q67304j101592r72975m89163
5423E779722j65841n16819j16739m40277k20912O1676j61452m4503j42616k29488
5413C802751J48327q3791p7565P7200r3115j33228j58020K67732M5143k53239
5403C542195N2869j64935Q7727j4338n8858l4948j97751O2563k8370P2302J01472
5392C419928j25996J4932p5673k0366r6941O2083q7618k10889J34454o5943J88739
5381C136710K7322j8475j31112m3583M5410J0299j27996p3608J38778k77288J01334
5370B787791p9734j07420L17987j16545j16891N1295j05825O8742j30704n3307
$$ plain form
5442 5162669 5109502 5121802 5295939 5492445 5293330 5582458 6009092 6531530 7424399 8434767
5432 8434767 9548928 10001023 10328622 10014790 9210756 8343452 7241860 6268885 5779722
5423 5779722 5613881 5097062 4980323 4540046 4319134 4380810 4219358 4174855 4032239 3802751
5413 3802751 3951078 3867287 3789722 3866922 3773807 3640579 3482559 3750291 3795434 3542195
5403 3542195 3595064 3430129 3517856 3503518 3444660 3409712 3211961 3274524 3246154 3318456 3419928
5392 3419928 3293932 3308864 3233191 3212825 3115884 3177967 3090349 2879460 3013914 2947971 3136710
5381 3136710 3164032 3145557 3014445 2970862 3016272 3026571 2898575 2824967 2963745 2686457 2787791
5370 2787791 2708057 2600637 2918624 2802079 2685188 2736483 2630658 2699400 2568696 2515389
5360B515389j40820L25162K0795J48004j41174j58744J5247j98258K38339j11818
5350B512122o3425k44799J17563J5758M1541J19512r0122j6915P8413p7509m1303
5339B350836J20325J44036k26308j19300k08696K81868O474j27100k0630J1777
5329B213282J39368m04467J83590j2627J80747q7328l3816p8885N0015O4043p2432
5318B141490K7695l39974M5846J26600k06035L8001J49707J08407j06229p0268
5308A915240J43524M4792j64459j07543m2289M8635J62331n3516k8313j04455
5298A813947P8221J23845M6337j94217j29123J67081k39667J89682j60075m9792
5288A646239K53670q3931J516R558j2918j26696R9516j38450J78472n5210j50346
$$ plain form
5360 2515389 2374569 2699731 2720526 2868530 2727356 2568612 2583859 2385601 2623940 2512122
5350 2512122 2448697 2203898 2321461 2337219 2378760 2498272 2408150 2391235 2469648 2392139 2350836
5339 2350836 2471161 2615197 2388889 2269589 2060893 2342761 2349235 2222135 2201505 2213282
5329 2213282 2352650 1948183 2131773 2119146 2299893 2212565 2178749 2099864 2149879 2213922 2141490
5318 2141490 2169185 1829211 1875057 2001657 1795622 1833623 1983330 2091737 1985508 1915240
5308 1915240 2058764 2103556 1939097 1831554 1789265 1837900 2000231 1946715 1918402 1813947
5298 1813947 1892168 2016013 2062350 1868133 1739010 1906091 1666424 1856106 1696031 1646239
5288 1646239 1899909 1815978 1817494 1827052 1814134 1687438 1786954 1648504 1826976 1771766 1621420
5277A621420J7592j26718O3442J34299r0726j44561N9200J13265j07709J73277
5267A712781j04491J4508P5852j54572L2866q4301J27393l4783m8259j51096L55133
5256A741031j66896k33464K54330j10127J38965r9961n4821j2324K218N8504p6738
5245A440717J35291j28574O4379j94410Q9016q7138r116O9146l3929P0532j20194
5234A295720m2294J24416L05574L6794j66658l5893k28227J75962R9819j03807
5224A461406j17892r4935M0596K06243p93k20016R4703k91313K13742j663J3879
5213A303957k9248m6711p3277J57043Q7324j19505j17555L7335M5035l0074k5265
5202A189059K65219j80558j10889J60982m8622J3615r2013J88221p9511N2205
$$ plain form
5277 1621420 1639012 1512294 1575736 1710035 1619309 1474748 1533948 1647213 1539504 1712781
5267 1712781 1608290 1622798 1698650 1544078 1576944 1492643 1620036 1585253 1536994 1385898 1741031
5256 1741031 1574135 1340671 1595001 1484874 1623839 1523878 1469057 1456733 1458951 1517455 1440717
5245 1440717 1576008 1447434 1511813 1317403 1406419 1319281 1310165 1379311 1345382 1415914 1295720
5234 1295720 1253426 1377842 1683416 1720210 1553552 1517659 1289432 1465394 1565213 1461406
5224 1461406 1343514 1248579 1289175 1495418 1494625 1274609 1369312 1077999 1291741 1290078 1303957
5213 1303957 1274709 1227998 1154721 1311764 1399088 1279583 1162028 1199363 1244398 1214324 1189059
5202 1189059 1454278 1273720 1162831 1323813 1275191 1288806 1196793 1385014 1305503 1357708
5192A357708k21674K17808l0444M2881j30848k6681J19799j46889J81553l8257
5182A324956L2733N9706m9770m3334r5373P2889j50552J55370j23190O0406P4818
5171A318659j10945j55924J24348J19082m1022K0285Q1717k91143O5934L2725
5161A163716j6403J10999n3307k81281J24328J9199K22807L9043k63247j83555
5151H82299J61419J22083J04363k30286J06996l3858r4237P9951O784j06900K31739
5140A230353j99411J79599Q4257k25210J60266j98545J11594k4201l776p3013
5130A041913j19063L70203k27026R4252k88843L19383j58428J36856l2348j08128
5120A028771M56J32735J476j45535O5337n3696L5770L5993l26309L07786j40957
$$ plain form
5192 1357708 1136034 1353842 1323398 1366279 1235431 1208750 1328549 1181660 1363213 1324956
5182 1324956 1357689 1417395 1367625 1324291 1228918 1301807 1151255 1306625 1183435 1243841 1318659
5171 1318659 1207714 1051790 1176138 1295220 1254198 1274483 1356200 1065057 1130991 1163716
5161 1163716 1147313 1258312 1205005 923724 1048052 1067251 1290058 1329101 1065854 882299
5151 882299 1043718 1165801 1270164 1039878 1146874 1113016 1018779 1098730 1105514 998614 1230353
5140 1230353 1030942 1210541 1294798 1069588 1229854 1031309 1142903 1118702 1114926 1041913
5130 1041913 922850 1293053 1066027 1160279 871436 1190819 1032391 1169247 1136899 1028771
5120 1028771 1029227 1161962 1163438 1017903 1083240 1029544 1065314 1101307 774998 1082784 941827
5109I41827O6555J30109O346j76044J3749K18116j68017J4418k2579P4865N550
5098A104895k50935K47837n1047J71908j80839m8736K85060K8002L8077n7082
5088A287140m9876L7427J40871J15922j66858Q0351n8703K31095n8746J77294
5078A735917J71098M0094N8639J71643M14953J38189N43869R71528K261155K274515
5068H781600K033065O62130r04904j365437j971062j652335j521640q29764o04928
5059B626725m08628l16400j91574p947j68007j07331n3010J19371k08778k30516
5049A053905J30626j24647J71476l22251J68174j32744N7550J75451j69737m8726
5039I59077l833O7721o2442J85375k61355P3391j4759q4113L09423l10412L6719
$$ plain form
5109 941827 1008382 1138491 1144837 968793 982542 1200658 1032641 1047059 1024480 1099345 1104895
5098 1104895 853960 1101797 1050750 1222658 1041819 993083 1278143 1306145 1344222 1287140
5088 1287140 1237264 1274691 1415562 1531484 1364626 1444977 1386274 1617369 1558623 1735917
5078 1735917 1907015 1947109 2005748 2177391 2592344 2730533 3274402 4245930 6507085 8781600
5068 8781600 10814665 11476795 10571891 9206454 7235392 5583057 4061417 3231653 2626725
5059 2626725 2218097 1901697 1710123 1702176 1534169 1426838 1373828 1493199 1284421 1053905
5049 1053905 1184531 1059884 1231360 909109 1077283 944539 1002089 1177540 1007803 959077
5039 959077 955244 1022965 960523 1145898 884543 957934 943175 859062 1168485 858073 894792
5028H94792j43488K19197N1528j09787L5441k6235q119J60234M22610O60642L21112
5017B477927l54305k82729j25352j32271k49053l21270L0339r4357J79228R9795
5007A227952l28704M2953j44125L7116J21256O0580l6931J06380j11538N1486
4997A026425K11012k25954n2611J57042k1749K07469j07375J52320j329q073L62844
4986A700021K11476N45871J026509J808127K55445p80566j046423q19821o57626
4977B243013k02893k49563M3341l49586J19552j74257n7545k443J36389J30043
4967A636051Q6087R5712K2245K46587J81478L80070Q7430R83174K454952M401056
4957A0574842L960284n89526l024884k994505k236626j491628r87481n47904q08135
$$ plain form
5028 894792 751304 970501 1022029 912242 947683 921448 913329 1073563 1496173 2156815 2477927
5017 2477927 2123622 1840893 1715541 1583270 1334217 1012947 1043286 948929 1128157 1227952
5007 1227952 899248 942201 798076 835192 956448 1017028 980097 1086477 974939 1026425
4997 1026425 1237437 1011483 958872 1115914 1094165 1301634 1194259 1346579 1345250 1337177 1700021
4986 1700021 1911497 2457368 3483877 5292004 5547449 4766883 3720460 2900639 2243013
4977 2243013 2040120 1790557 1833898 1484312 1603864 1429607 1372062 1369619 1506008 1636051
4967 1636051 1722138 1817850 1840095 2086682 2268160 2648230 2735660 3718834 6173786 10574842
4957 10574842 14535126 13945600 10920716 7926211 5689585 4197957 3210476 2662572 1854437
4948A854437j59011k97822q8053j71936q253K8062l716P6948k60884K47277j11196
4937A105853o7095q0611j33126P8163j05136Q7341l1586Q5175j73636j78069J53287
4926G40560O9087J27003j96485k9746r3037K24328k22696L9797m0511J58278q5955
4915F90623J27099j53373J88181j47466k03925K68182Q857k5390J34197j11422
4905G75563O1911j26599P2469j99415N4231M3454j00039P1897j02150R805K76531
4894H37658k89787K83338q8380k13052J71794j48983Q4708J37408k47624m9774
4884D77306Q1983L4601r9692J22910q9493M0349J01742j84937K00143k7298J38597
4873G96211j59841P8738R7063r2004j12292q82R9143M2556J03760J2116R5542
$$ plain form
4948 1854437 1695426 1397604 1309551 1137615 1129362 1157424 1153708 1230656 969772 1217049 1105853
4937 1105853 1038758 958147 825021 903184 798048 885389 853803 938978 765342 587273 740560
4926 740560 809647 936650 740165 710419 617382 841710 619014 658811 618300 776578 690623
4915 690623 817722 664349 852530 705064 501139 769321 778178 752788 886985 775563
4905 775563 837474 710875 783344 583929 638160 681614 581575 653472 551322 561127 837658
4894 837658 547871 831209 742829 529777 701571 552588 637296 774704 527080 477306
4884 477306 559289 593890 494198 617108 527615 567964 669706 484769 684912 657614 796211
4873 796211 636370 715108 812171 720167 607875 606993 706136 748692 852452 864568 960110
4862I60110r1120J23272J26253N2790K1512R3581J82022K02385j32104J01015
4852A639716k36496J90772k30314K9340j20826Q9101j71775K60046o011j24256
4842A319297j1223k04870J6618M1834o2803J08540k13620k15007m1199N9481o9518
4831G27530O2200j73933O7765P8403o6339k5084q8211j89190L1480k4923J93522
4820E93220j5790j02096P9656r3738K11325M5912k77559J97600j10098j9594k46665
4809B62173N7839j3151m15L27382j97781L4698j72811J38487m4226O3539j78938
4798B76796N1388K07909k47994P7801L01366j76393k87806J21870N3416J66998
4788E45351l51416p9831K05355n472O8701o7803o6726N4802j23702L36102j9671
$$ plain form
4862 960110 868990 992262 1118515 1171305 1192817 1286398 1468420 1670805 1538701 1639716
4852 1639716 1403220 1593992 1363678 1393018 1272192 1361293 1189518 1449564 1443553 1319297
4842 1319297 1308074 1103204 1119822 1161656 1098853 1207393 993773 778766 737567 797048 727530
4831 727530 789730 615797 683562 761965 695626 670542 582331 393141 424621 399698 593220
4820 593220 577430 475334 554990 461252 672577 718489 440930 638530 528432 508838 262173
4809 262173 320012 306861 306446 633828 436047 470745 297934 436421 392195 455734 276796
4798 276796 328184 536093 288099 365900 667266 490873 203067 324937 378353 545351
4788 545351 193935 114104 319459 313987 382688 314885 248159 302961 179259 515361 495690
4777D95690P6761q6531R2044j97903N7698N4722j5566k47430J65526L8797k2508
4766D11300K1833O034M4504L1064r1661P8863K2367j38445R4972J89198l64193
4755C05836J57300N8895k65896j1698K35637L3643j64602K6257J55437R7578j66565
4744D61822j22464J95467l9002k8751N7182N18p9761l296j26119L81480j41109
4733E55967R316o236J32972p2632j50648K22796k30206l0817J21094K18333q7321
4722F82618j37314J04104J5750Q3514J32877j80368P3977r4385r705J5909p80
4711F86197q9311j00646N0558J46246N5833n6002J06125p1245j60197K14593k62190
4700E19961P6023J04713j75657J26060n3906K59985k26366R5117O7706N2745N334
$$ plain form
4777 495690 572451 485920 577964 380061 437759 492481 476915 229485 395011 433808 411300
4766 411300 433133 439167 483671 514735 423074 501937 524304 385859 480831 670029 305836
4755 305836 463136 522031 256135 244437 480074 513717 349115 375372 530809 628387 461822
4744 461822 339358 534825 495823 467072 524254 524772 445011 441715 315596 697076 555967
4733 555967 565283 559047 692019 619387 468739 691535 461329 430512 551606 769939 682618
4722 682618 545304 649408 665158 748672 881549 701181 775158 680773 671068 686977 686197
4711 686197 596886 496240 546798 693044 748877 692875 799000 727755 567558 782151 519961
4700 519961 595984 700697 525040 651100 597194 857179 630813 725930 793636 846381 851715
4689H51715k90090n481K09544n6086R6429j74031K8757J5498j1983j9033P3384
4678G18623J49641k73169J12926k06734L5303K46130j9097N4619j72118J73556
4668H19680K44062j45890j94661N5436n1938J20949p834j19191K97909j72975
4658H45547P3339o5449Q2056M4075L854m2005j86582J98158j79990K30572j12321
4647H91254p79O2134j9374o0559j08268J35083J20336j56716Q3779R394R7676
4636A053960q4353J99915l47413p9074R8081J8936J01657k2862K6388k2583o1358
4625H81294J5051m2365J77196l4901k8500J3901J16162m7902n2952j10859L10852
4614A196977j27104j42015j53432K09388J12272Q2673k01217O208j7513J83819
$$ plain form
4689 851715 561625 556144 765688 709602 806031 632000 660757 676255 664272 645239 718623
4678 718623 868264 595095 708021 501287 536590 782720 763623 818242 646124 819680
4668 819680 1063742 917852 723191 778627 726689 847638 839804 720613 1018522 845547
4658 845547 918886 853437 935493 979568 983422 941417 754835 952993 773003 1003575 891254
4647 891254 890475 952609 933235 872676 764408 899491 1019827 863111 946890 956284 1053960
4636 1053960 969607 1169522 822109 743035 841116 860052 961709 938847 965235 942652 881294
4625 881294 896345 853980 1031176 996275 967775 981676 1097838 1049936 996984 886125 1196977
4614 1196977 1069873 927858 774426 983814 1096086 1178759 977542 983750 966237 1150056
4604A150056o5263o8641K18972j39908N2162L480L891n1284m333K7986N5452Q3927
4592A266497l01096N3196j13748J72606k7870R4632J12006k52326J99647M8833
4582A252377q3355P9097j83936P5178j01095L54048j50617q8632j17022N1414
4572A087457R2386p979j34353n6345K87186j93808o2295J65684q8331N2096J15345
4561A257043Q2340j47844J5951j92606J362J65529j8217J44105J7964j26479M08698
4550A607846K14952J42698j81660J49467K6008j30942o1400k39442k12869j41255
4540A173403K4174J21906j09199r544j0646j98226R3678O8617p5671j24787Q5566
4529A039271N3356J24768J705m520K0564J78582J169M1227O4827j96535O573Q846
$$ plain form
4604 1150056 1084793 1016152 1235124 1095216 1147378 1150858 1154749 1103465 1099132 1127118 1182570 1266497
4592 1266497 965401 1018597 904849 1077455 1049585 1144217 1256223 1003897 1203544 1252377
4582 1252377 1169022 1248119 1064183 1139361 1038266 1392314 1241697 1153065 1036043 1087457
4572 1087457 1179843 1171864 1037511 981166 1268352 1074544 1012249 1177933 1089602 1141698 1257043
4561 1257043 1339383 1191539 1207490 1014884 1016246 1181775 1163558 1307663 1325627 1199148 1607846
4550 1607846 1822798 1965496 1783836 1933303 1959311 1828369 1766969 1527527 1314658 1173403
4540 1173403 1197577 1319483 1210284 1200740 1190094 991868 1085546 1154163 1078492 953705 1039271
4529 1039271 1092627 1217395 1219100 1214580 1235144 1413726 1414895 1456122 1520949 1324414 1330987 1339833
4517A339833K6194j30990j56924J66174j55032K95087k66492K8865J85912k31413
4507A101214N8658L331J62346J19035k2992N3992j88900O2774m1431M4669L1456
4496A384152Q7071k4722J05002L8865L3802J31599l31498l7777k2274j8109J13093
4485A459204j78954J24378k69363K79559p6968N2322J47415n6427j46897R8845
4475A433114j19991J88917j05801r2812M8939P1670P7236r0886l1135r2651Q0923
4464A367523j53866K22965O4945o651K27140l4215K68879j44966J49360O5065
4454B026179m02807K91474J28250O4930o9468j11505L2464K33005R7455K10313
4444B500290R3895M7982j75505J81542L1986m6295j93224J2201J5902Q4865j48530
$$ plain form
4517 1339833 1366027 1235037 1078113 1244287 1089255 1384342 1117850 1146715 1332627 1101214
4507 1101214 1159872 1163203 1325549 1444584 1421592 1475584 1286684 1349458 1308027 1352696 1384152
4496 1384152 1471223 1446501 1551503 1590368 1624170 1755769 1424271 1386494 1364220 1346111 1459204
4485 1459204 1280250 1404628 1135265 1414824 1337856 1390178 1537593 1481166 1334269 1433114
4475 1433114 1313123 1502040 1396239 1303427 1352366 1424036 1501272 1410386 1379251 1286600 1367523
4464 1367523 1213657 1436622 1501567 1494916 1722056 1687841 1956720 1811754 1961114 2026179
4454 2026179 1623372 1914846 2043096 2108026 2038558 1927053 1959517 2192522 2289977 2500290
4444 2500290 2594185 2642167 2466662 2648204 2680190 2633895 2440671 2452872 2468774 2553639 2405109
4433B405109K6793K07599m5054K90791p2176k488j10104K76625k04391r1477j81938
4422B499289j37255J24202j88312K01503Q2175j12180j38057O8545R3406J43697
4412B637013k0695j14322j27155j12682L4348J20568l65307J44930J02927M6506
4402B346131K48053k25066K8933j07425M7681K83655J30819r6400j56508K36037
4392B735910k5496P270m7302K09179J05j83026O4676J62172K90446o9698o1290
4381C082946L23560L3225J51880j32597J03095N3130l8613K63395r1940J34720
4371C882801J09036L63629J55189L50347Q3339J71923K65833J87580L04303N46196
4361F420176N2618Q17522P99470J770165K023221R98240o60093j540421j038351
$$ plain form
4433 2405109 2431902 2639501 2594447 2885238 2813062 2810574 2700470 2977095 2772704 2681227 2499289
4422 2499289 2362034 2486236 2297924 2499427 2581602 2469422 2331365 2399910 2493316 2637013
4412 2637013 2616318 2501996 2374841 2262159 2296507 2417075 2051768 2196698 2299625 2346131
4402 2346131 2594184 2369118 2398051 2290626 2338307 2621962 2752781 2656381 2499873 2735910
4392 2735910 2710414 2717684 2670382 2879561 2879666 2696640 2761316 2923488 3213934 3144236 3082946
4381 3082946 3406506 3439731 3591611 3459014 3562109 3615239 3576626 3840021 3748081 3882801
4371 3882801 3991837 4355466 4510655 4861002 4944341 5116264 5382097 5569677 5873980 6420176
4361 6420176 6472794 7290316 8089786 9859951 11883172 12881412 12221319 10680898 9642547
4352I642547j109519o95308l24729j75897k52809M6484J11495J67961K56347L6089
4342G702661J87040Q4658j20878K74610N97076L37604J05815O24583P37228J018464
4332A1548861J434702J724998K681906L281013J510093l51683K68777J052567
4324B3151234L634358O801094P115912K371351k465976l804752l920480l092823
4316B9789918l127897l295093k784032k647541k316601j409929j394024j214414
4308A1600387q18185m23055l31309K64695j04846J88375M30946J246791J203965
4299A3257764J0221L47845P08435P49271q367m23697j133646r11717q66271j132858
4289A0596980o56056n44486m01671j96517l09035K480K53061K67198j42383K89062
$$ plain form
4352 9642547 8533028 7837720 7512991 7337094 7084285 7130769 7242264 7410225 7666572 7702661
4342 7702661 7889701 7974359 7853481 8128091 8725167 9062771 9168586 9793169 10530397 11548861
4332 11548861 12983563 14708561 17390467 20671480 22181573 21829890 22098667 23151234
4324 23151234 26785592 33586686 40702598 43073949 40607973 36803221 32882741 29789918
4316 29789918 26662021 23366928 20582896 17935355 15618754 14208825 12814801 11600387
4308 11600387 10782202 10359147 10027838 10292533 10187687 10376062 10807008 12053799 13257764
4299 13257764 13267985 13615830 14324265 15073536 15065169 14641472 13507826 12596109 11729838 10596980
4289 10596980 9940924 9396438 8994767 8798250 8489215 8491695 8744756 9011954 8869571 9158633
4279I158633L71428q2186K2001l4977K34704J061163J521181J533911N88657p07553
4269A3666962j199714j185816j290206j323453p30932o94833n71995m44050O392
4260F232355k68462J8657J13069J86835M95386J73224J9540p96319k08128l18019
4250E648138J89835M02062k46488k96952q26614m21281n05120m83541m18423m88323
4240B553293K19280l52619J4453l02717O3246k48404J31564j99304J30435j85687
4230A823540n9017p5464k11901J41161j49507m0402R5427q1642J94721j27687
4220A509229n2328j80431N2215j02295R8906k59783J49084l250l57691K86427
4210A140083j32699m7329J19661j3425l4284P3682j32373N1081m9837o1878Q1488
$$ plain form
4279 9158633 9530061 9447875 9469876 9434899 9669603 10730766 12251947 13785858 14374515 13666962
4269 13666962 12467248 11281432 9991226 8667773 7936841 7242008 6670013 6225963 6232355
4260 6232355 5963893 5982550 6095619 6282454 6777840 6951064 6970604 6174285 5966157 5648138
4250 5648138 5837973 6240035 5993547 5696595 4869981 4448700 3943580 3460039 3041616 2553293
4240 2553293 2772573 2419954 2434407 2131690 2194936 1946532 2078096 1878792 2009227 1823540
4230 1823540 1764523 1689059 1477158 1618319 1468812 1428410 1523837 1442195 1636916 1509229
4220 1509229 1456901 1276470 1328685 1226390 1325296 1065513 1214597 1211347 853656 1140083
4210 1140083 1007384 960055 1079716 1066291 1032007 1105689 973316 1024397 974560 912682 994170
4199I94170k60236K73443k15017K81152l16382K36381j67334m1050N4620j04990
4189G34757L85177k16683j92665J84387k84961K05720o4845O6890J33737p7879
4179H73635j36012j35268L45427j24085l7010j03884p4114m0794J317K29099J062
4168G99373J7659l0511j94590K2603o9002K48763l9744k73088J18394n7994J82839
4157G24702p9766q4723N3058K4076O3640q4211J56026q9092O2391k15026O7283
4146E98358m0339J7391l8607j2594J07531O8876m6409N2747j72252l8673K21030
4135G17059j22966K19501j26012O494j12678K03497o8183Q2789k42426J64213
4125G21288M6761P5529j59675K03955m291j29329J16766l0769O1115l1990P7266
$$ plain form
4199 994170 733934 1007377 792360 1073512 757130 993511 826177 785127 839747 734757
4189 734757 1119934 903251 710586 894973 610012 815732 750887 817777 951514 873635
4179 873635 737623 602355 947782 823697 786687 682803 608689 567895 569212 798311 799373
4168 799373 817032 786521 591931 614534 545532 794295 754551 481463 599857 541863 724702
4157 724702 644936 560213 613271 637347 700987 616776 772802 683710 746101 531075 598358
4146 598358 558019 575410 536803 524209 631740 700616 654207 706954 534702 496029 717059
4135 717059 594093 813594 687582 694076 581398 784895 716712 799501 557075 721288
4125 721288 768049 843578 683903 887858 883567 754238 871004 840235 901350 869360 946626
4114I46626j25048J75986M1308j14758J9112k4583P8346K231O3034Q951O6145
4103A137350j32658L0083J88454N7259J19916K0809r3339J74951K2674J12701
4093A638200q3495j14597j06461L871r8470J38277n2014J56605j28855J52358
4083A505419j81012K40947J49393k01170J39162m6250J4332J25334p7682J5631
4073A684104j50614L98170k62660K61809O5376L79132P9980l6356J51464k89539
4063B280866P4225k60670j83490K50817k64604o5710N0084L9002J40120L9420
4053B100060p6619N3352M6150J09972R0300N6994J85379j69935J04642J6128k54815
4042B261608J29936M9300k5359J54998l5588K1078J53293l33448J27306j39657
$$ plain form
4114 946626 821578 997564 1038872 924114 943226 918643 996989 999220 1062254 1071205 1137350
4103 1137350 1004692 1034775 1223229 1280488 1400404 1421213 1327874 1502825 1525499 1638200
4093 1638200 1554705 1440108 1333647 1337518 1239048 1377325 1325311 1481916 1353061 1505419
4083 1505419 1324407 1565354 1714747 1513577 1652739 1606489 1620821 1746155 1668473 1684104
4073 1684104 1533490 1931660 1669000 1930809 1996185 2375317 2455297 2418941 2570405 2280866
4063 2280866 2355091 2094421 1910931 2161748 1897144 1831434 1881518 1920520 2060640 2100060
4053 2100060 2023441 2076793 2122943 2232915 2323215 2380209 2565588 2395653 2500295 2516423 2261608
4042 2261608 2391544 2440844 2415485 2570483 2534895 2555973 2709266 2375818 2503124 2363467
4032B363467J06927R9921N4937j7174l1564K93178K0759M12716o2203N95984J47810
4021C984758j37362j73752m25166k35235k19281l27731r4478k5882K896j29565
4011B219202J14871m9007j71511J38213p1928k9695K90170L7417M1324m1532m1027
4000B436497L91632L466J8353J18780K8500j43653n6478j42937l15396k25633
$$ plain form
4032 2363467 2470394 2570315 2625252 2608078 2576514 2869692 2890451 3303167 3240964 3836948 3984758
4021 3984758 3847396 3673644 3248478 3013243 2793962 2466231 2371753 2345871 2348767 2219202
4011 2219202 2334073 2285066 2113555 2251768 2179840 2150145 2440315 2477732 2519056 2477524 2436497
4000 2436497 2828129 2831595 2849948 2968728 2997228 2853575 2797097 2654160 2338764 2113131
$$ [...]
##END NTUPLES=NMR SPECTRUM
##END=
