##TITLE=abcd
##JCAMPDX= 6.0         $$ Bruker NMR JCAMP-DX V2.0
##DATA TYPE= NMR SPECTRUM
##DATA CLASS= NTUPLES
##ORIGIN= UXNMR, Bruker Analytische Messtechnik GmbH
##OWNER= root
$$ XWIN-NMR		Version 3.5
$$ Mon Jan 19 18:48:34 2026 Russian Standard Time (UT+4h)  servis@DPX200
##.OBSERVE FREQUENCY= 200.131235884673
##.OBSERVE NUCLEUS= ^1H
##.ACQUISITION MODE= SIMULTANEOUS
##.ACQUISITION SCHEME= undefined
##.AVERAGES= 32
##.DIGITISER RES= 18
##SPECTROMETER/DATA SYSTEM= spect
##.PULSE SEQUENCE= zg
##.SOLVENT NAME= CDCl3
##.SHIFT REFERENCE= (INTERNAL, CDCl3, 0, 16.4885)
##AUDIT TRAIL= $$ (NUMBER, WHEN, WHO, WHERE, WHAT)
$$ ##TITLE= Audit trail, XWIN-NMR		Version 3.5
$$ ##JCAMPDX= 5.01
$$ ##ORIGIN= Bruker BioSpin GmbH
$$ ##OWNER= servis
$$ F:\spectra/data/av/nmr/H1/1/pdata/1/auditp.txt
$$ ##AUDIT TRAIL=  $$ (NUMBER, WHEN, WHO, WHERE, WHAT)
(   1,<2026-01-19 18:45:14.59 +0400>,<servis>,<DPX200>,
      <created by zg, POWCHK disabled, PULCHK disabled
       configuration hash MD5:
       00 E9 B6 7A A2 85 ED C7 34 08 36 98 17 FE 4E 26
       data hash MD5: 32K
       A2 EF 15 58 CB D2 E7 37 57 F0 AD 67 12 DE 80 30>)
(   2,<2026-01-19 18:47:59.42 +0400>,<servis>,<DPX200>,
      <Start of raw data processing
       efp BC_mod = 2 LB = 0.05 FT_mod = 6 PKNL = 1 PHC0 = -261.0463 PHC1 = 6.301564 SI = 16K 
       data hash MD5: 16K
       96 EB C0 E6 E3 3B 17 79 9A 27 66 D0 2E C3 A6 93>)
(   3,<2026-01-19 18:48:17.98 +0400>,<servis>,<DPX200>,
      <pk PHC0 = 4.400001 PHC1 = 0 
       data hash MD5: 16K
       A9 73 C3 E0 64 80 A3 7E 08 1A FA CF BB 62 96 D6>)
$$ ##END=
$$ 
$$ hash MD5
$$ AF D6 35 DA B3 4F C3 66 E0 72 04 4A A9 80 0E 36
##$RELAX= 
##$RELAX= 
##$RELAX= 
##$RELAX= 
##$RELAX= 
##$RELAX= 
##$RELAX= 
##$RELAX= 
$$ Bruker specific parameters
$$ --------------------------
##$DU= <F:\spectra>
##$EXPNO= 1
##$NAME= <H1>
##$PROCNO= 1
##$TYPE= <nmr>
##$USER= <av>
##$AMP= (0..31)
100 100 100 100 100 100 100 100 100 100 100 100 100 100 100 100 100 100 
100 100 100 100 100 100 100 100 100 100 100 100 100 100 
##$AQSEQ= 0
##$AQ_mod= 1
##$AUNM= <au_zg>
##$AUTOPOS= <>
##$BF1= 200.13
##$BF2= 200.13
##$BF3= 200.13
##$BF4= 200.13
##$BF5= 500.13
##$BF6= 500.13
##$BF7= 500.13
##$BF8= 500.13
##$BYTORDA= 1
##$CFDGTYP= 0
##$CFRGTYP= 5
##$CHEMSTR= <none>
##$CNST= (0..31)
1 1 145 1 1 1 1 1 1 1 1 1 1 1 1 1 1 1 1 1 1 1 1 1 1 1 1 1 1 1 1 1 
##$CPDPRG= <>
##$CPDPRG1= <>
##$CPDPRG2= <>
##$CPDPRG3= <>
##$CPDPRG4= <mlev>
##$CPDPRG5= <mlev>
##$CPDPRG6= <mlev>
##$CPDPRG7= <mlev>
##$CPDPRG8= <mlev>
##$CPDPRGB= <>
##$CPDPRGT= <>
##$D= (0..31)
0 2 0 0 0 0 0 0 0 0.06 0 0 0 0 0 0 0.0002 0 0 0 0 0 0 0 0 0 0 0 0 0 0 
0 
##$DATE= 1768833914
##$DBL= (0..7)
120 120 120 120 120 120 120 120 
##$DBP= (0..7)
150 150 150 150 150 150 150 150 
##$DBP07= 0
##$DBPNAM0= <>
##$DBPNAM1= <>
##$DBPNAM2= <>
##$DBPNAM3= <>
##$DBPNAM4= <>
##$DBPNAM5= <>
##$DBPNAM6= <>
##$DBPNAM7= <>
##$DBPOAL= (0..7)
0.5 0.5 0.5 0.5 0.5 0.5 0.5 0.5 
##$DBPOFFS= (0..7)
0 0 0 0 0 0 0 0 
##$DE= 6
##$DECBNUC= <off>
##$DECIM= 32
$$ [...]
##$SUBNAM4= <"">
##$SUBNAM5= <"">
##$SUBNAM6= <"">
##$SUBNAM7= <"">
##$SUBNAM8= <"">
##$SUBNAM9= <"">
##$SW= 20.6817932712277
##$SWIBOX= (0..15)
0 0 3 0 0 0 0 0 0 0 0 0 0 0 0 0 
##$SW_h= 4139.07284768212
##$TD= 32768
##$TD0= 1
##$TE= 0
##$TE2= 300
##$TE3= 300
##$TEG= 300
##$TL= (0..7)
0 120 120 120 120 120 120 120 
##$TP= (0..7)
150 150 150 150 150 150 150 150 
##$TP07= 0
##$TPNAME0= <>
##$TPNAME1= <>
##$TPNAME2= <>
##$TPNAME3= <>
##$TPNAME4= <>
##$TPNAME5= <>
##$TPNAME6= <>
##$TPNAME7= <>
##$TPOAL= (0..7)
0.5 0.5 0.5 0.5 0.5 0.5 0.5 0.5 
##$TPOFFS= (0..7)
0 0 0 0 0 0 0 0 
##$TUNHIN= 0
##$TUNHOUT= 0
##$TUNXOUT= 0
##$USERA1= <user>
##$USERA2= <user>
##$USERA3= <user>
##$USERA4= <user>
##$USERA5= <user>
##$V9= 5
##$VALIST= <valist>
##$VCLIST= <CCCCCCCCCCCCCCC>
##$VD= 0
##$VDLIST= <DDDDDDDDDDDDDDD>
##$VPLIST= <PPPPPPPPPPPPPPP>
##$VTLIST= <TTTTTTTTTTTTTTT>
##$WBST= 1024
##$WBSW= 30
##$XGAIN= (0..3)
0 0 0 0 
##$XL= 0
##$YL= 0
##$YMAX_a= 293729
##$YMIN_a= -153972
##$ZGOPTNS= <>
##$ZL1= 120
##$ZL2= 120
##$ZL3= 120
##$ZL4= 120
##$ABSF1= 0
##$ABSF2= 0
##$ABSG= 0
##$ABSL= 0
##$ALPHA= 0
##$AQORDER= 0
##$ASSFAC= 0
##$ASSFACI= 0
##$ASSFACX= 0
##$ASSWID= 0
##$AUNMP= <proc_1d>
##$AZFE= 0.1
##$AZFW= 0.1
##$BCFW= 0
##$BC_mod= 2
##$BYTORDP= 0
##$COROFFS= 0
##$CY= 18.4799938201904
##$DATMOD= 1
##$DC= 0
##$DFILT= <>
##$DTYPP= 0
##$F1P= 9.9274215381318
##$F2P= -0.165520771350173
##$FCOR= 1
##$FTSIZE= 16384
##$FT_mod= 6
##$GAMMA= 0
##$GB= 0
##$INTBC= 1
##$INTSCL= 4.127829e-11
##$ISEN= 128
##$LB= 0.05
##$LEV0= 0
##$LPBIN= 0
##$MAXI= 10000
##$MC2= 0
##$MEAN= 0
##$ME_mod= 0
##$MI= 50
##$NCOEF= 0
##$NC_proc= -6
##$NLEV= 6
##$NOISF1= 3.799351
##$NOISF2= 2.8
##$NSP= 0
##$NTH_PI= 0
##$NZP= 0
##$OFFSET= 16.48848
##$PC= 4
##$PHC0= -256.6463
##$PHC1= 6.301564
##$PH_mod= 1
##$PKNL= yes
##$PPARMOD= 0
##$PSCAL= 4
##$PSIGN= 0
##$REVERSE= no
##$SF= 200.130005582386
##$SI= 16384
##$SIGF1= 3
##$SIGF2= 2
##$SINO= 400
##$SIOLD= 16384
##$SREGLST= <1H.CDCl3>
##$SSB= 0
##$STSI= 16384
##$STSR= 0
##$SW_p= 4139.07284768211
##$SYMM= 0
##$S_DEV= 0
##$TDeff= 32768
##$TDoff= 0
##$TI= <>
##$TILT= no
##$TM1= 0
##$TM2= 0
##$TOPLEV= 0
##$USERP1= <user>
##$USERP2= <user>
##$USERP3= <user>
##$USERP4= <user>
##$USERP5= <user>
##$WDW= 1
##$XDIM= 16384
##$YMAX_p= 414828609
##$YMIN_p= -2727417
$$ End of Bruker specific parameters
$$ ---------------------------------
##NTUPLES= NMR SPECTRUM
##VAR_NAME=  FREQUENCY,     SPECTRUM/REAL,   SPECTRUM/IMAG
##SYMBOL=    X,             R,               I
##VAR_TYPE=  INDEPENDENT,   DEPENDENT,       DEPENDENT
##VAR_FORM=  AFFN,          ASDF,            ASDF
##VAR_DIM=   16384,         16384,           16384
##UNITS=     HZ,            ARBITRARY UNITS, ARBITRARY UNITS
##FACTOR=    0.252644378177508, 1,           1
##FIRST=     3299.83951724647, 0,            0
##LAST=      -839.233330435636, 0,           0
##MIN=       -839.233330435636, -2727417,    0
##MAX=       3299.83951724647, 414828609,    0
$$ Real data points
##PAGE= N=1
##DATA TABLE= (X++(R..R)), XYDATA
$$ [...]
12416 -234062 80666 78326 -5583 75229 -272362 -264572 -16669 37894 -93896 -321981 -318356
12405 -318356 7646 28116 -424699 -152663 -263772 -883 -373497 -377978 -207824 -182498
12395 -182498 124065 -40866 -1126 -546264 -231950 -44558 -161831 -386847 -2692 -165144
12385 -165144 -318629 291914 -103023 80052 250799 -462572 -131036 -211685 -317218 -46090
12375 -46090 -224142 -204195 7614 122698 -235026 125470 166727 -364749 77234 -476927
12365 -476927 -101505 -296978 -125533 -106884 -248731 166181 -26998 -121759 120642 -273657
12355 -273657 -5080 45602 -198384 -366841 -91095 -202145 -422583 -126812 -151492 -127385
12345 -127385 -29750 -57151 -123640 1905 -115393 -363619 -111051 -283699 -239010 76909
12335 76909 -253416 37175 -225878 -225633 27620 -264223 -161653 -817067 237359 -58691
12325 -58691 -748259 165839 -295632 134727 -394162 176864 -209177 -377447 85563 -224305
12315 -224305 -5729 -149928 -208082 -20847 -64102 -389294 -314152 -441266 -26923 -70139
12305 -70139 -74089 -541077 -79945 195455 -64100 77606 -61764 -44955 -373313 36916
12295 36916 265688 -217363 -104893 -141395 -432366 -341832 104106 -121808 -227506 -291566
12285 -291566 31804 380792 -302437 -339357 -155048 353789 -95030 14778 -174793 -177671
12275 -177671 -118822 325917 -350693 -22935 -82512 -354797 28398 -146352 -31101 -92489
12265 -92489 -16033 -187402 -243713 -397365 -178051 117256 -299780 -642401 110765 1806
12255 1806 -208864 -61159 127185 -333785 -292006 -61171 39663 -270480 -36576 -179337
12245 -179337 -185285 -6098 -229893 7121 -52390 -278124 -203776 -267897 -283115 -190132 -226211
12234 -226211 -437330 -78172 -178449 134812 -392265 114029 -86714 -336090 75055 -157761
12224 -157761 -64714 -360486 143501 103675 36974 127663 -224345 50116 300827 -89623
12214 -89623 77375 -448774 63726 -108571 44743 -176645 -94124 24750 -55365 -300296
12204 -300296 -128032 -331971 -200099 -68656 -20662 -468022 107651 93847 3575 -27052
12194 -27052 -128063 -173478 -159832 -75204 -82279 -298977 -37225 -100919 -331726 280357 -350793
12183 -350793 313595 -176333 29189 -205081 -190481 -497646 -252971 -107549 -158368 -200342
12173 -200342 -273880 -17978 -10163 255835 -165939 155979 -323061 -189143 -361242 -206236
12163 -206236 -85522 -289780 -5615 -242272 -74498 -147156 6004 -319653 -108643 -347729
12153 -347729 -62326 -203519 -237785 89408 -7792 32128 -150131 -155981 -128087 -158008 39975
12142 39975 -287596 -289046 -318317 -344499 -239331 -244588 -333075 44908 -152746 1871 -296418
12131 -296418 108194 161974 -94527 18208 276465 95 -15160 124753 -111446 132311
12121 132311 -65190 -227426 -340542 -350416 -147267 -321133 -151925 -581622 -237490 -134894
12111 -134894 -233487 -328405 -182637 -262359 -192470 110538 36620 -433409 -52014 -16326 -1820
12100 -1820 291748 239650 64343 -281739 -32024 77886 104377 -425431 -393129 -502307
12090 -502307 -77008 -143131 62404 -12058 -185375 95173 -243761 -2322 143363 -80954
12080 -80954 -52107 -270596 -72547 -182526 259047 184420 -108391 -44188 -369160 327971
12070 327971 -68091 -217705 -577330 -132267 220176 -334134 -150502 -357956 -55337 59485
12060 59485 -334473 -357695 -62566 149213 83969 23801 83416 -84589 47842 -150159
12050 -150159 -163097 -230989 -293969 -265295 229046 -256019 -192244 -248311 238221 -40872 -294437
12039 -294437 443 -258092 -192950 -256303 -99295 -156610 -351693 -71507 -497306 42371
12029 42371 154909 -170476 63592 -117437 294093 220353 -243693 -44135 -391911 -484325
12019 -484325 -264624 -177042 -115036 -105927 -93971 -30782 19146 -99567 -124228 -153026 -305845
12008 -305845 -189222 -138946 -282316 105520 -456117 -177615 -15174 -202233 -176546 -237669
11998 -237669 -312122 -121106 76679 -107747 -152428 -82550 -135264 -14887 -485541 -230846
11988 -230846 -107104 25892 -271565 -133836 -76891 -22004 -223032 -180681 -353383 -183956
11978 -183956 192460 -382794 -473845 78954 -164483 18729 -271431 -338441 151168 -126249
11968 -126249 -6561 -151383 -112713 -134602 -259467 -203940 -378960 10362 354661 -460845
11958 -460845 63040 24665 99439 -280449 -103932 -57143 -453203 70612 -389935 -200241
11948 -200241 84396 -136259 -21421 -88799 -451291 -55712 -193769 -213024 -191913 -210268
11938 -210268 -283741 73476 -80274 -67875 28139 455861 247404 -291766 68858 357895
11928 357895 180201 -553726 -282860 -132399 -41120 -309756 -668910 -488037 -267070 -427712
11918 -427712 -326336 -521711 -17353 192578 -315777 375165 151937 344380 -27805 -172277
11908 -172277 -142544 18452 -219978 -267167 -236520 -121885 -212679 -132488 -239856 -248146 -155111
11897 -155111 -70249 -83460 -193445 -177349 276206 459336 457715 93712 17847 53348 -70955
11886 -70955 65925 -253555 -34308 -531866 -269015 -135387 -345801 237866 7607 58474
11876 58474 34211 -168356 -56358 77372 -15765 -215924 -498919 -223248 -75330 249304
11866 249304 -257631 -57435 96279 -83877 46263 -26964 -173924 138072 65607 -80898
11856 -80898 -53447 -44847 -51781 -25603 -22581 -249724 -332714 -94884 90940 -104221 -33641
11845 -33641 -166594 138390 -106535 13676 -129556 -347914 140623 -505241 -103435 -142189
11835 -142189 -105913 203795 -187446 -328471 -207453 -231505 -124618 -183101 -308542 -318144
11825 -318144 28500 -258710 -106445 -71709 234876 54536 91132 96870 85240 50790 -384361
11814 -384361 -173942 -373982 -200733 -78482 46013 -191806 -327545 74074 -217794 -276255
11804 -276255 -15846 -86620 176790 -18527 -138917 -32230 -101489 -193580 5990 -38490
11794 -38490 -472380 118654 96732 -346449 268082 253799 -130800 -170362 -38130 117363
11784 117363 35943 -98369 209742 -19631 -129447 -171874 10301 -35349 47355 -28550
11774 -28550 22098 -288173 -245940 81963 30100 -66061 -160793 -40291 -577208 59033 -132511
11763 -132511 -27771 -248823 -152328 8063 -250469 23903 88204 -200757 18036 -214798
11753 -214798 -299281 155512 -479908 381875 -222848 -219291 -15658 246962 40264 -42907
11743 -42907 217096 138365 57363 -155510 4551 -72582 42702 -45042 -110679 -405366 235272
11732 235272 -400635 135982 -185786 -281246 -322140 -200265 63712 34728 -65031 -128277
11722 -128277 217255 -155628 -20216 -56887 -301872 -244445 -162397 -219678 -180000 -142668 -155973
11711 -155973 -187726 -46343 -289864 20034 204951 -4525 -12581 -20335 -284874 48500
11701 48500 41734 117685 -101103 19098 -185704 -212625 -195808 -352596 117991 -218463 -71962
11690 -71962 -296372 226158 -140015 -338136 217219 -310183 -251941 -62870 -280777 -470798
11680 -470798 -17964 -345089 -122660 36533 -354216 -96274 125918 14031 -396403 27596
11670 27596 31416 -383114 7189 -231624 -192240 -139842 3983 -157639 -253111 -13424 -263494
11659 -263494 397922 -441164 -377348 -423777 -114161 -109140 -285044 -84624 -507244 251398
11649 251398 146022 -278098 116991 -210638 111511 161573 -631678 -408951 -297952 29376
11639 29376 -42676 -141693 -613059 158140 -272850 135664 -372058 -173403 -51275 -431758
11629 -431758 -193973 -434664 212099 -111558 -121177 -119091 -346848 -70386 262453 -258630
11619 -258630 -12321 -133013 313127 -32861 9144 -523821 -68294 -273552 -203250 -260641
11609 -260641 -117520 -291719 -205657 -66030 -107243 373128 -269180 -22233 -138575 -30125
11599 -30125 -189338 77833 -87339 24839 -496841 45076 -189142 6343 38592 -85822
11589 -85822 -257377 -78236 20985 -143514 185378 -174248 79170 -271939 -126702 13424
11579 13424 -194747 -85682 -54218 -326056 -202132 -189310 -289380 -320038 -178307 115791
11569 115791 -471057 -46384 -186159 83891 -74213 89140 -223871 -22469 -176558 106214
11559 106214 -854 -340359 407262 -18159 -172036 -407858 -16326 108829 193689 -51641
11549 -51641 -221184 50561 -187776 25684 -84394 -414122 95688 -485244 1072 -96493
11539 -96493 -263961 197081 -210898 157963 36961 -136134 127233 -84270 -373835 -358935
11529 -358935 -71593 -677 -144695 56002 -107950 151869 212433 -406064 -28852 -386992
11519 -386992 -26276 79560 30959 -121613 -127274 123384 -420738 166811 -38167 -255613
11509 -255613 -28583 -239584 -129209 200414 39115 53887 -222594 -259766 -24971 -450116
11499 -450116 133686 -109409 -141489 -32459 -334341 -148351 -96801 242264 -356073 285865
11489 285865 -127583 -148006 -156500 -282208 -12469 -234709 -73822 -225985 -399198 23934
11479 23934 13590 137771 -51871 -210468 62021 7440 -438165 -132495 169645 -142432
11469 -142432 -159183 -308937 -304737 -248715 180497 -94648 72157 -577418 -135858 -59782
11459 -59782 -448496 -64462 -240015 -53473 -62163 1278 -104883 133751 -253778 -247742 -46219
11448 -46219 -275094 -81776 -15373 -529966 -155295 25395 -331958 43667 -381662 -414504
11438 -414504 -84426 163694 -95381 -36815 128775 -464693 94897 99582 -176648 -46952
11428 -46952 -310460 -358549 -254342 -69331 -178953 -401091 -26527 -260720 -249627 219451
11418 219451 -196136 291636 -96352 -261550 -366586 -34087 -90844 -251763 -205261 -235718
11408 -235718 -323363 181955 195413 -112615 -93285 -416515 -110416 -110855 -75816 -215072 -19735
11397 -19735 -135001 -388105 -204730 -183303 138021 161936 -123306 125870 -285419 143564
11387 143564 -285883 244929 -437146 -32030 -137619 -232353 -43052 44544 -20625 -57241
11377 -57241 -440715 -80513 -500040 -12000 -86750 -176340 19985 -214466 -184356 -109182
11367 -109182 72538 -100611 -4039 -322683 -213613 -188515 -285633 -146585 -36121 -182153
11357 -182153 -1720 -270884 127263 4296 54249 46290 -9426 -10509 -241113 104166 -64546
11346 -64546 350249 83699 -386257 -178069 -147165 109834 -178757 -14874 -92687 -49278
11336 -49278 -232254 48997 33643 -30117 167520 51249 -231686 -74107 -281998 -150096
11326 -150096 -106654 -111784 -114908 -41359 -183096 -134671 -377591 -146090 11520 -295285 -332548
11315 -332548 -189714 -274429 -81814 249221 -359204 -146273 -180425 -66754 -86418 -354227
11305 -354227 47127 -465865 -205493 24678 -133915 102157 47427 -126596 -177109 -324129
11295 -324129 -244963 2315 -140538 -432045 -52987 -122073 232903 -265808 206500 -428764
11285 -428764 80044 229715 -473095 -131203 -253227 -89319 -410830 -45745 -381860 -486495
11275 -486495 289658 63657 -128236 -18618 45521 -40913 22907 -258226 -209105 -69893
11265 -69893 143506 -244694 388231 -188117 77734 217780 -87440 -164368 230312 4283
11255 4283 -369358 -25455 -237889 -453939 428351 -168516 -288542 -212475 -273035 -235166
11245 -235166 -138074 -392747 -382884 158311 -21884 131041 -292612 53612 -329297 121545
11235 121545 22756 -524120 -283402 31324 -357632 -170571 153 -550932 -67988 23253
11225 23253 -291636 189144 51615 -261596 39887 -142150 -141436 329351 -128057 280729
11215 280729 86635 142997 -107664 60440 -47077 -346293 -373588 -333182 -275361 -310294
11205 -310294 81200 -51074 -271520 -95961 45615 347403 -252828 -53845 -43671 -40138
11195 -40138 -514376 111095 -88678 -465098 -55916 -20691 -3882 -9280 41358 -462675 -84063
11184 -84063 -190470 -124806 -400268 -118347 85451 -14761 -93006 64919 238211 -8301
11174 -8301 56390 -35935 -146485 -157601 110135 -232379 -241005 -349139 50451 270945 -93564
11163 -93564 -79691 120754 178623 -354164 -112377 12001 -347653 166007 -404374 -94313
11153 -94313 -151398 -10615 -148581 -166978 -99455 -349396 192527 -53979 -57935 -373481 129294
11142 129294 -211285 -38757 -244695 -374559 302405 144367 -536121 -310260 81688 -192
11132 -192 -191716 -183976 -256610 -157247 -24374 -274327 295226 -402199 -77633 -138382 -484501
11121 -484501 25139 -187059 243307 -306759 -51366 -295189 -8212 -283737 73690 -137309
11111 -137309 -468485 355155 -134168 -27251 168354 -140423 98591 17336 -311537 -35845
11101 -35845 91629 -158129 154085 13484 -358359 -12975 -195796 -122673 194890 -149738
11091 -149738 130837 -102865 -284708 131677 38516 33422 135829 -146890 -88006 436
11081 436 -23089 -28904 -214082 190235 -54929 -6297 288704 166459 289474 404500 772885
11070 772885 223660 253005 346575 483711 291911 -111764 229317 -342677 -96499 360475
11060 360475 82333 -91660 138590 5443 -45788 25450 5546 -36110 51002 -677082
11050 -677082 86679 -129736 -427759 10983 87578 -320217 70145 -120824 156507 -229744
11040 -229744 -139569 -312687 -505417 72600 133579 1447 -363301 -1966 -264096 13504
11030 13504 -504466 -19184 -47413 -16141 -292431 -146693 -44222 -363091 -100491 -156762
11020 -156762 179734 -86004 -84377 67368 -257287 -40655 -7624 -312702 -35591 91522
11010 91522 -22602 -542436 -286532 59880 -92722 -15649 -11011 -383279 151236 -181441
11000 -181441 -225168 -148266 -184800 -22315 325705 -366247 -100839 47566 -23386 -291231
10990 -291231 -35347 -238013 -220031 4014 -335256 -208796 133693 -195429 179015 -297481
10980 -297481 -23511 -590816 71411 -74778 -213210 -242762 -198334 164385 -225238 239447
10970 239447 -58663 -208932 -87194 22106 -144522 -107707 -432959 88188 -61451 -60696
10960 -60696 -135222 29067 88015 46679 156345 -558250 135252 288225 -259978 -135679
10950 -135679 -268062 126498 64255 11173 -450075 27435 6030 -194325 -140826 -116935
10940 -116935 138673 278632 109292 -31762 -206502 -85760 -50932 146206 161638 -102731
10930 -102731 73365 -15657 -585330 -146832 51244 -255863 145421 -274869 -165315 -278077
10920 -278077 101494 -278668 -319118 -124312 104485 55842 -185456 75035 -166498 283172
10910 283172 -163988 -258501 -54839 2585 81672 -122201 -468745 -234258 111671 28066
10900 28066 -264313 -12997 -156148 159378 297313 86913 -45384 -184747 45449 292357
10890 292357 -146056 -81505 -326145 -124559 168475 -70104 119319 -206089 35321 -173796
10880 -173796 -201396 -271757 94258 -148590 -354652 -13073 -230020 -3960 232877 -191774
10870 -191774 253378 -228209 -171663 114750 261601 -45116 -314889 -41265 71883 -141683
10860 -141683 195582 -203519 4083 -41959 -69336 -222930 -506913 264894 -27101 -46882
10850 -46882 -34628 -417092 157562 -448444 -262254 171209 94872 -85612 -311678 -20450
10840 -20450 170412 -198814 150165 -40505 -177457 -221836 -578201 -176773 -178578 -19610
10830 -19610 -66144 -527834 -94401 -133678 178238 -207582 -186945 136786 -61140 -38244
10820 -38244 -160934 -137546 217159 -46062 -90820 -167149 -97177 315270 236193 -161925 56634
10809 56634 -283086 -287087 -59760 -18854 -73355 -83523 -244494 -145286 -81947 168811 43812
10798 43812 -239349 225500 -238488 37302 -4455 74173 -72261 -13862 -43185 -160573
10788 -160573 -481248 -19098 195329 -203964 -25183 -214459 -107870 -258897 -348132 50128
10778 50128 -128374 5164 -352192 -381112 2734 -36412 38584 -255402 194740 -31442
10768 -31442 -342926 -139209 -248924 -49198 126380 -246451 -221587 -83502 -239395 332169
10758 332169 -448803 -97505 -56765 -183451 -166333 -280058 96245 -246329 21745 -259119
10748 -259119 -81751 238159 47185 40751 -118340 -161670 -48520 149634 12113 -166144
10738 -166144 -563323 7806 -232452 -93557 -149476 -235106 378726 134929 -236887 -103464
10728 -103464 -105935 -207962 147068 -137153 -474915 85055 -154869 -209668 52558 82358
10718 82358 -99882 -188771 -37590 -235913 -49881 -87774 -275129 -256909 -352774 17868
10708 17868 -7448 123396 -334318 -246220 -126121 -32927 24739 -64484 -10449 13118 153772
10697 153772 69925 -266883 68021 94920 -111301 311804 -51163 16478 66709 -69508
10687 -69508 -229326 -18017 -234375 -117764 -67573 -498378 -224524 164737 -100276 -474344
10677 -474344 173125 27344 -431541 206113 -37113 -175968 357465 -65673 -121023 -399693
10667 -399693 31253 -100277 -520349 -303436 -40154 -225252 -11309 68434 -23637 -246227
10657 -246227 -130974 109360 -186144 -158202 17685 -58105 -136800 21354 14464 -408924
10647 -408924 -301977 -396520 -404726 8122 -198934 61433 -43585 -326634 89098 39145
10637 39145 -325524 7897 -6169 -377602 -292991 107496 -4010 -194851 45279 80917
10627 80917 -264024 192305 -174094 -197501 -47142 -527520 229874 -38818 -66983 -220890
10617 -220890 -171495 -70572 -212416 112040 -305427 -63856 159203 772 -686 -317951
10607 -317951 -143357 125027 52522 -175691 36556 -257469 -34668 -134740 -173041 -141864
10597 -141864 134395 38736 -445722 -401755 -298287 71824 -211146 -82811 24975 -175702
10587 -175702 70558 -259711 -204621 -25086 -131191 13162 -74033 82487 -40867 355992
10577 355992 -193289 13760 -240771 -75715 97504 137416 -397721 -185646 -86405 -77658
10567 -77658 -193223 -50356 103457 -379095 55931 -83982 -176842 360535 -286440 -199657
10557 -199657 49599 -410252 -13241 -133819 -565780 -17791 137422 -156039 -200030 33494
10547 33494 -83751 -70802 299658 -225657 -88461 -352678 140551 348212 -67518 -181292
10537 -181292 -477204 -67254 -164860 174850 -222776 -63687 -19635 115192 159973 47810
10527 47810 -76904 -180109 284743 48969 -105696 -185063 122163 -369856 112287 -72571
10517 -72571 -11050 -42118 4504 -93884 -211618 -67307 -262126 34680 -277522 -106095
10507 -106095 -346770 60657 -383570 -395521 -139650 -52888 -260292 -281149 -199598 -451572
10497 -451572 176267 -282818 -477933 -187852 80070 222541 -145991 -199272 -69224 -75775
10487 -75775 -50354 -191199 97465 -46654 -17783 -202949 6331 -141290 -357055 106649
10477 106649 54280 -87140 -195349 91814 -109680 -209427 141185 -501596 -64618 -10111
10467 -10111 -293684 -298771 -303191 -36770 297464 232476 -239668 -144360 191938 -34293 397177
10456 397177 -154463 -403347 -118114 -29063 30100 96564 -573621 -162259 -36685 1359
10446 1359 -66672 74829 -312033 -142619 -172054 -191150 -61650 -450786 -289081 -305718 -97088
10435 -97088 -155417 -47352 -263173 -156647 213269 76654 -226567 -27131 -290037 -116331
10425 -116331 -315382 28055 -238105 29478 28133 -148255 30747 -156430 -97255 401008
10415 401008 -296978 105770 11139 -343071 -282861 -274770 -136386 -232873 104485 -273152
10405 -273152 134457 114738 47192 -286937 -103973 261881 -50801 -68836 -136768 -134018 4917
10394 4917 -81878 -202072 -12354 100579 -51573 292371 -316600 -536500 -52880 -108831
10384 -108831 -282753 -200100 -6061 -3318 62438 -337486 34093 -171726 128599 72786
10374 72786 60014 -255869 -401657 -4427 -158418 -274239 -205767 -32982 -48466 354326
10364 354326 -245571 -162050 -436818 -14376 102095 -526748 -23048 -395654 170366 15341
10354 15341 -178469 -285485 114502 -21568 267722 -263271 -260321 -51024 -142090 27619
10344 27619 -267197 29965 -2149 -86153 -137388 -515106 -114336 -90156 42145 195541
10334 195541 -415804 -49796 -11334 -21876 -451594 -155124 -389937 23628 117317 -204601
10324 -204601 -357973 253093 93335 -540281 -275421 -141406 -256324 -108705 -148288 -550888
10314 -550888 -266677 -305731 -270563 -82562 -19948 -230880 438460 66294 -225478 103699
10304 103699 -307379 -65949 -202337 -436601 -31495 34375 135680 -310774 -32535 69898
10294 69898 -229110 -252689 -351076 -196891 -190466 -131726 -242940 33435 28305 -170916 -60994
10283 -60994 -339140 -338772 -312200 -66371 -172543 108280 -106560 -16796 88435 -96126 -207126
10272 -207126 -79761 44733 -494069 -241292 -218040 1167 529 -155778 -189606 56791
10262 56791 -79027 -306181 7856 -419211 79211 -98053 -54826 -84574 -147681 233713
10252 233713 -215561 88872 354331 -92060 -303626 -230206 -158581 -293700 -52567 -262909
10242 -262909 -509408 246998 -259596 497747 -169375 -109326 -106786 -295653 4994 -436120
10232 -436120 -115166 -45836 -68231 -38221 -433184 -90586 209527 132887 118397 -604846
10222 -604846 -126518 -200745 -302577 -215320 -23854 4446 16213 -176427 93503 -223772
10212 -223772 162698 11963 -92243 -130552 -404984 349657 -143708 124776 -238966 111224
10202 111224 7017 113997 -158765 35829 -26175 -286876 -2644 -376352 -65014 -29017
10192 -29017 -82023 -343511 -102988 -231668 -386337 63095 -194254 -8763 -428122 -92737
10182 -92737 -5904 -322153 52261 -71967 68236 131964 110736 -541635 197192 12723
10172 12723 -81406 123619 -559980 -137849 82196 132195 111436 172887 -87363 -227820
10162 -227820 62048 -194771 77174 -202197 359276 90841 -331009 -21025 -31167 164276
10152 164276 381715 -215940 6969 -150544 -189042 194146 213882 -311727 -222171 -169026
10142 -169026 44369 -42872 -180775 28465 -117846 -29543 7894 34596 -386856 202398
10132 202398 -90028 -308130 51825 -233655 360914 296220 43587 221354 -93318 -362808
10122 -362808 -57134 79127 43010 49094 -510175 -55770 286108 32369 21884 -123247
10112 -123247 -138320 -157424 213935 -124798 -207080 22098 -5973 98887 -9551 -65634
10102 -65634 -62548 35683 -352762 -49048 -84010 -453180 -153424 -113248 -65755 -280179 -217002
10091 -217002 85611 -39586 92862 154229 46361 -9879 96065 -150186 -506205 362728
10081 362728 145380 44618 -178266 -325189 -171318 -230714 -45891 -124695 -326896 -228210
10071 -228210 -19701 -412649 -10446 30343 269229 46712 -236227 255421 -104937 44868
10061 44868 -117833 -77143 -31744 92428 -12261 -278677 -109860 -151780 -20754 -192527
10051 -192527 -144876 182255 28599 -227747 170748 -141769 -210419 -186488 -311527 52044
10041 52044 -371160 153260 -330582 30725 44373 -54177 -279046 -31199 -128711 68975
10031 68975 146657 -249180 116314 -254731 -475329 78261 -55495 79399 133469 -293210
10021 -293210 -170892 -67292 -88874 132870 -65284 -20036 -20261 -305518 -12173 125782
10011 125782 20490 207497 -59695 -258904 -295891 -196740 -242927 44631 -121544 -178155
10001 -178155 4142 49260 225618 208810 -245281 84443 -275909 -244324 -4967 118993
9991 118993 -199478 -112191 -368673 -80902 48561 -204540 -29590 -183837 142606 -28043
9981 -28043 49116 -135995 75744 57746 89516 95842 -172101 -430242 199953 65355 247351
9970 247351 -194955 -590150 90276 196623 -64425 -180604 -183056 -192667 -46604 -98219 -406679
9959 -406679 332883 216542 -83058 -50644 76258 225147 67362 -110053 108698 -109728
9949 -109728 -28719 -79078 -77358 12912 -115605 -308055 -279052 41130 329982 -31667 -139084
9938 -139084 -373546 -43979 241070 -72632 26483 -152744 151015 139507 98871 -388114
9928 -388114 -226919 6476 128412 131059 -12463 37246 -69448 -52003 108573 157940 -335753
9917 -335753 50696 -298336 174573 53194 -223224 97889 287993 -90700 -297369 94139
9907 94139 -102970 -61475 -255460 -210200 -8346 -142559 160872 -429423 225725 162311
9897 162311 184627 190472 -101777 248363 -273059 -225123 -50724 108044 209382 -239694
9887 -239694 127962 -225731 343338 227752 188969 -59783 -178578 340370 -123038 121715
9877 121715 -135246 -33406 -204501 -2848 47584 -230162 41606 4093 -189173 -294956
9867 -294956 -96343 -83118 -205918 228854 97084 350609 -291267 -141424 -165301 -37815
9857 -37815 129157 -103593 -166228 -253084 81157 22954 154966 -8776 80031 156941 -2006
9846 -2006 -30948 -171920 114951 98692 -170069 -301925 -270936 159530 59875 117081 -103240
9835 -103240 32652 -40349 -188282 -13031 114205 -129481 -117983 -62874 104706 115380
9825 115380 86918 -84052 14136 -8524 22676 -276201 16714 91725 -8930 -71399 -176501
9814 -176501 -33811 -107131 146391 146903 -162327 3656 -352768 568674 -12014 -22881 -31895
9803 -31895 123458 185159 -307613 17404 46432 4844 326881 -159545 -105979 341100 -32951
9792 -32951 49825 130270 -182300 -10137 -13395 5399 -73353 125755 35449 455787 -196226
9781 -196226 2856 137031 18158 310638 -125529 -202843 41438 413801 56464 -91634
9771 -91634 -145739 93918 399343 -156840 268785 -280490 -189113 187713 -141626 214560
9761 214560 54211 187555 24832 415465 113710 49253 258902 30779 375617 86802
9751 86802 5354 139983 273165 186685 186250 229154 548762 64639 -32553 89140 33899
9740 33899 114418 422654 -16265 404967 45284 89408 184556 379913 89326 158217 89064
9729 89064 22533 435406 236624 229085 -53993 265498 -60899 -18350 125765 -215865 281557
9718 281557 -15063 25261 -20389 280371 284081 115096 303807 131102 409266 244620
9708 244620 209956 -86321 34063 392984 357378 -3082 321127 219189 465570 182916
9698 182916 -213 259230 42514 210630 322183 39553 -24180 84741 -36587 104988
9688 104988 69613 312997 217622 274459 212603 301479 28311 305802 62428 -520440 -75468
9677 -75468 376778 -156363 128552 207899 198232 395062 252906 159722 522995 340465 305044
9666 305044 -12162 -186639 326302 341751 -22278 23111 284457 76720 182705 302719
9656 302719 364242 -129185 -54717 132569 61846 63183 -80660 -85231 -53474 125372 92960
9645 92960 -81443 456130 273782 302037 -130351 25020 315663 47159 -96462 -260864
9635 -260864 343135 -277591 -104807 63911 -268312 38622 284751 231651 116574 78221
9625 78221 293426 171309 413585 258174 169304 202332 320084 -4613 96725 151588
9615 151588 22402 222278 114622 283379 317903 214359 -11336 388214 -58243 -323329
9605 -323329 371976 90695 127788 -63817 292781 526838 789436 265174 10077 529358
9595 529358 186167 677218 -6884 -125636 125319 366653 -78866 54159 282869 102322
9585 102322 129340 16189 49798 47463 266811 391120 198466 440503 527959 140465 202522
9574 202522 144941 55509 434350 477894 -63073 49295 14970 -91170 154176 -169338
9564 -169338 96879 187460 -88568 385498 121080 502255 136784 359102 164378 393173
9554 393173 271313 217642 387111 370198 73663 89097 330053 157994 485140 56356
9544 56356 368891 104045 592015 -14584 350342 585454 261876 43939 35703 5730
9534 5730 210050 157285 125382 -75919 147731 72069 343490 439563 170870 210756 -5542
9523 -5542 112103 181255 -33434 56829 -152172 75223 136070 214217 215241 4574 17449
9512 17449 73824 19458 -207567 163828 40034 330642 -61997 361924 50522 264337
9502 264337 160883 350901 285350 245124 582230 414361 121339 106492 390998 100261
9492 100261 227350 248534 -5439 91944 366154 97623 220846 354164 192469 440094
9482 440094 49916 368728 180880 -6797 78438 18331 -49530 195559 111877 106307 325999
9471 325999 180376 509641 226578 268358 231530 458290 -173922 128847 -241299 227127
9461 227127 293654 179432 91429 304949 463222 244684 98451 338054 407596 388813
9451 388813 264806 -8224 76266 190484 -34709 431170 138066 116254 303086 272824
9441 272824 271010 174813 411421 163243 176134 185406 268773 306714 296079 554111 219929
9430 219929 654578 487834 179520 481568 423299 249590 318440 219057 -60377 256316
9420 256316 54800 110830 617994 -114198 371647 -89859 106045 234606 297311 113738
9410 113738 300576 26772 130573 318444 -70894 253594 -198788 -15245 236568 12519
9400 12519 248298 119655 277377 84565 415004 53370 322541 164895 31203 55003
9390 55003 -71119 177781 277953 36465 240223 104281 205604 122264 330636 118836
9380 118836 27341 163274 224024 21590 37739 440747 472973 112852 230193 374316
9370 374316 403628 294544 190831 102231 120139 -80126 98786 11107 377206 202402
9360 202402 33917 613084 10283 717352 188873 185704 166681 378181 290268 -205158
9350 -205158 433562 -201821 61456 423668 68134 -30067 -22024 316277 348777 320326 300847
9339 300847 139395 279013 282405 462838 213099 263574 204916 574085 219242 116786
9329 116786 589364 94573 107170 112902 387329 364767 602185 572047 142845 371092 -92371
9318 -92371 190551 219912 201761 189754 138841 416036 348391 265711 455802 191430 410563
9307 410563 84014 281604 324559 79221 -22967 477073 475304 12192 364851 -92219
9297 -92219 73560 248742 347068 371164 345055 114652 564386 429559 246473 420440
9287 420440 306330 -161596 308545 264782 61545 407541 174104 551284 -42266 333792
9277 333792 228744 41641 32204 410345 316480 33416 429197 286017 468264 371454
9267 371454 333584 32349 225576 350720 262885 409021 93432 -154271 234271 302851
9257 302851 186109 -81677 118740 484756 473017 303281 -193190 588381 223299 231062
9247 231062 226086 257089 -38472 382172 90398 84484 167403 195645 167283 50290 195560
9236 195560 36134 251317 35006 254211 72963 351892 285548 252651 52089 83191
9226 83191 390007 451507 125748 86402 5029 500899 392069 32902 161327 57600
9216 57600 230318 456663 134410 180258 69656 525496 305701 383015 176095 586956
9206 586956 109562 -8953 519888 -23783 581299 12092 440328 483604 547794 81907
9196 81907 436472 346825 209049 53058 136858 594173 511316 327658 202437 129140 342603
9185 342603 502099 465063 273849 396305 316026 289563 416537 224840 440773 383073
9175 383073 91244 179444 396398 536072 470492 443638 410924 235061 614976 386344
9165 386344 486334 337162 355850 190381 435527 176741 798603 604357 571220 129435
9155 129435 187513 368910 323027 663248 -31589 376732 307840 379156 326845 399768 719375
9144 719375 623315 392038 436673 541450 707006 358427 619034 742479 662259 583895
9134 583895 472168 590017 560924 834822 396310 610397 590316 787306 762082 956807
9124 956807 544928 498083 1088758 1158001 893878 1238940 1097470 775194 1205236 852678
9114 852678 942192 1318527 1073828 1259266 1326655 1561469 1457544 2055494 1694484 1896507
9104 1896507 2207028 2224941 2406591 2246497 3049076 2938822 3276904 3925683 3703828 4517443
9094 4517443 4657753 5189719 6165372 7017918 8782954 13378704 25621803 48208147 68740962
9085 68740962 68103433 43804590 27077465 18326249 12970092 9656475 7436953 5750518
9077 5750518 4403503 3330834 3441754 3099086 2659659 2447412 1993763 2212178 1664407
9068 1664407 1803340 1432923 1772895 1283855 1407179 1554280 1421636 1547344 1582521 1486095
9058 1486095 1096370 1249900 1621335 1182556 887992 1442566 860163 1270047 1074626 765236
9048 765236 1369483 888539 1020020 931007 833589 778427 1056129 999383 607854 630260 822349
9037 822349 1006204 938113 749390 741574 519134 985136 696139 633597 626369 658500 715003
9026 715003 769289 611215 468077 981177 269668 735486 510724 259223 588616 295863
9016 295863 227951 433000 426046 270503 32980 617520 -76781 632656 496543 28710
9006 28710 579245 271742 542329 439420 214098 233094 36281 506353 3896 192757
8996 192757 329341 470724 543054 396254 541456 351658 208991 61772 -162224 245880
8986 245880 430121 54603 315966 190185 689599 287881 465755 243314 273110 694524
8976 694524 266329 351422 206514 93399 324820 16300 86821 -676 312422 419993
8966 419993 135909 276999 238651 80683 423073 66059 93479 -174492 192503 -44969
8956 -44969 81808 -71411 -18152 294368 13115 316788 -71538 82333 317690 -58057
8946 -58057 284022 237248 121327 34613 -114538 467509 -7860 234956 15645 5516
8936 5516 -187772 328006 43040 -67810 292816 -131066 -172511 198845 -16192 248836
8926 248836 105981 -58727 119441 -155214 259246 55717 479159 -84655 188424 299726
8916 299726 149571 170087 -298693 184768 -31831 -1682 46025 274193 -80081 -276475
8906 -276475 211176 131136 -43963 -162748 -13090 146799 130085 -61450 -239734 83948
8896 83948 230035 361915 -182245 79960 10051 -97220 -42435 136560 213706 -225422
8886 -225422 184255 100683 -155273 179769 -121747 312031 95089 261392 -244005 272565
8876 272565 53525 -34413 407085 3906 129055 147388 274622 321896 -12909 327224
8866 327224 -172413 192463 -60817 101404 79566 -305657 92482 -380117 451714 325736
8856 325736 300951 28010 -62440 251778 -225295 284362 189773 131451 190627 -264107 41398
8845 41398 -308585 -244536 -205890 -132004 -175068 -219959 317351 -13500 152960 -10326 398301
8834 398301 -36932 144332 80423 -148714 114808 220964 -26926 -119787 286438 9576
8824 9576 250994 -242392 171820 -282709 -45936 -427533 327378 250062 32411 220144
8814 220144 -208526 12695 -24622 346544 19839 225802 -12274 -196032 102822 130291
8804 130291 -43318 -31984 19495 196800 259313 -81243 -28230 394445 47440 -45555 -35228
8793 -35228 127665 -21451 317712 447387 -136942 134603 48001 -171691 199696 -258906
8783 -258906 -93685 -48387 -8188 -83462 203390 13801 144258 536352 -218130 -88837
8773 -88837 103442 -174028 455397 -121915 -153548 -42237 6089 -116224 152515 -41657
8763 -41657 -89613 -302018 -112956 -153073 180505 -284477 49788 -43119 -301436 -73577
8753 -73577 56494 417007 -269884 146758 -5889 144795 87451 21025 -58582 213076
8743 213076 -261028 89681 -9021 182010 -192677 86698 63092 -75033 390831 -99798
8733 -99798 104676 -6830 204401 4228 -37072 65204 -277366 31504 213250 -200318
8723 -200318 -161318 -48107 274700 -151803 188067 -288920 121315 -134869 24308 27425
8713 27425 -170922 -467098 -356993 89929 -291383 89347 -344887 -212800 158961 -39752
8703 -39752 -51753 -322502 165819 135438 216282 -117986 -202829 35913 -73400 -17357 51591
8692 51591 65349 -463706 1363 -267510 -96289 155555 -92158 36566 -128097 191748
8682 191748 36130 -67745 178227 -252681 123724 -18321 110656 200690 241694 143646
8672 143646 -67519 94843 -293093 -39188 323803 24811 553382 -89590 -143868 -51028
8662 -51028 -220395 245306 57107 -1855 -353859 121919 -451043 59215 279636 307867
8652 307867 -85620 -18870 -118766 -78745 187199 131624 -285983 -137953 -269084 -50602
8642 -50602 275814 149812 113488 -253106 -162480 -125344 218042 -114645 -21147 94793 -82571
8631 -82571 1161 -158866 43828 -1178 18289 263357 -37297 -32924 -250665 383782 25185
8620 25185 -24656 77041 -300898 55843 39314 127513 -40688 -228945 50960 20132 -13205
8609 -13205 -15274 -64711 100465 -299705 67923 -95796 38816 -150798 345672 -176258
8599 -176258 -104823 -190814 -73979 59065 -213188 -126616 -259941 -46692 -82872 70306
8589 70306 -137926 -132280 -369238 -269598 25027 32419 -103356 149751 -299907 217780 103161
8578 103161 -57462 42090 47226 368500 -31776 -416210 69495 146445 -163182 -65806 -225637
8567 -225637 -258527 3520 -117 -91890 -296051 216301 152042 150882 -259815 229788 217979
8556 217979 -225371 -187251 67980 -88574 -256314 21221 -63642 -24987 -67751 88231
8546 88231 -35131 272073 -310682 134602 -211394 -132775 39791 -206295 -282453 260352
8536 260352 -220213 -37342 -298159 145759 -19161 -127695 277708 269988 313019 -204637
8526 -204637 -203003 166555 5076 -252317 -63746 67739 -264065 -189445 8977 -534236
8516 -534236 -193375 -83538 -193939 -140694 10380 -154563 192801 -209545 -23649 -55407
8506 -55407 -274047 -132662 -166212 -170626 -309320 368039 142793 -279916 -205455 -305688 -13735
8495 -13735 -29467 16195 -204870 -141877 234429 -185269 141678 -70616 -149558 327243 -70261
8484 -70261 70750 -386865 118141 -336729 70178 -195309 -210312 -76177 -222094 -143848
8474 -143848 -166376 55356 -337712 -103078 -380265 123093 -244426 150798 110961 -53048
8464 -53048 -94744 -350162 -49327 199952 207956 -155955 -96311 -389977 -442167 72621 -312960
8453 -312960 -72466 93794 -143636 7846 227143 -146696 -45062 -18365 -114950 -476095
8443 -476095 234179 -221238 -89472 182588 -291087 61498 164367 47972 329951 68840
8433 68840 85707 -246723 152890 -51242 -298570 -18075 -253793 125143 26129 -41626
8423 -41626 -236516 34192 180509 -59655 -44810 -231215 -516084 163027 162886 -196349 -84197
8412 -84197 285416 -271512 -28057 -246153 -614478 293540 -138245 48547 19901 119304
8402 119304 -118289 249940 229026 -290282 329305 -24205 -26618 11631 -65427 -7611 -336203
8391 -336203 169000 -295311 -109751 -110065 -266358 9807 130167 29496 -642842 -114017
8381 -114017 -396398 311461 -17945 -319464 152373 58842 -60140 11122 222765 -111023
8371 -111023 -178209 -29041 -257568 -77573 -278907 -161558 252102 -270275 -336436 -11277
8361 -11277 -59934 -370253 -325901 -108426 -257548 -86513 -122029 57997 -95486 22429
8351 22429 -418993 -109215 -518740 101751 -112172 -380274 -78660 277934 114435 -648628
8341 -648628 -84953 -23882 187604 -440144 -205634 -215390 -296984 -148392 156262 191930 24790
8330 24790 95890 -308857 -143691 -213859 68437 -75278 -127122 -261889 -137497 -258341
8320 -258341 -209636 86901 -145963 208569 -180683 -44165 -206989 -288799 114461 -237469
8310 -237469 -444174 -92240 -543945 -133156 -4161 -86494 -243270 -541553 -30159 128165
8300 128165 -156659 -281986 -165575 -102909 -104068 73697 -377129 -229128 -225944 -229233 -168115
8289 -168115 -351236 -72689 -61242 49384 128547 78975 -125283 -352046 -335148 46905
8279 46905 -80012 -416310 130941 -159046 -331565 -97581 -201 -269522 -268280 -168840 149009
8268 149009 -116546 -200998 -205831 164 2182 -149918 40780 -167189 79636 156803 -71392
8257 -71392 -219820 -332858 -28245 -178570 -315540 -158467 -388856 204172 -165604 72001
8247 72001 -140282 -1243 -83174 65236 -124243 -446091 24224 -309578 -177807 -187892
8237 -187892 -172500 -178178 35026 -432559 300708 104479 77167 33826 -88214 -133047 -458455
8226 -458455 282016 -207338 -72910 -396319 -237923 -190582 280206 -265770 -96407 -319295
8216 -319295 -175888 18842 -135678 82782 -353711 362713 -608947 -68594 -419203 -103565
8206 -103565 -373568 89688 110297 -113378 -119322 96352 -293287 24126 -419222 -2276
8196 -2276 -173680 -206692 176099 90123 -2727417 39314 -288909 -371245 -449126 92670
8186 92670 -375337 -292328 -43565 -149662 -126035 -271184 149356 4006 -111467 -218632
8176 -218632 -192890 -474450 17524 102281 119079 -235718 -126938 -63630 -233653 103011
8166 103011 -184987 103904 -370436 -67880 -28456 -133309 -85474 212677 161935 -260388
8156 -260388 -55544 49785 221630 85271 73712 -90919 -105467 -161500 -220374 -204619 -481157
8145 -481157 -377388 18355 79317 -378093 75152 -156584 -285375 -152648 -324849 -209661
8135 -209661 90679 -136085 67530 -142318 -63767 -240749 5570 -289266 103042 -206819
8125 -206819 -501509 -255409 -11749 105495 -183039 -97420 -122576 -129262 -327728 78233
8115 78233 -513628 -59750 -322255 30138 -57315 -470881 91220 -437858 4627 -358999
8105 -358999 -99220 -187079 128588 -92903 -67083 -260698 -222700 -214641 -248115 -412181 -54158
8094 -54158 42445 -207852 -199540 -299475 -166773 -508304 -81820 -121641 -220488 133495 248949
8083 248949 -38013 -339753 -56883 -448394 257520 -282273 -115928 -250874 -172893 -324033
8073 -324033 -355424 79032 -241590 189383 -384447 -532520 -229649 -187894 -458768 21335
8063 21335 -344300 -244146 99722 -253747 -121577 10515 334466 14811 -52452 -391085
8053 -391085 -108076 71572 -217971 -352657 -168623 -44174 -148684 114832 30809 130457
8043 130457 138422 127215 -269409 -386700 -377306 -223082 76701 -478291 -419239 63837 -111213
8032 -111213 21731 156828 -56759 -426514 -363428 -237020 -547125 -183274 -394250 -376005
8022 -376005 57190 -228101 -79902 -118355 30741 -249412 -123103 -119693 -250480 3954
8012 3954 -55668 -21417 -145877 154437 -214890 2678 67333 -174331 -466853 -132196 -177069
8001 -177069 -224773 -277802 -223235 -5699 -85586 -325890 -350374 353205 -158311 -121341 -427405
7990 -427405 -10188 -331101 -173031 -87488 -378508 92238 -93875 -115415 -151677 -102112
7980 -102112 -160542 -42653 -137683 -153014 -322523 -51193 -205233 -87703 -68344 -217167
7970 -217167 -116584 -153256 -68398 -11845 279943 -374504 -525429 -159843 -280390 90101
7960 90101 -126545 -426218 -128953 -91891 -94262 -217616 -97784 -87316 -57652 -8025 -603382
7949 -603382 293253 -197712 -173520 -36260 -403464 -89609 -471901 141173 -244723 -183469
7939 -183469 -86731 -141378 19544 -172526 123099 -239161 -359354 -407012 -232893 -346656
7929 -346656 37243 9121 122631 -270044 166347 -102491 -124743 -501085 58086 -114684
7919 -114684 -76359 -206679 9985 -217978 -498438 -54165 -86268 -525631 -209724 193829
7909 193829 -238222 109776 -141226 -231501 183997 -235064 -348109 -2539 -372631 -160366
7899 -160366 -311117 -526171 -108464 -27116 -169984 -215463 -117344 -80258 55127 -4334 -207128
7888 -207128 -145819 -214844 135746 -205240 -302040 -58800 -192352 25835 79496 -307711
7878 -307711 33961 -302458 -277895 -15050 -337741 -74149 -5317 -314559 212222 -49828
7868 -49828 -497702 -252946 -174306 -318636 54996 -198462 -336826 -201082 147867 130881
7858 130881 163221 126852 -463311 -108883 -771993 -261116 -401118 -355794 -215769 -17888
7848 -17888 -111654 -19186 -112156 -61868 -490602 -225463 -204074 -298320 -64293 -344406 248677
7837 248677 -116970 -86031 -97370 78937 -147522 -513390 253157 -577449 -65584 -495619
7827 -495619 -278336 -318841 -88377 -4676 -273053 -352099 -273416 -16719 -394509 -530702
7817 -530702 -235402 -103244 -64224 117429 -461472 95595 -123508 24786 -439831 -291382
7807 -291382 -38031 -201700 -560116 -314873 -272170 -51457 39510 -251658 78727 -253342
7797 -253342 -137047 4355 -378407 -255326 -215438 220752 -316231 43453 -50937 93699
7787 93699 -91631 -189155 117893 -262156 -77681 -540755 -93311 -38808 -235339 -356196
7777 -356196 -175649 -120216 37325 55827 178529 -124039 76796 -143351 -218892 -206722
7767 -206722 19945 8274 -317718 -285271 -159411 -53285 -310670 -92138 -378422 -727214
7757 -727214 -301027 -12597 -140324 -228336 -335883 -207823 -591361 -166203 -152597 -399623
7747 -399623 -139095 -342024 -204670 -372959 63605 -150236 42072 13306 -286074 19763
7737 19763 92177 -253255 -82329 -425577 -339461 80386 -170734 -51070 -278191 -77089
7727 -77089 -183253 -67158 -124524 -236450 -208666 -397454 146536 12992 -22888 15222 88418
7716 88418 -196741 64614 -160253 -428929 -372845 -201018 -131503 -277822 -254135 5543
7706 5543 259112 -395981 -226218 -228112 -57152 -83799 -431878 -282211 -239683 -316389 -108778
7695 -108778 -350069 -175094 -248175 -118557 -254724 92071 208258 172896 -345010 -355243
7685 -355243 -51071 -147871 24639 79914 -158592 -31637 -32825 -110963 -96246 -156370 -85987
7674 -85987 -8576 -368982 107044 -178602 -21900 -189381 -148639 -35704 -201102 -272078
7664 -272078 -379637 -114823 -191236 -272946 -220380 -246835 -68182 -53289 129566 24539 -10248
7653 -10248 -140730 -448871 -205537 -135492 -247709 -24587 -187215 -210906 111080 -66859
7643 -66859 -475147 -49565 -272441 -294852 25452 -339727 -74140 -320451 -42109 -293816
7633 -293816 -294879 220693 -145621 25000 -151794 -62638 85901 -153692 -198355 -332185
7623 -332185 -104882 -150696 -64433 20529 -375672 124655 40525 82815 236895 -277414 2067
7612 2067 -59894 -126595 277493 34045 64327 257721 -123487 62282 -100804 127794 41799
7601 41799 -121400 -304561 -284904 105286 147660 126310 -155142 -278819 -6093 69162 275072
7590 275072 79045 49945 -20048 8133 -147774 -103297 -440342 -220878 -3711 -70838 181128
7579 181128 -154838 -13529 149190 24292 -113337 294347 128575 334643 35936 332861
7569 332861 330455 -142427 42744 -196804 100591 -255319 508089 42665 145143 -123149
7559 -123149 89190 325957 -604284 41886 264260 133494 -271997 101260 -24033 120280
7549 120280 -35528 15151 -180037 -60924 164443 -335869 58551 -141634 23338 -96360
7539 -96360 -48008 53175 187549 -220867 -93584 260842 40390 -100091 140501 -510399
7529 -510399 71733 210486 -295834 -118700 -111352 210655 190362 -407311 185635 -100808
7519 -100808 176446 -264862 -275561 -295001 -32912 318399 -150446 -429143 -162369 -205232
7509 -205232 86475 -341326 -133103 -9106 160723 -155738 92414 117159 -218273 90843
7499 90843 127843 50198 70489 301528 -51470 -103975 30117 54523 145487 -64917 109339
7488 109339 -183517 35687 103731 100402 65887 -155623 262979 105127 132056 -19372 -188130
7477 -188130 160901 -201608 173291 -3147 -279850 36022 394233 -141756 279304 -205537
7467 -205537 -7443 168900 119052 38806 -350933 -99903 -69961 -54802 -71105 118003 714
7456 714 291895 251314 235840 65197 206323 -95345 -14515 -327010 -50782 45001 -15546
7445 -15546 24459 -31467 221387 367874 -59798 -132499 -390372 283735 -73595 -126334 247820
7434 247820 -78727 493882 220244 190748 295178 -139332 -5479 -226797 77079 394
7424 394 212131 170282 -58544 346007 326543 391141 193929 420712 365143 101582 248634
7413 248634 322110 526216 797740 364366 666169 346291 608930 393800 978457 899124
7403 899124 1062677 1193306 794380 1698234 1994560 2475439 3153929 3136129 3776599 4524452
7393 4524452 4482448 4547548 4096395 4205576 3104542 2635680 2349371 2083271 1573476 1135102
7383 1135102 1115857 733019 290184 642891 503952 570512 517083 297922 482845 112695
7373 112695 402373 443473 305543 113005 284015 125795 -271666 254611 365410 433012
7363 433012 188971 115901 -63874 184659 307306 185915 48620 -96994 117995 -88954
7353 -88954 -22449 -32299 266889 -136977 87977 23788 191148 359506 108559 46730 44001
7342 44001 -245566 -10580 115389 -138042 274340 343667 -135004 235955 -37984 -80479
7332 -80479 221475 102603 -303662 -66164 137870 -74560 166383 98353 185595 10458
7322 10458 -62872 -141926 283350 96325 237271 107306 125311 62029 60779 352044 61161
7311 61161 311721 136650 73606 -288722 140712 36185 -45760 170041 140303 95988 -106339
7300 -106339 -150453 177995 193900 406619 497627 -113066 169254 425157 438709 123812
7290 123812 189102 -227691 -81877 -119490 373888 -17405 403805 123849 83290 281561
7280 281561 97864 491538 261085 552950 118703 255811 96125 457546 781973 521781
7270 521781 849084 1536393 1457276 1469468 1043501 807758 720080 614769 831208 365114
7260 365114 670464 859204 901239 1102035 1286773 1684080 1805629 2075804 1441277 1743123
7250 1743123 2147835 1745260 1864140 1272276 1219201 934342 817148 704435 756202 797581
7240 797581 629776 1251334 765737 969676 1304914 1128848 1867579 1134856 1923145 1938701
7230 1938701 1879520 1510520 1019100 970395 852598 962033 922054 655392 354157 456504
7220 456504 684792 519745 652280 787399 604553 813568 938898 953278 710252 848492
7210 848492 990507 497422 858696 614881 711557 383729 576292 787917 356754 768431
7200 768431 613429 742506 749387 520276 852582 468353 736653 1070835 559688 736094
7190 736094 915981 718730 721577 773152 1048654 1576635 1119805 877354 839423 802479 999365
7179 999365 763594 594302 789489 811288 1081817 523051 1137353 799282 892131 940601
7169 940601 1043699 958756 1216940 1188549 803593 891859 1075263 1378318 1145319 1160584
7159 1160584 607590 1259096 1515630 1203906 1351201 1049609 1505794 1200528 1389207 1353245
7149 1353245 1198456 1707567 1683032 1530074 1757243 1660622 1921945 1997467 1973193 1867240
7139 1867240 1662437 2003263 1587313 1547384 1849456 1783757 2124701 1963015 1749203 1964221
7129 1964221 1890371 1836479 2150560 2144833 2156484 2217377 1946502 1969259 2518216 2245320 2148850
7118 2148850 2064281 2392952 2401004 2363056 2184249 2616672 2601824 2254615 2829983 2082788
7108 2082788 2568673 2611478 2743400 2378437 2483469 2644846 2917574 3221352 3144467 3585479
7098 3585479 3299857 3439224 3433880 3544712 3919415 4289316 4975727 5121894 4699582 4946339
7088 4946339 5441672 5265339 5395133 5365431 4786555 5192276 4934433 5037589 4945695 4989145
7078 4989145 4886501 5125950 4914724 4784944 5152276 5170488 5447087 5696590 5736615 5576606
7068 5576606 5814454 6194314 5776132 6076242 5935532 6107980 6356775 6230530 6478300 6462804
7058 6462804 6746560 6656417 6936558 6856590 7287061 7308636 7474402 7773643 7945667 8000747
7048 8000747 7803309 8440640 8480929 9082386 9047909 9320602 9796691 9606278 10242060 10098189
7038 10098189 10442506 11077290 11141616 11590663 11378365 11815458 12497937 12550373 13046332 12945997
7028 12945997 13881857 13772705 14556631 15519946 16504815 18415899 20907514 25383183 32233907
7019 32233907 40704521 46219779 45593823 39130299 33074568 28980640 25648596 24178126
7011 24178126 23445285 22512794 22683811 23105033 23758541 24664963 26531846 29072258 32879225
7002 32879225 40914592 53006846 65611403 70458874 64614829 54419402 46694705 42046278
6994 42046278 39618289 39160641 39092256 39220219 39378754 39247090 39863837 40279853 40776857
6985 40776857 41810622 43715278 46210135 49402025 52977024 57380114 63331464 71963169
6977 71963169 83351544 103149045 136046776 183363725 232840282 260758739 254428797
6970 254428797 222254085 184733221 154548370 134467831 121648379 115916628 114296191
6963 114296191 118487184 128427659 147830581 182537587 233967264 293181087 342089450
6956 342089450 374775286 399449358 414828609 397815774 340848576 271325078 216124134
6949 216124134 177417729 152974146 138891590 134273484 138065773 145717208 151271477 153063062
6941 153063062 157301952 165675300 174393141 185096316 207381936 251014353 300411718
6934 300411718 322617772 298501695 245000511 194120005 156143606 130894943 113900352
6927 113900352 105346463 104512474 108934053 112878016 109482024 98559435 87333201 79584475
6919 79584475 75674365 77427332 83911819 93154510 98622020 96463737 90169085 85621200
6911 85621200 80540890 72720570 63238310 55034635 48812777 43437512 40122221 37208236
6903 37208236 35185779 33579808 32393729 30784550 30085192 29276238 29212060 29253710 29955003
6894 29955003 31553723 33172314 36095565 42830903 54816222 67071479 71922287 65941570
6886 65941570 53685373 43122745 35830540 30490468 26891768 24096992 21874000 20616026
6878 20616026 19278347 18379727 17475245 16799069 16347808 16263836 16802209 17596544 18309827
6869 18309827 17849827 16640401 15376326 14312069 13402812 12796072 12223404 12121639 11639355
6860 11639355 11057927 10935807 10969134 10776831 10363718 10377438 10111231 9916695 10064059 9516238
6850 9516238 9484748 9739053 10020201 10205184 10384629 10957898 10962421 11414941 11583251 11195331
6840 11195331 10823301 10114862 10002358 9365496 9064492 8649994 7994962 7871960 7694400
6831 7694400 7866192 7618868 7085399 7243566 6972737 6789677 6781406 6632467 6631749 6645224 6253924
6820 6253924 6595205 6081639 6394897 6157961 6104140 6480168 6061079 6324653 6054018 6531410
6810 6531410 6447733 6452851 6232829 6382069 6485762 6729587 6405585 6592862 6761111 6939916
6800 6939916 7173900 7346993 7361088 7594558 8081565 8051213 8154265 8535093 8741090 9185651
6790 9185651 9859261 10565788 11325717 12602713 14068060 16265865 19049227 21302581 24308520
6781 24308520 25351329 25292988 24099070 21994628 20031125 19231011 18799094 17650165 18182058
6772 18182058 18183236 18893926 20371421 21874742 24236111 26960587 31045199 35614678 40072458
6763 40072458 44064810 47517950 50353036 52313467 52212364 50687949 47320422 43165563
6755 43165563 38800766 35104944 31612112 29794403 28765399 28078650 28617773 29727782
6747 29727782 32044852 34750482 39137254 43416378 48243657 53813688 59201869 62046167
6739 62046167 62217568 59143280 54701690 50278203 45330340 40470631 35970394 32120690
6731 32120690 28941107 26965381 25448657 24887896 25038500 25931773 26767721 28352782 29864124
6722 29864124 31682643 33250736 34804912 36048959 36614463 36152824 34402139 31325156
6714 31325156 27585118 24375320 21426340 18632690 16740596 15512211 14256447 13044932
6706 13044932 12430820 12231750 11715472 12099387 12067917 13501568 13809708 14528857 14372050
6697 14372050 13930980 12835114 12137372 11049523 10064082 9200727 8119909 7941321 7561057
6688 7561057 7397289 6951815 6631682 6381723 6441123 6072702 5714299 5712654 5989208 5625556
6678 5625556 5561791 5499862 5521896 5855036 5429326 6019582 6067565 6334036 6782377 6833113
6668 6833113 6724380 6383077 6500212 5973418 5930488 6147258 6270864 6057071 6186782 5915053
6658 5915053 5859663 6257534 6469470 7242810 7664316 7646934 7249007 6827477 6431861 6092429
6648 6092429 5953554 5784349 5880301 5832879 5659503 5794960 6064421 5726631 6134295 6919105
6638 6919105 6354905 7122969 7584303 8819587 9565393 9390896 8465137 8221900 7852878
6629 7852878 7230808 7494323 6759353 6683214 6677542 6500758 6093821 6318214 6201709 6667234
6619 6667234 6746726 6696986 6604941 7179951 7796349 7830634 7973260 8172650 8963036 8998352
6609 8998352 10347870 11552786 14865502 17753944 18471682 16526630 13937171 12119419
6601 12119419 11238756 10771237 10267669 10414877 10688729 11347252 12384008 13446393 13797674
6592 13797674 14306794 14130318 13753446 13181179 13156527 12840048 12797851 12974757 13285683 14265609
6582 14265609 14873577 16200053 18507920 23110984 26702069 29275338 28690682 26873084
6574 26873084 25908557 25742356 25642731 25684836 25726599 24568993 23620887 22486854 21574382 21312281
6564 21312281 20833351 20996271 21313727 21792428 22935105 24454314 26437719 27374610 28811287
6555 28811287 29146070 29706572 29831582 30191494 30484377 30762844 30617192 29584109 27486531
6546 27486531 25264595 22907219 20701169 19900491 18754492 18457057 17696962 18898353 19785728
6537 19785728 20651729 21434676 22060217 22390749 22303569 21683335 20483836 19316363 18132681
6528 18132681 17316205 16487356 15267764 13868243 12633666 11717778 10682618 9943702 9665967
6519 9665967 9319475 9327679 9463394 9213767 9947076 10605944 11010392 11203649 10445308 10142076
6509 10142076 9242132 8119682 7661753 6935005 6685445 6020637 6192224 5902258 5525362
6500 5525362 5718053 5360286 5290000 5122583 4695166 4843508 4710139 4681405 4320732 4563033
6490 4563033 4510432 4466707 4751134 4346979 4315962 4054021 4180143 4197700 3756316 3715609
6480 3715609 3808206 3932406 4519546 4036000 3820791 4293814 3936946 4065801 4343358 3831718
6470 3831718 4409844 4036445 4343899 4247453 4253806 4101819 4499036 4304999 4131333 4060205
6460 4060205 3737597 4448624 4001576 3806806 3585437 4492815 4273102 4570777 4673739 4249113
6450 4249113 4885137 4414769 4592057 4191676 3948887 4130186 3864621 4070961 4031527 4329483
6440 4329483 3812798 3929676 4113811 4155745 4161463 3834399 3847461 3997240 3675450 3681182 3785568
6429 3785568 3619840 3596457 3948307 3246301 3454416 3748688 3332947 3407998 3466484 3690377
6419 3690377 3712254 3739565 3982790 3625384 3444424 3740840 3416920 3692904 3722962 3644674
6409 3644674 4065917 4003472 4188875 4424107 4392703 4502767 4158724 4024937 4204173 4103762
6399 4103762 3854033 4492858 4318297 4675629 4686014 4660961 4724084 5153671 4875006 5193444
6389 5193444 5171384 4921066 5248624 5390104 5647394 6051376 6087770 6431225 6947828 7254272
6379 7254272 7758370 8684309 10230836 12267607 14594057 16633588 17506233 16901046 15151229
6370 15151229 13311340 12220372 10847230 10554333 10031185 9735401 10335444 10651864 12062423
6361 12062423 13677723 15405695 16757543 17262025 16566305 14830053 12399936 11613275 10318888
6352 10318888 10010537 8488079 8293728 8255330 7943530 8263639 7912120 8099569 8377781
6343 8377781 8841355 8869854 9269552 9786248 10095557 10874870 11684207 12524801 13648625 15618741
6333 15618741 18015425 21307548 26176535 32042187 37229707 40229280 38350855 34637026
6325 34637026 29494940 25436397 22827052 20309413 19808969 18697902 18979086 19817530 22323858
6316 22323858 26368750 30433344 34644483 36014293 33855085 29966821 25304491 21426260
6308 21426260 18213066 15837828 13679995 12482941 11636744 10824439 10285114 9621491 9863841
6299 9863841 9458338 9430996 8813276 9081078 9094842 9025482 9426575 9298886 9086166 9749818
6289 9749818 9612538 10114482 10376978 10872158 11616805 12189435 13407565 14095062 15790656
6280 15790656 17714459 20342070 23973697 29167799 35343046 39422683 40594149 37618310
6272 37618310 33001550 28554341 24551062 21270954 19040860 17640549 15829228 15583005
6264 15583005 14559424 13938650 14410071 14714542 15546605 15937596 17675519 19630608 22760674
6255 22760674 27319037 31595922 35048710 35378952 32592450 28949277 24603918 21403559
6247 21403559 18572281 16066951 14598750 13298929 12414451 11683548 11116608 11000137 10973670
6238 10973670 10566813 11077780 11326834 12080046 13601092 14617715 16599732 18708674 20160929
6229 20160929 20043366 19184601 17394198 14836876 13565244 11812077 10922096 10659945 9661584
6220 9661584 9721705 9366241 9558114 9295919 9416977 10019733 10020153 10318823 10646499 11578299
6210 11578299 13274249 15058705 16731496 17180195 16212330 13941162 12374583 11176846
6202 11176846 9647315 8575366 7993858 7122797 6628415 5774876 5314578 5179606 4975805
6193 4975805 5061217 4985868 5138567 4675108 4758958 4613413 4689685 4358737 3897118 3769118
6183 3769118 3915504 3808947 3714162 3393164 3787379 3907775 3822797 3932671 3956987 3910263
6173 3910263 3958717 3529619 3833589 3531127 3476538 3314992 3492535 3549113 3416204 3210903
6163 3210903 3133553 3354172 3202598 3364044 3290458 2969106 3053952 2743829 2733740 2591896
6153 2591896 2775783 2755122 2523122 2580216 2888127 2582935 2725297 2866148 2704391 2786191
6143 2786191 2525045 2469724 2283478 2351863 1927513 2202702 1982970 2046250 2431165 1925285
6133 1925285 2160846 2368457 2382108 2336506 2130244 2221894 1893804 2141100 1739606 1963023
6123 1963023 1762473 2126809 2208612 1818774 2256855 2036370 1843746 1904887 1994200 2044385
6113 2044385 2063883 1683743 1634116 2075966 1515146 1533953 1877515 1646990 1780789 1472209
6103 1472209 1658170 1402916 1639185 1314312 1407082 1878985 1629015 1513656 1302134 1428466
6093 1428466 1266428 1549316 1352628 1229277 1440675 1220233 1162598 1666632 1402010 1319821
6083 1319821 988881 1155048 1126831 1515740 1648292 1167204 1519592 919918 1626908 1408884
6073 1408884 1247750 1197174 885916 1096800 971294 778506 1235748 1041967 999489 1188931
6063 1188931 901810 1309436 945448 1096329 884421 1029509 733744 960628 1124456 789326
6053 789326 1375316 1083531 1119806 1231015 1103747 1064563 1367373 1015028 937747 1004994
6043 1004994 1026392 1073321 1280781 1224075 1254019 1397997 1452241 1262821 1297561 1213206 1536661
6032 1536661 1597911 1256706 1176514 1153879 1066863 1198355 1298444 1657815 600914 841229
6022 841229 1201411 816483 1058559 1088074 1247229 711139 1275934 874097 1051622 1045637
6012 1045637 773519 949624 830572 785985 928625 863871 750461 905797 938959 716744
6002 716744 1005109 1062411 1178293 1092111 891161 1225016 506710 1264495 1062730 984771
5992 984771 982430 1006106 1018655 964638 1153530 1250237 1032341 1182821 704085 1013759 772984
5981 772984 1006397 1105260 896069 724270 1116728 1347115 852894 606608 1115978 690314
5971 690314 1022652 1034572 934539 1276601 1115503 990100 828584 1307203 1038893 1008229
5961 1008229 884008 902705 1148676 786081 872878 1160199 1052894 827874 1055102 1000210
5951 1000210 1005583 809029 1082219 1213817 1002815 862211 1087433 1214345 1480672 968575
5941 968575 1193912 757138 1269580 1070235 752516 1316132 576513 1070970 731156 1277052
5931 1277052 1051275 1011482 1236614 819988 1245790 1394272 883919 975248 958746 1178080
5921 1178080 1045323 611150 833857 1129154 1018787 688885 1047186 1057414 935747 423070
5911 423070 1064246 1190361 704314 1267328 769559 797294 1029808 813571 928527 941245
5901 941245 654309 690138 929895 908783 981027 1421524 861859 876923 1056279 624015
5891 624015 992738 1052986 907901 540386 1456695 1191426 912166 1206884 1005325 1045326
5881 1045326 1030357 1032476 820145 817000 879550 525677 1484247 861766 1094669 981754 1501628
5870 1501628 1082348 696116 671009 790082 826570 1060898 811996 1023830 633096 1112179
5860 1112179 1211438 805989 1437196 866175 1044435 718679 857371 615184 1326287 858503
5850 858503 952853 732957 1140881 1550121 1209072 745566 1068748 1369919 1176213 1032549
5840 1032549 946675 1075032 1102380 1074123 621084 1112172 616886 1313866 774611 730861
5830 730861 971287 494785 871763 987237 1007169 991900 1178639 948438 632737 1355096
5820 1355096 552580 1134080 995638 983638 1102809 882367 1105278 1658684 781719 972425
5810 972425 1041853 835253 1230341 954508 695952 868341 1350465 930013 944228 978392
5800 978392 1268361 1202918 631025 1136890 727701 1057219 1004965 856173 744624 1011269
5790 1011269 928362 866815 753800 989885 944255 1125417 962592 751505 1156310 833943
5780 833943 1222201 890204 1160114 1095475 1114272 1190578 848532 1336449 1313946 1033784
5770 1033784 1069143 1078509 1088273 1243132 1051238 1193564 1446491 1262937 1001792 1335257
5760 1335257 1328812 1358126 1489459 1280477 1057024 1497236 1128248 1249146 1043871 1086027
5750 1086027 1034001 1097937 1227052 1314634 1227580 1370553 1266032 1421026 1278306 1267867
5740 1267867 1388181 1213208 1398812 1146160 1263985 1227485 1157341 1478388 1300783 1618829
5730 1618829 1602871 1464295 1377187 1615385 1303553 1607888 1702204 1379203 1294781 1836049
5720 1836049 1502410 1477954 1781606 1493603 1899939 1498780 1455114 1608017 1851677 1618510
5710 1618510 1581897 1358257 1204015 2199031 2104847 1601040 1874438 1719421 1857298 1903612
5700 1903612 1812936 1801878 1768347 2066763 2079707 1618071 1791633 1951021 2396158 2121639
5690 2121639 2124107 1869726 2264294 2088629 1968536 2369579 2074389 2510626 1809148 2457812
5680 2457812 2310971 2263172 2530241 2406192 2289453 2615729 2577931 2699301 3003451 2833271
5670 2833271 2877479 2657015 2452133 2729723 2750138 2589277 2892372 2880197 2845285 2512501
5660 2512501 2989676 2917983 2799268 2982881 2887476 2725309 2984410 3230032 2815075 3434299
5650 3434299 3024074 3502917 3751104 3589118 3221667 3482294 3649854 3445439 3714001 3411629
5640 3411629 3421605 3737989 3662996 3890549 4017789 3978646 3904138 4095343 4485074 4060143
5630 4060143 4387681 4297960 4287919 4338693 4323843 4717079 4760686 4810159 4654757 4796709 4924961
5619 4924961 4824501 4858261 5461618 5101315 5193109 5166571 5585165 5512171 5679998 5553179
5609 5553179 5482376 5718344 5970193 5973961 5979548 6215824 6607575 6184019 6618250 6682025 6591106
5598 6591106 7043155 7084515 7231309 7235278 7107249 7585726 7365802 8090881 7896100 8022334
5588 8022334 8103119 8077956 8896664 8206267 8591268 8900673 9244675 9120400 9433032 9918289
5578 9918289 9790965 10466160 10301276 10473269 10780044 10789046 11613994 11721551 11852872 12370017
5568 12370017 12424967 12369540 13237961 13213852 13784062 14000581 14361080 14517194 14560951 15253716
5558 15253716 15674000 15911585 16711505 17029579 17163885 17957763 18185299 18931121 18868017 19619822
5548 19619822 19532486 20624237 21016966 21484358 22145764 22442052 23709098 23920869 24336432
5539 24336432 24761145 25554320 26174718 26808990 27444618 28109634 28880959 29932107 30403857
5530 30403857 30770928 31432100 32309400 32875051 33333401 33989220 34448125 35125096 35733692
5521 35733692 36325835 36818491 37284697 37962372 38077200 38693876 38781350 38961957 39414858 39443170
5511 39443170 39524261 39367696 39746158 39591069 39635326 39780656 39394988 39229657 38748465 38180701
5501 38180701 38130770 37781736 37147439 36611623 36403502 35404406 35331304 34746641 34196173 33421616
5491 33421616 32974692 32466252 31901346 31057817 30723378 30150906 29280006 28534944 28096012
5482 28096012 27418490 26858357 26882485 26021399 25075205 24772178 24665043 23540486 23533370 22722513
5472 22722513 22493595 21727876 21408712 21188824 20333148 20329970 19760283 19638575 18744982 18583801
5462 18583801 18449614 18204964 17631534 17724572 16893294 17311630 16871259 16604251 16477760 15870671
5452 15870671 16015550 15754483 15871412 15494970 15664400 15186401 15059950 15374066 15168873
5443 15168873 15223598 15239944 15386342 15653341 15976539 16323042 16581582 17474252 18345474 19953954
5433 19953954 23026965 28115087 35080108 44187823 53322918 60174782 63179166 60372894
5425 60372894 53739309 44968734 36307148 29391352 24169760 20504443 18174584 16172465
5417 16172465 14579852 13205185 12529532 11621786 11225643 10642842 10281950 10145613 9527760
5408 9527760 9698485 9253572 9339797 8872818 8805201 8631143 8825428 8691144 8250017 8053837
5398 8053837 7851037 8105258 7877760 7561129 7398520 7536593 7556843 7419001 7033901 7041881
5388 7041881 6944365 6685348 6468247 6665379 6649131 6685704 6495725 6402791 6228578 6321890
5378 6321890 6013304 6164218 5840609 5782723 6022051 5796032 5626911 5642121 5620257 5728665
5368 5728665 5917921 5312473 5667303 5333891 5530213 4795560 5247386 4854626 5008023 5132585
5358 5132585 4844407 5340808 4888353 4841877 4867886 4797287 5029104 4639804 4300629 4476068
5348 4476068 4488638 4816458 4167670 4833463 4516527 4492094 4398851 4124436 4359543 4307225
5338 4307225 4196493 4201765 4130015 4002957 4247421 4114040 4686836 3966346 4105171 4536432
5328 4536432 3950004 4014648 4185799 4096550 3942916 3889523 3952362 4049192 4280670 4223935 4177380
5317 4177380 4199414 4171118 4168920 4436417 3710357 3955805 4030602 3717356 3866290 3875485 3966693
5306 3966693 3835862 3811080 3980884 3617903 3758744 4044731 3223207 3430582 4068711 3579493
5296 3579493 3828934 3394267 3329546 3568980 3421884 3253027 3760470 3390741 3355548 3660208
5286 3660208 3689196 3384066 3846612 3740232 3425356 3893789 3385804 3510539 3473441 3475122
5276 3475122 3668352 3265467 3550949 3743689 3579342 3620287 3383397 3444229 3599854 3611222
5266 3611222 3277456 3371580 3332223 3635634 3280517 3557586 3541925 3909639 3831080 3503411
5256 3503411 3734980 3823369 3631389 3517814 3661939 3705751 3482022 3705338 4032291 3713761
5246 3713761 4270880 3423393 3709991 3537056 3646913 3380021 3796542 3416759 3563875 3461698
5236 3461698 3641818 3701604 4117036 3803118 3780282 4168219 3510157 3786015 3759990 3823181
5226 3823181 3818945 3937925 3577503 3701933 3998817 4100090 4224151 3955016 3995808 4084854
5216 4084854 4031756 3977472 4020485 4038994 4127776 4296238 4190389 4315581 4475675 4101193
5206 4101193 4088847 3949536 4175872 3979042 4082630 4324588 4233591 4505519 4149629 4431972
5196 4431972 4389900 4084202 4521422 3896862 4314611 4475799 4519314 4316488 4096434 4628150
5186 4628150 4584673 4807753 4566414 4671069 4840731 4992690 4989677 4562972 4903673 4969704
5176 4969704 5067833 4820570 4923283 4639118 4946712 4872300 4981673 4808056 4867634 4908192
5166 4908192 4777137 5178400 5020379 5396833 5252885 5344385 5302832 5024196 5390884 5183458
5156 5183458 5360310 5694177 5346301 5525582 5346691 5389298 5512737 5721862 5479841 5498770
5146 5498770 5651390 5674148 5480583 5952728 5521250 5635385 5462147 5424999 5873779 5405501
5136 5405501 5900039 5575075 5629497 5974598 5974984 6172554 6257110 6191177 6225515 5954523 6063399
5125 6063399 6024888 6410682 6269305 6212851 6347532 5932493 6140720 6406978 6068998 6419106
5115 6419106 6196614 6179193 6296265 6809293 6251968 6289166 6767342 6383662 6688770 6295528
5105 6295528 6630537 6596967 6694191 6563062 6708948 6783152 6678932 7302949 7049129 6975304
5095 6975304 7052243 6905942 7032255 7321517 7756118 7984889 7878598 8077819 8028636 8057517
5085 8057517 8359128 8907617 8706538 9069923 9627114 9925615 10849627 10978155 11785693 11893211
5075 11893211 12609796 13260392 14422745 15740822 18160485 23258454 32937962 50142856
5067 50142856 70696342 89590368 95750261 89357277 71644566 54504627 38984743
5060 38984743 28781892 22681379 18100673 14847496 13282711 11456136 11230002 10567568
5052 10567568 9343117 9155088 8763322 8403395 8095264 7669383 7380176 7330955 7306575 7013748
5042 7013748 6894158 7079579 6818332 6757917 6749954 7030674 6186398 6166479 6424531 6272029
5032 6272029 6113424 5761236 5928642 5817960 5901571 5590655 6033237 5378014 5581956 5866063
5022 5866063 5433066 5764358 6152917 6970897 6219687 6364620 5902193 5374573 4882380 5184457
5012 5184457 5121617 4601406 4664053 4554901 4195925 4439187 4314798 4534648 4324446 4384296
5002 4384296 4433373 4009570 4383024 4363035 4202406 4226497 4219857 4294177 3950554 4051883 4602605
4991 4602605 4055688 3905427 3875215 4542530 5153488 5748872 5688833 5438212 4926350 4931549
4981 4931549 4643102 5118405 4343667 4490274 4777919 4420914 4664812 4519254 4641356 4978823
4971 4978823 5107644 5130954 5531485 5628764 5500394 5780088 6413326 6325690 7103257 7496043
4961 7496043 8822345 11568173 18649983 31922898 47153222 53273284 44581380 29966181
4953 29966181 20526732 15092942 11557163 9409986 7738091 6482623 5869502 5669716
4945 5669716 5405247 4842151 4843032 4447580 4743182 4097008 4133191 3786635 3995931 3721767
4935 3721767 3877924 3646745 3666537 3764672 3440066 3509213 3463585 3504095 3098531 3395657
4925 3395657 2980944 2981741 3385044 3142419 2981100 2676721 3060481 3285880 3087387 3070937
4915 3070937 2801664 2987445 2707788 3091618 2851589 2893683 2913528 3112155 2851876 2767099
4905 2767099 3219631 2986159 2507958 2804768 2526945 2699829 2572275 2741826 2699412 2663418
4895 2663418 2624192 2869129 3026405 2495948 2904746 2454498 2740372 2523109 2617056 2433812
4885 2433812 2384119 2532778 2817511 2355257 2742971 2861516 2491914 2759896 2444404 2370880
4875 2370880 2563877 2456107 2590245 2651309 2326031 2846051 2410789 2475191 2436469 2847452
4865 2847452 2592352 2598354 2753987 2522844 2872037 2735079 2976136 2711606 2769385 2861312
4855 2861312 2221479 2657468 2823229 3171094 2989470 2856672 3045154 2921704 3017053 3152939
4845 3152939 3163300 3047044 3166004 3040711 2734888 3318238 3373260 3051253 3195078 3260834
4835 3260834 3742211 3519863 3796525 3380257 3658460 3424484 3430624 3605073 3490209 3564080
4825 3564080 3466649 3655213 3489773 3503714 3441780 3908079 3373212 3463954 3436966 3183870
4815 3183870 3384607 3510302 3681686 3946294 3819342 3505358 3731343 3404761 3184545 3616345
4805 3616345 2839953 3086004 3097092 2893708 3160684 2814927 3185925 3204801 2836876 3216898
4795 3216898 2977414 2836863 2795310 2749427 3018063 2702983 2921626 2791657 2788246 2826278
4785 2826278 3211829 2544207 2827198 2368156 2789261 2759669 2830047 2851022 2630400 2974738
4775 2974738 2403741 3242938 2714881 2794421 2913992 2481593 2589978 2594516 2671915 2633967
4765 2633967 2757308 2740687 2939639 3359034 3122246 2501512 2674616 2527482 2547412 2593176
4755 2593176 2204390 2314460 2916326 2481892 2303442 2541524 2313944 2708881 2238169 2567407
4745 2567407 2033296 2495703 2049850 2239998 2365770 2117875 2430974 2630225 1956579 2272113
4735 2272113 2077678 2302759 2163711 1824730 2126213 2048320 2561643 2538824 2288245 1836302
4725 1836302 2034898 2232526 2000450 2065873 1987569 2357836 2073490 2370151 2365183 1739385
4715 1739385 2277274 2304529 2377479 1864987 1965444 2015208 2358099 2341979 1978859 2297454
4705 2297454 2418565 2340339 1936707 1928443 1602745 2301540 2044237 1723765 1840520 1864705
4695 1864705 1871603 1533011 2014851 1991361 1758215 1808336 1600925 1809730 1663593 1792348
4685 1792348 1602129 1535583 1849232 1626581 1746415 1440485 1624625 1547478 1740875 1485766
4675 1485766 1413524 1655777 1780168 1719797 1478195 1543931 1604597 1756439 1460566 1376147
4665 1376147 1220803 1839369 1621407 1794284 1826896 1448680 1657191 1404561 1450420 1543755
4655 1543755 1534781 1389956 1466192 1762863 1659135 1519468 1389768 1471821 1776308 1086300
4645 1086300 1771023 1275297 1140743 1672856 1648241 1633832 1215917 1428927 1470853 1830849
4635 1830849 1466801 1814847 1219824 1203841 1218689 1804757 1235242 1765222 1393270 1670187
4625 1670187 1559650 1591298 1734664 1521294 1738788 1518676 1396679 1767073 1562556 1504264
4615 1504264 1510039 1309108 1843386 1661194 1411152 1459847 1479427 1686935 1929023 1871688
4605 1871688 1432277 1855023 1910009 1817832 1840293 1814326 1576953 2018029 1571469 1447420
4595 1447420 1708691 1866551 1939378 1405957 1423519 1647965 1885869 1970387 1875752 1481426
4585 1481426 1756418 1809921 1748597 1941472 2006367 1666372 1940405 1569576 1955529 2044627
4575 2044627 1817098 1886832 2243927 2178059 2476763 2432266 1931223 2314519 2265564 1889637
4565 1889637 1792824 1997818 1942908 1874686 1463653 1681181 1594843 1678973 1456713 1643716
4555 1643716 1664796 2176499 2307729 2378852 2399185 2587278 3455841 2698176 2748103 2552311
4545 2552311 2115751 2160929 2146127 1890149 1842384 1327195 1244331 1336425 1777965 1619632
4535 1619632 1436120 1573769 1345293 1983165 1611487 1545225 1674022 1781598 1941923 1766959
4525 1766959 2364149 2154075 2078740 2319009 1960487 1861546 1801361 1814446 1799126 1591974
4515 1591974 1935866 1592483 1748648 1700919 1479587 1711985 1593738 1858408 1658707 1569156
4505 1569156 2330623 1637178 2080921 2047004 1971318 1830783 1789563 1834003 2241800 2474163
4495 2474163 2022961 2331415 2472399 2257625 2271643 2071490 1760883 1765119 1853484 1642578
4485 1642578 1459786 1923790 1819983 2303148 1714035 1562811 1720186 2070209 2136943 1874019
4475 1874019 1894241 1594135 1949078 1798553 1904655 2145261 2013999 2374398 2159496 1784068
4465 1784068 2157998 1919080 2232242 2259768 2162429 2316574 2095927 2516343 2399296 2616961
4455 2616961 2377477 2526354 2917084 2612136 2725972 2879822 3085182 2971491 3733691 3379944
4445 3379944 3652942 3965546 3870825 3229496 2995804 3015343 3074184 3204296 3219748 3146563
4435 3146563 3186166 3274497 3683551 3752900 4124797 3752321 4349193 4200183 3599353 3957743
4425 3957743 3064089 3233560 3113887 2922245 3293627 3313153 3246892 3138397 3233194 3191345
4415 3191345 3403176 3151312 2768885 3261497 2991929 3330513 2945402 2858795 2927770 3149695
4405 3149695 2893750 3239454 3020195 3186742 3319297 3390643 3190324 3181399 3391271 3540836
4395 3540836 3201069 3229975 3515007 3257787 3667731 3391472 3637036 3330507 3743466 4140759
4385 4140759 3934301 4033939 4193509 4238705 4334306 4397806 4431356 4627852 4793348 4767436 5286997
4374 5286997 5320510 5657228 5719236 5707611 6157579 6319785 6420816 6994842 7456095 7976149
4364 7976149 8153859 9045609 9557847 11137605 13703967 18225396 23956853 26583975 24126618
4355 24126618 19037244 15591892 13643562 12629539 11478496 11322351 11207857 11514275 11745513
4346 11745513 11921902 12613120 12605356 13274127 13810639 14555048 15007797 16200555 17756587
4337 17756587 19230013 21529597 24499462 27872782 30544822 34975439 41668860 52291279
4329 52291279 62712583 67900634 73780800 96941570 146157417 206166759 238497351
4322 238497351 219188337 166329875 118764570 88197059 68228492 54799351 45014528
4315 45014528 37798779 32234988 28247585 24507095 22075371 20455331 18935595 18293072
4307 18293072 18389700 17808046 17537217 18794016 20868477 24681703 29409192 30823936 29027627
4298 29027627 27058234 25481773 22877798 20344787 18722788 17051018 16407371 14977194
4290 14977194 14015638 13781561 12932086 13020477 12842567 12513402 13084430 13666371 13443089 13197416
4280 13197416 13184277 13582886 13780448 14927402 15842601 16912228 18008325 18179362 17069072
4271 17069072 15162430 13382114 12494002 11101490 10093057 9846493 9042104 9379223 8948219
4262 8948219 8784966 8783141 8738955 9041895 8973385 8895041 7992066 8005950 7565328 7535095 8039352
4251 8039352 8040341 8358684 7482476 6565015 6065758 5014197 5075210 4453121 4118679 4077808
4241 4077808 3802287 3840484 3573014 3647381 3384818 3269828 3487245 3246755 3329464 3058954
4231 3058954 2993846 3042833 3025907 2693265 2767721 2677507 2617574 2338194 2802789 2397355 2654713
4220 2654713 2694877 2474936 2524988 2302887 2548296 1966799 2238995 2037689 1768018 1992983
4210 1992983 1847849 2100057 2144132 1621807 2024638 2051273 1798251 1969905 1652731 1628158
4200 1628158 1504371 1754283 1713771 1544896 1671240 1960859 1781638 1542262 1564699 1292572
4190 1292572 1513282 1730729 1505624 1534335 1178187 1481532 1566816 1140507 1655263 1053259
4180 1053259 1275087 1106751 1521848 1345324 1429488 1193135 1186791 1101232 941828 1265722
4170 1265722 1331479 1638242 1289786 743128 1395951 1713973 1170220 1375079 942043 1394042
4160 1394042 1370417 1096298 977514 1213027 1294025 1085225 1144420 1067604 838164 1621246
4150 1621246 1039186 945854 1056464 827045 813931 1021765 1015469 901766 1207244 1168595
4140 1168595 1502965 1250893 758602 996982 1158611 1049195 955175 754265 834250 1088698
4130 1088698 983700 988156 954793 1237248 1313956 845077 956385 1257416 1055582 869476
4120 869476 842154 1053864 1242219 1563482 1173267 1485879 1103611 1009728 1146373 1013459
4110 1013459 1043861 1362349 1527941 1020927 1280778 1633947 1635897 1802187 1527389 1754909
4100 1754909 2003777 1916085 2088126 2030719 2058112 2338674 2231692 1729253 1747562 2119788
4090 2119788 1892245 1599729 1860255 1619517 1703388 1523246 1810157 1878940 1967424 1952525
4080 1952525 1815372 2260338 2381240 2395429 2304315 2215015 2680213 2741859 2909486 3290420
4070 3290420 3505852 3892638 3635055 3597672 2451024 2940051 2611991 2031483 1941649 1748824
4060 1748824 1956091 2121698 1832765 2193139 2043479 2193436 2238908 2100795 2162175 1767383
4050 1767383 2091644 2062606 2559320 2127568 2312256 2140960 1975454 2636169 2497406 2408448
4040 2408448 1976937 2627246 2379845 2492402 2185587 2097648 2111834 1975638 1620816 1725045
4030 1725045 2201598 2126464 2230391 1755606 2275742 2205199 2750451 2547697 2423424 2118757
4020 2118757 1852443 1775989 1778651 1830642 1691675 1678955 1426460 1202986 1577391 1382917
4010 1382917 1507307 1532839 1315621 1703432 1101089 1634437 1731636 1312188 1615509 1640532
4000 1640532 1677373 1386410 2067479 1659578 1597841 1319558 1181420 1288880 915477 1278391
3990 1278391 1211239 929804 1135477 782954 1103572 1091051 1211731 1209056 1138499 1041680 1238001
3979 1238001 1146012 406410 977707 983941 1138646 599689 987165 788691 929844 733134
3969 733134 571270 766222 685790 1053833 747654 707971 596244 377978 533976 737278
3959 737278 793408 399130 890905 868796 749166 1013737 163703 594806 512521 477591
3949 477591 680675 467690 407223 701501 660027 377914 783235 553733 861882 699094
3939 699094 345117 569477 559257 219909 624593 265143 333113 349511 267479 606012
3929 606012 723136 405591 500690 587937 806181 300464 282639 662152 432959 367626
3919 367626 458269 255523 578421 686929 62076 523436 555252 283165 500174 879826
3909 879826 401874 640001 69689 394442 767718 163197 450254 618849 572649 208764
3899 208764 475458 334414 526823 421160 88722 292053 116828 823909 563393 141374
3889 141374 715289 953472 763956 556824 316770 284146 452148 23975 529008 249611
3879 249611 70048 401091 341601 131973 738548 718196 219918 344857 169045 494541
3869 494541 329465 260461 686328 350388 334822 756894 216666 213282 486284 61798
3859 61798 376086 169776 400712 472581 513781 166183 285634 315438 399813 419272 334986
3848 334986 560419 218880 539586 294419 73708 537825 482000 84334 466024 419030
3838 419030 145680 592557 123694 141499 583050 78026 269344 356597 296128 303719 512291
3827 512291 542360 393687 174198 347509 -109625 97064 259693 235290 77216 -11952
3817 -11952 183920 374643 373129 210270 405681 279192 -115586 126751 411361 207805
3807 207805 427014 69819 450353 175485 162972 457781 310927 182696 546758 56455
3797 56455 304846 394148 330401 159558 313113 202350 127684 179058 -53551 423545 10789
3786 10789 35741 377634 271029 381087 525623 419570 275698 44289 74872 19614
3776 19614 294614 503695 472416 143106 363258 454470 390638 371844 97659 275280 223133
3765 223133 75572 46488 536385 -1490 514141 207419 205949 253737 576500 541318 306790
3754 306790 392517 113470 332886 339874 283588 78983 428609 598241 -16800 48958 46425
3743 46425 -11332 447601 -38009 25091 258534 644115 320549 327161 315461 -1017 244125
3732 244125 71256 183843 110129 -6071 109909 689893 416641 120150 231989 423163
3722 423163 530988 333269 -261899 60221 -107952 161033 354423 238491 277707 492559
3712 492559 373277 511379 647116 318834 457213 33712 -87242 244882 -17876 475600
3702 475600 60916 107546 23799 442963 120483 218211 162402 144794 186717 119879 236951
3691 236951 147979 188561 4508 502509 113589 430526 34465 497731 253798 225989
3681 225989 183671 -16143 18574 130159 519344 -42512 86560 217784 -68682 361292
3671 361292 -5405 476426 410100 32114 106620 251719 251619 48875 600324 -134263 290587
3660 290587 -11439 116017 481814 420519 256487 329233 134783 291015 292696 13078
3650 13078 137351 295714 144016 325839 26355 397675 464014 -83773 367503 245710
3640 245710 190058 510175 462961 114874 500460 102927 3055 269079 176677 46068
3630 46068 34186 357402 181955 471132 265471 166561 257979 200225 -46478 222768 170873
3619 170873 279820 262588 289703 509799 -8056 291575 590687 363239 570681 295430
3609 295430 -71051 331495 -190354 -167354 113750 381077 136933 594422 492266 292100
3599 292100 685125 455046 359250 6561 215318 -167520 -223837 207740 -124908 211255
3589 211255 35563 53454 532608 481714 190984 -207286 460058 169509 24752 -35095
3579 -35095 -64802 83069 357158 205254 201579 326388 349566 328839 351051 61721 160150
3568 160150 310295 -209706 -140453 438887 104401 385405 327556 515281 285208 723939
3558 723939 501793 455952 83103 138556 273031 176060 193804 36915 39110 240780 227081
3547 227081 63477 316889 126624 4542 233911 -132860 446110 495570 -298106 118783
3537 118783 117001 193141 143095 237638 210064 272428 211398 332047 72018 206649 271207
3526 271207 165854 309910 -244002 21422 -313971 374384 -52954 396122 367909 -67350
3516 -67350 262198 341611 -6970 500120 39699 173142 509955 -59533 273458 -78776
3506 -78776 444628 141037 372078 7422 229966 547293 -134619 427217 -65213 -90603
3496 -90603 -29554 -61843 294479 308308 192087 407391 50009 441988 36454 538937
3486 538937 270794 384861 -157636 -172488 55360 155454 307090 178269 240844 173650
3476 173650 194079 107961 281307 115891 318786 122092 157839 383747 383274 58172 -75964
3465 -75964 589273 205940 126992 146428 414642 406095 390943 122781 -12037 70095 -130443
3454 -130443 551544 325875 212702 320977 112584 153706 176841 246893 201875 201212 -173700
3443 -173700 181872 423082 89515 464188 183293 500989 222697 539783 381525 287744
3433 287744 236014 -232427 59328 -20482 369419 -120757 640974 223417 63976 387451
3423 387451 -10743 277847 325977 241088 77439 238422 300659 930 238998 485842
3413 485842 -32748 278822 46707 639743 142970 382117 547962 614522 13250 213916
3403 213916 240295 599572 36213 304839 358132 -263661 601594 714400 626444 418839
3393 418839 743231 135069 475929 424210 195737 85396 213857 477953 182808 84128
3383 84128 254644 470035 734468 725448 136061 376434 498199 307397 318889 277364 -162314
3372 -162314 196976 17446 359501 713904 133340 259272 589576 373217 284350 185546
3362 185546 481082 715567 540590 60586 158007 397437 641321 502096 198842 779910
3352 779910 514852 623325 717543 715317 585220 893752 754130 751595 1257091 1228807 1412594
3341 1412594 1455586 1763437 1988626 1721788 1918677 1965833 2142074 1937160 2383612 2629217
3331 2629217 3340342 4338289 7556221 14801849 23292432 27535300 22391850 13914049 9805179
3322 9805179 7113490 5025440 3653612 3163089 2570032 1821099 1444424 1517374 2207832
3313 2207832 2137772 1580779 1894395 1016185 1471467 1226244 864369 703077 603957 861050
3303 861050 1227350 688704 748050 872386 601865 1122868 643422 527758 736546 877527
3293 877527 535715 58896 720316 443912 186182 653908 674125 555485 552844 845259
3283 845259 579201 608640 627706 205164 689037 307687 186489 597005 376109 681373
3273 681373 603886 129445 459916 794054 418275 309530 569055 507147 328672 221129
3263 221129 726757 97849 266647 301962 281318 458840 610600 319580 453460 438091
3253 438091 484208 551501 272342 -125039 201872 329880 36194 423770 132234 113480
3243 113480 186807 403288 438465 360905 280763 -27013 609889 250808 235165 155636 329432
3232 329432 586750 152433 662325 298516 389223 305090 129863 -22215 431353 -22050
3222 -22050 436347 127846 -150870 622733 54029 410862 245231 359279 201273 389061
3212 389061 292503 39588 248766 -189735 170512 443949 127774 323704 -115021 107291
3202 107291 445078 169568 109890 162022 395727 405278 -54674 243080 -71954 581327
3192 581327 445503 -79128 265012 232935 237674 64043 99310 127370 364551 160400 225390
3181 225390 175537 -9640 152410 454580 -43010 46870 103018 299275 75682 208377
3171 208377 230458 146586 374200 171198 233423 431879 266429 283144 214500 260698 239525
3160 239525 413771 358394 25063 235236 178455 -121386 262921 408848 -146404 413393
3150 413393 161844 296519 415500 234134 135194 -7767 251904 362444 -50267 133771
3140 133771 369990 146196 330603 59427 -301259 92133 51780 333225 -253012 9520
3130 9520 -3830 392864 292706 -21607 439782 -218250 509212 266628 159476 158140 -174840
3119 -174840 284922 134560 61184 48845 214976 371139 43657 465721 -237507 72763
3109 72763 114511 26207 1341 227676 61826 -146008 -83651 88747 221265 -33916 77729
3098 77729 328927 -138034 464146 -14653 85018 256327 452864 203340 -2360 369479
3088 369479 341616 83162 111815 -160454 330813 132496 -54620 382873 244752 35697
3078 35697 261689 208925 286108 -34914 103170 251872 443626 448785 363490 -90176 181584
3067 181584 683175 -643458 15278 -227172 -88573 122546 -62602 237247 202798 462725
3057 462725 72814 677336 -35200 187122 418876 -127141 396573 -217775 140447 197982
3047 197982 -28415 60207 226503 160551 296256 34559 38782 287803 340257 -126968 189704
3036 189704 -46481 97205 86540 -62901 398069 -157135 471570 316374 189914 -896
3026 -896 117269 12560 246938 211801 89666 -52272 121510 299850 137311 -191734
3016 -191734 -238019 445280 -18856 383351 71501 -305969 427276 -229175 12705 67016
3006 67016 222504 -95040 170064 -130178 399670 526009 173686 639683 116091 247938
2996 247938 220541 -42500 12874 5750 238600 163863 81931 132452 605983 499037 -29156
2985 -29156 522349 -35480 375685 6037 -159647 285930 38789 235297 -42538 -1083
2975 -1083 227680 400050 319121 90175 -178303 -130217 -3037 216946 280494 67746 38987
2964 38987 194063 142195 356049 54167 389259 128498 431610 28729 158659 107744
2954 107744 37140 557634 -25967 73302 163190 198035 209336 232131 327877 75990 299752
2943 299752 125831 -25592 34785 378076 343243 200410 -89953 -90269 234901 26825 107863
2932 107863 -5451 197770 -113617 227767 74146 41661 301066 245530 -88022 91591
2922 91591 312560 173817 242697 81262 90989 -27948 167302 41029 1576 202318 326026
2911 326026 124279 -361434 214760 83107 50531 111049 443463 18876 -234020 230415
2901 230415 69840 29567 8032 433 60064 -48823 359790 35944 76992 113262 198317
2890 198317 96470 -43716 233879 121541 133846 -246783 27073 144324 198979 356109
2880 356109 480513 112413 336016 294310 7188 148206 121100 65085 148603 165336 213423
2869 213423 125397 -118486 63753 171810 436750 215650 -29219 109614 279811 79941
2859 79941 106453 -96222 126935 -18555 437979 38047 275924 33185 227023 237256
2849 237256 -184536 -9934 95826 256235 -111098 269487 -413768 23606 349521 180732
2839 180732 274182 -84983 246069 81738 405385 20898 274927 83563 -255904 257599
2829 257599 389516 217308 51114 240320 422304 201295 -33469 115189 106431 200766
2819 200766 23747 -4798 167259 350992 254623 107811 238749 114090 166090 210183
2809 210183 108469 522472 -119927 124699 103954 216154 161613 12303 -227134 -93536
2799 -93536 281578 33992 379375 365928 112578 432693 -63015 255022 -144691 -150030
2789 -150030 319000 64227 100220 -11448 35377 510229 534673 376931 105070 -63898
2779 -63898 316422 307034 449010 29888 37032 -24013 150366 273352 279713 117058 232594
2768 232594 148725 126788 -327596 78681 244376 -118446 -19543 -103701 54948 438887
2758 438887 3633 89044 283579 164589 -199901 12035 76616 -230454 29092 -262667
2748 -262667 77604 219775 98452 213349 -61206 534375 246892 272440 85070 -20724
2738 -20724 53590 -57556 445791 -154032 173706 49612 78186 90151 -286823 477023
2728 477023 167210 -101063 149721 176084 277247 156434 -147501 84240 65155 387811
2718 387811 286209 61288 256862 69219 24177 337480 55194 -85911 297854 209597
2708 209597 164155 78060 80976 20973 98592 207354 -84199 -162528 -123756 249478 25981
2697 25981 359438 47655 230750 485951 -187860 12530 119486 97429 131858 160264
2687 160264 -348974 35850 180166 -95514 -74107 204978 -77916 49482 109422 119436
2677 119436 169907 -189167 -118507 50538 199375 322850 -205678 135065 84392 113955
2667 113955 131118 -200313 -181071 325349 189918 -17463 -133829 186519 60056 -119997
2657 -119997 253400 -125421 -114952 302576 186842 253226 77956 252137 488869 103066
2647 103066 41083 107427 -124685 196360 339307 190150 -47840 365547 38583 -34601
2637 -34601 336457 92000 -217578 -281521 35674 514763 134432 -231907 -202212 251968
2627 251968 230822 -57141 380896 178744 434725 -141403 143539 57379 -84375 147377
2617 147377 -39943 230820 -166994 142803 204453 179708 181023 178368 -72792 121354 214710
2606 214710 202708 178764 54118 -177902 196326 269171 1233 61594 96316 -32937 338944
2595 338944 24951 -141141 167750 52940 172043 198276 -104045 97895 -113923 216804
2585 216804 80522 276037 293528 29577 464214 -385682 202430 537757 69089 105409
2575 105409 -56786 207855 125363 226250 181151 204476 208428 199560 177800 396267 98121
2564 98121 -56812 -173710 -186183 -16072 -180052 220042 163332 440513 257514 55111
2554 55111 111638 317242 22354 2732 -297183 -140274 152548 -151441 -22815 23240
2544 23240 217226 133313 418672 -32169 -124709 174118 98582 -84819 429122 -514602
2534 -514602 -39868 46266 112882 139856 145792 229762 -88267 392938 -15815 38799 233019
2523 233019 150769 73660 -12755 29023 105186 272491 324974 227718 50617 94815 141801
2512 141801 251813 -73088 83711 69096 -16405 172942 84951 84847 234324 276878 2855
2501 2855 -47405 -10100 205635 162156 268982 -138650 132622 -113876 -118876 173286 80081
2490 80081 111962 77309 -13361 -179080 251120 366023 -45773 120924 34109 77386 107213
2479 107213 292339 62271 -38645 4279 171665 181476 304244 98996 -193244 202122
2469 202122 43445 232487 -100635 108767 -10503 329855 -231248 -129747 -174513 122246
2459 122246 -203329 115158 34476 194608 -30308 253701 -51701 -217125 340821 113163
2449 113163 290120 2692 461250 -303901 565679 132794 -29689 354149 218857 200411
2439 200411 205264 162529 -11566 391894 -200959 -175316 -31952 52871 -61133 17032 -161733
2428 -161733 -340843 218480 149055 -104307 48945 164996 161476 92314 -29432 170027
2418 170027 286966 220776 -33611 -42081 334909 270924 -61557 116984 221245 445695
2408 445695 430254 -15805 197765 81166 30866 -111881 -253056 -163853 19519 58704
2398 58704 -112325 607093 10962 -28201 172341 266186 378981 202357 -95442 -103032 -180564
2387 -180564 -172930 125667 100598 37926 -184072 24299 -50405 61112 -179750 404848 -157117
2376 -157117 145852 15320 -41583 319593 -96075 232713 72962 111635 -77611 67825
2366 67825 164620 319874 505780 88403 -100385 23791 165586 14470 184480 -112637
2356 -112637 468682 233560 207677 70704 121719 409895 -69795 233898 -174277 -39633
2346 -39633 330500 46084 57560 162208 15551 -24533 274000 -10007 224677 169164
2336 169164 130357 8090 606836 191457 -68681 45047 -85147 -15332 -107107 -139341
2326 -139341 25275 -24 55487 14334 -238705 335037 -207571 -3196 65414 -130840
2316 -130840 62175 274130 269147 347654 206293 19038 -11622 -143244 58916 -122487
2306 -122487 10979 -118805 381245 -243371 3341 191767 211395 309919 -133001 301682
2296 301682 45864 87170 -29447 388080 -99098 -31973 95728 -83393 147604 268204
2286 268204 -9792 67491 144944 -60452 412291 245719 49091 24901 220628 9009
2276 9009 323700 136720 -140143 273909 444756 25450 73793 45293 107886 279423 -67396
2265 -67396 388992 912 184184 25057 80725 -87205 181501 -106569 -141264 17687
2255 17687 108772 180875 -240848 -197930 152387 365379 -54336 218744 18110 69529 268726
2244 268726 23802 -134263 22272 -277498 239813 20285 -49587 136243 -102280 188031
2234 188031 380353 -154471 -58706 91101 216878 55367 -20801 102580 -65996 55648
2224 55648 251393 148854 -77148 65956 332639 238708 259954 -33722 -22121 259325
2214 259325 -72073 106035 11464 -209899 -137015 307113 51330 -260203 328154 155205
2204 155205 131463 422318 -147667 250505 33205 -83108 73219 -11100 317552 431639
2194 431639 259139 55887 -56629 28335 18485 273975 -172062 -314309 209416 297244
2184 297244 292089 64552 199402 -77295 268555 169897 13397 196137 134084 111812 -193258
2173 -193258 407194 74698 -85475 -129227 331187 478792 -87048 444312 -265122 268359
2163 268359 -8322 27476 85223 -228911 331226 293227 -163202 -126167 164670 -36154
2153 -36154 177272 199632 59674 -39597 111929 -10705 207399 5672 166765 143360
2143 143360 -364300 8965 39121 -136045 -62008 256172 -98396 -438669 273567 181522
2133 181522 64563 -182090 -56363 186824 25596 213904 82792 190002 110265 162253
2123 162253 214754 -233721 171295 190155 158727 183073 -323998 164869 -212280 329369
2113 329369 104974 322440 119569 67385 -81882 430409 154974 208041 372147 -363306
2103 -363306 16782 173289 162101 -112614 370824 41768 315929 367758 -95551 26259
2093 26259 435939 96919 -236370 36227 127147 -290980 275013 13859 -110523 225674
2083 225674 -7282 -77183 -18125 178589 239423 253184 -274660 32426 -99172 108447
2073 108447 325414 405853 -456146 163053 206324 -146107 -25908 63104 388787 -405280
2063 -405280 -168463 217749 148357 165724 463371 -41797 -77787 82752 51150 85386 72309
2052 72309 156552 78958 318954 -138291 -17071 50008 9337 150495 98456 -271713 276089
2041 276089 74304 16314 -260679 14914 297253 -52790 -162873 263799 167478 275426
2031 275426 84073 -188126 -151137 243331 142240 23807 474702 -241610 259462 212545
2021 212545 -27373 252096 147809 70679 96804 -148846 90788 -195401 -129768 290485
2011 290485 75211 294755 -38340 144904 208072 14771 313919 271683 -111239 -344088
2001 -344088 108061 -2314 346112 -165432 -70124 -17700 110539 73244 58507 -145302
1991 -145302 -35270 126675 -47287 217588 -219919 537402 160179 -284803 -41005 -111862
1981 -111862 5886 223300 336260 -273848 344343 158760 -199611 116814 322721 115141
1971 115141 39591 -52060 22361 23062 42139 434414 -118860 -68426 199801 -79456 382064
1960 382064 351236 -76784 227860 91798 43405 69321 -15284 5509 276880 3244 -498173
1949 -498173 162937 144197 -218676 556979 84176 -131369 -4872 168007 386564 -85806
1939 -85806 474154 -109992 -28681 257940 88401 1727 395439 -150924 142257 293
1929 293 -278807 348756 131827 150227 301935 109041 -361797 181084 240074 -28328 131629
1918 131629 14201 312877 -85017 158233 224536 -34488 48795 -26793 -195499 144372
1908 144372 -36752 -89395 -23134 52945 -91779 110418 286418 -96241 439040 -28800
1898 -28800 44291 252757 -232950 16232 178569 179438 -48677 315535 177238 367938 301139
1887 301139 100506 217860 -274066 -34776 -111249 207265 68933 -84548 547998 -130514
1877 -130514 74911 -103686 393160 213330 98184 -61607 -94286 242456 89094 298331
1867 298331 -224874 16501 328111 -176382 -209398 141031 183881 82878 118414 -97370
1857 -97370 57305 73312 36114 -368228 198649 -127188 282337 -249957 181165 -74754
1847 -74754 177817 41205 -59431 297978 155990 49003 357180 131073 -11211 46488
1837 46488 -206917 -9253 -7484 -52488 -141677 228701 90435 51280 -103291 -90351 -125327
1826 -125327 192065 72068 -182850 -267339 -181991 429975 333783 31315 -198632 103775
1816 103775 355162 -396516 27485 160528 118601 -57010 -91006 -17190 -174420 493435
1806 493435 -306117 85299 62931 -150915 203890 179 290850 -15393 32086 -439578
1796 -439578 -114265 211359 -183683 38559 -46561 97104 53646 -141845 272166 107270
1786 107270 -81490 168732 -76824 154003 308337 56849 10585 105980 -179104 100179
1776 100179 48422 43341 -104150 490168 -38231 131277 298305 -182430 114895 -54852
1766 -54852 -26540 125850 49884 326690 115429 -41146 -44472 -109825 146628 -204765 -86539
1755 -86539 -32609 228824 -327797 141819 107641 110446 -117628 -54045 -74947 130462 -101144
1744 -101144 -23322 205204 762 -30949 -31085 152462 143548 424599 -31926 58310 292663
1733 292663 178232 79889 130838 -223767 117052 239044 -11649 51175 78335 203105
1723 203105 -61023 -57343 -210298 150747 213626 62298 -137112 155768 200164 111901 40041
1712 40041 -161252 -45208 332068 -25691 111196 211856 207408 179026 583126 224391
1702 224391 -147466 201458 -163560 83002 158535 -191996 -35730 -25445 -9365 185201
1692 185201 48279 27 -145950 247693 -1309 -110987 -6838 -87808 55893 48708
1682 48708 -311742 197727 66333 64907 -343447 147540 157996 133311 141338 -3114 339300
1671 339300 288516 320934 28111 -30177 255870 144897 289182 -225158 90998 36818
1661 36818 -339546 -6208 -243706 137358 61390 -42807 -141070 138985 82787 26277 95737
1650 95737 -61526 44204 126139 -129629 138757 -33708 -189403 56502 20390 -66722
1640 -66722 -131846 187467 -87346 143217 233954 136696 -4560 16226 -126533 -184471 -34569
1629 -34569 74553 -115589 345043 -3066 115026 258911 97664 92959 -12447 401009
$$ [...]
##END NTUPLES=NMR SPECTRUM
##END=
