##TITLE=abcd
##JCAMPDX= 6.0         $$ Bruker NMR JCAMP-DX V2.0
##DATA TYPE= NMR SPECTRUM
##DATA CLASS= NTUPLES
##ORIGIN= UXNMR, Bruker Analytische Messtechnik GmbH
##OWNER= root
$$ XWIN-NMR		Version 3.5
$$ Thu Jan 15 18:25:35 2026 Russian Standard Time (UT+4h)  servis@DPX200
##.OBSERVE FREQUENCY= 200.131235884673
##.OBSERVE NUCLEUS= ^1H
##.ACQUISITION MODE= SIMULTANEOUS
##.ACQUISITION SCHEME= undefined
##.AVERAGES= 32
##.DIGITISER RES= 18
##SPECTROMETER/DATA SYSTEM= spect
##.PULSE SEQUENCE= zg
##.SOLVENT NAME= CDCl3
##.SHIFT REFERENCE= (INTERNAL, CDCl3, 0, 16.4885)
##AUDIT TRAIL= $$ (NUMBER, WHEN, WHO, WHERE, WHAT)
$$ ##TITLE= Audit trail, XWIN-NMR		Version 3.5
$$ ##JCAMPDX= 5.01
$$ ##ORIGIN= Bruker BioSpin GmbH
$$ ##OWNER= servis
$$ F:\spectra/data/av/nmr/H1/1/pdata/1/auditp.txt
$$ ##AUDIT TRAIL=  $$ (NUMBER, WHEN, WHO, WHERE, WHAT)
(   1,<2026-01-15 18:23:25.53 +0400>,<servis>,<DPX200>,
      <created by zg, POWCHK disabled, PULCHK disabled
       configuration hash MD5:
       00 E9 B6 7A A2 85 ED C7 34 08 36 98 17 FE 4E 26
       data hash MD5: 32K
       28 34 D0 D6 99 AC 1F AB 0A 38 18 BF 2E E5 D1 97>)
(   2,<2026-01-15 18:24:57.06 +0400>,<servis>,<DPX200>,
      <Start of raw data processing
       efp BC_mod = 2 LB = 0.05 FT_mod = 6 PKNL = 1 PHC0 = -261.0463 PHC1 = 6.301564 SI = 16K 
       data hash MD5: 16K
       36 D0 27 15 EB 3B F3 AD 2F 8F 2C A4 27 B6 4C C8>)
$$ ##END=
$$ 
$$ hash MD5
$$ 3F EE 5C F7 06 1D CC D1 7A 83 21 2C 4F 28 92 76
##$RELAX= 
##$RELAX= 
##$RELAX= 
##$RELAX= 
##$RELAX= 
##$RELAX= 
##$RELAX= 
##$RELAX= 
$$ Bruker specific parameters
$$ --------------------------
##$DU= <F:\spectra>
##$EXPNO= 1
##$NAME= <H1>
##$PROCNO= 1
##$TYPE= <nmr>
##$USER= <av>
##$AMP= (0..31)
100 100 100 100 100 100 100 100 100 100 100 100 100 100 100 100 100 100 
100 100 100 100 100 100 100 100 100 100 100 100 100 100 
##$AQSEQ= 0
##$AQ_mod= 1
##$AUNM= <au_zg>
##$AUTOPOS= <>
##$BF1= 200.13
##$BF2= 200.13
##$BF3= 200.13
##$BF4= 200.13
##$BF5= 500.13
##$BF6= 500.13
##$BF7= 500.13
##$BF8= 500.13
##$BYTORDA= 1
##$CFDGTYP= 0
##$CFRGTYP= 5
##$CHEMSTR= <none>
##$CNST= (0..31)
1 1 145 1 1 1 1 1 1 1 1 1 1 1 1 1 1 1 1 1 1 1 1 1 1 1 1 1 1 1 1 1 
##$CPDPRG= <>
##$CPDPRG1= <>
##$CPDPRG2= <>
##$CPDPRG3= <>
##$CPDPRG4= <mlev>
##$CPDPRG5= <mlev>
##$CPDPRG6= <mlev>
##$CPDPRG7= <mlev>
##$CPDPRG8= <mlev>
##$CPDPRGB= <>
##$CPDPRGT= <>
##$D= (0..31)
0 2 0 0 0 0 0 0 0 0.06 0 0 0 0 0 0 0.0002 0 0 0 0 0 0 0 0 0 0 0 0 0 0 
0 
##$DATE= 1768487005
##$DBL= (0..7)
120 120 120 120 120 120 120 120 
##$DBP= (0..7)
150 150 150 150 150 150 150 150 
##$DBP07= 0
##$DBPNAM0= <>
##$DBPNAM1= <>
##$DBPNAM2= <>
##$DBPNAM3= <>
##$DBPNAM4= <>
##$DBPNAM5= <>
##$DBPNAM6= <>
##$DBPNAM7= <>
##$DBPOAL= (0..7)
0.5 0.5 0.5 0.5 0.5 0.5 0.5 0.5 
##$DBPOFFS= (0..7)
0 0 0 0 0 0 0 0 
##$DE= 6
##$DECBNUC= <off>
##$DECIM= 32
##$DECNUC= <off>
##$DECSTAT= 4
##$DIGMOD= 1
##$DIGTYP= 9
##$DL= (0..7)
0 120 120 120 120 120 120 120 
##$DP= (0..7)
150 150 150 150 150 150 150 150 
##$DP07= 0
##$DPNAME0= <>
$$ [...]
##$SUBNAM4= <"">
##$SUBNAM5= <"">
##$SUBNAM6= <"">
##$SUBNAM7= <"">
##$SUBNAM8= <"">
##$SUBNAM9= <"">
##$SW= 20.6817932712277
##$SWIBOX= (0..15)
0 0 3 0 0 0 0 0 0 0 0 0 0 0 0 0 
##$SW_h= 4139.07284768212
##$TD= 32768
##$TD0= 1
##$TE= 0
##$TE2= 300
##$TE3= 300
##$TEG= 300
##$TL= (0..7)
0 120 120 120 120 120 120 120 
##$TP= (0..7)
150 150 150 150 150 150 150 150 
##$TP07= 0
##$TPNAME0= <>
##$TPNAME1= <>
##$TPNAME2= <>
##$TPNAME3= <>
##$TPNAME4= <>
##$TPNAME5= <>
##$TPNAME6= <>
##$TPNAME7= <>
##$TPOAL= (0..7)
0.5 0.5 0.5 0.5 0.5 0.5 0.5 0.5 
##$TPOFFS= (0..7)
0 0 0 0 0 0 0 0 
##$TUNHIN= 0
##$TUNHOUT= 0
##$TUNXOUT= 0
##$USERA1= <user>
##$USERA2= <user>
##$USERA3= <user>
##$USERA4= <user>
##$USERA5= <user>
##$V9= 5
##$VALIST= <valist>
##$VCLIST= <CCCCCCCCCCCCCCC>
##$VD= 0
##$VDLIST= <DDDDDDDDDDDDDDD>
##$VPLIST= <PPPPPPPPPPPPPPP>
##$VTLIST= <TTTTTTTTTTTTTTT>
##$WBST= 1024
##$WBSW= 30
##$XGAIN= (0..3)
0 0 0 0 
##$XL= 0
##$YL= 0
##$YMAX_a= 391003
##$YMIN_a= -185312
##$ZGOPTNS= <>
##$ZL1= 120
##$ZL2= 120
##$ZL3= 120
##$ZL4= 120
##$ABSF1= 0
##$ABSF2= 0
##$ABSG= 0
##$ABSL= 0
##$ALPHA= 0
##$AQORDER= 0
##$ASSFAC= 0
##$ASSFACI= 0
##$ASSFACX= 0
##$ASSWID= 0
##$AUNMP= <proc_1d>
##$AZFE= 0.1
##$AZFW= 0.1
##$BCFW= 0
##$BC_mod= 2
##$BYTORDP= 0
##$COROFFS= 0
##$CY= 18.4799938201904
##$DATMOD= 1
##$DC= 0
##$DFILT= <>
##$DTYPP= 0
##$F1P= 9.9274215381318
##$F2P= -0.165520771350173
##$FCOR= 1
##$FTSIZE= 16384
##$FT_mod= 6
##$GAMMA= 0
##$GB= 0
##$INTBC= 1
##$INTSCL= 4.127829e-11
##$ISEN= 128
##$LB= 0.05
##$LEV0= 0
##$LPBIN= 0
##$MAXI= 10000
##$MC2= 0
##$MEAN= 0
##$ME_mod= 0
##$MI= 50
##$NCOEF= 0
##$NC_proc= -6
##$NLEV= 6
##$NOISF1= 3.799351
##$NOISF2= 2.8
##$NSP= 0
##$NTH_PI= 0
##$NZP= 0
##$OFFSET= 16.48848
##$PC= 4
##$PHC0= -261.0463
##$PHC1= 6.301564
##$PH_mod= 1
##$PKNL= yes
##$PPARMOD= 0
##$PSCAL= 4
##$PSIGN= 0
##$REVERSE= no
##$SF= 200.130005582386
##$SI= 16384
##$SIGF1= 3
##$SIGF2= 2
##$SINO= 400
##$SIOLD= 16384
##$SREGLST= <1H.CDCl3>
##$SSB= 0
##$STSI= 16384
##$STSR= 0
##$SW_p= 4139.07284768211
##$SYMM= 0
##$S_DEV= 0
##$TDeff= 32768
##$TDoff= 0
##$TI= <>
##$TILT= no
##$TM1= 0
##$TM2= 0
##$TOPLEV= 0
##$USERP1= <user>
##$USERP2= <user>
##$USERP3= <user>
##$USERP4= <user>
##$USERP5= <user>
##$WDW= 1
##$XDIM= 16384
##$YMAX_p= 349981189
##$YMIN_p= -805769
$$ End of Bruker specific parameters
$$ ---------------------------------
##NTUPLES= NMR SPECTRUM
##VAR_NAME=  FREQUENCY,     SPECTRUM/REAL,   SPECTRUM/IMAG
##SYMBOL=    X,             R,               I
##VAR_TYPE=  INDEPENDENT,   DEPENDENT,       DEPENDENT
##VAR_FORM=  AFFN,          ASDF,            ASDF
##VAR_DIM=   16384,         16384,           16384
##UNITS=     HZ,            ARBITRARY UNITS, ARBITRARY UNITS
##FACTOR=    0.252644378177508, 1,           1
##FIRST=     3299.83951724647, 0,            0
##LAST=      -839.233330435636, 0,           0
##MIN=       -839.233330435636, -805769,     0
##MAX=       3299.83951724647, 349981189,    0
$$ Real data points
##PAGE= N=1
##DATA TABLE= (X++(R..R)), XYDATA
$$ [...]
12774 79867 -96766 -110060 -4715 -170246 46542 36044 -109018 -5514 37709 61056
12764 61056 -11450 -102673 57186 -446245 37913 -40609 73930 94846 155367 14945 21728
12753 21728 -146049 -78021 -41237 75164 19468 185103 200057 76257 -90982 23318
12743 23318 -128474 251791 90156 139554 201090 -319017 -113574 -94261 16776 143077
12733 143077 18165 -3554 123511 70250 -50332 -456 -68824 137293 -152850 122014
12723 122014 -29727 -118507 234803 -13022 -18057 42398 -245717 73324 -25915 19764 -21656
12712 -21656 108352 -275904 -113725 -27651 -1611 -111485 -256594 26311 -31910 27991
12702 27991 -23713 -122929 188573 57207 -83719 -114265 134397 -283084 -47764 -259496
12692 -259496 263163 38303 142158 -263496 -38816 108366 -23477 23559 -41846 -115805
12682 -115805 -189349 33547 -161569 187072 -61317 -301348 53506 142727 -80807 -34636
12672 -34636 -10741 -115716 -77577 -230605 184070 27654 -130379 95164 -172298 -302327
12662 -302327 128978 -102585 -86827 243956 -20796 -20760 117677 104372 -6149 -80977 24641
12651 24641 7150 24554 95647 -124139 -137255 -140507 198031 225364 200812 12088 -43269
12640 -43269 -212430 167351 -24290 43029 -163462 -105479 150779 -24830 166437 128439
12630 128439 -24126 -99500 -154400 191824 -89133 -83300 -107364 131520 -41039 10248 -207115
12619 -207115 -149799 -87748 -57254 20374 59341 119184 22293 16568 -43010 -152405 122576
12608 122576 102078 206456 193854 -22338 273568 -100940 -219797 184020 71693 5214
12598 5214 342331 67288 342357 152935 138334 86611 3224 264482 -97162 11742
12588 11742 83436 117051 128961 65348 -29519 106349 -81924 93308 368418 -93914 39893
12577 39893 -234778 -167261 -205453 79563 51848 118523 -132280 -336349 -17926 -112610 164098
12566 164098 23474 -60375 162329 -89550 33291 -65387 245890 -66120 -212343 -108678
12556 -108678 138170 148645 133469 -243990 -38881 -3336 -205884 -22273 44128 108049
12546 108049 -231211 -81745 21558 -213918 -12044 -119375 206975 -28543 160959 -33319
12536 -33319 -124191 38989 22310 28970 -44665 -73244 5229 -230743 -31131 -114195 214423
12525 214423 177440 61122 -31384 -134999 -8252 113596 251863 110902 -2701 12897
12515 12897 66443 -3991 -96378 91635 179785 58608 -107829 87375 -232469 -189411 50190
12504 50190 255693 -40716 -142485 -576513 3151 26261 -79304 138373 -48919 114521
12494 114521 -84907 44195 263367 92532 59920 -79893 32155 382044 175392 72906
12484 72906 104146 -37563 294812 183025 217308 210548 67329 -348 65346 111911 227469
12473 227469 -93291 -39866 338053 21402 122578 -45322 68552 170611 12231 90
12463 90 24279 -52664 -73218 -74538 -156300 316615 -51574 -189016 44476 -77296 289233
12452 289233 44643 -20096 -32713 -74916 -145434 52074 24719 -143899 91049 -146609
12442 -146609 46148 -21752 -67519 126041 173907 -217307 117236 -123091 135709 84087
12432 84087 -15500 147023 -188073 -135526 303630 140973 19726 72257 36445 -45399 -103796
12421 -103796 -106623 111303 43592 -88781 -307434 161498 -118191 -18910 -168573 237304
12411 237304 89979 250297 -43137 87440 61790 16309 148174 381807 -17637 -130541
12401 -130541 -114290 95823 276694 -38533 -15292 -77552 -198995 39991 -122669 31536
12391 31536 -114223 -132381 159065 97524 -250460 -227766 -199564 190785 284793 63959 149208
12380 149208 -56651 -11025 -27166 79475 72951 -23332 -241732 185593 26019 49548 -107916
12369 -107916 -62844 -90422 85248 -78431 117812 34048 -9646 -100894 -98779 106322 158233
12358 158233 -14365 48417 -14078 -136502 -73377 122300 189923 -66143 -79670 -42317 120644
12347 120644 160651 20898 -172980 -64837 118534 -338961 163335 -110165 247385 -276732
12337 -276732 170675 90507 58430 34487 -94433 168558 -42344 151198 53076 101575
12327 101575 -90661 54589 -18656 380302 67194 67781 -147149 100042 122457 -5109
12317 -5109 13497 9777 137231 15558 37191 264597 180208 -111313 -57865 24061 175803
12306 175803 204785 -153507 -144041 219596 98588 -2409 -9333 -103844 144664 -43773 94867
12295 94867 -19842 127753 -35010 248223 91571 134096 61641 77305 99483 -94428
12285 -94428 303558 -61548 -117291 -174839 66549 249240 71040 163410 101711 130044 -189425
12274 -189425 -99083 47644 173813 53584 48559 354 -12065 -86286 -124918 -93162 220595
12263 220595 151270 -217754 -88546 -186129 -68229 -234931 107965 51603 -184289 91139
12253 91139 -6553 85631 275569 -312098 57460 -5388 -149166 -112791 166493 75575 -20188
12242 -20188 -119661 58383 43829 15986 120112 181925 80376 123678 -46648 177062 80629
12231 80629 167372 -261510 424218 -55633 -28921 -231761 33926 -118147 -71826 20312
12221 20312 -148755 -202524 -185092 67643 207634 30231 -12881 -7631 303978 -307653 148074
12210 148074 113190 326854 34020 142201 146885 -116102 85675 -210180 82540 148525
12200 148525 -11904 -75301 -146141 -31112 156667 -2153 53205 -107283 -19276 -11560 26678
12189 26678 145608 23568 -117034 -70911 149963 261727 -39952 97688 95882 135948
12179 135948 -104888 197113 13267 208814 19549 34849 87334 66213 -97687 -210173
12169 -210173 -80927 104011 -208419 -81201 -111927 -70349 -76254 41420 -9155 261853
12159 261853 -187704 31858 119778 150169 98359 78149 -107633 176901 -70351 -67832 -95764
12148 -95764 96900 -22286 -32509 -37432 -20716 162787 -121636 61234 -73964 88139
12138 88139 141934 41705 194981 -147842 128087 191069 139035 -4442 -23459 -349617
12128 -349617 220620 3509 139636 -137812 -6761 -31526 304085 409292 389798 -26377
12118 -26377 -141118 50896 195779 295687 -55289 18504 -257297 -10609 92134 -23208
12108 -23208 -91275 -201736 -353669 -55248 174725 240808 124775 -101054 -29054 61131
12098 61131 -107571 100968 45225 38969 -185238 34446 -386636 -84331 -41302 -105453 127719
12087 127719 -900 -61488 -14282 21413 215852 131157 -64799 -120319 -98341 88529 90566
12076 90566 68483 -175596 -76070 167150 -142916 139110 34871 -112607 -10189 -268533
12066 -268533 356046 11123 371851 -146995 30694 -10655 -100768 -17166 25711 116116
12056 116116 -21909 -110185 -6007 86213 -160968 284302 -161509 127893 102880 -271397
12046 -271397 311511 -125076 -18253 36251 -6006 178279 100281 -82597 175908 -214608
12036 -214608 133133 31706 39423 8896 -169202 -110731 80988 53736 160447 115026 112048
12025 112048 68176 -138234 -73375 -31731 -138707 74919 -93203 49342 8031 66254
12015 66254 -198783 245804 141025 -22691 -129969 136988 129945 66297 -2016 105106
12005 105106 -11861 21541 31829 23745 -190062 -297703 23896 -26072 217052 124354 -176973
11994 -176973 -54516 114501 76798 242144 -7241 43336 104933 -41324 219352 327164
11984 327164 -26242 118325 198350 96054 -3969 -98709 223389 90295 165456 258189
11974 258189 -101545 73886 81659 4415 184863 5232 164555 137688 -76379 17446
11964 17446 39360 -41463 -70951 20190 -397237 -10395 -129307 287258 -165801 161299
11954 161299 -110863 82671 154632 -59699 76654 81887 87524 159619 103947 -114733 46939
11943 46939 68261 267759 210408 -23549 223950 61308 58959 69605 -2921 -11184 201689
11932 201689 -70467 71412 -179653 33481 71648 -58428 -30745 -162290 -18552 -210142
11922 -210142 93240 73006 -96024 -52593 -60378 -121438 -173020 46832 -51629 185815 -5759
11911 -5759 203721 -140735 105638 104730 254215 110788 45088 124797 -76028 190176 -39964
11900 -39964 82534 -187079 143086 -175260 161947 258859 356953 -27734 -106665 -99155 56116
11889 56116 249192 103365 80479 -39121 -33183 89546 360796 108569 88127 -73477
11879 -73477 10583 255810 53385 192650 -51687 328125 156219 201659 166791 75027
11869 75027 -130770 191144 -78254 8487 154690 -366695 21563 100925 43306 103842
11859 103842 -15391 170953 84125 167527 84307 270978 -67830 176977 31589 205653
11849 205653 -211259 -159949 -104002 47777 328205 -30867 263965 -29962 -146279 -78279
11839 -78279 27359 -27651 147821 -449301 46915 291297 -81979 63634 -107715 128864
11829 128864 135861 128726 406781 38134 -286850 -169638 -275625 251031 -10877 -9924 96006
11818 96006 -195536 -102640 -173192 -48474 274158 -72842 -111507 207965 217435 593521 -133118
11807 -133118 -26143 293348 105085 161340 123642 85002 -72627 136 205268 -30443
11797 -30443 72366 -266826 -123171 182946 432169 -152646 6270 -445321 -225849 157846
11787 157846 223403 21306 -22168 -74276 25475 96950 184425 172288 -268173 -27533 28863
11776 28863 187924 321634 -13097 -45595 -158524 67233 276473 200943 141521 70997
11766 70997 121506 163288 -23281 86795 52444 120123 13123 -13893 20680 96604 -110270
11755 -110270 -186755 82079 85041 85416 -101349 -27870 119113 -97619 -146689 95405 38945
11744 38945 220461 -14912 53711 74147 117843 -310170 25717 -257921 229558 42978
11734 42978 -119029 -105657 -133964 -159776 78396 -78181 -73196 -300647 -52019 356163 35238
11723 35238 333582 167247 89203 170478 -202308 212476 12039 -180363 -44719 5171
11713 5171 157231 207227 -161058 41901 289216 -117460 131266 -57536 -19575 -105298
11703 -105298 -125063 304233 57007 -41597 179138 108 254093 -16687 -50149 -84915
11693 -84915 93352 -118320 131536 -18668 43843 29250 -105469 122052 221732 418094
11683 418094 184907 455330 135759 -118248 189913 77855 242948 271898 165067 38502
11673 38502 -22024 -138827 -15825 47605 347745 -5508 -30931 95099 -128559 95795
11663 95795 46311 107749 169979 135335 -55508 39221 -117844 150916 445600 225588 173718
11652 173718 -78742 41914 205 3272 265400 1057 387420 252451 188752 -54130
11642 -54130 -88542 -113849 -39848 237700 -430 48862 -259093 36326 -79230 -84841 157315
11631 157315 -90239 102638 37773 145783 279514 143608 365155 320295 -60164 162136
11621 162136 -70610 61906 -164472 -17192 114722 -117914 -90488 42874 -55378 15440
11611 15440 186471 73242 -31304 182446 -19756 127464 14421 -133714 -130228 -30784
11601 -30784 -52458 129046 -293599 -65980 -49277 -134994 169955 14699 258302 142901
11591 142901 52032 75702 4159 359500 69443 305207 453337 10065 124895 305509
11581 305509 -58090 139586 -28502 49231 -94425 -218453 -754 869 -72821 143807
11571 143807 -16970 237748 -75993 -48632 221608 139812 5629 134217 12806 -72256
11561 -72256 -96636 59057 67926 5020 158315 -209816 1962 67393 -12794 80773 116404
11550 116404 310048 238764 9633 192560 182760 -59775 2030 160746 255274 44804
11540 44804 -30064 -8953 -12151 29102 92054 157670 60369 -169555 -190563 4303 231846
11529 231846 -20469 -52752 296499 -37031 315298 -90760 120744 21863 88471 229701
11519 229701 95752 131535 98016 251937 122404 11619 26194 -17302 -219257 -12734
11509 -12734 -69659 -83290 78111 160690 -36897 173598 -39187 -95579 58173 209817
11499 209817 238695 56837 -109586 -111872 110710 402810 183134 26578 89656 178973
11489 178973 23165 249733 176728 313643 -25902 44909 -47034 117365 90826 315726
11479 315726 -8849 31877 34853 -127070 119422 -115818 441583 204766 31410 -41828
11469 -41828 15240 124196 214020 140549 9198 130810 -128017 101308 139918 65850 -47933
11458 -47933 74836 35282 157026 80102 185890 212412 235976 -48481 92930 164621 405520
11447 405520 69397 81855 139713 46477 18896 -140652 191196 256550 177739 -10395 68383
11436 68383 -266627 139577 57213 -10347 136411 -283966 251764 58543 -121059 117810
11426 117810 -154337 223749 81275 52598 67495 303737 -171526 21308 162577 215110
11416 215110 -40713 -337615 234587 -131680 62049 -44250 121659 138061 -209394 -102159
11406 -102159 141126 400769 164569 31167 51309 130963 93648 63007 278286 163889
11396 163889 306541 81346 239322 -115661 310310 -295515 -63031 103005 69976 -83596
11386 -83596 76173 281448 -29558 -105377 41902 78777 99753 135124 -65369 151636
11376 151636 25804 402978 162976 200832 -113033 27685 232286 300816 252032 81192
11366 81192 250886 146055 204085 52905 50376 176181 4141 -86329 -72215 80064 32754
11355 32754 170932 138567 229733 35247 -84286 353481 162086 254096 -105509 234326
11345 234326 134905 65564 -40624 -50844 84428 -36079 58537 105599 114151 -199721 15962
11334 15962 -78925 65654 71768 41763 179662 135026 145246 -44958 2689 296882 35987
11323 35987 56543 118781 117930 101551 107021 249311 -201270 -345737 232249 13779 49343
11312 49343 101588 123911 -8810 160221 83154 209018 -76761 211775 124188 170575 220521
11301 220521 178221 53156 -180193 77200 173789 -86909 59223 207469 40820 -35661
11291 -35661 203474 -141649 -40436 -18348 268121 40318 -181256 -153803 -226200 161219
11281 161219 236139 8660 338207 79908 210537 -112157 23072 246166 172113 283668
11271 283668 121656 320047 -18926 183013 107943 65840 464111 100298 262690 19600
11261 19600 131140 -63917 46679 218067 -17434 -275009 -34258 252797 20763 242417
11251 242417 -82159 -26089 143118 -85649 164941 -232660 285172 106825 175133 163440
11241 163440 -140635 85175 -136129 2733 398396 201946 144619 116181 74518 208256
11231 208256 77882 75176 322712 133407 264016 74565 161075 -186316 217216 268748
11221 268748 116536 274385 -25258 -120780 164063 -71076 26390 -68398 -35406 104375
11211 104375 221244 92889 280015 -133461 147134 263529 244559 313260 31624 296532
11201 296532 117681 163996 150691 139126 241897 182335 172795 -74921 37521 -41223 -46311
11190 -46311 310269 93107 21080 -21123 -296716 -175911 57827 64869 76498 -109752 179467
11179 179467 224238 -61661 212483 133931 137986 100676 356887 506163 -188035 130822
11169 130822 34031 146984 319035 -16360 55876 -106670 92735 -67380 -59938 175795
11159 175795 75856 -30346 -132753 78537 67815 39422 -72251 603548 96486 364705
11149 364705 140792 117831 63951 110733 90981 147187 32469 -160626 -260152 -213514 78909
11138 78909 -21634 -148847 -155398 118020 -326282 -160907 30913 -126814 251013 247352
11128 247352 122717 16557 33789 91777 157883 173409 171844 208795 141491 361268 221527
11117 221527 60568 104609 56720 326725 218447 152000 146911 -191742 148407 100804 211931
11106 211931 -80494 147638 -175973 237950 266027 -42398 152562 -146970 114914 395705
11096 395705 50925 196018 81738 27234 35567 180202 246046 56725 211770 83157
11086 83157 -20220 133186 277568 141439 113406 219521 119544 386340 264949 421050
11076 421050 200015 284603 355782 263045 516411 948190 1069811 1523231 1422885 1080951
11066 1080951 1192974 679422 725508 311577 209983 516556 392637 262524 76406 103891
11056 103891 208334 183854 337145 443119 240555 239931 47846 241081 173688 409447
11046 409447 151343 -50820 291449 264576 -28067 135819 43189 74614 158180 147733
11036 147733 -89222 93373 248314 118270 41242 134503 74613 -113484 40007 58314
11026 58314 90941 123742 154904 73597 108430 143856 32841 272139 95976 425862 276532
11015 276532 198174 126609 157934 208430 -11677 39237 219589 15059 12658 78784 33821
11004 33821 7489 -291486 178024 -46616 299606 159444 -147896 413304 66833 437725
10994 437725 179067 164669 168331 158757 274869 103817 -65002 -117292 134388 -34139 170364
10983 170364 -88206 22418 -170081 33114 170571 117777 16630 235311 67034 94960
10973 94960 102946 318418 23346 132489 155976 157863 234920 139387 305095 322430 99340
10962 99340 141179 333383 4529 67743 63036 -13150 80639 239392 238139 10999 493128
10951 493128 93017 255039 222311 237893 52215 297466 289388 288921 179364 220297 105175
10940 105175 -153447 38112 91991 -148761 -274359 -112758 -46058 42207 66038 -46759
10930 -46759 -157903 80158 -89017 63675 24142 101013 4628 328922 345445 257541 132406
10919 132406 60789 511021 528650 356329 404910 30381 10589 -4596 25618 508258 46036
10908 46036 43928 9530 61951 59281 45882 91789 23995 137851 42513 303923 380204 517948
10896 517948 -3797 203043 362484 -36836 114252 190678 325090 301101 -14843 248545
10886 248545 110575 258733 449264 156709 368872 222753 205220 164583 83108 302306
10876 302306 210395 119531 276276 142816 89115 385641 189263 -10531 37121 72257
10866 72257 237262 169118 371522 315564 194042 85875 -9311 229891 335947 246083
10856 246083 25353 -80117 165525 216442 322272 414254 482725 292268 243411 442436
10846 442436 511666 167634 -18334 291187 125454 93221 278798 105678 156899 63583
10836 63583 72727 122014 -23707 160149 72357 75468 194378 204695 149828 275811 -132506
10825 -132506 -56533 224293 405642 197497 190284 199462 278138 174735 156400 -53727 79863
10814 79863 143987 209220 94776 304508 -23569 -75490 -99853 -54270 197695 244008 -24471
10803 -24471 194794 111468 -75211 -154559 294096 44826 80511 115548 -66162 30363 379705
10792 379705 305099 136566 -13269 101991 429230 320274 299155 263477 -84426 202860
10782 202860 334545 308554 131191 352462 166175 369907 263947 489209 292980 -159249
10772 -159249 -14930 84011 210219 337765 -106302 22269 388625 175937 411331 -165753
10762 -165753 107123 -38850 49996 283942 372716 27492 169992 -22464 267767 246601
10752 246601 324496 255131 342387 141707 7709 265006 139707 287665 187918 94136
10742 94136 231735 378178 207137 210950 412877 -124805 402427 159927 165065 15213
10732 15213 55268 187035 -20767 67783 213474 229228 -176244 251243 230985 130437
10722 130437 83195 -131148 326266 146226 196885 81519 74786 -124117 -17706 242689
10712 242689 83099 262476 -32733 -337322 93139 346986 227859 315982 130024 74257
10702 74257 29720 257241 34346 151077 -133996 218873 178436 122090 97997 22056 167106
10691 167106 15964 164400 148462 259567 248918 227284 48994 236385 82472 81763 143154
10680 143154 62325 274689 98759 -6176 170846 150348 155198 106485 -6606 113944
10670 113944 36132 162748 365387 68468 98459 13656 65112 257147 103917 253465
10660 253465 249009 -48580 95007 120453 -24085 99589 140433 49365 -167410 -141583 122206
10649 122206 254261 151816 209172 -10642 222978 -16258 93875 72385 -1057 93028
10639 93028 59053 -72215 200762 158667 -68587 167 -45043 -137316 220434 -107495 83343
10628 83343 -40997 129109 308028 214176 300999 122097 191653 264653 -16682 156981
10618 156981 186208 56064 -8682 75638 170374 102347 67270 15679 -88578 292103 85543
10607 85543 3572 157056 -97415 123532 135114 380219 483919 155766 -62953 284412
10597 284412 158085 224690 -118093 402509 104759 101782 160624 32420 213784 13238
10587 13238 -139424 133158 193547 155663 168884 6200 159198 83545 124649 383245 315095
10576 315095 402380 290662 309630 439330 249787 226425 161971 331052 435659 275295
10566 275295 127968 31987 109847 344330 467199 561201 208174 306612 -22553 173891
10556 173891 362261 200856 401275 230240 155023 396169 155617 301269 264055 504851
10546 504851 257113 463573 423306 334362 619549 233289 333620 264142 191490 194389 195188
10535 195188 269880 261630 48604 11712 216379 125780 93664 2204 148561 -27045 -92828
10524 -92828 -46635 211584 218929 191581 -114276 115457 314261 62306 245781 72014
10514 72014 335814 122061 223928 400124 520253 270947 122029 167785 299768 -8214
10504 -8214 365082 31328 12169 96503 35479 279989 285435 251426 -125861 30716 97422
10493 97422 370474 49054 202711 4236 127217 313211 129789 314693 248289 -58698
10483 -58698 -145549 394596 151158 176817 -64638 99092 -165634 -67440 105124 143128
10473 143128 148372 156746 309106 -31309 194710 222567 213264 165325 161029 216411 262619 135235
10461 135235 182257 281658 18716 151522 49711 304746 -50547 185789 13391 124858
10451 124858 216576 28297 -13518 -118363 -10721 172982 29659 53541 166150 142633
10441 142633 254409 40559 141910 174293 81503 110341 182756 71087 181919 201901
10431 201901 305270 120951 148988 107442 315537 202155 171196 124934 215167 207039 192171
10420 192171 129179 215454 301343 95050 -34386 141074 260372 139938 38615 132500
10410 132500 -21407 275757 119063 468394 -110858 -144169 90987 148735 -38817 173455
10400 173455 308875 147650 15995 159699 221512 -15359 73899 66485 344619 310103
10390 310103 302850 121885 284240 265969 30337 -1281 132134 172492 117781 33477 100548
10379 100548 75581 -133794 35357 37197 203319 -51719 205162 -100432 -150999 177307
10369 177307 74460 251428 259465 -8166 26426 193248 188183 294454 68795 348093
10359 348093 158726 -94530 -8818 162085 235487 162104 198536 -10234 -115010 135932
10349 135932 66735 32704 273687 -67590 -17958 121913 37786 132747 164055 382245 296015
10338 296015 41362 53380 59150 -147780 -24725 207451 139376 105744 10237 111081 260702
10327 260702 111821 57805 71009 162076 136595 96447 302524 320181 114567 -154665 318504
10316 318504 338578 220784 -143532 378720 59832 192218 142797 140270 364169 -121003
10306 -121003 68321 -29453 59554 -119228 68466 191655 283031 -27818 139771 197583
10296 197583 128914 308322 170260 250546 135982 154444 -43590 348581 176718 353317
10286 353317 214783 224010 151440 -160444 170970 -106352 264822 334993 41294 49101 -139442
10275 -139442 -5512 153004 283654 212604 -73432 -233844 113907 348431 78497 282898
10265 282898 139948 182321 6984 2096 322639 -82790 223883 168162 419802 209712
10255 209712 211838 -112504 8894 284170 244252 248426 41587 265564 111024 140868 94885
10244 94885 37749 37997 -116187 207132 51523 99219 237729 67847 117042 229568 88815
10233 88815 84249 109253 264238 308117 270519 245865 179820 -8738 134656 198664 186940
10222 186940 413838 375369 200827 -29615 49263 114708 170691 225663 222597 122759 305116
10211 305116 13837 214227 72638 -48309 36959 172491 374511 642048 160912 -44504
10201 -44504 -21448 -30329 231552 393688 228164 274929 -41893 62884 89009 142080 239969
10190 239969 31117 270259 224711 -30777 205832 122615 174505 -1205 94044 338569
10180 338569 304427 -135973 117200 64929 256789 146256 -74132 -3326 -75449 200596
10170 200596 245973 235397 370281 -80369 -94815 107846 120495 398316 91886 526347
10160 526347 -45522 -40748 169657 -5755 355674 132510 51557 -122256 143401 -107224
10150 -107224 -50806 409185 233731 70818 94745 -939 20548 467730 208600 372379
10140 372379 392297 260145 320870 301149 225336 145976 278314 353154 148191 153134 72330
10129 72330 -59276 271927 -40772 61219 182402 -67068 -150234 11038 46616 15956
10119 15956 146175 338536 331215 95702 -233529 108717 258517 200891 167327 144503 297740
10108 297740 290626 126592 258415 -56420 97941 -145067 284115 548079 27573 73469
10098 73469 54302 116790 186998 170291 543821 121067 140870 245922 224439 366281 245171
10087 245171 40300 394777 437990 255338 -129782 215616 382048 52235 289055 487149
10077 487149 103321 210693 -85443 460333 186652 274773 78242 159250 418863 -1368
10067 -1368 244035 502837 609980 198450 133930 -94007 265262 407738 338102 302851
10057 302851 182256 140505 -228463 10922 215304 8590 3630 -1112 62199 -33362 81546
10046 81546 315862 132100 23859 -35518 129650 415264 154996 159042 112714 12726 82678
10035 82678 530835 446178 512005 43873 197718 408980 228942 347580 251049 239874
10025 239874 -39445 190937 327159 239799 144134 158183 -27458 275425 159953 69120
10015 69120 331426 205101 162968 286038 150971 346132 47702 134525 18615 191785
10005 191785 350850 251019 367471 158482 -111739 120224 224699 375182 184060 232076
9995 232076 119528 123125 186932 120680 134673 77554 271076 333878 318516 52660 330326
9984 330326 -14071 54879 276977 223581 412759 103675 -11811 -176316 351381 74073
9974 74073 -27374 -9278 302331 305121 48596 264040 173016 249642 -22770 180330 322537
9963 322537 375258 138129 25506 82548 313652 155654 152961 31556 157029 127478 149210
9952 149210 123513 331699 -87684 -32850 316584 95601 357198 -39470 74627 272021
9942 272021 247681 447802 -11122 94371 27896 316534 339536 403557 360713 13801 435784
9931 435784 233944 249847 128409 370306 -197166 134951 315150 253463 390337 -103156
9921 -103156 85826 70672 179810 137907 226621 221062 -81862 169574 179429 270120 181230
9910 181230 11871 314910 3402 208031 23718 70575 487987 181021 43537 221411
9900 221411 79291 182943 153603 270040 424638 -102203 220149 138436 235820 337541
9890 337541 86524 530830 337526 -78466 260031 232538 193507 355120 70922 223167
9880 223167 236364 42661 407921 6260 379098 274385 37214 56591 -41284 269913
9870 269913 167042 31570 267025 79847 171520 304243 172226 132543 227699 306847
9860 306847 387435 107674 435790 150576 153463 141662 333101 251543 134189 239154 350180
9849 350180 219644 196530 72261 245795 82077 -1438 401927 353176 189953 20906
9839 20906 186259 205920 248970 514055 133888 153634 275110 64962 37022 243484 201490
9828 201490 172628 105923 101209 285360 118396 445714 535790 274428 225794 254545 12292
9817 12292 227861 332906 198736 328437 223091 204065 -38476 -78332 528196 106332
9807 106332 202061 289720 526273 150999 149476 251238 149677 156769 312784 276605 133825
9796 133825 365418 26593 302147 89442 200601 150985 201943 275909 323989 164565
9786 164565 180927 255682 319464 528556 253351 -38055 146069 215772 746200 237396
9776 237396 274108 -61672 414355 22772 525115 560680 204159 219325 13546 370736
9766 370736 255820 313975 549959 202368 249223 489876 217577 434991 648483 44625
9756 44625 472103 320031 757776 684122 210999 659329 642682 1114726 1372746 1069150
9746 1069150 838462 706701 503882 441307 315982 367293 277115 141347 544673 180108
9736 180108 221480 440650 346472 271318 384605 334695 570075 97933 460255 127008
9726 127008 384685 366367 291836 352529 345543 -9367 115459 405705 436055 417861 47797
9715 47797 214035 139119 298843 221380 272183 346954 74149 216639 215894 91940 81195
9704 81195 281754 426988 453178 185100 346807 251400 514361 281450 82147 383183
9694 383183 137601 157651 290596 378678 436994 244697 41924 553015 146655 214242
9684 214242 287527 141916 420505 117232 50095 231644 206369 185343 445869 239434
9674 239434 570464 136969 294942 296864 234043 129265 157740 248948 255854 323478 101289
9663 101289 303332 160849 2684 557110 472090 456600 434082 231560 247061 367085
9653 367085 435855 174324 526319 14021 467743 227949 58519 405138 155816 442946
9643 442946 612053 649135 125239 243778 254647 369807 265076 297278 233456 12194
9633 12194 167742 287937 455586 465711 420128 150362 96208 174229 70248 207387 432833
9622 432833 189183 233431 120878 -86760 464080 152135 365694 376814 274876 286862
9612 286862 319468 65305 407526 150966 517052 557132 290222 407109 342419 290599
9602 290599 315326 182012 233980 307468 229099 214820 350208 69232 62895 398978 323618
9591 323618 313726 296075 116326 277171 263587 205610 279366 422974 301676 417988 168270
9580 168270 276819 314535 320622 475114 392545 389048 220237 248111 416958 486829 322267
9569 322267 360009 346457 353245 95620 239769 277419 365526 203676 288841 400215 362863
9558 362863 74638 155194 221964 213235 162561 204065 165355 375293 281942 232077 146289
9547 146289 237145 387842 49741 201616 208039 75751 318349 -131018 343938 288472
9537 288472 424072 239012 441433 194130 511077 376516 158279 349892 330314 383324
9527 383324 313848 -24043 10512 -53692 278625 408083 228454 152888 69931 161895 279869
9516 279869 250143 348091 267928 305409 187587 330003 317040 397469 504132 526886 100791
9505 100791 394117 526571 355323 632613 334458 605655 587134 705074 845883 560088
9495 560088 462767 549437 260037 421011 275755 301063 286087 247907 494793 310196 218733
9484 218733 59419 242469 335807 394124 216101 202676 229903 49711 419104 283515
9474 283515 465045 322085 209891 339442 330823 349370 248859 358822 444828 245490
9464 245490 212893 374453 412601 258599 219042 10538 498799 160961 523298 529431 10552
9453 10552 461205 323336 557992 549327 166078 245004 323094 127917 353701 423241 394517
9442 394517 288825 355124 598433 323516 440293 452137 236871 583632 260822 397263
9432 397263 568204 576298 451236 192265 396312 443401 335206 362605 519327 619457
9422 619457 465394 298579 419699 415928 142588 409794 577311 675167 422304 366819
9412 366819 403084 550347 331592 277223 625687 570392 499540 538653 322599 446093 445802
9401 445802 386292 622343 604895 493620 442259 373278 476975 385958 254029 667912 300956
9390 300956 464023 264007 557733 616285 353369 400269 465652 460330 374040 423472 566472
9379 566472 728130 313401 509471 508111 575884 671052 1061794 1391147 1406260 1020668 950685
9368 950685 863171 640595 491800 519109 907321 570930 529938 264979 683091 621649
9358 621649 555567 512030 498974 360409 408855 459785 464257 562499 279248 362162 644997
9347 644997 406853 429467 342697 612509 245411 716530 508467 556241 249792 389023
9337 389023 530640 509912 809284 682122 507028 455631 352161 638814 647862 555402 252424
9326 252424 600346 620435 387455 583765 420364 588205 468330 508563 554713 629237
9316 629237 335115 488409 428085 438983 693862 448365 721396 567899 515064 402440
9306 402440 529728 685803 539568 569277 350322 611761 587049 253273 250546 417246
9296 417246 594504 390670 513811 330099 319663 281527 467831 607835 788996 575836
9286 575836 164553 485451 348393 642804 544261 440403 445415 417815 153412 300978
9276 300978 587631 475570 787846 393720 512971 434600 613705 300993 446005 530829
9266 530829 233042 525006 509053 461812 287461 259283 645823 475630 528669 653184
9256 653184 503421 336098 398964 490676 605648 552087 548250 241328 496163 586898 616559
9245 616559 468991 551054 577963 471623 412451 461808 566465 443163 509633 354433 399683
9234 399683 160320 289420 317762 450585 477225 586424 555447 601878 485768 574750 344081
9223 344081 385311 445465 652769 736083 447361 534931 165429 635859 611012 620149 745311
9212 745311 350619 543629 354777 751506 548453 566895 501775 735925 551943 476067
9202 476067 612570 266190 541477 582449 522174 614810 606112 483354 520267 727702 775754
9191 775754 803955 612659 407647 387076 529438 799697 614013 832531 548937 448790
9181 448790 778619 813510 655292 836022 673201 768784 825403 848662 835043 855510 695024
9170 695024 724063 659176 915587 777317 750793 972034 560316 753899 710182 584968
9160 584968 1038815 628995 800130 624405 782761 1082252 852759 959189 725053 631643
9150 631643 947244 1215079 724117 901390 897056 1008082 894120 877606 1051896 828600
9140 828600 731362 1200715 938227 1083389 918898 922739 1010213 941345 1196502 1201933 1185539
9129 1185539 1071492 1165211 1108637 1496470 1148011 1233754 1284425 1455609 1498059 1629030
9119 1629030 1622098 1529756 1758209 1807390 1894775 1708203 1970514 1819932 2381903 2312905 2444204
9108 2444204 2439526 2340137 2702640 3005961 3175626 3357271 3589998 3690398 4148487 4199607
9098 4199607 4626278 5054013 5417058 6040769 6563768 7720075 8622890 10066306 13028710
9089 13028710 17747170 27463886 45419382 61541880 55702068 43496846 26679540 17587091
9081 17587091 11599665 8221876 5482100 4341410 3616747 2821465 2650536 2358926 2151658
9072 2151658 2230352 1829359 1800301 1754404 1599022 1585872 1733467 1440088 1273779 1020480
9062 1020480 1342928 1056047 1221729 994883 1338543 1214850 784360 1126907 1118411 1274502
9052 1274502 839048 1067312 1232726 1132358 1011618 997367 845105 870747 1072374 755271
9042 755271 958605 826908 935022 559768 552838 723656 958237 967072 766018 574543
9032 574543 479517 451829 748950 618526 626853 467781 658312 583546 573583 835218 436264
9021 436264 699507 458429 462716 575149 507748 539970 598616 501410 536262 549220 442611
9010 442611 738549 115031 572688 386843 468765 430081 670570 791043 658672 562681
9000 562681 518581 325369 618714 472607 692567 821454 453102 331938 346937 368653
8990 368653 634879 415168 498344 586920 397690 416121 479105 501518 447179 303474 443648
8979 443648 597038 707816 459333 478020 536472 408035 387530 438466 512540 594606 472466
8968 472466 411101 586579 186331 410226 409818 379156 342465 123458 442200 470580 419980
8957 419980 306965 -2310 399803 587638 333697 508736 101232 152820 558780 184244
8947 184244 827599 267908 175487 534943 347782 578740 319051 215275 39400 197878
8937 197878 489655 382806 374165 479239 167672 312434 454486 173780 594112 295847
8927 295847 497961 353064 408439 351057 126098 140719 213798 373819 453183 350179 509909
8916 509909 496273 195924 290019 238787 367115 485436 334968 289002 362467 461975 225795
8905 225795 455863 390951 595446 405224 388923 491864 386193 491520 321330 351391
8895 351391 501665 230073 424391 552525 377778 594376 360034 302398 314714 424086
8885 424086 527673 380827 195294 552475 123144 602080 362213 41798 502769 56800
8875 56800 390979 192624 336237 329544 200222 567601 250486 435600 322652 310332
8865 310332 279374 371253 207510 423232 261610 207142 136707 145010 324229 393228 299744
8854 299744 127416 374318 454257 330809 344899 418766 153384 526546 376217 525952
8844 525952 317669 447129 288085 207214 604917 441556 584075 407907 231046 550616
8834 550616 296196 470116 330519 319460 421197 577439 347978 405628 153736 257091
8824 257091 463522 461523 588595 169386 158702 106648 167686 255498 437320 601969 258344
8813 258344 393491 287229 505320 572463 588292 367734 414934 566537 329848 433395
8803 433395 429852 509236 512932 269900 455564 485729 448387 335950 313714 456952 367168
8792 367168 421883 304230 344741 177274 130453 212663 556552 392679 215021 564243
8782 564243 410294 182093 249766 741497 465736 377571 217295 455664 445867 299075
8772 299075 110845 549725 320184 357133 259191 292183 739048 376347 445514 158187
8762 158187 569393 339695 541073 319476 559152 320899 291126 529745 205187 396265
8752 396265 414787 357004 263287 554740 299505 532828 485191 308248 185718 283471 579858
8741 579858 486211 503699 177760 512546 304102 458573 578175 574877 544731 646286 517033
8730 517033 285029 473328 453239 493632 558923 653288 358461 405645 452695 367045 579705
8719 579705 481607 320075 465534 200069 149918 149797 200863 325271 374362 75963 78024
8708 78024 292824 344482 183428 496911 554769 425308 640690 252956 208211 492452
8698 492452 355890 730371 360005 443083 310568 110878 407620 563178 587755 404590
8688 404590 429252 370752 379554 279721 388888 307102 782585 303415 701339 585271 186230
8677 186230 545220 76527 690094 419796 545755 456107 563069 738232 260070 589982
8667 589982 622148 465866 597115 613989 108724 88294 279075 399312 649551 168304
8657 168304 494287 229969 702716 545293 557992 449092 482605 489719 352474 504414
8647 504414 630345 500815 338868 350556 530974 271000 410067 187933 323720 567467
8637 567467 577036 378979 321399 201088 130628 168952 440118 434044 404579 271193 330187
8626 330187 643069 389968 337020 485275 403788 728687 311229 412202 475400 410716
8616 410716 813265 388247 637967 258787 409673 442562 827927 443271 350831 284551
8606 284551 449668 285336 381648 278582 277220 406715 305973 268118 675969 158112
8596 158112 97458 346846 261255 621504 181818 310919 366591 479020 502683 428173 707261
8585 707261 583389 713694 205353 550983 446466 625870 366440 480900 801083 502267
8575 502267 251801 304337 151267 316703 517651 589694 412998 581275 255617 203074
8565 203074 328503 511921 390539 401879 234363 599037 617959 295592 590553 721701
8555 721701 537508 559261 504783 773411 763152 511575 566922 314370 700352 621788 530858
8544 530858 508369 473819 337871 251607 435458 508623 425517 134953 11771 112609 502002
8533 502002 236991 -134705 -427372 284893 620646 350355 738080 613098 611884 422790
8523 422790 689269 500094 394238 292130 565354 329403 332569 342025 152308 405075
8513 405075 366281 494532 412095 346198 301298 484265 605843 627589 379960 497465 558523
8502 558523 373789 781192 500665 836002 694140 967042 363260 574878 527459 698142
8492 698142 682103 835636 799783 485290 506787 167426 1037048 392250 484524 416064 293833
8481 293833 393404 458386 506523 315194 750315 215705 641614 399782 727369 446424
8471 446424 205824 738994 445482 773498 504106 460609 663463 619106 364739 445020
8461 445020 60695 643487 453466 448680 424362 475276 304205 226098 750183 778386 484566
8450 484566 594142 446438 483665 751961 447082 469825 524202 367306 754426 385116
8440 385116 711989 522525 244063 509316 586761 475758 337629 509306 528863 547311
8430 547311 525273 348961 532597 419383 591375 587938 953863 434559 631842 406023
8420 406023 639042 988406 629575 577396 264422 501337 387541 457380 585529 433393
8410 433393 295941 549110 491908 376191 621519 698857 414470 395034 641415 573714
8400 573714 501743 794849 640223 268893 630966 671674 624306 593118 498975 610988 341418
8389 341418 664933 648017 551666 656051 807135 456537 821805 331941 704323 350074
8379 350074 671962 654530 620307 494735 582361 587186 687332 867776 760323 508208 384627
8368 384627 603066 593272 737818 569069 597276 563549 285846 576600 776364 545789
8358 545789 474469 450882 294551 810794 514303 528690 604785 481358 574730 352471 613986
8347 613986 370163 389873 348404 609994 548206 449538 933279 593195 485926 539116 616845
8336 616845 511099 702171 906787 437359 586770 478350 666412 385285 831812 665976
8326 665976 424192 423695 608177 607404 355709 642704 468839 797955 633178 678121 540474
8315 540474 306489 590807 656759 609336 429046 369755 371616 846914 827203 656965 371252
8304 371252 621493 414944 483742 818515 940829 713803 413951 784067 444653 734047
8294 734047 541204 875528 674839 761024 561606 596579 405252 694900 725734 495922
8284 495922 769244 576560 766152 449990 610219 488036 362418 550086 523880 421735
8274 421735 804518 877754 404271 556231 362595 436111 784922 719709 775829 667511
8264 667511 752455 779393 691864 559052 724056 792446 636725 649875 604306 709868 252797
8253 252797 516629 561878 596743 722120 480913 593995 504231 751406 701414 562019
8243 562019 783357 216397 535268 691624 821939 769619 715507 833646 454503 666950
8233 666950 629543 675711 694360 664582 586196 922234 590760 513895 646272 553992 996051
8222 996051 831380 587437 524171 563875 632764 639891 571599 937860 243661 681345 823893
8211 823893 493391 821905 755414 738649 830665 913383 726222 980470 883674 382128 963514
8200 963514 346123 1104688 506330 749451 817856 580318 620575 11104 904769 921023
8190 921023 982477 801643 774405 954750 909067 825945 732726 1044945 646568 868945 328930
8179 328930 642222 550289 649928 795906 958876 410230 660654 719256 496628 781949
8169 781949 824565 786227 690138 574127 636548 876004 612524 502770 499859 740555 888740
8158 888740 664616 706455 651751 643159 867395 892593 806258 642174 429516 626702 964639
8147 964639 632110 737518 671193 567451 898949 841778 867444 634767 771999 778862 761009
8136 761009 1037347 391305 733418 850113 898261 1025840 848494 591702 1110525 532153
8126 532153 685695 778869 995391 888099 900774 709478 832671 858228 787178 706946 772849
8115 772849 834369 745907 682230 875711 682006 746323 525824 970655 826124 697372
8105 697372 959914 613595 817574 974163 783602 682239 893713 960125 929045 661085
8095 661085 784553 1060531 642858 955241 686412 823249 1041671 683484 732990 483411
8085 483411 801302 711106 659596 710042 892308 495035 556010 874728 1055383 936819
8075 936819 548808 747787 835527 1008895 765442 895728 622133 922051 983643 980457
8065 980457 1053009 805747 779946 511948 1124954 640360 912050 938020 1144676 746792
8055 746792 884352 849113 739081 863986 785036 1041792 995542 950227 620180 724480
8045 724480 876998 752619 886500 692671 1041903 1033492 1066941 1044344 1245968 765379
8035 765379 919799 1144136 1400580 900682 844617 847160 1020524 766229 896418 975327
8025 975327 842738 962187 685712 952950 1179774 794126 658350 996420 902407 1155164
8015 1155164 794825 841717 1301456 990022 1029606 1044561 1052194 955083 1107339 843538 1032060
8004 1032060 870041 923170 1085093 706401 981289 773945 1097697 904979 1093348 806738
7994 806738 1178258 913085 688385 1033898 743790 1042551 626418 979087 1091268 977376
7984 977376 662816 725063 1015377 1006284 1022946 1205088 953463 733888 1021521 688103
7974 688103 995894 954729 757988 987954 876616 957953 912302 1044364 993907 1165737
7964 1165737 1122511 1201449 878064 1358565 1010742 1227490 1150629 1053551 1095344 980105
7954 980105 1089939 1150770 1230955 992232 976533 782180 775796 737682 1000051 978015 755007
7943 755007 928488 1024574 1182895 1038362 1003059 877892 1407347 1390874 1438659 1205815
7933 1205815 1054822 1181460 1022925 1132456 1274472 1192393 1075044 1413485 1200311 1142721
7923 1142721 822834 1024124 1174980 1100198 1299917 1039008 1122182 1055404 1323634 1091947
7913 1091947 1140595 1295448 1175478 873930 1152315 1468376 1212751 1463581 761270 1227743
7903 1227743 1154237 1363013 1254856 1040325 1242555 1108606 1184401 1429562 1522332 1173186
7893 1173186 896279 1152621 1341751 1615409 1315948 1351124 1006534 1035121 1206728 1420346
7883 1420346 1591838 1145797 1277962 1042173 931362 1489287 1225945 1268205 1454317 1262868
7873 1262868 1112993 1415041 1211182 1363082 1373684 1258571 1816025 1324512 1391586 1266387
7863 1266387 1140560 1414584 1536077 1366578 1446809 1230402 1241759 1347767 1229389 1301511
7853 1301511 1848554 1350016 1624003 1567407 1723489 1383977 1550121 1394870 1664015 1520274
7843 1520274 1440689 1653720 1876301 1560531 1454735 1676286 1633138 1732507 1341697 1560029
7833 1560029 1781432 1556594 1745028 1546906 1515103 1836763 1611603 1413833 1951508 1507856
7823 1507856 1671769 1559202 1705693 1807831 1366167 1619093 1914639 1504832 1662451 1631980
7813 1631980 1709844 1765891 1501809 1630216 1588814 1656922 1844136 1781354 1314941 1710240
7803 1710240 1791738 1696650 1935399 1587261 1983440 1757306 1780457 2269354 1795223 2201513
7793 2201513 1936618 1715907 1971214 1923133 2046986 1901626 1839457 2212150 1926447 1898938
7783 1898938 1937186 2084867 2137619 1892326 1850042 2375211 1929518 2391877 2016449 1932708
7773 1932708 2364196 1959620 2222507 2307883 2297388 2211563 2298449 2230922 2175269 2397980 2602287
7762 2602287 2373542 2113672 2326241 2130313 2273080 2431156 2229216 2645432 2141183 2057714
7752 2057714 2525164 2304149 2535288 2595892 2253720 2227047 2325046 2312023 2485930 2447592
7742 2447592 2522086 2565893 2494917 2699994 2585879 2653659 2395922 2758448 2897631 2687874
7732 2687874 2655097 2742546 2847299 2982431 2960148 3228537 2933860 2993932 3202800 2988877
7722 2988877 3056071 3305983 3013108 3594200 3618472 3393343 3867218 3833017 3816373 3728486
7712 3728486 3553178 3756608 3789907 3910535 3579318 3534944 3657787 3653147 3621050 3955941
7702 3955941 4087611 4260707 3982433 4255187 4201248 4185449 4162235 4021319 4296008 4036819
7692 4036819 4458097 4520500 4656793 5045880 5230629 5308730 5336226 5792877 5535935 5460579
7682 5460579 5630687 5241667 5289073 4991086 4528145 4650606 4453017 4670334 4643731 4032555
7672 4032555 4161173 3887168 3748312 3979756 4040668 3962760 4091143 4334602 4076590 4290712
7662 4290712 4024316 4196584 4191413 4102991 4441344 4381226 4610834 4547687 5097188 5334406
7652 5334406 6190700 6933541 6705251 6258966 5764309 5247253 4956445 4632011 4168106 4301198
7642 4301198 4246760 4387301 4707058 4325682 4609432 4127116 4337729 4544498 4348806 4614111
7632 4614111 4546864 4496775 4607283 4613254 4910462 5176142 4983625 5096547 5279739 5479752
7622 5479752 5400308 5618514 5761092 5738953 5777378 5494587 5387542 5723787 6103538 6313240
7612 6313240 6600290 6760856 7008240 7087123 7625009 7847694 8141207 7559714 7287674 7232574
7602 7232574 6961112 6922902 6581943 6318392 6519019 6606661 6138847 6251679 6175900 6113502
7592 6113502 5750911 6255809 6057275 6305360 6072433 6515812 6908249 6366248 6502661 6365985
7582 6365985 6054584 6375325 6057320 6351784 6302846 6259966 6162185 6504828 6740398 6989417
7572 6989417 6948780 6874661 7025969 6576929 6515687 6581874 6614768 6563295 6133079 6302982 6347323
7561 6347323 6562743 6627312 6735192 7016192 6875844 7257011 7186496 7240583 7554852 7620459
7551 7620459 7657035 7811700 7884788 8087938 8191847 8279382 8442918 8493440 8276222 8228543
7541 8228543 8181224 8425514 8696106 8953512 9262617 9667120 9648980 9915298 9887412 9842191
7531 9842191 9453685 9481837 9431594 9552337 9185745 9560564 9813570 10026919 10398320 10873967
7521 10873967 11468454 11928918 12046718 12265196 12286386 12711954 13208966 13755531 14782642
7512 14782642 16093614 16670496 16545381 16302013 15972612 16834518 18276281 20447208 21692853
7503 21692853 21864561 20098476 18471256 17355542 16571352 15984107 15712474 16311960 16562823
7494 16562823 16832862 17510066 18520952 20448748 23060424 26738096 29519503 30714411
7486 30714411 30303693 30599144 29909241 27956610 25746052 24613815 25972498 29053414 32423441
7477 32423441 33091268 30783188 26512425 22202466 18772902 16490866 15078923 14118163
7469 14118163 13914652 13538667 13540372 13445234 13184351 13323413 13280238 13483191 13202165 13517577
7459 13517577 13435827 13400296 13582769 13683015 13459477 13629429 13589442 13414234 13582627 13196716
7449 13196716 13795295 13478656 13582596 14175385 13843681 14200486 14110391 14615416 15001894 15215452
7439 15215452 15466424 15771282 16262528 16562398 16822024 17343880 18082757 18604863 18612804 19273172
7429 19273172 19836888 20276492 21165157 22046121 22845006 23662244 24502078 25423713 26703389
7420 26703389 27789417 29129851 30666103 32569688 34552840 36576420 39319719 41882875
7412 41882875 44614558 47308903 49854604 53149382 56711741 61209368 66411259 72603390
7404 72603390 80221552 88890696 100040872 114708595 132879153 156797247 186242575
7397 186242575 220826125 257852845 292052489 320361067 340828978 349981189 339953543
7390 339953543 308576807 262795034 213467836 169909602 135456633 108502244 88723850
7383 88723850 73796758 62754445 54456556 47892691 42880828 39008099 35322667 32846245
7375 32846245 30673113 28697212 26818013 25496655 24463855 22981378 21975317 20997110
7367 20997110 20254520 19598610 18863131 17930232 17413095 16646887 15932463 15235776 15156313 14785812
7357 14785812 14395543 14149795 13604163 13381027 12646582 12722216 12524114 12052233 11985024 11526944
7347 11526944 11464816 11236949 10845974 10684460 10498792 10287951 9725408 9484376 9166629 9042747
7337 9042747 8889997 8704971 8728455 8583165 8271638 8023614 8236103 7796861 7726114 7736128
7327 7736128 7556152 7347152 7303476 7075816 6902506 6585926 6767345 6484076 6361720 6582359
7317 6582359 6402723 6195008 6280692 6270210 6024662 6015905 6331229 5927413 5805566 6032196
7307 6032196 5971933 5812236 5752826 5909821 5643436 5535473 5851456 5736149 5766421 5489898
7297 5489898 5726449 5488216 5348615 5469602 5553735 5765335 5851791 5806836 5754046 5682208
7287 5682208 5714986 5663027 5711579 6016415 5706227 5818432 6030182 6011192 5841161 5939443
7277 5939443 6095808 5816399 5412649 5721303 5646983 5906779 5604885 5685307 5503973 5595702
7267 5595702 5707693 5437514 5398495 5300935 4812776 4888299 4863177 5103760 5272373 5037213
7257 5037213 5305351 4969861 5190632 5272519 5303318 5595599 5328113 5660185 5630470 6068013
7247 6068013 6174008 6256124 5998914 6013574 5703740 5344056 5382422 5490263 5507235 5226724
7237 5226724 5558025 5639819 5836187 5948907 6021102 6470193 6097931 6130406 5974479 5655715
7227 5655715 5824138 5512575 5582205 5474065 5683520 5553317 5441233 5480243 5693130 5720199
7217 5720199 5877934 6215165 5870490 5750445 5594172 5829094 5876512 5659853 5903131 5808235
7207 5808235 5994485 5965429 5845316 6086009 6129772 5923492 5866906 6271612 6327373 6547018
7197 6547018 6620835 6676666 6727118 6777536 6819330 6833920 6691940 7087971 7430849 7388175 7739906
7186 7739906 7765166 8326592 7892404 7979265 8038975 8167856 8125136 8189407 8242956 7896842 8105926
7175 8105926 8330342 8231747 8677446 8794688 8844237 8963465 9374885 9348007 9490464 9405332
7165 9405332 9629865 9681312 9758642 9891897 9948371 10270076 10297550 10390176 10736344 10750887 11412176
7154 11412176 12044303 13180872 14633649 14705007 14470913 14457060 14204842 14450523 14691868
7145 14691868 15205526 15148695 15805128 16504829 17819934 18452260 18081689 17319263 16404539
7136 16404539 16251271 16347063 16451022 16574930 17199661 17659933 18687301 19675428 19847978
7127 19847978 19706432 19719595 19691209 19954513 20163899 20261632 20136735 20113141 20186938 20137023
7117 20137023 20846117 21499521 22360213 23498916 24476231 25341088 26249478 27077432 28591304
7108 28591304 30545529 33304456 37243770 42804127 50079079 56741490 60450591 60734118
7100 60734118 59727191 57578015 54005061 49332407 44429044 40388898 37890209 36712169
7092 36712169 37101134 37666754 37086754 35506467 33503324 31909054 30972284 30850505 31213303
7083 31213303 31921145 33105771 35345179 38142910 40219560 41231545 40059235 39405521
7075 39405521 38412770 36890943 35260970 33709976 32758010 32002184 31713107 31634802 31975159
7066 31975159 32289256 32957534 33931832 34296503 34879918 35338771 36032349 37149291 39301179
7057 39301179 42099104 46032005 51924072 57634090 61327293 61862893 61560628 62305334 63731927
7048 63731927 64003122 61586339 57013284 52078609 48404954 46051184 44684557 43778599
7040 43778599 42965629 41876953 41082028 40476644 40174463 40070387 40728322 41698743 43522235
7031 43522235 46357423 50514511 56031436 59522072 60980577 59390599 57071524 53514182
7023 53514182 50617212 49130715 48805085 50034234 51892737 53107996 52509101 50172348
7015 50172348 47532498 45728622 44637782 44801471 45635784 46771823 48512446 49299220 51551753
7006 51551753 54002866 57495107 60284650 60709573 60524609 60886056 61922595 63008166 62258663
6997 62258663 60587016 58680891 56792800 56216713 56865352 57086527 56536377 54620195 52674941
6988 52674941 50721589 49679492 48808851 49457283 49954747 51505511 53329720 56169619 60927483
6979 60927483 66375459 72351935 76045680 80407795 85460901 92299091 98785883 101099484
6971 101099484 97796682 90483746 82029884 74150409 68122455 63764921 61211951 60205091
6963 60205091 61028138 63564138 67873367 74904245 84995635 98644938 112874821 124747424
6955 124747424 132305500 133107740 124901264 109437603 91958717 78546404 69428577 64178775
6947 64178775 61081922 60360060 61903015 66729666 73519622 80470749 84713585 85924890
6939 85924890 85160868 85574575 86706611 89251592 94992401 99011392 96411295 87384039
6931 87384039 75568286 65856393 60155194 56874134 54326445 53437617 53713258 56791099
6923 56791099 61132957 64090930 63900992 60087969 54630802 49860444 47400308 47144223
6915 47144223 49223344 51612238 52773201 51070422 47834077 43569080 39889237 36836085
6907 36836085 34290147 32491288 30918662 30091980 28985365 28107849 27215192 26457283 25317147
6898 25317147 24594051 24436698 25222904 26826697 28871849 30026603 30321283 29706678 30196303
6889 30196303 31954338 32937513 32247397 30032620 27177177 25111756 23692316 22544436
6881 22544436 22055057 21673330 21625102 21302734 21712066 22131214 22323984 23273782 24069942 25170644
6871 25170644 26995240 28373902 29760748 30251803 31311326 32609297 34048410 34619225
6863 34619225 34681109 33892365 33520843 33434020 34265535 35403480 36227037 37831254 38901703
6854 38901703 40792943 43059235 46476382 50590844 55155417 60978483 67777684 77742180
6846 77742180 92009326 113010816 141986552 178217432 213627282 238442280 241852866
6839 241852866 224128135 190752948 152593016 118485355 90934303 70709841 56105828
6832 56105828 45769055 37918101 32795289 29182941 26302794 23939875 22311113 21274253
6824 21274253 20274021 19201746 18321924 18231698 18021990 17961415 18197752 18746673 18612976
6815 18612976 18148088 16987891 15438971 14594576 13803894 13435323 12943006 12478842 12031931
6806 12031931 11607345 11482153 11848044 11273647 11369575 10682348 10491853 10115265 9702891 9985490
6796 9985490 9758028 9740085 9609395 9438234 9127761 9437001 9219028 9495093 9914918 9824261
6786 9824261 10390776 10669802 11367624 12179898 12298993 12081277 11312492 10446135 9864210 9331957
6776 9331957 9040477 9021498 9290094 9580461 9700454 10101895 10726794 12064656 12985050 13620894
6766 13620894 14455549 15345686 15932451 16404179 17178913 17059592 17373410 16453619 15441964
6757 15441964 13874073 12252939 11141105 10254968 10086887 9659468 9775000 9975586 10604470
6748 10604470 11345227 12233207 12943664 14124968 15423769 16828930 18450084 19386166 19262561
6739 19262561 17682123 16236045 14623828 13494907 11973686 10852658 9942176 9339987
6731 9339987 8860006 8691003 8545648 8593736 9110110 9422979 10349855 10790878 11470736 11800464
6721 11800464 12189711 12388084 12620126 12659623 12093475 11069397 9980784 8990642 8021156
6712 8021156 7373009 6795604 6478939 6467416 6152608 6337724 6278819 6057654 5731603 6397540
6702 6397540 6274190 6781145 7106934 7011049 6800877 6321904 6047327 5792895 5403734 5465978
6692 5465978 5738787 5221618 5390337 5266313 4952436 5061084 5202610 5185353 5036954 5291145
6682 5291145 5516774 5164388 5267775 5447686 5713975 5741299 5955053 6046113 6137196 6046030
6672 6046030 6526000 6766395 6828194 7362130 6861904 6997046 6679102 6888554 6969120 7046852
6662 7046852 7445098 7297844 7340216 7332059 7352110 7434135 7969381 8205769 8657021 8690565 8793810
6651 8793810 8926113 8659732 9184628 9254829 9063706 9277068 9381299 9762837 9940823 9910415
6641 9910415 10240403 10884393 11528460 12148771 12636913 13189786 13997698 15010299 16753280
6632 16753280 17236358 16645738 15784856 15038708 14888646 14283957 14387707 14759072 15308353
6623 15308353 15435417 15817487 16100126 16452711 16624638 17199350 17533189 18423255 19413885
6614 19413885 19714335 19584756 19468534 20176736 21201291 22828116 24622075 27857743 32490443
6605 32490443 38744672 42903857 44427381 45067952 45085354 43343692 40008973 36814824 35481483
6596 35481483 36391514 39860381 41365206 39875130 36382960 34132557 33348581 32426494 30593873
6587 30593873 28341985 26644434 26255543 26939211 28040481 30118769 33199742 36198214
6579 36198214 37795548 39726647 42467441 44075820 43348632 40196516 36088965 33274048
6571 33274048 31467025 29573720 27682040 26391175 25253857 24384635 24508542 25199777 26501315
6562 26501315 28581320 29226508 29255129 28058558 27662170 27625559 27099073 26325944 26099543
6553 26099543 25184475 24741383 24847275 25208652 25887214 25685085 24336086 21957285 19152643
6544 19152643 17596548 16504104 16070919 15707005 15602124 16191047 16878615 17808404 18293282
6535 18293282 18892984 18930034 18709263 17723760 17504350 17205231 17238822 17199624 17450093 17378161
6525 17378161 16518737 16206760 15428992 14759679 13942326 13599774 13854915 13899064 14283556 14461721
6515 14461721 14836635 14807552 15091590 14000732 13394934 13552550 13278213 13060322 12360020
6506 12360020 12254906 11349109 11293510 11010806 11044018 10804683 10884127 11085083 11323134 11675065
6496 11675065 11436735 11589866 11575730 12220933 13019664 13736409 14163769 14170226 13959390 13342494
6486 13342494 13558043 13736093 13547793 13478597 12219789 11762979 11459202 11234535 11133372
6477 11133372 11109830 11308076 11508763 11815236 12274072 13087371 13022436 13061795 13476592 14033139
6467 14033139 14763880 15481057 15819919 15064434 14305027 13979604 13810590 13986579 13961366 13086875
6457 13086875 12273200 11370704 11037678 10644896 10749500 11101758 11356974 11676923 11695435 11821970
6447 11821970 11515075 11353537 11418996 11624818 12325323 13220852 13417294 12767440 12536054 11850670
6437 11850670 11064872 10712206 10602607 10290874 9754891 9263603 9394907 9327768 9113453 9189427
6427 9189427 8967708 9042510 9234833 9034335 8995143 9566563 9402972 9218608 9611714 10017006
6417 10017006 10062362 10095769 10319742 10141396 10095608 9862800 9792819 9397641 9196687 9081302
6407 9081302 8801986 9112050 8965381 8914094 8377269 8474291 8756758 8434316 8864330 9029375
6397 9029375 9151963 8945260 9302565 9596716 9531253 9717172 9760573 10047233 9647507 9703383
6387 9703383 9873281 10075279 10374977 10298255 10344288 10245810 10363874 10395389 10238976 11106583
6377 11106583 11537616 12715589 13245134 14359704 15390566 15365453 14828247 13822584 13225057
6368 13225057 12529169 12217221 11669214 11623552 11614341 11893852 12188028 12639069 13898721 14477279
6358 14477279 15629761 16184572 15623115 14898858 14488058 14215826 14437732 14511052 14637642
6349 14637642 14115687 13964679 13682865 13234972 12511693 12411066 12484104 11829888 12283657 12482472
6339 12482472 12669392 13022269 13209478 13572709 13875305 14768117 15435097 16569561 18386434
6330 18386434 21352882 24682974 28462831 30382795 29053761 26540361 23531191 21262174
6322 21262174 19555929 18419178 17981547 17884295 18464416 19442361 20878138 22891662 24830998
6313 24830998 27221619 28640798 27855679 26489322 24524656 23504614 22849704 23016228 24529912
6304 24529912 26582508 28657195 29679729 28788721 27422219 25272458 23209421 21762089
6296 21762089 20838667 20231333 20225849 20586782 21716953 22294151 22770326 22876457 22810658 23658502
6286 23658502 24692528 26163703 28677121 31607533 33976665 34529119 33858083 32860015 31345248
6277 31345248 31103225 32113860 33416150 34636194 34477332 32281369 29290633 26814679
6269 26814679 25132277 24641196 24466527 25234035 24928393 25472917 25615914 25754802 26322544
6260 26322544 26055343 26371491 26027359 25642337 26003790 26253901 27458430 29251848 31229420
6251 31229420 31531760 30058802 27218744 24189342 21663026 19774392 18627746 17738692
6243 17738692 17306891 17018441 16350417 16087397 16196237 16329222 16668143 17377925 17795211
6234 17795211 18825188 19369228 20315661 21291442 21944895 23107577 24091521 23618849 23132721
6225 23132721 22907490 22168633 21574500 20669965 19794970 19048957 18326003 17807988 17448879
6216 17448879 17109094 16704841 15959440 15448653 15012544 14429757 14163143 13670964 13959807
6207 13959807 13965877 13831166 13321027 12057046 10981021 10077769 9096950 8249972 7884238
6198 7884238 7655797 7302084 6890273 6706049 6326024 6141006 6372472 6568699 6995408 6986510
6188 6986510 6743775 6677997 6396783 6465630 6037747 6254609 6326289 6421913 6390809 6686375
6178 6686375 6032039 5975951 6150838 6152140 6132073 5909333 6341113 6568079 6925696 7081696
6168 7081696 6738405 6769203 5948632 5569534 5209061 4957323 4544015 3998874 3973828 3886931
6158 3886931 3902167 3899920 3655322 3540494 3322978 3154470 3344216 3118891 3161886 2931371
6148 2931371 2730178 3034829 2993934 2701052 2787382 2707555 2645767 2621473 2763727 2682465 2663434
6137 2663434 2698508 2576385 2648679 2749805 2887086 2789554 3057125 2923527 3115240 2887307
6127 2887307 2877750 2844916 2590624 2553641 2555531 2497550 2606471 2936428 2379730 2318989 2207041
6116 2207041 2362323 2243704 2493143 2113447 2383600 2191352 2207459 1941015 1961503 2089572
6106 2089572 2022790 1777492 1795868 2088058 1960375 1787894 1681689 1810177 1785031 1732775
6096 1732775 2168416 1868557 1744576 1794961 1587357 1895474 1778345 1496236 1900030 1735585
6086 1735585 1751693 1784946 1774359 1600205 1963142 1586239 1852181 1677499 1810805 1459545
6076 1459545 1557892 1567900 1405366 1956115 1703896 1585961 1637691 1472888 1636476 1844186
6066 1844186 1760584 1640380 1602327 1463402 2052942 1647220 1754329 1677615 1778812 1634782
6056 1634782 1590005 1668863 1614412 1650390 1765413 1607948 1549221 1630071 1528168 1434683 1634741
6045 1634741 1659392 1839470 1560697 1859498 1553919 1796618 1871923 1522693 1626889 1578063
6035 1578063 1928303 1482458 1811425 1708472 1621479 1556876 1537873 1515999 1639545 1588598
6025 1588598 1840756 1368537 1287461 1472661 1089889 1492846 1280499 1444655 1591833 1657267
6015 1657267 1491597 1654410 1564849 1573283 1852367 1433406 1583057 1456303 1370270 1584205
6005 1584205 1815595 1545234 1449795 1473712 1559524 1549056 1593735 1608372 1547456 1435122 1405081
5994 1405081 1422598 1472199 1701983 1580154 1650204 1472888 1670155 1433410 1527556 1471873
5984 1471873 1514429 1650190 1360776 1776915 1373471 1607943 1269867 1602673 1533369 1717619
5974 1717619 1531719 1273355 1441014 1661539 1761795 1452179 1593828 1614246 1528176 1379736
5964 1379736 1598868 1898939 1539002 1533208 1363670 1426671 1476063 1500508 1392844 1624645
5954 1624645 1299541 1439915 1560133 1624759 1810229 1058382 1575595 1504812 1429723 1508564
5944 1508564 1546940 1787917 1227382 1548825 1434747 1416785 1493101 1365764 1627064 1767526
5934 1767526 1759154 1357780 1426569 1446822 1520025 1605836 1755772 1541815 1540861 1553646 1564245
5923 1564245 1578818 1541216 1500627 1544985 1235228 1934691 1594576 1546385 1644307 1431643 1582164
5912 1582164 1397199 1245274 1648818 1470202 1709352 1456888 1667845 1664103 1447005 1527327
5902 1527327 1680307 1770526 1866065 1555336 1704670 1747094 1458750 1564459 1765102 1610390
5892 1610390 1686831 1718572 1866193 1779178 1549299 1526824 1737370 1884315 1697707 1709753
5882 1709753 1844802 1824496 1565561 1760616 1670756 1893993 1895800 1921341 1818272 1842317 1878821
5871 1878821 1914074 1955105 2013311 1897543 1822762 1694802 1730954 2220098 2084382 1783184
5861 1783184 1894525 2032635 2040194 1961268 2157527 2170440 2385793 1958841 2028884 2203054
5851 2203054 2070089 1824100 2162149 2132441 2175340 2121685 1984747 2223496 2156626 2082660
5841 2082660 2277692 2064725 2100829 2160868 2016390 2560619 2465537 2436059 2490622 2402826 2329752
5830 2329752 2303544 2420259 2597271 2723407 2434749 2655587 2464888 2736530 2457731 2519484
5820 2519484 2728319 2414492 2584494 2693697 2860264 2820477 2778127 2547338 2898555 2872847
5810 2872847 2969053 2842616 2872099 2931549 2906862 3060572 2849744 2836238 2861339 2896957 3081764
5799 3081764 3064697 3104989 3094512 3079452 3221288 3157445 3247381 3215516 3260186 3327040 3331257
5788 3331257 3599455 3471155 3277153 3530648 3552681 3610716 3663761 3555025 3653037 3551260
5778 3551260 3553335 3554707 3721693 3592684 3557064 3832475 3720084 3868566 3789800 3627814 3689426
5767 3689426 3963709 4048155 4049469 4241376 3651264 4089665 3990495 4158676 4104927 4521209
5757 4521209 4455203 4469840 4325031 4328780 4399084 4290061 4536551 4676339 4440671 4563043
5747 4563043 4248129 4658688 4964837 4711532 4731739 4791783 4934545 4972877 4980961 5236941
5737 5236941 5487556 5358880 5109169 4982599 5303187 5315421 5356336 5711021 5702752 5367371
5727 5367371 5275330 5593532 5679580 6058850 5692975 5754177 6014361 5937545 5935223 6195165 6067045
5716 6067045 5973282 6086961 6240065 6487049 6445184 6618318 6646803 6677865 6497417 6886993
5706 6886993 6963711 7006039 6842124 7305602 7104216 7330618 7362357 7216043 7498311 7360691
5696 7360691 7621862 7796980 7885896 7831661 7947297 8028412 8242691 8267663 8015489 8409623
5686 8409623 8248721 8450325 8413846 8809466 8645515 8835911 8622425 8948670 8736617 9056933
5676 9056933 9223681 9446091 9409012 9339968 9390894 9522162 9558815 9917750 9801380 10037401
5666 10037401 10310669 10038462 10130606 10285881 10376291 10208268 10434308 10342970 10392026 10477705
5656 10477705 10539527 10849880 11033876 11133911 10719709 10813136 10853666 11063997 11302751 11328718
5646 11328718 11321178 11337566 11101511 11359669 11767779 11491298 11591440 11451747 11815821 11649035
5636 11649035 11852455 11940288 11978765 11842506 12010530 11977936 12244709 12162292 11973577 11973180 11980107
5625 11980107 12040955 12082918 12087680 12153699 12112188 12201069 12137254 12124425 11925611 12049464 11982935
5614 11982935 12188250 12282158 12332622 12260726 12142087 12157370 12357282 12292589 12132298 12087292
5604 12087292 12154182 12253039 11958736 12036732 12084874 12130819 11879254 11907142 11936872 12085187 11774646
5593 11774646 11770658 11760217 11902667 11892100 11815418 11461255 11802085 11667931 11730489 11633061 11592303
5582 11592303 11467456 11470919 11422560 11562644 11477264 11167254 11091382 11227385 11092721 10992906
5572 10992906 11057274 11005563 10850164 10983623 10958304 10804536 11111378 10802248 10929796 10981275
5562 10981275 10779649 10772717 10493678 10637084 10640436 10561216 10394905 10613401 10249072 10239400 10116512
5551 10116512 10276000 10394900 10229728 10278992 9829048 10215148 9806049 10155590 10149309 10038868
5541 10038868 9832508 9693480 9593413 9776027 9836120 9451457 9507227 9618538 9528297 9394356
5531 9394356 9414935 9578882 9350966 9478033 9457574 9322536 9246740 9035571 9331336 9244154
5521 9244154 9263742 9034848 8927845 8807883 8873518 8805665 8747949 8738287 8556199 8538976 8527483
5510 8527483 8776453 8170052 8334950 8092627 8212021 8180554 8080203 8225571 8234350 8352250
5500 8352250 7927817 8009773 7973383 8134902 8137632 7991141 7930738 7609037 7533718 7604110 7586269
5489 7586269 7562330 7450982 7626506 7234506 7136922 7280159 7124501 7063445 6782025 7201544
5479 7201544 7013321 7126653 7456468 7053078 6784827 6879602 6800209 6805207 6840740 6608605
5469 6608605 6883780 6749931 6943284 6659916 6381004 6209886 6503581 6541955 6543063 6548149
5459 6548149 6525266 6213273 6154732 6093560 6124035 6237420 6124703 6237874 6244477 6186077 6083387
5448 6083387 5788576 6165605 6022198 6220254 6140712 5971964 6117327 6200005 6015146 6191397
5438 6191397 5998333 6151024 6056180 6360661 6627819 6786972 7152752 7604649 8201001 8912190
5428 8912190 9035143 8669436 8504519 7761513 7336103 6872244 6290439 5884695 5495077 5482786
5418 5482786 5401578 5299649 5044172 5241731 5224176 5079310 5206623 4914238 4877034 4862146
5408 4862146 4973365 5107864 4924675 4953362 4834072 4897993 4815331 4772067 4543513 4789450
5398 4789450 4750202 4666112 4886005 4344095 4609819 4381031 4382875 4589852 4630566 4707745 4481437
5387 4481437 4539945 4515325 4430805 4444604 4475617 4649312 4580162 4516293 4395829 4287436 4141843
5376 4141843 4393933 4123509 4259539 4211812 4167831 4047331 4190434 4111007 3969735 3819279
5366 3819279 4091410 4168116 4047631 3964854 3989411 3799004 4369547 3829122 4223714 3996846
5356 3996846 4040623 3886491 3942042 4249216 3966261 4060361 3810364 3795642 4328110 4033214
5346 4033214 3840386 3945652 4010144 3642279 3928474 3766448 3860609 3790367 3884682 4315243
5336 4315243 4077390 4211699 3803183 4081841 3935184 4012425 3901001 3959090 3726000 3806027
5326 3806027 3963064 3868762 3988091 3588183 3628144 3602924 3678593 3977878 3648644 3869750
5316 3869750 3830503 3793715 3822423 3823574 3903413 3874971 3846718 3841593 3958587 3971405 3842827
5305 3842827 4007427 3865912 4038118 3843087 4139913 3927469 3946457 3661522 3851008 3867314
5295 3867314 3629801 3825531 3686829 3769599 3695420 3824899 3857282 3880263 3747619 3588535
5285 3588535 3587151 3752420 3843486 3539022 3929853 3559222 4028967 3983259 3826800 3775365
5275 3775365 3881234 3579131 3775709 3810154 3918687 3811583 3720824 3746651 3635136 3875599
5265 3875599 3680837 3631454 3913271 3763011 3735957 3924019 3812125 4003382 3679569 3943663
5255 3943663 4016675 3805126 3829448 3856738 3970296 3957411 3822550 3937631 3648263 3776029
5245 3776029 3718088 3899210 3849161 3881514 3707153 3805015 3863624 3672173 3905199 3736388
5235 3736388 3880128 4092838 3774668 4002758 3681521 3662232 3948528 3937278 4227441 3984530
5225 3984530 3780543 3687857 3816410 3850333 3964196 3959755 3778633 3940492 3822217 3941785
5215 3941785 4016304 3895684 3748767 3959586 4231214 4532992 4485842 4482829 4395472 4311097 4289379
5204 4289379 4098675 4080433 4193989 3887647 3609288 3635184 3964089 3974758 3765633 3889329
5194 3889329 3827691 3784643 3705700 3999533 4087864 3928975 3777397 3838407 3594637 3780462
5184 3780462 3853200 3799044 3582470 3964504 3614972 3813342 3719163 3636692 3754233 3548789
5174 3548789 4043931 3600787 3981231 3708803 3525284 3566409 3484484 3944845 3924031 3831762
5164 3831762 3348914 3818797 3589900 4013849 3764807 3790875 3694607 3794457 3676122 3784095
5154 3784095 3816665 3695749 3621357 3699795 3602803 3474686 3640991 3587705 3680546 3448316 3455821
5143 3455821 3717738 3625736 3690788 3668833 3637012 3756324 3509879 3668548 3724305 3680308 3510202
5132 3510202 3393288 3502265 3604974 3757408 3691143 3637052 3553650 3390234 3582277 3678400
5122 3678400 3602796 3366420 3829798 3473877 3628879 3709139 3800993 3545090 3645971 3490613
5112 3490613 3631179 3688459 3378876 3434240 3831024 3656987 3745437 3688468 3723487 3688983 3736913
5101 3736913 3703318 3483336 3602968 3502301 3615390 3823011 3383385 3513372 3562027 3633439
5091 3633439 3700373 3490050 3415827 3739757 3678110 3854198 3941355 3783075 4032427 3890663
5081 3890663 3856676 4223130 4085498 4311317 4168726 4577029 5080769 5300788 5344480 5230941
5071 5230941 5227737 5400342 6103461 6975294 8225860 9438426 10173277 9976993 8976513
5062 8976513 7964284 7016426 6382480 5624369 4851344 4452743 4307826 4088762 4301089
5053 4301089 4012251 4016845 3940950 3750966 3864680 3730010 3713586 3545530 3741864 3923225
5043 3923225 3743720 3671641 3660328 3755424 3693934 3748342 3794846 3905531 3805811 3894449 3607048
5032 3607048 3720009 3960992 3776756 3708230 3845878 3784581 3891377 3629870 3820965 3933492
5022 3933492 3861635 3981591 3849272 4034342 4307096 4406330 4405146 4478993 4204190 3918545
5012 3918545 3923059 3973488 4119071 3767827 3902812 3747528 3816010 4054018 3825478 3975229
5002 3975229 3946986 4069704 4125903 3863945 4033397 4058350 3897753 3968867 4422956 4327874
4992 4327874 4191150 4195097 4310264 4731279 4515311 5223091 4985605 4890499 4994742 4801274
4982 4801274 5144230 4953334 5190492 5176579 5517180 5642495 6009008 5926657 6406247 6609878
4972 6609878 6500977 7111490 7207780 8046508 8435367 9070394 9186474 9779900 10011433 11116862
4962 11116862 11983365 13963297 16399928 19592868 26131506 38952581 61050926 80060348
4954 80060348 79828725 65017114 44584414 29925186 21237686 15571760 11550102 9790662
4946 9790662 7837946 7184834 6620191 6353371 6481170 6011565 6283013 5879537 5593996
4937 5593996 5341093 5254724 5250649 5131541 4967337 4825779 4856359 4477414 4564328 4102105
4927 4102105 4368141 4250263 4118224 4222960 4409282 4004104 3871092 3946299 3907891 3980084
4917 3980084 3569415 3676196 3234623 3678588 3445803 3585344 3400439 3233863 3219680 3474592
4907 3474592 3348337 3255602 3333482 3106786 3451976 3201162 3087863 3046232 3245228 2995889
4897 2995889 2726522 3091993 2830426 2865306 2862436 2780775 2672177 2787037 2690845 2786966 2847927
4886 2847927 2874934 2730190 2812227 2648022 2551419 2469207 2597553 2678008 2854464 2650639
4876 2650639 2480302 2602671 2700913 2724226 2742059 2777270 2847722 2667136 3066021 3023951 2984645
4865 2984645 3300817 3147350 3316144 3560092 3439313 3405492 3363073 3164426 2962337 3320881
4855 3320881 3005539 3180421 3126420 2946282 2941640 2798125 3237987 3086824 3095212 2764294
4845 2764294 2575829 2653764 2714897 2562135 2471725 2488475 2472278 2610123 2418034 2577822
4835 2577822 2797288 2422282 2504821 2506884 2587655 2668744 2317726 2159757 1942104 2120615
4825 2120615 2009148 2186386 2426926 1863782 1807210 1689936 1888522 1883036 1802009 1735376
4815 1735376 1938726 1520800 1833243 1375179 1688139 1632784 1454734 1834605 1676877 1737591
4805 1737591 1624585 1541557 1478164 1602936 1650311 1459637 1596764 1358912 1662299 1678863
4795 1678863 1843123 1629338 1579131 1314938 1324735 1323842 1539098 1309202 1523980 1758154 1569033
4784 1569033 1454377 1417161 1712183 1484840 1570014 1706265 1530944 1637864 1506132 1263834
4774 1263834 1480760 1532908 1188508 1417840 1432967 1348966 1314277 1230806 1332052 1412202 1435093
4763 1435093 1136197 1425031 1142075 1498684 1245677 1388606 1455122 1139717 1189573 1231350
4753 1231350 1543663 1379081 1340347 1443033 1346046 1478248 1396988 1247087 1331979 1435371
4743 1435371 1464397 1555238 1246617 1135484 1212292 1094014 1225392 1032710 1237959 1422193
4733 1422193 1479158 1292962 1268374 1103852 1762817 1348475 1202552 1382281 1478087 1088821
4723 1088821 1226736 1435378 1324522 1329427 1200568 1351062 1171432 1458516 1192749 1381341
4713 1381341 1450662 1240848 1201323 1255861 1384170 1287837 1134331 1386633 1441963 1278566
4703 1278566 1316772 1172660 1291846 1555623 1672211 1913017 1644689 1568996 1521763 1574246
4693 1574246 1194115 1631975 1275329 1211531 1481893 1482688 1464524 1067395 1206371 993955
4683 993955 1329437 1346864 1160081 1369427 1442355 1427255 929807 1361638 1341062 1439619 1137270
4672 1137270 1226830 1468189 1263241 1326474 1468459 1550490 1709770 1797063 1611899 1460932
4662 1460932 1544747 1471314 1385043 1824494 1488668 1474983 1284247 1405302 1478460 1537053 1412737
4651 1412737 1397960 1635405 1251717 1308173 1323577 1288652 1506852 1286128 1581315 1407022
4641 1407022 1488426 1189136 1344715 1754976 1604170 1278950 1380336 1443812 1652717 1314767
4631 1314767 1461099 1409519 1495854 1505022 1390380 1438955 1450611 1419069 1489798 1579430 1558523
4620 1558523 1528540 1583874 1529964 1781633 1508921 1468189 1380252 1678695 1325224 1566776
4610 1566776 1569403 1531702 1748582 1663594 1579499 1693606 1764720 1776525 1854445 1840980 1943405
4599 1943405 1544743 1788306 1797173 1734376 1718583 1638776 1729446 1859721 2039971 1882958 1847489
4588 1847489 1489415 1728400 1811185 1707494 1797877 1788182 1474773 1649003 1981820 1700283
4578 1700283 2115829 1534787 1940807 1722814 2189061 1994897 1559624 1791848 1390905 2106123
4568 2106123 2222266 2077673 1797744 2005158 1660662 2126931 1935560 2043790 2131503 1970291
4558 1970291 1885293 1836794 2027979 1868513 1989015 2095451 2295140 2077098 2363239 2309811
4548 2309811 2475445 2551089 2360044 2297621 2322015 2461078 2418365 2351128 2362806 2203873 2611938
4537 2611938 2483844 2608446 2476980 2277238 2551783 2776815 2925783 2589515 2379488 2623018
4527 2623018 2561268 2685502 2166897 2337088 2526695 2297059 2284203 2285267 2404506 2320526
4517 2320526 2224036 2384502 2264531 2379969 2427838 2234364 2282098 2458155 2314324 2561991
4507 2561991 2572429 2756651 2362861 2340777 2358319 2465909 2704384 2364612 2611409 2621755
4497 2621755 2825237 2486519 2892727 2771459 2883144 2823277 2885786 2795664 2788029 2496694
4487 2496694 2394630 2277340 2300286 2580301 2262827 2648177 2374719 2593541 2515855 2598860
4477 2598860 2674339 2827759 2523137 2642482 2934486 2896342 3075701 2679228 2938218 2687421
4467 2687421 2820798 2782834 2974777 3136235 2957076 2971773 3117362 3139896 3268262 3037282
4457 3037282 3166705 3462320 3371915 3342678 3603406 3525509 3725514 3532791 3642743 3917093
4447 3917093 4033738 4137237 3816906 3999175 4145856 4264065 4157402 4244261 4393456 4463912
4437 4463912 4599524 4339549 4508175 4384672 4724763 5053948 4908368 5017490 4819087 5120629
4427 5120629 5188731 5334155 5341793 5243760 5193303 5222950 5143350 5238351 5352330 5031666 5257113
4416 5257113 5540247 5569529 5635810 5696881 5702297 5647400 5855855 6167885 5817381 6289477 5825746
4405 5825746 6187198 6370391 6726816 6898843 7023947 7364834 7414455 7899440 8023543 8617237
4395 8617237 9046214 9164586 9520492 9952675 10238980 10313962 10733903 10956132 11549889 11936877
4385 11936877 12540413 13518596 14207117 15056338 16359380 18066614 20867117 24485896 28640836
4376 28640836 32185393 34070973 34621595 34172245 32772985 30456556 28116135 25942712
4368 25942712 24800765 23799023 23102997 23063329 22580427 22942194 23590468 24806218 26769154
4359 26769154 29829254 34518863 41462657 47535504 48253014 46675839 45809788 47295780
4351 47295780 49319922 50527142 51980551 52342379 51898033 50323760 48772066 47934246 48635309
4342 48635309 50705237 52242383 52350369 50326481 46852848 43859201 41651659 41537473
4334 41537473 41972961 43400020 45202395 48823057 55290592 67548410 82111854 85139281
4326 85139281 84523620 80182398 80127318 80310599 78618838 74414427 70722872 69965894 72151873
4317 72151873 75462499 79239951 81631314 81916083 78819734 72728184 65525018 58037773
4309 58037773 52724891 49110461 46721538 45143120 45102144 46308876 49901632 55963916
4301 55963916 63423221 72138121 73341121 70589899 63843249 59602830 58983901 60743209
4293 60743209 65459476 70267661 74819784 78462293 80194016 79472013 76742132 74246994
4285 74246994 73809837 73117352 71045718 66392467 59796906 53458807 48002279 44307850
4277 44307850 41178382 38754192 37072310 36383001 35921452 36154375 36724823 38638563 40852294
4268 40852294 42460795 43015299 41546287 40222544 39347705 39289523 41512547 45655219 49492070
4259 49492070 50826022 48537071 43275871 36987519 31235669 26341455 23217714 20725191
4251 20725191 20030602 19464438 18991139 18118817 16277027 14536396 12674083 11537834 10060634
4242 10060634 9254556 8807124 8181727 7482261 7483725 7395826 6701384 6741592 6180288 6016798
4232 6016798 5799857 5758610 5646235 5573884 6232505 6614782 7580265 8429941 8920230 8675504
4222 8675504 7901177 6905938 5896152 4778559 3920109 3490568 3369182 2896568 2937427
4213 2937427 2821883 2494637 2309682 2217834 1954140 2192094 2021534 1984742 1592380 1879895
4203 1879895 1665685 1705478 1347240 1517420 1517973 1477216 1396639 1244844 1274489 1158477 997944
4192 997944 1245560 1131495 1184308 1098520 981497 822452 1090324 880806 793034 1013482
4182 1013482 846923 842239 1059731 394362 685400 613502 405032 629657 603028 823469
4172 823469 532488 309153 332072 364563 202353 421932 290063 382148 44583 140431
4162 140431 238301 265175 539273 314829 238234 273233 102791 193266 60353 54055 139331
4151 139331 233439 147551 109153 17301 136240 343508 151132 127447 -33228 -83817 154835
4140 154835 122963 253255 -159033 -63482 -276873 195920 184180 50429 -110747 -8832
4130 -8832 3342 22403 157905 -17714 -11818 -31173 206819 221038 334503 298380 150155
4119 150155 117048 163949 106891 168419 125062 163140 274030 98524 109948 212938 253815
4108 253815 76524 328062 335505 289796 459124 183522 194880 28235 337385 341165 517608
4097 517608 442373 558795 521376 464056 225628 675598 593749 844098 547167 496814 508894
4086 508894 635801 535649 545584 697952 646608 338262 590897 533472 540769 463417 915310
4075 915310 756243 480163 576950 483535 460632 530346 396528 546175 570507 471998 571964
4064 571964 817344 898108 730801 776553 967982 811853 594149 541148 492264 1134172
4054 1134172 783527 909409 886702 625955 681093 682715 766957 804444 724346 638369 644073
4043 644073 509767 653324 581038 806650 488866 795532 898551 614765 863785 606185
4033 606185 711630 800300 619144 1010104 651337 759212 752743 1031310 920680 1035684
4023 1035684 948564 1275694 744998 942082 664932 490327 498551 282859 444983 408931
4013 408931 463135 397107 340532 305881 415723 385880 550715 403213 71684 248932 158283
4002 158283 319966 213638 301604 270472 258659 350322 229347 408550 102748 218983
3992 218983 230515 155999 34064 31650 -184439 -133781 43615 -166359 -65522 -150491 4634
3981 4634 -130196 -109332 166705 -97283 -69488 -95011 -256828 -87693 -187726 -9714 -138503
3970 -138503 -70122 -341280 -52708 -403673 -35578 -188836 -273489 -309179 -314090 -254519 -152318
3959 -152318 -340771 -239976 -419361 -371188 -374503 -330362 -427973 -145612 -420868 -148394 -514682
3948 -514682 -221126 -459712 -338186 -373991 -566252 -187293 -572613 -297058 -385805 -280694
3938 -280694 -414153 -326858 -477591 -305945 -586262 -625299 -603053 -434934 -203646 -647185
3928 -647185 -388002 -464480 -426161 -263528 -394695 -397771 -397201 -505137 -446385 -459163 -172388
3917 -172388 -379308 -658156 -525725 -474358 -570656 -262249 -431334 -250340 -615401 -440470
3907 -440470 -687758 -322840 -336372 -443748 -362493 -463274 -389453 -494620 -431475 -287591
3897 -287591 -371168 -602848 -458144 -563432 -459119 -598725 -520470 -319551 -472141 -519535
3887 -519535 -431451 -445723 -265496 -575054 -272711 -413844 -344296 -637039 -318856 -325817 -290161
3876 -290161 -480224 -393160 -369447 -304338 -452078 -451373 -75646 -437670 -504878 -313730 -437033
3865 -437033 -535128 -594605 -455659 -299210 -421444 -302329 -481830 -621819 -766075 -518834
3855 -518834 -433084 -327112 -316383 -496297 -431914 -470291 -285833 -243373 -231567 -504327 -377811
3844 -377811 -504116 -463951 -338137 -452710 -482191 -471634 -546591 -445719 -301574 -268924 -651165
3833 -651165 -536717 -737290 -620002 -206655 -393009 -339447 -612596 -511258 -395180 -667139
3823 -667139 -458468 -502486 -491834 -587534 -201333 -196867 -290402 -533932 -531042 -338905 -455867
3812 -455867 -206503 -441625 -291283 -637692 -412441 -356534 -312734 -282836 -277551 -231792 -486121
3801 -486121 -659561 -371778 -355182 -491763 -592335 -379992 -364124 -339748 -506984 -611525
3791 -611525 -423136 -449218 -482551 -424341 -475978 -520219 -345239 -550122 -64959 -560551 -362397
3780 -362397 -454507 -473986 -200451 -279550 -449541 -441938 -433020 -529813 -216551 -337291 -300594
3769 -300594 -399375 -636762 -595190 -631077 -345023 -581107 -500506 -561890 -374207 -558678 -639879
3758 -639879 -461728 -298785 -538305 -296659 -349617 -266154 -380964 -462620 -207711 -299259
3748 -299259 -375054 -417465 -119114 -409904 -193791 -353880 -146260 -344299 -337889 -379824 -224522
3737 -224522 -466503 -586643 -543113 -480702 -409175 -414642 -455022 -641438 -361110 -242934 -75139
3726 -75139 -342975 -587604 -351709 -456207 -197817 -82622 -320477 -508585 -208671 -462211
3716 -462211 -369420 -170426 -293784 -593134 -592935 -414889 -384375 -410476 -517233 -805769 -492722
3705 -492722 -305638 -367166 -323516 -613373 -383102 -486128 -508492 -103528 -280092 -314744
3695 -314744 -466926 -246486 -286518 -362992 -513217 -241733 -522545 -393548 -301883 -437104
3685 -437104 -333250 -406205 -782356 -553914 -327492 -456582 -403742 -394680 -385870 -636785 -614652
3674 -614652 -307907 -509824 -639800 -382836 -473609 -278705 -494510 -403440 -583484 -516553
3664 -516553 -459025 -511905 -290344 -150141 -383294 -436483 -377505 -222718 -411335 -798462
3654 -798462 -186514 -25763 -454662 -162829 -196602 -362145 -464548 -470216 -115233 -7417
3644 -7417 -558269 -333360 -662990 -255119 -672682 -397948 -621437 -353198 -533059 -660528
3634 -660528 -438418 -438656 -490277 -702644 -524008 -356191 -402000 -226007 -446144 -501769 -332850
3623 -332850 -271554 -92610 -386392 -376829 -659972 -438812 -322551 -198995 -299170 -450607
3613 -450607 -269128 -616984 -435157 -451185 -228795 -386815 -382295 -358947 -432154 -574524 -173731
3602 -173731 -420341 -451617 -482742 -216360 -152421 -355616 -196597 -247066 -472852 -118178
3592 -118178 -179616 -435419 -164438 -247287 -219106 -255021 -266629 -360884 -632802 -398103 -159764
3581 -159764 -263209 -456489 -241568 -645939 -424101 -374973 -336021 -233992 -406079 -459628
3571 -459628 -613886 -278694 -298756 -356284 -225126 -271446 -515667 -258806 -323636 -287332 -4316
3560 -4316 -371861 188662 -98132 -100684 -206268 -32086 -6743 -503174 -191884 -672665 -348847
3549 -348847 -427989 -288283 -277338 -232483 -485716 -264249 -138811 -447522 -174438 -363614
3539 -363614 -320197 -432717 -447965 -242160 -388830 -421133 -423076 -96542 -275307 -648573 -384600
3528 -384600 -285617 19103 -32441 -228715 -302479 -456377 -584123 -170780 -162838 -115467 -238451
3517 -238451 -485087 -374552 -166533 -93003 -298925 -130531 -265001 -383832 -262610 -262769
3507 -262769 -221131 -489377 -400293 -31737 -44848 -317655 -438049 -524610 -233303 -239077 -22175
3496 -22175 -292094 -195564 -120669 -400780 -185055 -30698 -230382 -408217 -165451 -102070
3486 -102070 -299139 -176329 -246950 -272518 -409582 -649020 -181367 -267024 -8762 -222597
3476 -222597 -680184 -129437 -304857 -237614 -180422 -440677 -346995 -81956 -396946 -230416
3466 -230416 -170986 -253243 -81918 -348958 -63722 -197797 -455915 -256916 30711 75918
3456 75918 -176088 -250121 -72806 -319510 -256834 -296424 30942 -74286 -482849 -452048 -169983
3445 -169983 -78951 1125 -86890 -270455 101523 -372527 -253188 -286460 -206741 -123281 -169699
3434 -169699 -301395 76581 -160317 -323740 -15088 -85867 -67655 68239 -141114 196371
3424 196371 -192565 -24758 -133680 -71807 -36484 -49474 -175243 30981 -96322 -192800
3414 -192800 -145040 101422 12830 -228711 -211330 -77600 -21546 -89818 21206 -39268 -161142
3403 -161142 149341 165675 13338 162410 67905 154245 62681 272509 178635 294673 180191
3392 180191 -20237 246153 316533 400661 198739 360429 108614 -11839 455382 101324
3382 101324 390179 376837 530455 212671 294140 365961 507150 170426 317453 344883
3372 344883 362214 654412 341223 490494 630054 723185 677815 870212 1074570 807322
3362 807322 562418 792225 926077 1010388 827862 714961 1158951 1064065 1141751 1346598
3352 1346598 1533224 1477570 1358717 1550801 1858389 1803585 2089077 2196610 2389228 2891820
3342 2891820 3084215 3382774 4532277 5148248 5605881 5682183 5530903 5965803 6236471 6909970
3332 6909970 8188483 10010259 12373172 15945379 23445876 38489879 62006058 64342390
3324 64342390 56197563 36229960 23693468 15995246 11295238 7787093 5555348 4228927
3316 4228927 3546000 3188846 3247215 3487701 3476852 2979912 2739976 2268027 1755447 1684053
3306 1684053 1530519 1343683 1188101 1061996 851237 968253 847771 618322 820432 856685
3296 856685 496481 666165 502418 659806 608917 167182 687511 359735 450559 366347
3286 366347 248285 123218 228665 194144 394733 418979 81970 264890 83975 603146
3276 603146 403389 183014 261910 99032 56533 152852 50047 2519 252451 48700
3266 48700 -128727 -3599 -157205 -24117 -59956 205409 -131378 -22834 -44904 -155252
3256 -155252 26739 -358329 -302868 -135731 95156 -66187 -349401 -478810 -271981 -298670
3246 -298670 -372108 110121 36108 -74066 -467762 -347846 -568841 -156308 -1469 25728
3236 25728 -284169 -521105 -312137 -442688 -19342 -100909 -354010 -203919 -159972 22619
3226 22619 -137860 -1115 -125660 -302228 -372220 -257933 -208843 -261036 -126470 -36440 127783
3215 127783 -322884 -406482 -393685 -390153 49291 -395882 -367520 -95254 -364044 -334089 -91286
3204 -91286 1261 -305511 -331766 -373560 -116356 -177388 -249235 -409472 -382712 -313145 -158090
3193 -158090 -152901 -284397 -255619 -446956 -417180 -167456 -294813 -306275 -68559 -411958 -193630
3182 -193630 -580952 -225123 -254655 -496839 -260691 -377115 -309136 -603955 -376461 -505430
3172 -505430 -207584 -143634 -394033 -471460 -768940 -573067 -543686 -380806 -138169 -267242
3162 -267242 -448859 -799374 -513858 -337582 -75255 -72758 -307062 -531014 -569488 -376125
3152 -376125 -256439 -472895 -226096 -273389 -352627 -272123 -314628 -327844 -180268 -298883 -392303
3141 -392303 -317977 -279761 -295160 -499335 -506043 -206378 -553186 -218013 -408189 -140378 -574913
3130 -574913 -550281 -248413 -470355 -407660 -449074 -223199 -426582 -528369 -481776 -504552 -421103
3119 -421103 -49340 -357869 -429293 -365099 -547552 -238086 -376127 -352217 -383622 -429259 -305975
3108 -305975 -437672 -649329 -399849 -477066 -147936 -93161 -178840 -390750 -428390 -486829 -141974
3097 -141974 -259795 -193440 -209636 -334603 -217423 -18312 57021 164907 -8867 -105073
3087 -105073 -97485 -191144 -344567 -491083 -584699 -328668 -634527 -249246 -418903 -508330 -547948
3076 -547948 -613662 -386361 -126158 -583574 -608547 -438419 -592537 -494681 -323151 -131358
3066 -131358 -352901 -423439 -374387 -286073 -442335 -451201 -375169 -231569 -225963 -158187 -432068
3055 -432068 -371330 -412069 -297446 -527192 -220721 -510406 -346642 -364596 -631575 -380074
3045 -380074 -261522 -378971 -388961 -520193 -522834 -238701 116117 -301933 -372852 -649307 -437891
3034 -437891 -314202 -317888 -105789 -321250 -348553 -638008 -280997 -206196 -275928 -415871 -475876
3023 -475876 -386806 -283725 -391051 -518727 -517538 -411489 -352552 -272838 -158894 -153340 -342752
3012 -342752 -432376 -237998 -720058 -431481 -439502 -198727 -462072 -314372 -451616 -482143
3002 -482143 -610135 -550224 -399817 -333926 -148013 -362299 -298156 -479935 -478266 -365676 -395101
2991 -395101 -301647 -415368 -385369 -156594 -312204 -366883 -326396 -313820 -478729 -583271 -284421
2980 -284421 -393297 -11886 -320854 -524561 -520796 -263702 -263921 -273580 -245714 -274807 -551252
2969 -551252 -335161 -463008 -335477 -390056 -519526 -328206 -248816 121200 -314562 -527031
2959 -527031 -377793 -222608 -320819 -273596 -134533 -275923 -555582 -466984 -256734 -222855
2949 -222855 -287603 -459216 -693207 -347209 -250046 -304945 -198795 -183878 -308773 -447134
2939 -447134 -322552 -275657 -247219 -306959 -342306 -472587 -642566 -279885 -633964 -416936
2929 -416936 -260276 -439293 -262760 -307621 -485439 -568067 -575650 -279082 -211462 -256821 -310824
2918 -310824 -397624 -502632 -374856 -517191 -161255 -308541 -211281 -262346 -682188 -452594
2908 -452594 -321585 -337341 -473073 -467834 -578260 -506132 -267819 -40953 -254988 -445413
2898 -445413 -668350 -373501 -473531 -283222 -416326 -349605 -289620 -509590 -504924 -286503
2888 -286503 -491667 -173678 -551273 -290680 -325815 -397481 -462793 -146332 -416082 -233147
2878 -233147 -333133 -283973 -410464 -451164 -132905 -345921 -27783 -218178 -397230 -373198
2868 -373198 -466724 -417042 -146420 -311081 -267166 -523837 -241029 -598431 -328666 -199907
2858 -199907 -418592 -90374 -351763 -455973 -547898 -443918 -413772 -356313 -433100 -479891 -501863
2847 -501863 -646178 -321917 -497471 -375804 -324864 -143033 -295201 -273482 -422146 -333881
2837 -333881 -235596 -443925 -281022 -323318 -307979 -397056 -196355 -306192 -256955 -377670 44937
2826 44937 -80227 -214548 -479841 -347164 -462602 -404075 -548674 -584822 -490456 -313639
2816 -313639 -337096 -364507 -471700 -451332 -394329 -405381 -146978 -456827 -459472 -399574 -312276
2805 -312276 -282132 -261827 -227250 -542753 -602868 -441167 -121322 -95387 -127081 -466244 -365113
2794 -365113 -345505 -280598 -159719 -430690 -539815 -247234 -559966 -91157 -415064 -355745
2784 -355745 -451489 -196424 -174405 -211269 -242250 -254312 -257289 -577395 -138736 -195914 -164084
2773 -164084 -533045 -560173 -603169 -326742 -369534 -164354 -106758 -247813 -234509 -294099 -133262
2762 -133262 -508761 -283912 -160565 -211067 -388911 -328402 -301193 -214907 -413848 -316606 -115074
2751 -115074 -558713 -417870 -492076 -345461 -338683 -329048 -373329 -155276 -392075 -554245 -351987
2740 -351987 -489971 -382757 -589741 -234778 -158939 -179039 -428476 -424049 -455580 -289462 -420965
2729 -420965 -220357 -362641 -366614 -316319 -223523 -371947 -421617 -475721 -546518 48223 -412714
2718 -412714 -373617 -496766 -420199 -487809 -403077 60776 -191144 -377794 -487179 -207449
2708 -207449 -156855 -44020 -401199 -239826 -314750 -73628 -168305 -418477 -167037 -556550
2698 -556550 -6678 -374260 -329577 -285074 -546004 -347650 -530751 -307828 -180346 -367542
2688 -367542 -416586 -287353 -487149 -380105 -56304 -188002 -238380 -464900 -126896 -183292
2678 -183292 -240447 -202114 -504320 -140811 -254229 -351286 -256323 -271780 -499446 -115153 -483732
2667 -483732 -272576 -200330 -437597 -355561 -423925 -183028 -358976 -492153 -341844 -12926
2657 -12926 -301701 -170584 -622061 -529786 -176223 -445147 -278964 -223692 -216925 -615773 -364035
2646 -364035 -273006 -532527 -299351 -430368 -189052 -398175 -390657 -322724 -398103 -236042 -311096
2635 -311096 -197240 -288789 -594269 -373816 -354965 -140370 -40921 -349007 -370834 -294660 -400963
2624 -400963 -97318 -242085 -363271 -376732 -558888 -351765 -481304 -172351 -292339 -291670
2614 -291670 -550803 -290195 -464581 -108306 -530149 -558797 -311734 -198450 11159 -120630
2604 -120630 -310033 -258268 -333664 -350349 -269590 86681 -201724 -551565 -605263 -27195 -348679
2593 -348679 -389531 -303635 -384699 -198869 -306608 -503765 -221393 -382825 -511138 -492789
2583 -492789 -425277 -154316 -272677 -368636 -190227 -308454 -361249 -297243 -244686 -272713 -273015
2572 -273015 -278209 -162091 -166722 -399835 -422599 -495108 -428884 -243828 -315356 -350144 -360615
2561 -360615 -317341 -292885 -379500 -216540 -185228 -460063 -85754 -507191 -234435 -199107 -442130
2550 -442130 -149298 -248363 -404687 -174579 -413246 -301449 -175609 -400677 -35608 -699953
2540 -699953 -391811 -291160 -466322 -75641 -658479 -570988 -236438 -425639 -356599 -180948
2530 -180948 -427052 -373508 -349573 -417008 -263227 -489852 -347687 -280056 -536542 -240221
2520 -240221 -288861 -298997 -195279 -249218 -374025 -345952 -406275 -147679 -469730 -282320 52019
2509 52019 -615504 -317363 -510903 -344521 -50061 -209766 -15708 -548419 -473939 -364886
2499 -364886 -464713 -290364 -76613 -157391 -276956 -441316 -309285 -355629 -331843 -206044
2489 -206044 -171331 -414503 -314107 -279271 -225349 -318309 -13687 -336244 -131226 -132785 -372228
2478 -372228 -401161 -468421 -478737 -180050 90748 -315751 -595676 -393464 -480886 -455349 -267936
2467 -267936 -245962 -158378 -384916 -426449 -381452 -240365 -417011 -335086 -440966 -197675 -310927
2456 -310927 -379943 -223489 -501296 -542021 -399836 -154932 -347213 -387706 -388148 -84692 -158530
2445 -158530 -338084 -531565 -385264 -265733 -611049 -253553 -107090 -209068 -287960 -365173
2435 -365173 50681 -96804 -420088 -355389 -161144 -161804 -284733 -464317 -16220 -205309
2425 -205309 -276004 -267723 -401166 -201335 -245134 -334761 9843 -392719 -527284 -627183 -547140
2414 -547140 -358874 -144637 -268409 -372358 -201681 -392993 -548266 -491181 -284068 -279267
2404 -279267 -27522 -288740 -617658 -313599 -419471 -317143 -414261 -328603 -356293 -422086
2394 -422086 -494672 -124389 -186818 -91029 -371948 -402113 -130867 -172038 -120572 -135652 -27698
2383 -27698 -299779 -307323 -336379 46497 -139798 -404273 -299318 -392263 -339422 -560417 -387358
2372 -387358 -181631 -251882 -147696 -559701 -385107 -407275 -444069 -95212 -446700 -337471
2362 -337471 -420984 -324822 -200678 -223339 -510370 -338365 -475987 -61122 -554684 -71857
2352 -71857 -87631 -299216 -147602 -179353 -356461 -270883 -494394 -269093 -278507 -92411 -404502
2341 -404502 -278735 -152713 -388038 -368104 -373537 -539485 -365903 -273872 -334676 -359456 -344661
2330 -344661 -247353 -198932 -429415 -136381 -470176 -514408 -305113 -380908 -516337 -491482 -208712
2319 -208712 -248786 -281949 -508268 -113344 -364898 -455780 -235453 -555611 -288876 -463889
2309 -463889 -352960 -243381 -303194 -360561 -341389 -341196 -253004 -348304 -471986 -68121 -440482
2298 -440482 -134399 -465713 -196436 -298909 -106230 -401733 -184597 -261243 -434845 -416611
2288 -416611 -411985 -151577 -141625 -196916 -494345 -283402 -352912 -366798 -281511 -231349 -530538
2277 -530538 -418716 -105536 -266171 -10384 -233623 -649382 -523285 -362300 -226227 -131696
2267 -131696 -369659 -361953 -543597 -715129 -421573 -239254 -626256 -312004 -444958 -478240
2257 -478240 -247714 -418972 -363638 -189301 -63668 -251335 -177686 -273259 -393200 -328842
2247 -328842 -247854 -209748 -258908 15963 -238919 -197485 -467623 -371605 -389005 -396918 -242331
2236 -242331 -273551 -377870 -139407 -555932 -626336 -244254 -414995 -288700 -541730 -312805
2226 -312805 -259776 -379285 -210607 -277235 32988 -183679 -168892 -23237 -265298 -345797
2216 -345797 -594096 16051 -96267 -315328 -378334 -303027 -110658 -482233 -198890 -491317
2206 -491317 -204976 -573153 -529043 -336497 -480660 -436049 -421512 -178994 -389224 -225367
2196 -225367 -528227 -233818 -276953 -402595 -246645 -89034 -291042 -319659 -264986 -266409 -174803
2185 -174803 -175106 -592820 -242542 -282935 -490529 -256990 -405613 -402396 -425161 -235916 34561
2174 34561 -131932 -46551 -629899 -327208 -342558 -69465 -101173 -71734 -240519 -247842 -640692
$$ [...]
##END NTUPLES=NMR SPECTRUM
##END=
