##TITLE=abcd
##JCAMPDX= 6.0         $$ Bruker NMR JCAMP-DX V2.0
##DATA TYPE= NMR SPECTRUM
##DATA CLASS= NTUPLES
##ORIGIN= UXNMR, Bruker Analytische Messtechnik GmbH
##OWNER= root
$$ XWIN-NMR		Version 3.5
$$ Tue Mar 31 19:02:27 2026 Russian Standard Time (UT+4h)  servis@DPX200
##.OBSERVE FREQUENCY= 200.131235884673
##.OBSERVE NUCLEUS= ^1H
##.ACQUISITION MODE= SIMULTANEOUS
##.ACQUISITION SCHEME= undefined
##.AVERAGES= 32
##.DIGITISER RES= 18
##SPECTROMETER/DATA SYSTEM= spect
##.PULSE SEQUENCE= zg
##.SOLVENT NAME= CDCl3
##.SHIFT REFERENCE= (INTERNAL, CDCl3, 0, 16.4885)
##AUDIT TRAIL= $$ (NUMBER, WHEN, WHO, WHERE, WHAT)
$$ ##TITLE= Audit trail, XWIN-NMR		Version 3.5
$$ ##JCAMPDX= 5.01
$$ ##ORIGIN= Bruker BioSpin GmbH
$$ ##OWNER= servis
$$ F:\spectra/data/av/nmr/H1/1/pdata/1/auditp.txt
$$ ##AUDIT TRAIL=  $$ (NUMBER, WHEN, WHO, WHERE, WHAT)
(   1,<2026-03-31 19:01:46.76 +0400>,<servis>,<DPX200>,
      <created by zg, POWCHK disabled, PULCHK disabled
       configuration hash MD5:
       00 E9 B6 7A A2 85 ED C7 34 08 36 98 17 FE 4E 26
       data hash MD5: 32K
       F4 24 46 1B EE 0D 18 A0 E4 F6 99 DA 80 D5 6C 0D>)
(   2,<2026-03-31 19:01:48.34 +0400>,<servis>,<DPX200>,
      <Start of raw data processing
       efp BC_mod = 2 LB = 0.05 FT_mod = 6 PKNL = 1 PHC0 = -256.1951 PHC1 = -0.898437 SI = 16K 
       data hash MD5: 16K
       6C 42 91 5A 3B C6 5D 10 0D 05 4F C0 41 EF 3C F5>)
(   3,<2026-03-31 19:01:59.15 +0400>,<servis>,<DPX200>,
      <pk PHC0 = -6.799999 PHC1 = 0 
       data hash MD5: 16K
       A2 76 83 61 CF 50 FC DE E8 BC 39 93 AA D9 AF 70>)
$$ ##END=
$$ 
$$ hash MD5
$$ A4 BD 7A D4 41 BA 0A 39 B4 78 56 4D 7B F7 1C 7B
##$RELAX= 
##$RELAX= 
##$RELAX= 
##$RELAX= 
##$RELAX= 
##$RELAX= 
##$RELAX= 
##$RELAX= 
$$ Bruker specific parameters
$$ --------------------------
##$DU= <F:\spectra>
##$EXPNO= 1
##$NAME= <H1>
##$PROCNO= 1
##$TYPE= <nmr>
##$USER= <av>
##$AMP= (0..31)
100 100 100 100 100 100 100 100 100 100 100 100 100 100 100 100 100 100 
100 100 100 100 100 100 100 100 100 100 100 100 100 100 
##$AQSEQ= 0
##$AQ_mod= 1
##$AUNM= <au_zg>
##$AUTOPOS= <>
##$BF1= 200.13
##$BF2= 200.13
##$BF3= 200.13
##$BF4= 200.13
##$BF5= 500.13
##$BF6= 500.13
##$BF7= 500.13
##$BF8= 500.13
##$BYTORDA= 1
##$CFDGTYP= 0
##$CFRGTYP= 5
##$CHEMSTR= <none>
##$CNST= (0..31)
1 1 145 1 1 1 1 1 1 1 1 1 1 1 1 1 1 1 1 1 1 1 1 1 1 1 1 1 1 1 1 1 
##$CPDPRG= <>
##$CPDPRG1= <>
##$CPDPRG2= <>
##$CPDPRG3= <>
##$CPDPRG4= <mlev>
##$CPDPRG5= <mlev>
##$CPDPRG6= <mlev>
##$CPDPRG7= <mlev>
##$CPDPRG8= <mlev>
##$CPDPRGB= <>
##$CPDPRGT= <>
##$D= (0..31)
0 2 0 0 0 0 0 0 0 0.06 0 0 0 0 0 0 0.0002 0 0 0 0 0 0 0 0 0 0 0 0 0 0 
0 
##$DATE= 1774969306
##$DBL= (0..7)
120 120 120 120 120 120 120 120 
##$DBP= (0..7)
150 150 150 150 150 150 150 150 
##$DBP07= 0
##$DBPNAM0= <>
##$DBPNAM1= <>
##$DBPNAM2= <>
##$DBPNAM3= <>
##$DBPNAM4= <>
##$DBPNAM5= <>
##$DBPNAM6= <>
##$DBPNAM7= <>
##$DBPOAL= (0..7)
0.5 0.5 0.5 0.5 0.5 0.5 0.5 0.5 
##$DBPOFFS= (0..7)
0 0 0 0 0 0 0 0 
##$DE= 6
##$DECBNUC= <off>
$$ [...]
##$SUBNAM4= <"">
##$SUBNAM5= <"">
##$SUBNAM6= <"">
##$SUBNAM7= <"">
##$SUBNAM8= <"">
##$SUBNAM9= <"">
##$SW= 20.6817932712277
##$SWIBOX= (0..15)
0 0 3 0 0 0 0 0 0 0 0 0 0 0 0 0 
##$SW_h= 4139.07284768212
##$TD= 32768
##$TD0= 1
##$TE= 0
##$TE2= 300
##$TE3= 300
##$TEG= 300
##$TL= (0..7)
0 120 120 120 120 120 120 120 
##$TP= (0..7)
150 150 150 150 150 150 150 150 
##$TP07= 0
##$TPNAME0= <>
##$TPNAME1= <>
##$TPNAME2= <>
##$TPNAME3= <>
##$TPNAME4= <>
##$TPNAME5= <>
##$TPNAME6= <>
##$TPNAME7= <>
##$TPOAL= (0..7)
0.5 0.5 0.5 0.5 0.5 0.5 0.5 0.5 
##$TPOFFS= (0..7)
0 0 0 0 0 0 0 0 
##$TUNHIN= 0
##$TUNHOUT= 0
##$TUNXOUT= 0
##$USERA1= <user>
##$USERA2= <user>
##$USERA3= <user>
##$USERA4= <user>
##$USERA5= <user>
##$V9= 5
##$VALIST= <valist>
##$VCLIST= <CCCCCCCCCCCCCCC>
##$VD= 0
##$VDLIST= <DDDDDDDDDDDDDDD>
##$VPLIST= <PPPPPPPPPPPPPPP>
##$VTLIST= <TTTTTTTTTTTTTTT>
##$WBST= 1024
##$WBSW= 30
##$XGAIN= (0..3)
0 0 0 0 
##$XL= 0
##$YL= 0
##$YMAX_a= 264854
##$YMIN_a= -156749
##$ZGOPTNS= <>
##$ZL1= 120
##$ZL2= 120
##$ZL3= 120
##$ZL4= 120
##$ABSF1= 0
##$ABSF2= 0
##$ABSG= 0
##$ABSL= 0
##$ALPHA= 0
##$AQORDER= 0
##$ASSFAC= 0
##$ASSFACI= 0
##$ASSFACX= 0
##$ASSWID= 0
##$AUNMP= <proc_1d>
##$AZFE= 0.1
##$AZFW= 0.1
##$BCFW= 0
##$BC_mod= 2
##$BYTORDP= 0
##$COROFFS= 0
##$CY= 18.4799938201904
##$DATMOD= 1
##$DC= 0
##$DFILT= <>
##$DTYPP= 0
##$F1P= 9.9274215381318
##$F2P= -0.165520771350173
##$FCOR= 1
##$FTSIZE= 16384
##$FT_mod= 6
##$GAMMA= 0
##$GB= 0
##$INTBC= 1
##$INTSCL= 4.127829e-11
##$ISEN= 128
##$LB= 0.05
##$LEV0= 0
##$LPBIN= 0
##$MAXI= 10000
##$MC2= 0
##$MEAN= 0
##$ME_mod= 0
##$MI= 50
##$NCOEF= 0
##$NC_proc= -5
##$NLEV= 6
##$NOISF1= 3.799351
##$NOISF2= 2.8
##$NSP= 0
##$NTH_PI= 0
##$NZP= 0
##$OFFSET= 16.48848
##$PC= 4
##$PHC0= -262.9951
##$PHC1= -0.898437
##$PH_mod= 1
##$PKNL= yes
##$PPARMOD= 0
##$PSCAL= 4
##$PSIGN= 0
##$REVERSE= no
##$SF= 200.130005582386
##$SI= 16384
##$SIGF1= 3
##$SIGF2= 2
##$SINO= 400
##$SIOLD= 16384
##$SREGLST= <1H.CDCl3>
##$SSB= 0
##$STSI= 16384
##$STSR= 0
##$SW_p= 4139.07284768211
##$SYMM= 0
##$S_DEV= 0
##$TDeff= 32768
##$TDoff= 0
##$TI= <>
##$TILT= no
##$TM1= 0
##$TM2= 0
##$TOPLEV= 0
##$USERP1= <user>
##$USERP2= <user>
##$USERP3= <user>
##$USERP4= <user>
##$USERP5= <user>
##$WDW= 1
##$XDIM= 16384
##$YMAX_p= 312260796
##$YMIN_p= -209981
$$ End of Bruker specific parameters
$$ ---------------------------------
##NTUPLES= NMR SPECTRUM
##VAR_NAME=  FREQUENCY,     SPECTRUM/REAL,   SPECTRUM/IMAG
##SYMBOL=    X,             R,               I
##VAR_TYPE=  INDEPENDENT,   DEPENDENT,       DEPENDENT
##VAR_FORM=  AFFN,          ASDF,            ASDF
##VAR_DIM=   16384,         16384,           16384
##UNITS=     HZ,            ARBITRARY UNITS, ARBITRARY UNITS
##FACTOR=    0.252644378177508, 1,           1
##FIRST=     3299.83951724647, 0,            0
##LAST=      -839.233330435636, 0,           0
##MIN=       -839.233330435636, -209981,     0
##MAX=       3299.83951724647, 312260796,    0
$$ Real data points
##PAGE= N=1
##DATA TABLE= (X++(R..R)), XYDATA
$$ [...]
10685A2221l388l6715j773j9942K936J8834m4495j293J00778m8590p463m765P6807
10672D3152r9238n6837K0269N9488o7260J36180q335p6247M7337r5492P1952N3646
10660B8615n4327M396Q923L1539j2612p3326J24252q2083m283N7838j1517l5950
10648a8535M2729l3635j4758N1820k8755M713J907O4177l3661k0804k8577Q3824
10636G0445p7948M8175n4516j2895J10349j00702q369m9850L2666L5776P7179
10625G0310n9990M2795o0814K6685r8131O0496M0387q6288J5713R1960m3930K8871
10613B8064o2538N5914K884j09753J42934j13379L4678J8296J2160p039Q1617
10602H3838m9308M1530p6367J6703K3217N882m7565l6679J0039O2235L6734p0337
$$ y = [12221, 8833, -27882, -29655, -49597, -46661, -27827, -72322, -73615, 27163, -21427, -28890, -33655, 43152, -56086, -112923, -92654, -33166, -100426, 35754, 27419, -48828, -1491, -96983, -25031, 28615, -25712, -21316, -12393, 19146, 6534, -66792, 57460, -24623, -28906, 28932, 17415, -18535, 24194, -9441, -24199, 27621, -1134, 3579, 5486, 69663, 36002, 15198, -13379, 70445, -7503, 40672, -13844, -26739, 83610, -17092, -25461, -75311, -42645, -6869, 70310, 10320, 53115, -7699, 18986, -79145, -18649, 21738, -64550, -48837, 43123, -807, 28064, -34474, 21440, 24324, -85429, 57505, -55874, -21196, -2900, 9260, 2221, 83838, 34530, 76060, -307, 16396, 39613, 45495, -2070, -38749, -28710, 33525, 70259, -78]
10590g8P8137l647J9097J3368j05502O7593M6790l6390j04404R7283m0595j2627
10578A9025K5493n341J2021n1379R933J07198q4348J7536n2700N7356K1186j17424
10566d1444Q7962l4187k0658p9021K20466j15026O5511m1154P982k2205j02401
10555g4175L7745N4922J5242l1211j2483R6235q9764r0o1440O684J44215K0613
10543A06493j67199J10192j1364O3396q5766k5581J857J28448r3255n9233L9231
10532G219j03428J22649Q5833q7744j6150J11116q8216M1251j3862N6402m4871
10521G0199r3469M5213j231n0527n541M7733J5942M0952j36233j3098P6996J2099
10509I035M2701K6091q8990j3582N2279p5146M9412k404P6497j36320M8162O9329
$$ y = [-78, 78059, 74412, 93509, 106877, 1375, 68968, 115758, 79368, -25036, 72247, 31652, 19025, 44518, 39177, 51198, -181, 9752, 116950, 32602, 50138, -2562, 54794, 75980, -41444, 46518, 12331, -8327, -87348, 133118, 18092, 83603, 42449, 50431, 28226, -74175, -36430, 18492, 33734, 2523, -9960, 86275, -3489, -3579, -65019, -58335, 85880, 106493, -60706, 49486, 38122, 101518, 15752, -9829, -7972, 120476, 27221, -32012, 7219, -96209, 26440, 112273, 24529, 8379, 119495, 31279, 72530, 58668, 115070, 70199, -23270, 21943, 20712, -29815, -35356, 12377, 28319, 69271, -66962, -80060, -3064, 9035, 51736, 77827, -11163, -24745, 27534, -47612, 1800, -604, 75893, -60427, -12265, 57064]
10497E7064q3923R6098n2356N542m4099O8924k0248j9030P9707J1565j22487J1265
10485a1978r461L5908k2619L2693k8741k137Q1765l2677l604m2515m2801M5565
10473f02N4014j0357j06086J24833p3973P61N8728p5905J01119p2937L5695m8196
10461a2906M5297r5147o1M5427L2497L3188n6867N6608K6664j18599J42769j10151
10449a1281j1015p587N0689K0835l141m6219j5114L5726k7949K0548r709m3288
10437d7505P8017p0321J00572o0965K8791j2267M711P6790Q990j45735n0922J48096
10425E8252k2490m0360Q1710L300n651j32411O3146J02510K5402l8601j6920J3047
10413I0934n4038L5132L1528m2739m9855J62410j92390O9675m1520r082K2783
$$ y = [57064, -26859, 69239, 16883, 22425, -21674, 47250, 27002, 7972, 87679, 99244, -23243, -11978, -21439, 14469, -8150, 24543, -4198, -6335, 75430, 42753, 39149, -3366, -46167, -602, 53412, 43055, -63031, 61802, -12171, -11410, 47318, -28587, 72532, -405, 35290, -12906, 32391, -62756, -62817, -17390, 15107, 48295, -8572, 48036, 74700, -43899, 98870, -11281, -22296, -29883, 20806, 41641, 38500, -7719, -22833, 12893, -15056, 5492, -4217, -47505, 30512, -39809, 60763, -202, 28589, 16322, 21033, 97823, 106813, -38922, -89844, 58252, 35762, -4598, 77112, 80412, 74761, -57650, 5496, 108006, 133408, 94807, 77887, 90934, 36896, 72028, 103556, 60817, 10962, 173372, -19018, 50657, 9137, 55, 22838]
10402B2838o4676J36643o4204j2786K4755n8774L9388R6554j14728K8885n1583
10391a7688N6352m1433J3070k4773O0121j4110k1678K723J1184j4310P347J9789
10379C6594k6305k7862L429j834q150Q5882p887K262j50029R8496N619K045l4282
10366b2022k485P4305K4771n7848k1496L2034l1794j03274J04673l8201M4047
10355B710J7121n310k0191J4615k8071J04257j36299J5320O0684L2431m5434L1168
10343D3001j50421K41130o1015q3322n905O0993l7744L3619K506k1349m9310J63701
10331A35884k14038J24528M9218o4012l9768K9546l2956j7187P0875j5714q290
10320A8086k4785M9404j8652m5754N3798j9087J9944n4295L3597J1404K0033o4149
$$ y = [22838, -41838, 94805, 30601, 17815, 42570, -16204, 23184, 119738, 5010, 33895, -17688, 38664, -2769, 10301, -14472, 45649, 31539, 9861, 12584, 23768, 9458, 16805, 36594, 10289, -17573, -14144, -15978, -24128, 61754, 53867, 56129, -93900, 4596, 10215, 12260, -22022, -24507, 49798, 74569, 16721, -4775, 27259, -4535, -107809, -3136, -41337, 2710, 19831, 14521, -5670, 8945, -19126, 85131, -51168, -35848, 24836, 57267, 11833, 43001, -107420, 133710, 72695, -10627, -16532, 44461, 6717, 40336, 42842, 21493, -27817, 135884, -78154, 46374, 95592, 31580, -8188, 21358, -11598, -28785, 42090, 26376, 18086, -6699, 42705, 24053, -21701, 32097, 13010, 32954, -21341, 12256, 23660, 43693, -20456]
10308b0456J24139l2606k7664J95L7894j03509O4553m1989Q8628m9719p2400j0977
10296d3911o263J02794j4209l9643n163o0634M5307N5782p5819O4493l1616R8651
10284H9769j1001l8668K7784O4225j17091M0655k5642J373m7131J7670k6896r7768
10272a22721J24389j09301J27922L2045o8454J17335n0125r5819O6397R7907r1490
10261B8085L6269j05094J52196o5641K8453k5566J5951J3486r3362j0801O2581
10250C6557l9034M0949N1667r6013N1309j13492N4332J00733j93553J31061J8324
10239D2840N938Q0897l8897n4204M738m8305L8705L8739n3960j04065O3979M8973
10227B5378k4662L1025N972j0893L6759K6506l0907M0724j14551Q1817J832m0227
$$ y = [-20456, 103683, 71077, 43413, 43608, 81502, -22007, 42546, 557, 89185, 39466, -32934, -43911, -50174, 52620, 38411, -1232, -6395, -67029, -21722, 34060, -41759, 22734, -8882, 89769, 78768, 40100, 67884, 132109, 15018, 55673, 30031, 31404, -15727, 1943, -24953, -122721, 1668, -107633, 20289, 52334, -16120, 101215, 51090, -44729, 21668, 119575, 28085, 64354, -40740, 111456, 45815, 74268, 48702, 64653, 78139, -15223, -26024, 36557, -2477, 38472, 90139, -5874, 45435, -68057, -13725, 87008, -106545, 24516, 42840, 48778, 129675, 90778, 36574, 41312, -6993, 31712, 70451, 16491, -87574, -23595, 25378, 716, 31741, 37713, 26820, 63579, 90085, 59178, 99902, -14649, 67168, 69000, 28773]
10215B8773r6877j4417M4575j9187L1015J20302p7882N336O1494n9280P6452o9937
10203C0367N9214n4734N2441l9476m0268P2718n1628K6L7882K4746o4154J3415
10191D0549o0122Q2103o7847P3428l1511l1497J10416j40886M9996N3821l360
10180G5090m0378J35749m6768j42705J5311L8173l7408Q0763j37141q52L8639
10169b1527Q686J16329k1387K1840o5406J0124L8890j1088l6023N485n5100N0250
10157D1073j8743R5368o1144n852K7121k0753j8502N0258j845r1101R0683j29623
10145d3060J5828Q5413m4244n501m7018J4016N3414k7194N9387K7907l2805q6942
10133c0799J47346K2299m6702l7222j0931L8996l6922N9631r6201M5365n217k9798
$$ y = [28773, -68104, -82521, -37946, -57133, -26118, 94184, 16302, 21638, 83132, 23852, 100304, 30367, 89581, 34847, 87288, 47812, 7544, 80262, 28634, 28660, 66542, 91288, 27134, 40549, -19573, 62530, -5317, 68111, 36600, 5103, 115519, -25367, 24629, 78450, 75090, 34712, 170461, 123693, -19012, -3701, 34472, -2936, 77827, -59314, -60166, -21527, -12841, 103488, 82101, 103941, 38535, 48659, 87549, 76461, 40438, 45923, -9177, 41073, 22330, 117698, 56554, 50702, 77823, 57070, 38568, 88826, 86981, -4120, 86563, -43060, -27232, 58181, 13937, 8436, -38582, -24566, 28848, 1654, 61041, 88948, 56143, -30799, 116547, 138846, 92144, 54922, 43991, 82987, 46065, 105696, 9495, 54860, 49643, 19845]
10121A9845K7865R4234k3392j30348L7937M3487q1937J35111k0157j5278j32249
10110d4882L3722J61013j38552N1281j066n0419R2074o7362L550m7040M2544Q2063
10098A16926r0478j4705n047R9210j63370O7833L8380m7232M2062m8464P5640
10087G0755r8422J32434n5873M9582j42392Q3572J03442p7689l1041r708K6254
10076E0914K3996P0240q2064k0391o5466K4713k2837M5729P4733K1201p4670k3140
10064B2958K8458l0873K360M6971j1223J406j16293J38085j1555K5446k0028l9317
10052C6395P179n1178N8622N6409j24983J2507J16593j24066Q7216j14357P9063
10041C9400P3274r153j01235l2429M6713O9356l5884o5450J19703n2328j7766
$$ y = [19845, 47710, 141944, 118552, -11796, 26141, 69628, -12309, 122802, 102645, 87367, -44882, -11160, 149853, 11301, 62582, 61516, 11097, 103171, 35809, 39359, -7681, 34863, 116926, 26448, 11743, 6696, 105906, -57464, 10369, 48749, 1517, 43579, -4885, 70755, -27667, 104767, 48894, 98476, -43916, 39656, 143098, 65409, 34368, 24660, 50914, 74910, 145150, 63086, 42695, -22771, 1942, -20895, 24834, 99567, 120768, 46098, 22958, 51416, 20543, 22903, 69874, 58651, 60057, -56236, 81849, 70294, 95740, 75712, 36395, 43574, -7604, 51018, 107427, -17556, -5049, 111544, -12522, 74694, -39663, 39400, 112674, 103521, 2286, -30143, 16570, 85926, 50042, -15408, 104295, 51967, 34201]
10030C4201J1533Q7494j29343M4837R6361n2618p0055J9979K2432K239N1040o6830
10018E1270n4529R1469q4868n55R5533k2004L1232q3409M0301Q788q4031P8585
10006F7782j04710J00699l7262M1965o4835P2345n736k4379M9831q8246K8876
9995C6330Q4776j7166p7411J8237M3177o8708J50390j75888J28844m3866n7223
9984B1492R0323M604m9229N3226r6781R3947j04717L8442L3222k8988q16K47l4753
9971B0219k5093J81671k0758j43442J48078q3164M5654L757j09463Q1649j0553
9960H8555J2507n8127R1277r2457R2922j06660J6649n3051J09035l2734p0096
9949b180K6546J14920l6139l0497J08383j81469R3751J0782J5724r6970P666J05243
$$ y = [34201, 45734, 133228, 3885, 48722, 145083, 92465, 22410, 42389, 64821, 67060, 118100, 51270, -3259, 88210, 3342, 2787, 98320, 76316, 107548, 24139, 64440, 73228, -10803, 67782, -36928, 63771, 26509, 68474, 3639, 75984, 70248, 45869, 95700, 7454, 36330, 121106, 103940, 26529, 44766, 87943, 19235, 169625, -6263, 122581, 78715, 21492, 111815, 116419, 67190, 120416, 23635, 117582, 12865, 51307, 84529, 55541, 54725, 54972, 20219, -4874, 176797, 156039, 12597, 160675, 77511, 123165, 126922, 17459, 99108, 88555, 101062, 42935, 134212, 41755, 134677, 28017, 44666, -8385, 100650, 67916, -2180, 24366, 139286, 103147, 72650, 181033, -436, 93315, 104097, 119821, 22851, 30517, 135760]
9937A35760j0955o8125R8712j78712J22000q4202P8267K2326j00796N9952l9500
9926C4727k2897R0569m7062Q814N9947r4145J21094q9387M1620O3534p3157L4225
9914A27882q9450M629Q8518n7395o8145O8095N3549j13583P214J5733J20997o5200
9902I2844q8583Q366O9247M3769j32436J17831l5609n7392R259L9610N0028M6842
9890A63776m5505p003l0545m8794Q8139K5649j37259J28336j11950J14481j2505
9879A26820q8254m2612R9525o2241M4471J0625M9969j00229J4079Q0118j0140
9868A22131p6805L5660J07269j45522R306m7901J11548k5973j2617p0586Q3566
9857I0076n124m4924N6892O0615m7604O3525j19964J04311p087j11985P3533l6579
$$ y = [135760, 124805, 56680, 155392, -23320, 98680, 14478, 92745, 115071, 14275, 74227, 34727, 11830, 102399, 55337, 64151, 124098, 29953, 151047, 61660, 103280, 166814, 93657, 127882, 38432, 43061, 131579, 74184, 6039, 74134, 127683, 14100, 21314, 37047, 158044, 92844, 4261, 12627, 81874, 125643, -6793, 111038, 75429, 18037, 27296, 66906, 116934, 163776, 118271, 111268, 80723, 31929, 120068, 145717, 8458, 136794, 24844, 139325, 126820, 38566, -4046, 95479, 33238, 77709, 88334, 138303, 38074, 52153, 132271, 122131, 45326, 80986, 188255, 42733, 52039, 4138, 115686, 89713, 77096, 6510, 90076, 84952, 40028, 96920, 157535, 109931, 173456, 53492, 157803, 150716, 38731, 112264, 75685]
9845G5685O1340k5335l1774J3856M931P071J801Q080q3505P0353Q3664k2458J2933
9832A76642l5615k4801Q4457j18454K2187J3164L692o7802j2536Q5950n7321L9810
9820A09373k6605J15428n5734j00426J76865q3934J8631l2849r198P6803q0316
9809A08038j2777N2399j31262J11254Q1117j26720p4558Q0581k5647P9127m0626
9798A00926m7638J08945l0977p8943L0342K6324j2887M8590J011O225n8604K6080
9786A19394k586J7269J8754r46K103j2983m978k4127O6518j24124J19763o0461
9774A13596J2018N426J3223K0324j1301P1567J6571m4266o4173R7675m3938K3989
9762B10711k4817L5264p10l8666n4767j9153l7251L9666P7531Q6069l0482N3408
$$ y = [75685, 137025, 111690, 79916, 93772, 98703, 105774, 107575, 115655, 32150, 102503, 186167, 163709, 176642, 141027, 116226, 200683, 82229, 104416, 117580, 121272, 53470, 40934, 126884, 69563, 109373, 82768, 198196, 142462, 42036, 218901, 134967, 153598, 120749, 111551, 188354, 108038, 95261, 147660, 16398, 127652, 208769, 82049, 7491, 88072, 62425, 141552, 100926, 53288, 162233, 131256, 52313, 82655, 108979, 96092, 144682, 145693, 151918, 93314, 119394, 116808, 134077, 152831, 151885, 153988, 141005, 136027, 111900, 178418, 54294, 174057, 113596, 125614, 131040, 144263, 164587, 153286, 224853, 241424, 197158, 132985, 230660, 186722, 210711, 185894, 221158, 220448, 181782, 127015, 107862, 70611, 110277, 187808, 273877, 243395, 296803]
9750B96803M1556k0749r6990N870M4089j32423k4592K9702O5155r8947o5674k3462
9738B0338j0113J07918o3822J27850M9246o3566K6554o9562r722J22794j07553
9727A30362l5092Q2590j6609l3615P599o3651M3304N0375p403m3564j478Q586
9715A21404L696P5896n9126M6223l3752M2418M642n1518J8761Q1883r3847P006
9703A63686M4404m0615Q845K9374r1981J22374p568K4486M3644k0585n2629q5926
9691A37509J8555Q3312j01798J33214j44800o9205J68288m7042l3507M3329o9447
9680A18408J14523p3270J771N8209q6831M0114k9175L4078m8195M7766O387l6203
9668A47582n6236J25518r166J0729m9257j34133J75635l4535J06021r1660n8173
$$ y = [296803, 338359, 317610, 220620, 226490, 270579, 138156, 113564, 143266, 208421, 109474, 43800, 20338, 10225, 118143, 54321, 182171, 231417, 167851, 194405, 124843, 115121, 237915, 130362, 95270, 177860, 161251, 127636, 135235, 71584, 114888, 165263, 157860, 114296, 112818, 121404, 125100, 200996, 141870, 188093, 154341, 196759, 201401, 149883, 168644, 250527, 156680, 163686, 208090, 167475, 176320, 205694, 113713, 236087, 228519, 253005, 296649, 276064, 223435, 137509, 156064, 239376, 137578, 270792, 125992, 56787, 225075, 178033, 144526, 187855, 118408, 232931, 159661, 161432, 219641, 132810, 172924, 143749, 177827, 129632, 177398, 183785, 147582, 91346, 216864, 207698, 218427, 169170, 35037, 210672, 176137, 282158, 190498, 132325]
9657A32325P9505j5553l3235P8012j3011r9398n792P8573J5156O905m3045M1867
9645B22309K0321P16q2276m8307J51962j63912J17203l3515N2557j9503k4896
9634A92659l7738O947M3303q455M9180m4749n1829P3636n164j08365R7163l8497
9622A68091K5362K187N2656j07783R4164J11499q5367k8876j29315J26853j04504
9611A24967J35973q5386l263N2021N5138l1097j07581R0677K5570K1510q2532
9600A95997N6431K6435j18579O1416r742j9718K9884O8463j68415J43187l9950
9589B25409K5663J4682p4481L2466p1926O3669M2318j8966j01444J09055Q07l2222
9577B15030M7456p1891R4551q9417J4159N5671J1151j8170k7383J321l2001J07326
$$ y = [132325, 211830, 196277, 163042, 241054, 228043, 128645, 122853, 201426, 216582, 223487, 180442, 222309, 242630, 243346, 161070, 112763, 264725, 100813, 218016, 184501, 237058, 217555, 192659, 154921, 161868, 205171, 196716, 245896, 201147, 149318, 222954, 217790, 109425, 206588, 168091, 193453, 195640, 248296, 140513, 234677, 346176, 260809, 231933, 102618, 229471, 124967, 260940, 175554, 172291, 224312, 279450, 248353, 140772, 231449, 257019, 278529, 195997, 252428, 278863, 160284, 221700, 211958, 192240, 222124, 290587, 122172, 265359, 225409, 251072, 265754, 191273, 223739, 151813, 215482, 257800, 238834, 137390, 246445, 247252, 215030, 262486, 190595, 285146, 195729, 209888, 265559, 276710, 258540, 231157, 232478, 200477, 307803]
9565C07803m6594O5343o7112K3636J8343R423o1925q6481J07925Q911L4164j3149
9553C00287j11875J24084m2457M2m2926M5097r5344L0387j9203J45496l7516M474
9541C00546K3355K4406n6505M1977n2369n6491J51459j57217K1490l4538K31Q8164
9529B94508m6496P759o7393P4283k3675K6139n4965J09211q6253n5845N7531J4952
9517B49756L0893K0341J870K0225l5643j1587L9453o5734J19630p3775n0165Q8202
9505C33466q2512R9540L3881m5136j2308O6635Q2887K970N7702l3985j26100j0602
9493C66438J0994m9406n3207Q466N0564L4819m8552N8092n7106N4802q8730L8693
9481C25867P3690o8285J4904L9036r0136P4333K1496m6307Q857J9140m4214l5860
$$ y = [307803, 261209, 326552, 259440, 283076, 301419, 310842, 248917, 162436, 270361, 279272, 313436, 300287, 188412, 312496, 270039, 270081, 227155, 272252, 176908, 207295, 188092, 333588, 296072, 300546, 323901, 348307, 291802, 333779, 281410, 224919, 376378, 219161, 240651, 206113, 206344, 294508, 248012, 255771, 188378, 262661, 238986, 265125, 210160, 319371, 233118, 177273, 234804, 249756, 280649, 300990, 302860, 323085, 287442, 275855, 315308, 249574, 369204, 295429, 245264, 333466, 250954, 350494, 384375, 339239, 326931, 393566, 476453, 479423, 537125, 503140, 377040, 366438, 377432, 328026, 274819, 283285, 333849, 368668, 320116, 378208, 321102, 375904, 287174, 325867, 399557, 331272, 346176, 385212, 295076, 369409, 390905, 344598, 353455, 372595, 328381, 292521]
9469B92521M7566J30315j14052o9584K2095J00821o4176O1055j2273r637o5561
9458C19090Q3136j20060J04621p4828N2389k5090j962K6374K0055J2161M6712
9447D42598p1920L3519k4454J61528j13955o6156O2605o089r1335J00469K5818
9436D52628k0934L338m4716J8155K102K9350M8064q9500O3071N7854j39790M0936
9424D20558l580J617O793j254K1351M434q756k7616j16543J62470O2704q7660
9412D34518P4439j5140K2339r6585J2827j02846Q3339L8947O0550K638j52267
9401C62759L7332L6947j3942J6169j1898L7481J316K1813Q789j4633j8152J13481
9389E77462j38667j3481J63044j81285Q2384l551M4286m4339l5543J25074n0140
$$ y = [292521, 340087, 470402, 356350, 286766, 308861, 409682, 345506, 406561, 394288, 384651, 319090, 402226, 282166, 386787, 311959, 364348, 339258, 337296, 363670, 383725, 395886, 442598, 370678, 404197, 379743, 541271, 427316, 361160, 423765, 417676, 326341, 426810, 452628, 431694, 435032, 390316, 408471, 410573, 439923, 487987, 398487, 461558, 519412, 379622, 420558, 416978, 418595, 425388, 424134, 445485, 449919, 441163, 413547, 297004, 459474, 522178, 434518, 508957, 493817, 516156, 419571, 432398, 329552, 412891, 451838, 512388, 515026, 362759, 400091, 437038, 423096, 439265, 427367, 464848, 466164, 487977, 496766, 482133, 463981, 577462, 438795, 425314, 588358, 407073, 489457, 485906, 530192, 485853, 450310, 575384, 525244]
9378E25244K2514n8179M3295p3533J18156L8883p5963j9322J4175J03729j30284
9367E08715K9664Q2071r6174l7056J40579o3657j1883m597O6840r5054L5192o3669
9355D90971N5995M3620k8662l0254J33494l4768m0516Q2248j32675J993J0134
9344E51580M9837j952j6452K1287p9610J00414L3978j33396L9935J07540l3696
9333F39465O2466m6750j5819k9033R3668p129n857l8354N31m8608J7952J46835
9321G69367r281m0851q8679K7795Q5066p4815Q357m4069N3626Q2751j72391J42826
9309G39702k5261K2008N7123l6487p3391N0722m2340N5231l6289l4543Q9509j6280
9297G49704Q7537k4057K362L0380l6810L056n8311m5212L5420O9338l9277l0210
$$ y = [525244, 547758, 489579, 532874, 459341, 577497, 616380, 540417, 521095, 535270, 638999, 508715, 538379, 620450, 524276, 487220, 627799, 564142, 552259, 547662, 614502, 519448, 554640, 490971, 546966, 590586, 561924, 531670, 665164, 630396, 589880, 672128, 539453, 541446, 551580, 601417, 599465, 583013, 604300, 524690, 625104, 659082, 525686, 565621, 673161, 639465, 701931, 655181, 639362, 610329, 703997, 696868, 691011, 652657, 653188, 604580, 622532, 769367, 760086, 719235, 630556, 658351, 743417, 668602, 676959, 632890, 686516, 769267, 596876, 739702, 714441, 736449, 793572, 757085, 683694, 734416, 692076, 747307, 711018, 676475, 765984, 749704, 837241, 813184, 815546, 845926, 809116, 812172, 753861, 708649, 744069, 813407, 774130, 743920]
9285G43920K8149P2467N0530j06131J33683p1882o6635j3360L7309L1223j1998
9274H27275J3974k4914M5170j776l373k3826J09650o6034K3085Q9313j22650N2006
9262I17900m6556l671N1229O8612j7409L6120j09600K06035j02028l5n8251Q5356
9250A027702p1147O220n1707O7933m5816N7609M5619L5066k092K4445r281J8607
9238A103158Q1784j22592k5498N245k1210J2953l6848Q8985O7020L0301Q8884
9227A272182P223p2666N0128J18712q9076j37874K0688n9033M5644P2371r3322
9216A134977n9447J12082o4504J77543o2983N4500p6908J28935n0755R130m3863
9205A258707P3875Q6261r9136O9212q7227J0973R3409k344Q379l4502J6812m248
$$ y = [743920, 772069, 844536, 895066, 788935, 922618, 850736, 784101, 770741, 808050, 839273, 827275, 841249, 816335, 861505, 859729, 856356, 832530, 942180, 876146, 899231, 988544, 865894, 917900, 871344, 867673, 918902, 987514, 970105, 1006225, 896625, 1102660, 1000632, 1000597, 942346, 1027702, 956555, 962775, 911068, 979001, 933185, 990794, 1036413, 1071479, 1069387, 1093832, 1084551, 1103158, 1184942, 1062350, 1036852, 1042097, 1020887, 1033840, 996992, 1085977, 1152997, 1183298, 1272182, 1279405, 1206739, 1256867, 1375579, 1286503, 1148629, 1169317, 1110284, 1155928, 1228299, 1134977, 1075530, 1187612, 1123108, 1300651, 1237668, 1292168, 1215260, 1344195, 1293440, 1302570, 1258707, 1332582, 1418843, 1319707, 1388919, 1301692, 1312665, 1406074, 1403730, 1412109, 1377607, 1394419, 1390171]
9193A390171O8518P07r9066N9201J8869O5222n0000N0759K41O3553r5700J00617
9181A573092q2768J42200j4794j1691R40Q4584j02358K7010L3595P5433m9190
9170A676053N1057k6072J83332k23844M3652Q2886k1325l0489R4888o6261P8784
9159A842661M0665k4770O0900m6679j9168N2872K7476l6762m5013Q1884J51816
9148B085882o4662k6330L6375o4496O2603J58880j21421K3373J8370O312L2606
9137B147492J111R0853j3028o5408J10747N6096K5633m24L4910L8285l8384L3857
9125B421740J39002n1209L7464j2308N4790k0134N2649M8649O9210p0055P2573
9114B742371J27886J2433m2393K5727R701R5021m3726J04304J14778p088J39807
$$ y = [1390171, 1458689, 1459396, 1360330, 1419531, 1438400, 1503622, 1453622, 1504381, 1504622, 1568175, 1472475, 1573092, 1490324, 1632524, 1617730, 1606039, 1606979, 1691563, 1589205, 1616215, 1649810, 1725243, 1676053, 1727110, 1701038, 1884370, 1660526, 1704178, 1787064, 1765739, 1735250, 1830138, 1763877, 1842661, 1883326, 1858556, 1919456, 1872777, 1853609, 1906481, 1933957, 1897195, 1852182, 1934066, 2085882, 2021220, 1994890, 2031265, 1966769, 2029372, 2188252, 2066831, 2090204, 2108574, 2114886, 2147492, 2148603, 2239456, 2226428, 2161020, 2271767, 2327863, 2353496, 2353072, 2387982, 2426267, 2387883, 2421740, 2560742, 2509533, 2546997, 2534689, 2589479, 2569345, 2621994, 2670643, 2739853, 2669798, 2742371, 2870257, 2882690, 2840297, 2866024, 2875725, 2970746, 2927020, 3031324, 3146102, 3139014, 3278821]
9103C278821Q2017j7443K10009R4061L0752J83656J80109J51306R5351K27728
9093D516367L27618N43191M45590R37715K744329O757809Q872490Q705615m459032
9084B9391692p308033o339453l553526k543537j752547j182962r02191l19615
9076E489828k52861k12731k43586j09715k33507M799p9325j1942J16088p0817
9066D396231p294J3737K0790q2386k4596k2186J23977J1487k8670m990j6980P88
9054D379908L9744Q5793K9786J4014J941J06733m6860j1089M0940k0741Q0828
9043D700997J1820Q8609l4367L0153j2657J08090j206L1322N7608L6985J785N5967
9031E075106N0607P3014P69L034R6140J9309K5619M4400N4044J06459K0903N8993
$$ y = [3278821, 3360838, 3343395, 3553404, 3647465, 3678217, 3861873, 4041982, 4193288, 4288639, 4516367, 4843985, 5387176, 5832766, 6770481, 9514810, 16272619, 25145109, 33850724, 29391692, 22083659, 15744206, 12190680, 9647143, 7894596, 6711634, 5809443, 5489828, 5236967, 5024236, 4780650, 4670935, 4437428, 4442227, 4362902, 4350960, 4467048, 4396231, 4388937, 4402674, 4423464, 4341078, 4316482, 4294296, 4418273, 4429760, 4401090, 4396100, 4379120, 4379908, 4419652, 4505445, 4535231, 4549245, 4551186, 4657919, 4611059, 4599970, 4640910, 4620169, 4700997, 4712817, 4801426, 4767059, 4797212, 4784555, 4892645, 4891439, 4922761, 4980369, 5017354, 5019139, 5075106, 5125713, 5198727, 5199496, 5202530, 5298670, 5317979, 5343598, 5387998, 5442042, 5548501, 5569404, 5628397]
9019E628397j6278J07242R123R6675K4044R1036M4615k7941N954K0488J60532
9008F143887P9867j8617O4335L4698J40608K9606Q4001l0246P7747N6815J67018
8997F829719n3130P1914R4859j0459J74373k9130Q7438K9435P670J78544r343
8986G371890Q9163Q0577N4767P5357J1005M7704O1328P0889J39279L4315K9535
8975H065809J62510L8791l5607J25437M5373P3230J63557j1472P7150O9853o437
8964H768194J95826R0340M6859J31944n5455J20189P2486L7629J05610J04175
8954I617797l7143Q6829N0965J18586J1601M25J54094k024P5598R4795p2741J78663
8942A0277445J71366o4708K7427R9780K5134n571J62408l0529k982J1813Q7723
$$ y = [5628397, 5612119, 5719361, 5728484, 5825159, 5849203, 5940239, 5984854, 5956913, 5962867, 5983355, 6143887, 6223754, 6205137, 6269472, 6304170, 6444778, 6474384, 6558385, 6528139, 6605886, 6662701, 6829719, 6776589, 6848503, 6943362, 6932903, 7107276, 7078146, 7165584, 7195019, 7202689, 7381233, 7371890, 7461053, 7541630, 7596397, 7671754, 7682759, 7730463, 7791791, 7862680, 8001959, 8036274, 8065809, 8228319, 8267110, 8231503, 8356940, 8402313, 8475543, 8639100, 8627628, 8704778, 8774631, 8768194, 8964020, 9054360, 9101219, 9233163, 9177708, 9297897, 9370383, 9408012, 9513622, 9617797, 9580654, 9667483, 9718448, 9837034, 9848635, 9849060, 10003154, 10001130, 10076728, 10171523, 10098782, 10277445, 10448811, 10384103, 10411530, 10511310, 10536444, 10530873, 10693281, 10662752, 10659770, 10671583, 10759306]
8931A0759306j5599J36827P1677o611K4440J18678J2808L0772j0886R702J4601
8920A1145715j6344P3796N9584l6633L6833k3125j8674R1951o1171L7508P2234
8909A1361674q5046M2727K5914N7596j22042j5717L9232n6253P0751m1480m8310
8898A1229046r1161J2857L0234j56863J23614J2123j21974J0844j35449Q924o0143
8887A0862052o6498N0548p6554l4883r1749o2610l9104j6685k9187j23932l5543
8876A0335855j24869m639m5693L135j54311p6030J3034K0823o9980j23013j46120
8865I628192o845L1414k28256P0025l9240q0353j15288j50742l2015n174j5704
8854I056014k62522J73538k22990K1163j06835p8699q1443r6002l464q1658j2493
$$ y = [10759306, 10743707, 10880534, 10952211, 10945600, 10970040, 11088718, 11101526, 11132298, 11121412, 11131114, 11145715, 11129371, 11203167, 11262751, 11226118, 11262951, 11239826, 11221152, 11313103, 11251932, 11289440, 11361674, 11276628, 11319355, 11345269, 11402865, 11280823, 11265106, 11304338, 11248085, 11318836, 11277356, 11229046, 11137885, 11150742, 11180976, 11024113, 11147727, 11159850, 11037876, 11048720, 10913271, 10922195, 10862052, 10795554, 10846102, 10769548, 10734665, 10642916, 10580306, 10541202, 10524517, 10495330, 10371398, 10335855, 10210986, 10206347, 10160654, 10163789, 10009478, 9933448, 9946482, 9967305, 9897325, 9774312, 9628192, 9621347, 9652761, 9424505, 9494530, 9455290, 9374937, 9259649, 9108907, 9076892, 9071718, 9056014, 8793492, 8967030, 8744040, 8765203, 8658368, 8579669, 8498226, 8402224, 8398760, 8317102, 8304609]
8843H304609j13344k45919j1956K7322p032o3553j18481p0248p1212o9427l3718
8832G527041p7849n1553n3563j80833l3704N3070r3559j37096n8206n5354j2306
8821F826088r6915j13237n7740j9470m623q3462p6174j30733k3904k488j75766
8810F041576j2687r4489O918o5961r1940L650j35201M8199j14243j04927M1368
8799E522263j45723J05908j19985j29995J04892j31820l7167m0882J9521o9301
8789E077711n3983j29567K6628J9174q5989j74602L9268P161k6578j04455j21271
8778D473497l9440M1719J3181j25478m4999l7647O034m9955P4099k45546L9061
8767D104526O0892j50149n0621m3576m4746m6919J0163j11604J9436n2393K0594
$$ y = [8304609, 8191265, 7945346, 7933390, 7960712, 7953680, 7890127, 7771646, 7701398, 7630186, 7560759, 7527041, 7449192, 7397639, 7344076, 7163243, 7129539, 7182609, 7089050, 6951954, 6893748, 6838394, 6826088, 6729173, 6615936, 6558196, 6538726, 6534103, 6450641, 6374467, 6243734, 6219830, 6217342, 6041576, 6028889, 5934400, 5941318, 5875357, 5783417, 5787067, 5651866, 5700065, 5585822, 5480895, 5522263, 5376540, 5482448, 5362463, 5232468, 5337360, 5205540, 5168373, 5127491, 5147012, 5077711, 5023728, 4894161, 4920789, 4939963, 4853974, 4679372, 4718640, 4725801, 4699223, 4594768, 4473497, 4434057, 4475776, 4488957, 4363479, 4318480, 4280833, 4286867, 4236912, 4311011, 4065465, 4104526, 4165418, 4015269, 3964648, 3921072, 3876326, 3829407, 3839570, 3727966, 3747402, 3695009, 3715603]
8756C715603O555j26886j8797O1347n1131o0849K0219q8040n7342k1177l1823
8745C347679L1361n6450n1544o8456k1475j26713m6137o189N9225K8295j8070
8734C071526r4454m9128J00852n0254J2604j57365N1347n2728k2486q9385N5986
8723B776515r4303N0891j8121l9513n5614M0462j10875P4947k0616o5210P3321
8712B611884j26343j9236N9748j65145J06160n8650m5135J8444l1159N1289m5819
8701B356038l9331J1670m8079n3452L5418p9567Q4769o3938k6978M8759j429j15556
8689B108324Q0618K79j01472n9376O7843o0856K47k3818P0528o5518m8560L3148
8677B001387j11420L4339j5146M1574m3333L2597L2344p649L3351j58989Q7899
$$ y = [3715603, 3722158, 3595272, 3576475, 3637822, 3586691, 3525842, 3546061, 3458021, 3400679, 3379502, 3347679, 3379040, 3322590, 3271046, 3202590, 3181115, 3054402, 3008265, 3002076, 3061301, 3089596, 3071526, 2977072, 2927944, 3028796, 2978542, 2991146, 2833781, 2885128, 2832400, 2809914, 2720529, 2776515, 2682212, 2733103, 2714982, 2675469, 2619855, 2660317, 2549442, 2624389, 2603773, 2538563, 2611884, 2485541, 2466305, 2526053, 2360908, 2467068, 2408418, 2363283, 2381727, 2350568, 2401857, 2356038, 2316707, 2328377, 2280298, 2226846, 2262264, 2182697, 2267466, 2203528, 2176550, 2225309, 2223880, 2108324, 2188942, 2189221, 2087749, 2028373, 2096216, 2035360, 2035607, 2011789, 2082317, 2016799, 1968239, 2001387, 1889967, 1924306, 1909160, 1950734, 1907401, 1939998, 1972342, 1964693, 1998044, 1839055, 1926954]
8666A926954j15492l1437j5003n120J4800l8701m4843j2760j2208k026n8630P8356
8654A683890n8235o1290Q3586j55702J34801k9424j1268M869j8923O04j6850q0295
8642A475763K7401k5290R0071j21524m8013R8516j51839J26448n3023j1520l908
8631A403082j15599R1881j1169m1572R1787l0979m1776j479m4713P9234M7941
8620A426638n2796o8607J4262n3396P532m6968r1713Q9385L9229N6191o4895m754
8608A250108m9424J03333j07862n736m4562N8688L5201m7004m034M3223o1958
8597A169973k7565K7717k7833l4343L6237r0657P2266p83J775J2609j21490O6567
8585A084473k4583P143p7870K0462O0264j03669k4000N346Q0336n6744J5502k746
$$ y = [1926954, 1811462, 1780025, 1765022, 1759902, 1774702, 1736001, 1691158, 1678398, 1666190, 1664164, 1605534, 1683890, 1625655, 1564365, 1647951, 1492249, 1627050, 1597626, 1586358, 1591227, 1572304, 1572908, 1556058, 1475763, 1503164, 1477874, 1567945, 1446421, 1398408, 1496924, 1345085, 1471533, 1418510, 1406990, 1403082, 1287483, 1379364, 1368195, 1326623, 1418410, 1387431, 1345655, 1344176, 1299463, 1378697, 1426638, 1373842, 1305235, 1319497, 1266101, 1273633, 1226665, 1134952, 1224337, 1263566, 1319757, 1254862, 1250108, 1200684, 1304017, 1196155, 1190419, 1145857, 1204545, 1239746, 1192742, 1188708, 1231931, 1169973, 1142408, 1170125, 1142292, 1107949, 1144186, 1053529, 1125795, 1125012, 1126787, 1139396, 1017906, 1084473, 1059890, 1067033, 989163, 1009625, 1069889, 966220, 942220, 947566, 1027902, 971158, 986660, 983914]
8573I83914P7888m6535J38257j34991L2692j31626N5690M3804j18940N0498L3424
8562I84075q8087Q6227m1420j8195O8380p0149r843M4894K1648m8516N769j06681
8550H28102L9198n7433k0185J07505m1732N32K5972r8776Q7569q2212M7536k7552
8538H08524M3382N3214J16987m18180J61816M7591j11868O3222j5824k5426l3002
8527F90436P6662p2341J4357j9073J20494r5822m9248J57153j18448n0667P5198
8516G28701j2305m2381O4902N5663p8707q4172Q7755J4314K4498r3194r066j5400
8504F40608j47255J45568Q6931R824k6150l4025m437O7415M5703q8673l6883l8880
8492F19746Q5166r8479k2831J9114Q6997n0420l8221M5639n005R021Q181J31441
$$ y = [983914, 1061802, 1015267, 1153524, 1018533, 1051225, 919599, 975289, 1019093, 900153, 950651, 984075, 895988, 982215, 940795, 922600, 990980, 920831, 910988, 955882, 977530, 929014, 934783, 828102, 867300, 809867, 789682, 897187, 855455, 855987, 881959, 783183, 870752, 788540, 836076, 808524, 851906, 905120, 1022107, 603927, 765743, 813334, 701466, 764688, 748864, 723438, 690436, 767098, 694757, 709114, 690041, 810535, 714713, 665465, 822618, 704170, 653503, 728701, 716396, 674015, 738917, 794580, 715873, 631701, 719456, 733770, 758268, 665074, 656008, 640608, 493353, 638921, 725852, 735676, 709526, 675501, 671064, 738479, 784182, 695509, 658626, 619746, 704912, 606433, 583602, 602716, 689713, 639293, 601072, 646711, 641706, 650727, 658908, 790349]
8480G90349j52656j4672J6267Q2935r9530Q7225j96072J36457m7904M260k0902
8469E85757R2365n9254o1084L9931J6673o0169L4215l0337M8545j06475J32018
8458F32185l6358l5784n592M5598k1952l1169j18208Q7415L6017j84765R4501
8447D61888M5430O598N158N7542j01678P3226O4755j45386k4781L5220R6194k8771
8435E45395k8018L5537k7309p6809N9550q3444J1664J12723m0300Q3225j72607
8424D19607Q7504l0591n1099O5729K4567o0997R8416l5701q000j17394L6940L1359
8412D60340J11906j44999J16685r0332N5148l5795l8544O5396n4944J7425n2413
8401D09873J47064j19223P6743k9033p6975K7613L3798O7481m1936r4630j10369
$$ y = [790349, 637693, 623021, 639288, 722223, 622693, 709918, 513846, 650303, 602399, 606659, 585757, 678122, 618868, 557784, 597715, 614388, 554219, 588434, 558097, 606642, 500167, 632185, 595827, 560043, 554451, 600049, 578097, 546928, 428720, 516135, 552152, 367387, 461888, 507318, 513916, 519074, 576616, 474938, 548164, 612919, 467533, 442752, 477972, 574166, 545395, 517377, 552914, 525605, 448796, 508346, 424902, 436566, 549289, 508989, 592214, 419607, 507111, 476520, 425421, 491150, 515717, 454720, 553136, 517435, 509435, 392041, 428981, 460340, 572246, 427247, 543932, 453600, 508748, 472953, 434409, 499805, 444861, 462286, 409873, 556937, 437714, 514457, 485424, 408449, 436062, 469860, 537341, 495405, 400775, 290406]
8390B90406O8635P9118O007k3283m1103j5902K8420L1440J03459r0847l2646k57
8378D03447L2429k9748P2517j35510J35856m2380p3986N7504m8244j3843J63280
8367E21322r5550k3868J9747j5663j07331J41211o2781K589m3661J2570n95J7221
8355C65211K3484J0013O7740N9897j66904M7670M3228n4958p5706K7407p9238
8344B67844O5973q27J7355j2856m3311N2689l4427K2084Q7234j05196J55773j29976
8332C42359j8830J24334m7421K9709p6300J12798p3306n0107M1033p4385R2760
8321D02644q4344j6692J16682m9247j1793n0915M7676k8360K5915l4984K3296
8310C39878j5415m923J3525M8629j4111k9571m7919m6653R2144K3446J2455m3029
$$ y = [290406, 359041, 438159, 444166, 420883, 379780, 363878, 392298, 423738, 527197, 436350, 403704, 403447, 435876, 406128, 478645, 343135, 478991, 436611, 362625, 420129, 371885, 358042, 521322, 425772, 401904, 421651, 405988, 298657, 439868, 377087, 379676, 336015, 348585, 347990, 365211, 388695, 398708, 466448, 526345, 359441, 407111, 450339, 395381, 319675, 347082, 267844, 333817, 332990, 350345, 337489, 294178, 346867, 312440, 334524, 421758, 316562, 472335, 342359, 323529, 447863, 400442, 430151, 353851, 466649, 393343, 343236, 384269, 309884, 402644, 318300, 301608, 418290, 369043, 357250, 306335, 354011, 325651, 351566, 316582, 339878, 324463, 319540, 333065, 381694, 367583, 338012, 290093, 243440, 335584, 359030, 371485, 328456]
8298C28456L3707m0738m5134J3528N0921n3997J66431j69473M3295M2076m5373
8287C23699p550R221p7559N0838o1602K551Q6190M1129j20256J75276j00730n9464
8275B61743Q1057l6834m2915M5395J0457J7872k9626l2765J35708j55127K9295
8264B84260J37122j08755O2543j5588n4029j4340J7018j6656m1230N8984J07171
8253D16500p9865m1461l0436K7682n6299J18569r5466J7520J23863M1463j70644
8242B71426M7979O4342M8542L4215j5325P3051q7977J16847J9436O8302L2343
8231F73181J5277J26221q431R9379L8097j0754l3850J2013p3058K6836j04397
8220G60514K6559L1055k30058o8943K6306K5315p1446p3217N3987o4236q8081
$$ y = [328456, 362163, 321425, 276291, 289819, 340740, 286743, 453174, 283701, 326996, 369072, 323699, 316149, 325370, 247811, 298649, 237047, 239598, 325788, 366917, 246661, 421937, 321207, 261743, 342800, 305966, 263051, 308446, 318903, 336775, 307149, 274384, 410092, 254965, 284260, 421382, 312627, 375170, 359582, 305553, 291213, 308231, 291575, 250345, 309329, 416500, 336635, 295174, 264738, 292420, 236121, 354690, 259224, 276744, 400607, 442070, 271426, 319405, 383747, 432289, 466504, 451179, 524230, 436253, 553100, 572536, 640838, 673181, 688458, 814679, 806248, 905627, 943724, 932970, 899120, 911133, 838075, 864911, 760514, 787073, 818128, 588070, 519127, 545433, 570748, 499302, 426085, 480072, 415836, 327755]
8209C27755P3124J513p8946j02213J57245o8938r375m8550M1187K3015J6186o4564
8197B67439M236R7726q2459J23896J76906L40747j039160K52176J16508M9500
8187C07515o4871n607j30545J50813K5928k8314q8519J7401l4789J81556j92979
8176A37589J70214q2009P6689m6796o6420J1406j18184J64751N656M2584m9466
8165B46014o737K5551m5270r3685Q0509n835Q6045K6543p1362r6634J77701j79939
8153A42901M0969N0393M5379J8339m8708K544o6421j4779J7073j0370l8475J04889
8141B43734m6877K8558q5625L5059L1900q3202J68075m3143M5397r7506r9194
8130I7176J73428o2462J8755j4534P6938j24411j0546Q5980j03680M6366N6008
$$ y = [327755, 400879, 402392, 323446, 221233, 378478, 309540, 300165, 251615, 292802, 315817, 332003, 267439, 271675, 369401, 286942, 410838, 587744, 928491, -110669, 141507, 258015, 307515, 242644, 237037, 106492, 257305, 283233, 254919, 166400, 183801, 149012, 330568, 137589, 307803, 225794, 302483, 255687, 189267, 200673, 82489, 247240, 252896, 295480, 246014, 239277, 264828, 219558, 125873, 206382, 200547, 286592, 313135, 241773, 145139, 322840, 142901, 183870, 234263, 279642, 297981, 249273, 251817, 185396, 170617, 187690, 177320, 138845, 243734, 196857, 225415, 139790, 174849, 206749, 123547, 291622, 248479, 293876, 196370, 97176, 270604, 208142, 226897, 212363, 289301, 164890, 154344, 240324, 136644, 183010, 239018]
8119B39018q1518k2750N4762O9924q2281j3983O5182o4120M4145j445j16850M9233
8107A39317J8781R052L2274n953K7617o4721O9537m7497l0498n2161M6970N6953
8095A99671n9014L50N1034M9321R176N698m0394j5179l4678K1476j1504m7323
8083A28634J08201j17804J71922j23251n0990k3190J70006j29448O5721j19391
8073H0410P1016k3144J36402j37108O0340r4472M5129J78356k19550J27950k6515
8062A98814j3791k5691O8083k1874k4953q4549Q2381p8278N0495L1130K5376o6868
8050A40275j1224K0334r5075R6601n482m5765M6146n3498M5976j15532Q1366m2030
8038F2092J04413J7641O2140r2989N9635n1101j3572J15215j37315K5040m6999
$$ y = [239018, 157500, 134750, 189512, 259436, 177155, 163172, 228354, 164234, 208379, 206934, 90084, 139317, 158098, 167150, 199424, 193471, 221088, 156367, 225904, 178407, 147909, 95748, 142718, 199671, 140657, 141007, 192041, 241362, 250538, 256236, 215842, 200663, 165985, 187461, 175957, 128634, 236835, 119031, 290953, 167702, 116712, 93522, 263528, 134080, 199801, 80410, 151426, 128282, 264684, 127576, 187916, 93444, 138573, 316929, 97379, 225329, 198814, 185023, 159332, 227415, 205541, 180588, 96039, 178420, 100142, 150637, 181767, 207143, 140275, 129051, 149385, 54310, 150911, 145429, 99664, 145810, 92312, 138288, 22756, 104122, 62092, 166505, 184146, 246286, 153297, 212932, 161831, 148259, 263474, 126159, 151199, 104200]
8027A04200J04797m3206Q3014q6843k4361J7011k7591J6438J1117O2787m8950
8016A68413P5637n5962n0457N267M1888M2m6130j7149n8231K2872R8998l99n4576
8003A30213m0916J15562m1065J3618q85n936k5247o9313M9041k8764P7683L1179
7991B05170k5919K8111J9331o1775L4181n1275l8763K0929q1840O2076J07263
7980B17489n7769J220L1141q731l4206l6782O1471j835k8897N996k260K9773J4464
7967A91074o904m9999k6770P5110K0077q8862O4475l2327L6065k0423n1378k4429
7955H5709R2368j9126K0254j7800n0226k2658O0473J1621o850N2686m9058N0594
7943B07987j35596K2231M8478J11781m0935r3238N7902j8168O2081k04427J19098
$$ y = [104200, 208997, 165791, 248805, 161962, 137601, 154612, 127021, 143459, 154576, 217363, 168413, 244050, 188088, 137631, 142898, 184786, 184828, 138698, 121549, 63318, 86190, 185188, 184789, 130213, 89297, 204859, 163794, 177412, 176527, 170591, 145344, 76031, 125072, 96308, 173991, 205170, 179251, 207362, 226693, 164918, 199099, 147824, 109061, 129990, 48150, 110226, 217489, 159720, 160940, 192081, 183350, 149144, 112362, 173833, 171998, 143101, 149097, 146837, 176610, 191074, 184170, 134171, 107401, 182511, 202588, 113726, 178201, 145874, 181939, 161516, 110138, 85709, 178077, 158951, 179205, 161405, 111179, 88521, 148994, 160615, 153765, 206451, 157393, 207987, 72391, 94622, 143100, 254881, 213946, 120708, 178610, 160442, 222523, 18096, 137194]
7932A37194J5763J3673k0175N5108q2905O0493r1463J55427p1613J08835j00964
7921A79373M220O8189n2235o0397N1223j31083K3649J25917p3711J17144J0049
7910B62338m0322j05784J71315M2741o3640n0721N536j0848k6016o6336J794M0888
7898A60945m8091J257m7275Q0961l2059l2328n600r009K9009L9254N5109n007
7886A87166n8847O7449l1796j15095J21379j09308O7589n5084J43152n2756O3231
7875B27080r7443N4733o1760J22833p5338r635j9161N1454p1592J12613l4498
7864A99286p7420J6567q8791O5728Q397L9243J2227l3591o1182J21509p7362N7130
7852A81741n3131J0582J69858N54462q26241N7280m8316K08302p7306j6053L234
$$ y = [137194, 152957, 166630, 146455, 201563, 118658, 179151, 87688, 243115, 171502, 280337, 179373, 183593, 251782, 199547, 139150, 190373, 59290, 82939, 208856, 135145, 252289, 262338, 222016, 116232, 287547, 330288, 266648, 215927, 221463, 210615, 184599, 118263, 120057, 160945, 112854, 114111, 66836, 147797, 115738, 83410, 77810, 68801, 97810, 137064, 192173, 187166, 128319, 195768, 163972, 48877, 170256, 60948, 128537, 73453, 216605, 163849, 227080, 129637, 184370, 122610, 245443, 170105, 160470, 141309, 192763, 121171, 233784, 199286, 121866, 138433, 49642, 115370, 123767, 163010, 175237, 141646, 80464, 201973, 124611, 181741, 128610, 139192, 309050, 863512, 37271, 94551, 46235, 254537, 177231, 161178, 164412]
7841A64412P804j9072J8246n1590J7436R2074j09299Q6105n2344L511J1133n4645
7829A13771j7241M8993J5436k3707J285l4411Q738m6134J02323o5269J9797N2507
7817A76088o0037n5023J47076l0678q70k1143J2755R755k6693k8546M424j570
7805A25538n8074J26699q9589M7007j1288K9287L914o871L4716j0773n8762J40458
7793B72262r6585N7722k3685j9126J7785n3003m6209J42603N3233Q581Q474o1118
7781B60934Q2330j42918j978P1550j4620K8184l4506R4596j41888J24407m6728
7770B79363O93j16498J10015q7073K7655q1024m4536J31571N0661L629j0876r8327
7758A65253Q8383M0253k2557j09298R2957p3709N398J24511m391m9013k5371O3974
$$ y = [164412, 172216, 153144, 171390, 119800, 137236, 229310, 120011, 206116, 153772, 157283, 168416, 113771, 96530, 145523, 160959, 137252, 138537, 104126, 112864, 66730, 169053, 103784, 123581, 176088, 116051, 61028, 208104, 177426, 176556, 155413, 168168, 177923, 151230, 122684, 127108, 125538, 67464, 194163, 104574, 151581, 140293, 169580, 173494, 166623, 201339, 190566, 131804, 272262, 175677, 233399, 209714, 190588, 208373, 155370, 109161, 251764, 304997, 313578, 322052, 260934, 343264, 200346, 198368, 269918, 255298, 283482, 248976, 343572, 201684, 326091, 279363, 280056, 163558, 273573, 186500, 214155, 133131, 88595, 220166, 270827, 274456, 263580, 165253, 253636, 293889, 271332, 162034, 254991, 181282, 186680, 311191, 306800, 257787, 232416, 296390]
7746B96390k9271n0510J28449j01917j7512M4346k0213m4010P5725m6123l3599
7735B01755Q9493J843l4578M3405p5031J8093P609q4050K10440j86686J94431
7724C86724j257l8518n0945J61408j03032K8089o5017M8775n1869N8022p2297
7713C00083P7059m26j20833J41197o3946J7251K1633j0563L0846M2889q7032p9815
7701B68343K6526K9806N8786J77010j063K9805R7886K8025J40665J21506Q0135
7690A057430J68584J09956J37142K03574J88946J04710r9385m5026j95461j31619
7680A498851l02319r8275k07411n138j74429M4863o499j54830N8288k5460J0423
7669F38064q4286J0982J4758j8425J4567q7114J8744L3312L8792m038R0112j7737
$$ y = [296390, 267119, 216609, 345058, 243141, 225629, 269975, 249762, 205752, 281477, 235354, 201755, 291248, 293091, 258513, 301918, 226887, 244980, 252589, 168539, 378979, 192293, 386724, 385467, 346949, 296004, 457412, 354380, 382469, 317452, 366227, 314358, 372380, 300083, 377142, 376716, 255883, 397080, 333134, 350385, 372018, 361455, 392301, 435190, 348158, 268343, 294869, 324675, 383461, 560471, 559408, 589213, 687099, 715124, 855789, 977295, 1057430, 1226014, 1335970, 1473112, 1676686, 1865632, 1970342, 1870957, 1825931, 1630470, 1498851, 1196532, 1098257, 890846, 885708, 711279, 756142, 749643, 594813, 653101, 627641, 638064, 553778, 564760, 579518, 561093, 575660, 488546, 507290, 540602, 579394, 575356, 665468, 647731]
7657F47731n7375P8580j9904j36696L2586O4796l9434n2250M6975r6792L5003
7646E03220k407J989M3707l3308Q0638q9017r5869O8264J07344j00663L1139o3407
7634D51630R4364j04395O6756j25335M0506L9450m3546J25313j20629j2768N4231
7623D65577N078r6831J03196J2088p1230J32548J42094J3800j54058R7817n5744
7612E94335k9717M8908l8634M4282O807l0954K8525P148O0517L0211k6645J10370
7600H05153p0028r2210P0575m3136J22781r1306J5303n7831Q2186j3562o0580
7589F67345J44979q3041m8301O4103k084P3817n0542L2635k0012J0414n7129m8671
7577F83513R6580J4480p6837M6160m8375R0363k8405j3422J8145J77459j09608
$$ y = [647731, 590356, 668936, 649032, 512336, 544922, 609718, 570284, 518034, 565009, 468217, 503220, 500813, 502802, 546509, 513201, 593839, 504822, 408953, 477217, 584561, 483898, 515037, 451630, 545994, 441599, 508355, 383020, 423526, 462976, 419430, 544743, 424114, 411346, 465577, 470655, 373824, 477020, 489108, 417878, 550426, 692520, 706320, 552262, 650079, 594335, 564618, 613526, 574892, 619174, 625981, 595027, 623552, 630700, 691217, 721428, 694783, 805153, 735125, 642915, 713490, 670354, 793135, 701829, 717132, 659301, 741487, 727925, 667345, 812324, 729283, 680982, 745085, 743001, 816818, 766276, 798911, 778899, 789313, 732184, 683513, 780093, 794573, 717736, 763896, 715521, 805884, 777479, 764057, 782202, 959661, 850053]
7566H50053O8655P2789l1146j4688m5569j6474p1558P0535J9346J9921k7118K2723
7554I17469R9030j11143j9996L3554Q5685J4304o4370Q6596N8882n427J05945
7543A200529q2589P4009L1813M5996o0639L895O2541K0488N679q3551l5678Q0297
7531A262790o0462J21957j04920M6466K3268J9991J63233k157J55909N259j25835
7520A505499J6887O192m6553O6515J14290L8608J12962l5189M6545K47433N2661
7509B125850M4488k7398j83815P1550j1661J03845j01092N1251O6875J3561n7031
7498B096423Q1906p9746J37000J00696O7524P175J44162N903J09707j5805R3612
7487B748557N6209m2512p651K7380M2245P0359m3312J49663K3269N4957K57868
$$ y = [850053, 918708, 991497, 960351, 945663, 900094, 883620, 812062, 882597, 901943, 921864, 894746, 917469, 1016499, 905356, 885360, 918914, 1004599, 1018903, 954533, 1041129, 1100011, 1094584, 1200529, 1117940, 1191949, 1223762, 1269758, 1209119, 1213014, 1275555, 1296043, 1301722, 1218171, 1182493, 1262790, 1202328, 1324285, 1219365, 1265831, 1289099, 1309090, 1472323, 1470166, 1626075, 1631334, 1505499, 1522386, 1528578, 1482025, 1548540, 1662830, 1701438, 1814400, 1779211, 1825756, 2073189, 2125850, 2170338, 2142940, 1959125, 2030675, 2019014, 2122859, 2021767, 2073018, 2139893, 2153454, 2096423, 2178329, 2098583, 2235583, 2336279, 2403803, 2410978, 2555140, 2561043, 2670750, 2654945, 2748557, 2804766, 2762254, 2754603, 2781983, 2824228, 2894587, 2851275, 3000938, 3024207, 3079164, 3337032]
7476C337032J11062o1083O6564o847N112O4641K7225j424N4149q197j0235J74050
7464C752049M1670N7072J18138R7872J07173O5099J04406L7338J4983l8644R4487
7453D451643J28518N2334J50852Q9322J19921J99357J52074P5186J91166J24324
7443E734697R1711L83089K46598Q8674K27048K32449K37731K04596K45792K86434
7433G978819L03252M12505K16085L78412L33414L50801J31212M52999K74049M28377
7423A1259925N29044M05543N16879O84723P45907O88221P93505J003683J117987
7414A7745417J340082J476204J661104J990703K385888K627342L148273L757641
7406C6132654M542841N531486O913789Q558439J1178489J4004693J6715249J8439005
$$ y = [3337032, 3448094, 3387011, 3453575, 3446728, 3451840, 3516481, 3543706, 3542282, 3596431, 3588234, 3577999, 3752049, 3793719, 3850791, 3968929, 4066801, 4173974, 4239073, 4343479, 4380817, 4395800, 4357156, 4451643, 4580161, 4632495, 4783347, 4872669, 4992590, 5191947, 5344021, 5419207, 5610373, 5734697, 5826408, 6209497, 6456095, 6544769, 6771817, 7004266, 7241997, 7446593, 7692385, 7978819, 8282071, 8694576, 8910661, 9289073, 9622487, 9973288, 10104500, 10557499, 10831548, 11259925, 11788969, 12194512, 12711391, 13396114, 14142021, 14830242, 15623747, 16627430, 17745417, 19085499, 20561703, 22222807, 24213510, 26599398, 29226740, 32375013, 36132654, 40675495, 46206981, 53120770, 61679209, 72857698, 86862391, 103577640, 122016645]
7398A22016645J8777755J7892446J7643483K0650201K7814007L5494994L4539459
7391B94828990J7431806j0996042l3745852m2135903l9953095l3840800k7423379
7384A24165725k1441694j6119342j2164009r277092q001511o828454n829745m882277
7376C9621601l932467l222009k546929k166476j859570j611693j360695j207811
7368B1713951j200799j018233p78301j033185q23862p47189o48251n56715o17952
7359A4289464n10739o72863m40969n12815l24042n31577k38116m14760l38890
7350A0304693k95698k25503l75082l06351k37013k87843k35023l17853k82493
7341G741834j85837l40094k54127j11052j81990k69949j91164j55233j88594j62279
$$ y = [122016645, 140794400, 158686846, 176330329, 196980530, 224794537, 260289531, 294828990, 312260796, 301264754, 267518902, 225382999, 185429904, 151589104, 124165725, 102724031, 86604689, 74440680, 65163588, 57162077, 50333623, 44503878, 39621601, 35689134, 32467125, 29920196, 27753720, 25894150, 24282457, 22921762, 21713951, 20513152, 19494919, 18716618, 17683433, 16859571, 16112382, 15464131, 14907416, 14289464, 13778725, 13105862, 12664893, 12152078, 11828036, 11296459, 11058343, 10643583, 10304693, 10008995, 9783492, 9408410, 9102059, 8865046, 8577203, 8342180, 8024327, 7741834, 7555997, 7215903, 6961776, 6850724, 6668734, 6398785, 6207621, 6052388, 5863794, 5701515]
7331E701515j44665j74193r3746k23236q2629j05381j12341j57005j34398j47033
7321D326888j29333l4000j70794j12814l0458j64404p5180l0507j05414r2617
7311C381367j34744n8192k2748q9465p9163j3051o7792p1698k0912q6607o5794
7300B671201m4444p1115j18951J39236j57387l2114r8818l6930q2200j6348l6184
7289B115946J9433n2726k8871j06411J4260k6806j26861L3538k0988J0491r1396
7278A739609p4164Pn9004n7935o3425j0698j4044R493M325l0152j0900j16931
7266A316181L2953J32000j12960O8267m1413L8697J4268P8734k7792N2182m5869
7255A505248R5911j18899n6595j10813J0000O6985o4091j7630q1449r2607j6044
$$ y = [5701515, 5556850, 5382657, 5288911, 5065675, 4983046, 4877665, 4765324, 4608319, 4473921, 4326888, 4197555, 4163555, 3992761, 3879947, 3849489, 3685085, 3609905, 3579398, 3473984, 3381367, 3246623, 3188431, 3165683, 3076218, 2997055, 2984004, 2916212, 2844514, 2823602, 2736995, 2671201, 2626757, 2555642, 2436691, 2575927, 2418540, 2386426, 2287608, 2250678, 2168478, 2152130, 2115946, 2135379, 2082653, 2053782, 1947371, 1961631, 1934825, 1807964, 1841502, 1820514, 1831005, 1739609, 1665445, 1665452, 1606448, 1548513, 1485088, 1474390, 1460346, 1469839, 1474164, 1444012, 1433112, 1316181, 1349134, 1481134, 1368174, 1436441, 1395028, 1433725, 1447993, 1526727, 1498935, 1551117, 1505248, 1601159, 1482260, 1425665, 1314852, 1324852, 1391837, 1327746, 1310116, 1228667, 1136060, 1120016]
7244A120016j48275K0150J5316p9589N8417o8566k8814K5603p8088K4400j5526
7233H45044l9722L1690m8704Q2891q3632K2311n2788J57687j66269l3461N4634
7222G69681Q9243j6030r6671J05754N674n8046m7994J4244R541o6301K6114r1034
7210F44175O8391O6527o6331j0612n3923K9290J28456q0859p2011O3373k229j65911
7198E48336J89770j33120o4676J13638n0065N8893k6555l6944l8092O4266J8238
7187F43689k3954r369k0318J17885n4439p4750J3841P3579J6412M952q832M6659
7175G25355M2626J6926K1356L1622R9790m0060K8350m9978k8850K4457J6330j7419
7163H70505L4355P974j4379P4283o2218O5259J41679J17476O3930K09115J39070
$$ y = [1120016, 971741, 991891, 1007207, 927618, 986035, 917469, 888655, 914258, 836170, 860570, 845044, 805322, 837012, 788308, 871199, 787567, 809878, 757090, 914777, 748508, 715047, 769681, 858924, 842894, 746223, 851977, 857651, 799605, 751611, 765855, 775396, 709095, 735209, 644175, 712566, 779093, 712762, 702150, 648227, 677517, 805973, 725114, 653103, 716476, 714247, 548336, 738106, 604986, 540310, 653948, 603883, 662776, 636221, 599277, 561185, 625451, 643689, 619735, 610366, 590048, 707933, 653494, 578744, 592585, 666164, 682576, 687528, 678696, 725355, 767981, 784907, 806263, 837885, 937675, 897615, 925965, 875987, 847137, 871594, 887924, 870505, 904860, 912834, 898455, 972738, 910520, 975779, 1117458, 1234934, 1298864, 1507979, 1647049]
7152A647049J7574P5513q1178J1499j26624j08879J06484J25465K40492K48229
7142B155624J99093j07490k15734k03244o4693R926q9515N6676K4153J04298K51349
7131B120443K42673K02563J33249J02635M362P2939O9202M54353J114449J559757
7121F076625J019877k04036j212383j082919p72858m77871n04645j08514j38088
7112B595188k15150M1177M9093j7471l6223J23294J58169O6379K45159r881J57801
7101C157535J84036J33007J61325K72488L42264M34594O53348P85445M78795j4844
7091F587993n39249o27809m62508k92418j72156j87508k13562J11659J55231L54025
7081D713698M79083K51944o6611l11399m5897R9935L63964N22765M17291j33406
$$ y = [1647049, 1664623, 1740136, 1658958, 1670457, 1543833, 1434954, 1541438, 1666903, 1907395, 2155624, 2354717, 2247227, 2031493, 1828249, 1763556, 1773482, 1683967, 1740643, 1764796, 1869094, 2120443, 2363116, 2565679, 2698928, 2801563, 2805925, 2878864, 2948066, 3402419, 4516868, 6076625, 7096502, 6892466, 5680083, 4597164, 3824306, 3346435, 2841790, 2733276, 2595188, 2380038, 2421215, 2470308, 2452837, 2416614, 2539908, 2698077, 2764456, 3009615, 2999734, 3157535, 3341571, 3474578, 3635903, 3908391, 4250655, 4685249, 5338597, 6124042, 6602837, 6587993, 6048744, 5420935, 4958427, 4666009, 4493853, 4306345, 4092783, 4204442, 4359673, 4713698, 5192781, 5444725, 5378114, 5066715, 5020818, 5120753, 5484717, 6007482, 6424773, 6291367]
7071F291367l97994o30552k44285k73230k5894o533P2527P4435K52000K36326
7061E348167M18288M27770P48041P98199J252378K252397L443159M687864M370008
7052B3746271J539334j792021l660843l688767k858078j907237j373362q43908
7044I161389q56995n32769n68836m11565k20826j05381K1179R2133M07252K78939
7034G264520R10430J614781K259444J983142M98459r23018j109898r12080p74356
7025A0811424j148094j141094p87657m93349k52816n2531j28234n0429j11413
7016F645807J06156J15430L91483Q82083J536960J914843K010400Q45951r56969
7007A3492144j441312j483027j074860l92448r2007J50151O778l38177n75512
$$ y = [6291367, 5893373, 5262821, 5018536, 4745306, 4719412, 4712879, 4785406, 4859841, 5111841, 5348167, 5766455, 6194225, 6942266, 7740465, 8992843, 11245240, 14688399, 19376263, 23746271, 25285605, 23493584, 19832741, 16143974, 13285896, 11378659, 10005297, 9161389, 8304394, 7771625, 7202789, 6791224, 6570398, 6465017, 6486196, 6578329, 6985581, 7264520, 8174950, 9789731, 12049175, 14032317, 14530776, 13607758, 12497860, 11585780, 10811424, 9663330, 8522236, 7734579, 7241230, 6988414, 6935883, 6807649, 6757220, 6645807, 6751963, 6867393, 7258876, 8140959, 9677919, 11592762, 13603162, 14449113, 13492144, 12050832, 10567805, 9492945, 9100497, 9008490, 9158641, 9165419, 8827242, 8251730]
6998H251730o56038p11152n61821l25969j63857k71471K6148K04695Q3756M8538
6988E924559R6709J21904J81446K58278L81956o3375Q0165q7665P1916O47699
6978G613592J209558J948071J872907N31709r59524j870961j493600j208011q19829
6969F823912n42694n28200k27725j70467L8683p5670J26079Q0608L73874J59474
6959F057874L1927m04944m37045l16029j26769Q367J65014m5746J70625k33242
6949D870032l25558k58477k85651o2914r7359j21846P1383J02222N1987K51539
6939D195358R8429K79178K67807M18542N02790P29183K93094j28602j61125k72344
6929F222310R9060L64096Q24350J459406J914167J590921k8082j348118j643253
$$ y = [8251730, 7595692, 6884540, 6322719, 5996750, 5832893, 5561422, 5587570, 5792265, 5876021, 5924559, 6021268, 6143172, 6324618, 6582896, 6964852, 6901477, 6981642, 6893977, 6965893, 7613592, 8823150, 10771221, 12644128, 13175837, 12216313, 10345352, 8851752, 7643741, 6823912, 6281218, 5753018, 5525293, 5354826, 5393509, 5317839, 5443918, 5524526, 5898400, 6057874, 6089801, 5684857, 5247812, 4931783, 4805014, 4813381, 4978395, 4932649, 5103274, 4870032, 4544474, 4285997, 4000346, 3937432, 3840073, 3718227, 3789610, 3891832, 3943819, 4195358, 4293787, 4572965, 4840772, 5259314, 5762104, 6491287, 6784381, 6655779, 6494654, 6222310, 6321370, 6685466, 7509816, 8969222, 10883389, 12474310, 12446228, 11098110, 9454857]
6920I454857j364059q81197o73010o31745k97424k31127k70201k84941j25478
6911D695675j38629R013r7222o8311n662m4691l1114m8769n4032O828M9457J56679
6899D429222N2756M9847J62346J46690J1116j710J63664J37069J32426J74763
6889E458189K20829K31937K49239M81521N53467N44401O79258P45891Q02827J181240
6879A1148799J158708J452529J980017K765737L978628N532070Q692441J3540518
6871E0249447K0390907K6314789K3955599J4100179m553648j7548989k3618377
6864H9289907k1642439j6706174j1978371q601271o109879m036693l014294k231176
6856A4969610j738997j129629j019488p72559n10276o92271n07930m66037m51067
$$ y = [9454857, 8090798, 7209601, 6536591, 5904846, 5607422, 5376295, 5106094, 4821153, 4695675, 4557046, 4566059, 4468837, 4400526, 4394864, 4350173, 4319059, 4270290, 4216258, 4223086, 4272543, 4429222, 4481978, 4531825, 4694171, 4840861, 4851977, 4850267, 5013931, 5151000, 5283426, 5458189, 5679018, 5910955, 6160194, 6641715, 7195182, 7739583, 8418841, 9164732, 9967559, 11148799, 12307507, 13760036, 15740053, 18505790, 22484418, 28016488, 36708929, 50249447, 70640354, 96955143, 120910742, 135010921, 130457273, 112908284, 89289907, 67647468, 50941294, 38962923, 30361652, 24251773, 20215080, 17200786, 14969610, 13230613, 12100984, 11081496, 10308937, 9798661, 9106390, 8598460, 8132423, 7681356]
6847G681356l84187l84227l73072l34166k41504l37161k04765j20900k22582j17434
6837D961358j57014j95683j57047j28271j72257j09167j23661r6467o3779j80610
6827C577402O1768J7861Q4772J34169J79514J61635j67981j37519j78805k48518
6817C484298j98943q9935k07937j40356N3481o3079n8162j31736P4352r7913j44362
6806B479708l3680l2792O3280k0869Q219l374O7498k48261q2102o3245k3634r4194
6794B016554L4276j00341p8242q5107J69844j61930j9775K922m7067j90447J20500
6783A661187k6284O8938j65427N6291L1371J96978L7200Q9326O9574m8262J1219
6772A982111M5061p3285K7323j70024P034m1610l3753J4431j1662L7962P8927
$$ y = [7681356, 7297169, 6912942, 6539870, 6205704, 5964200, 5627039, 5422274, 5301374, 5078792, 4961358, 4804344, 4608661, 4451614, 4323343, 4151086, 4041919, 3918258, 3821791, 3758012, 3577402, 3639170, 3657031, 3741803, 3875972, 4055486, 4217121, 4049140, 3911621, 3732816, 3484298, 3285355, 3195420, 2987483, 2847127, 2900608, 2837529, 2779367, 2647631, 2721983, 2624070, 2479708, 2446028, 2413236, 2476516, 2455647, 2463866, 2460492, 2527990, 2279729, 2197627, 2134382, 2110748, 2016554, 2050830, 1950489, 1872247, 1787140, 1956984, 1795054, 1775279, 1778201, 1731134, 1540687, 1661187, 1634903, 1703841, 1538414, 1594705, 1626076, 1823054, 1860254, 1949580, 2019154, 1970892, 1982111, 2027172, 1953887, 1981210, 1811186, 1818220, 1776610, 1742857, 1757288, 1745626, 1783588, 1862515]
6761A862515Q0562r8010L0902j21438m0945N5656M0809o0146k19433J40198k16392
6750A454278P2731k01467M3429j0149j30376J5557m092j15390n3066J59033n9375
6739A171113q8265J35983K6161R013K9330p8107j8167m0492J07308j03614j2547
6728A137716L9421M723j67877J0805r3088l17Q634m5169K1755r377L5720O7352
6716A010298N2944q0642m6393K6915M0259P512j48851K39866j46032P4337r5551
6705I34662k5214L2268r1640J29624o5845M0083k4123J05440J30406n036L0971
6694A191596L8763N1794P6088J3617n2420J087M2093m2445j5373J27452r5507
6683A336745Q0152q2393J45725J07675J17424L25083N08492Q43521O70399p3017
$$ y = [1862515, 1943077, 1845067, 1875969, 1754531, 1713586, 1769242, 1810051, 1749905, 1530472, 1670670, 1454278, 1527009, 1325542, 1368971, 1358822, 1228446, 1244003, 1239911, 1124521, 1071455, 1230488, 1171113, 1082848, 1218831, 1244992, 1254005, 1283335, 1205228, 1187061, 1146569, 1253877, 1150263, 1137716, 1177137, 1181860, 1013983, 1024788, 931700, 931383, 940017, 894848, 916603, 907226, 942946, 1010298, 1063242, 982600, 936207, 963122, 1003381, 1010893, 862042, 1101908, 955876, 1030213, 934662, 909448, 941716, 850076, 979700, 913855, 953938, 929815, 1035255, 1165661, 1160625, 1191596, 1230359, 1282153, 1358241, 1371858, 1319438, 1320525, 1362618, 1320173, 1304800, 1432252, 1336745, 1416897, 1334504, 1480229, 1587904, 1705328, 2030411, 2538903, 3382424, 4052823, 3979806]
6673C979806m80498o15261n05206j66132k98855o3216j77212M9970m6679n030
6663A671687J13339L8845J01866K1488J00215p7692J20462J01414K01865J86460
6653B579949J24390J67837K58600Q59003J490337K310241K162907P77188j032828
6644I697624j622417j308169j078113q87410q02130m01725m03928j13866j07335
6635B972531K8017K5656J13862J40593J85569K49003L02627r4391n8950n495Q4340
6624C943362J99056L47355L78762J432603K196891K624398J284464n50458j752926
6615A0103507j488278r42366n39922j91742q344M53709J631543K738004L254105
6606A5010216K054138p12481k128354j367461J98386K193998L346456K251802
$$ y = [3979806, 3499308, 2884047, 2378841, 2212709, 1913854, 1850638, 1673426, 1723396, 1676717, 1671687, 1785026, 1823871, 1925737, 1947225, 2047440, 1969748, 2090210, 2191624, 2393489, 2579949, 2704339, 2872176, 3130776, 3989779, 5480116, 7790357, 9953264, 10730452, 9697624, 8075207, 6767038, 5688925, 4801515, 3999385, 3597660, 3193732, 3079866, 2972531, 3000548, 3026204, 3140066, 3280659, 3466228, 3715231, 4017858, 3923467, 3864517, 3859022, 3943362, 4142418, 4489773, 4868535, 6301138, 8498029, 11122427, 12406891, 11856433, 10103507, 8615229, 7672863, 7132941, 6941199, 6932855, 7386564, 9018107, 11756111, 15010216, 17064354, 16351873, 14223519, 12856058, 13054444, 15248442, 18594898, 20846700]
6598B0846700j388577l116464k652218j398323q85037q55110o77456k00000j91694
6589I481821o62667q71484r13392q31222n04799l21609j37770p1008M5110j06412
6579E106568n1516j05363P6651L09704L39000N51747P37141K40869n60406p45455
6569E898940o85106m95948m80181k83955j95433O766J56827K26762k58462l58298
6559C531912m04491j79466k16869k02811k8919j91150l2356p2901N0734M346m2073
6548B215956P4532k1581j23041Q692n0258j18234K1090O518O780K84011L65412
6537B669877K10681p1019j78561k72886j07569k47988j63261j73650q4920P2421
6527A653125j86746j4537j2105L7343o0398j004N6161j38535N0615j38364Q8414
$$ y = [20846700, 19458123, 16341659, 13689441, 12291118, 11406081, 10550971, 9873515, 9673515, 9481821, 8819154, 7947670, 7034278, 6203056, 5698257, 5376648, 5238878, 5167870, 5212980, 5106568, 5055052, 4949689, 5026340, 5336044, 5675044, 6226791, 6963932, 7204801, 6644395, 5898940, 5213834, 4717886, 4237705, 3953750, 3758317, 3765083, 3921910, 4148672, 3890210, 3531912, 3127421, 2947955, 2731086, 2528275, 2499356, 2308206, 2275850, 2202949, 2253683, 2258029, 2215956, 2290488, 2268907, 2145866, 2154558, 2104300, 1986066, 2007156, 2013674, 2020454, 2304465, 2669877, 2880558, 2809539, 2630978, 2358092, 2250523, 2002535, 1839274, 1665624, 1580704, 1653125, 1466379, 1451842, 1439737, 1477080, 1416682, 1415678, 1471839, 1333304, 1383919, 1245555, 1333969]
6516A333969j86486n9987R1583k1363L8181l7837L7604J6551m9845P8714l922
6505A237162k886J30899l941J7631p5911J20038j03616r9714m0814q7225l288
6494A088335K4727o6005M928j11637J08792p7757O8466j21838J2094j9256q614
6483I02235L9333l4630j14970K759L4217p5731K118R2001j44063M7952Q5932N921
6471H43074J01465p0172n5804K437M3061K4471k1863K8431L7696M7217R270K8205
6459A017488j7320j8639M2627K0657j04362N9463K9628n9766Q570Q7901j30987
6448I35260K07677p8445K1819r4766l0716k1931j07897j0578J3690j15050K9178
6437G48241O7007n0438l9733O8042n8519M8786M9224j29221N6344L1026K443J46162
$$ y = [1333969, 1147483, 1087496, 1179079, 1157716, 1195897, 1158060, 1195664, 1212215, 1162370, 1241084, 1237162, 1234276, 1365175, 1361234, 1378865, 1302954, 1422992, 1319376, 1219662, 1178848, 1091623, 1088335, 1113062, 1047057, 1051985, 940348, 1049140, 971383, 1039849, 918011, 930105, 910849, 902235, 941568, 906938, 791968, 794727, 828944, 753213, 755331, 847332, 703269, 751221, 837153, 843074, 944539, 874367, 818563, 821000, 864061, 888532, 866669, 895100, 932796, 980013, 989283, 1017488, 1000168, 981529, 1024156, 1044813, 940451, 999914, 1029542, 969776, 978346, 1066247, 935260, 1142937, 1064492, 1086311, 991545, 960829, 938898, 831001, 820423, 834113, 719063, 748241, 815248, 764810, 725077, 793119, 734600, 783386, 832610, 703389, 759733, 790759, 793202, 939364]
6425I39364l8582L8003P6624M7173M704M1342Q979R4425J6818J9402O8395R1881
6413A408528Q4901O7536k6836J11716p1452P3398j40167Q1216R084J46128L5177
6402A779229J75811K39867K33712J45329J31925K0318l72089n4534j97847p7635
6392B024086j07947L275R232p0041l4680j38461O2016k7355K901O3149p4466M0660
6380A752369P963J18941q5440q294J78110j29567o030O4521Q9227J7186P3802
6369B072788J27038j1190N4639K8019P7582K2348n4612O8428J20063Q0609J2463
6358B598175J62810J50394N6240J93610L68112N21079O08193O37841L11835l71959
6348E236330n83440n30451m21558l61422l00804j61677o7914n5242j51181r4300
$$ y = [939364, 900782, 938785, 1015409, 1062582, 1067286, 1108628, 1117607, 1212032, 1228850, 1248252, 1316647, 1408528, 1493429, 1560965, 1534129, 1645845, 1574393, 1647791, 1507624, 1588840, 1597924, 1744052, 1779229, 1955040, 2194907, 2428619, 2573948, 2705873, 2726191, 2354102, 2299568, 2101721, 2024086, 1916139, 1919414, 1928646, 1858605, 1823925, 1685464, 1747480, 1720125, 1723026, 1786175, 1711709, 1752369, 1760332, 1879273, 1793833, 1785539, 1963649, 1834082, 1828052, 1892573, 1981800, 1998986, 2072788, 2199826, 2188636, 2243275, 2271294, 2348876, 2371224, 2316612, 2385040, 2505103, 2585712, 2598175, 2760985, 2911379, 2967619, 3161229, 3529341, 4050420, 4658613, 5296454, 5608289, 5236330, 4652890, 4122439, 3700881, 3339459, 3038655, 2876978, 2809064, 2753822, 2602641, 2508341]
6338B508341O3763n7128j8499j06134P5231M3152l9846j154O2985O8248P2585
6327B671544P2344J56837O8857K42319J45044J14764J28428K28457L09994N01790
6317D640378O18797P74650M66585O7752n17407m63661n16367k66166k57804k88840
6307D257917k95116J09766j95735M3722J04569j68393j12746j31638k61929k07818
6297C142599k32403P873j60969o8786k75198K577J04327p5817R8213p7808j5959
6286B448649p4433p7798k26945K1809j81698J59106j26148k2428K296m15O1914
6275A983909J9321l4888K27517K0862J13895K65257J1452K14283O7793J13806
6265C003207k13443j31995j03881j00673j00070J906l5865j5248N8546L48778
$$ y = [2508341, 2572104, 2514976, 2496477, 2390343, 2465574, 2508726, 2468880, 2467726, 2530711, 2598959, 2671544, 2743888, 2900725, 2969582, 3211901, 3356945, 3471709, 3600137, 3828594, 4138588, 4640378, 5259175, 6033825, 6500410, 6568162, 6050755, 5587094, 5070727, 4804561, 4546757, 4257917, 3962801, 4072567, 3876832, 3920554, 4025123, 3856730, 3743984, 3612346, 3350417, 3142599, 2910196, 2918069, 2757100, 2688314, 2413116, 2415693, 2520020, 2444203, 2542416, 2464608, 2448649, 2374216, 2296418, 2069473, 2091282, 1909584, 2068690, 1942542, 1920114, 1922410, 1921995, 1983909, 2003230, 1968342, 2195859, 2216721, 2330616, 2595873, 2607325, 2821608, 2889401, 3003207, 2789764, 2657769, 2553888, 2453215, 2353145, 2355051, 2319186, 2303938, 2362484, 2711262]
6255B711262L86966M47924L91549K01291J61482m6852l35340m32259l31520m72981
6245B681522j65318j43586k24912q1806Q053m5779j86900M9299k5115q9425R191
6234A785224k12836J481j22941N1996q8078J834n6766Q5845p7870o08r339J6197
6222A374139K3149J6104k1254l2014o0110M0547O0730J1191J1518m0291l9895
6211A343814J02851p3294j09034P8622r70L5056j03917J3906L1111J03388J5121
6200A436654n7521N6779j76003N6283j45191N5732j6031l7958n0242P5928j4618
6189A183812J07725r6763J2609m0885J94228j25745J24455o7887j01244R5753
6179A286058k7624o3052M1598r5900Q1033k4971N2413l1957o1796n6163J4944
$$ y = [2711262, 3098228, 3546152, 3937701, 4138992, 4300474, 4253622, 3918282, 3486023, 3154503, 2681522, 2516204, 2372618, 2147706, 2065900, 2073953, 2028174, 1841274, 1890573, 1865458, 1776033, 1785224, 1572388, 1573869, 1450928, 1502924, 1414846, 1416680, 1359914, 1445759, 1367889, 1367281, 1357942, 1374139, 1397288, 1413392, 1392138, 1360124, 1300014, 1340561, 1401291, 1412482, 1424000, 1383709, 1343814, 1446665, 1373371, 1264337, 1342959, 1341989, 1377045, 1273128, 1287034, 1318145, 1421533, 1436654, 1379133, 1435912, 1259909, 1316192, 1171001, 1226733, 1210702, 1172744, 1122502, 1198430, 1183812, 1291537, 1194774, 1207383, 1166498, 1360726, 1234981, 1359436, 1291549, 1190305, 1286058, 1258434, 1195382, 1236980, 1141080, 1222113, 1197142, 1249555, 1217598, 1155802, 1099639, 1114583]
6168A114583o6854N2281p5067n7441N9780j40482K4725O098J2336j37174M1439
6157H34224J8470j43789k0119J3539r593m3017L8917j20783J59692j84719M3898
6146E86720J4113j3945j7119p641O6537M8301r1785J5004M1721J02540k8446N8343
6134G74343n9030Q6235q4127M6990l4199n7862Q577N5913l8697n6510L9293l4926
6122F46000L4643K3621j58368K4722K3640K407q8601R1664r8550m9824P2807m3232
6110D80929j09442J36749n3483p8870M211N433K0799N431q8202J8289n4212M5294
6098C32926o2758M1630j28058J11660n7784N5292P7578o9590l1271J4753r1562
6087A92816J39129j03434M2343j2309j9932K1070l4969p2229J26871J4494L362
$$ y = [1114583, 1047729, 1100010, 1024943, 967502, 1027282, 886800, 911525, 917623, 929959, 792785, 834224, 852694, 708905, 688786, 702325, 692732, 649715, 688632, 567849, 727541, 542822, 586720, 600833, 586888, 569769, 562128, 628665, 676966, 585181, 600185, 641906, 744446, 716000, 774343, 715313, 801548, 717421, 764411, 730212, 672350, 680927, 736840, 698143, 641633, 680926, 646000, 680643, 704264, 545896, 570618, 594258, 596665, 508064, 599728, 501178, 451354, 524161, 480929, 371487, 508236, 454753, 375883, 380094, 385527, 406326, 411757, 323555, 341844, 287632, 332926, 270168, 311798, 183740, 295400, 237616, 292908, 370486, 300896, 269625, 284378, 192816, 331945, 228511, 270854, 258545, 238613, 259683, 224714, 152485, 279356, 293850, 297212]
6076B97212O7870j30295M1643M5169q7117M2365k057k0777o9375P5919j5425m7327
6064A97805K0705L0230o93o9161L9430O1265q2541l3350L631r862J04283k8278
6052B33464k5037L62N2042j7028j08747Q8115j56020J80415j32122J6431K7025
6041A58900J03819j50760M9767j06617R1478q969N5958J5311j57729K07645j72834
6030H5969M8320O3616k1810m4932j25085J13720J50537r4771J1466j6800P5855
6019B46085j36447Q0214n3189L6173o2519J95929j01580n5087J1196l8837o1955
6008E9983J03237k6080m2658P0980j04776M0630o8950J7057J887R5727o0241J283
5996H8079L4996q3280L6809R1450r4566N1039L890j20452O5267p235L5565o7794
$$ y = [297212, 365082, 234787, 276430, 321599, 234482, 276847, 274790, 254013, 184638, 260557, 245132, 197805, 218510, 248740, 248047, 178886, 218316, 279581, 197040, 163690, 167321, 157459, 261742, 233464, 208427, 208789, 260831, 243803, 135056, 223171, 67151, 247566, 115444, 131875, 158900, 262719, 111959, 161726, 55109, 146587, 137618, 193576, 208887, 51158, 258803, 85969, 134289, 197905, 176095, 131163, 6078, 119798, 270335, 175564, 187030, 170230, 246085, 109638, 189852, 136663, 172836, 110317, 306246, 204666, 149579, 160775, 121938, 59983, 163220, 137140, 94482, 165462, 60686, 101316, 32366, 49423, 51310, 147037, 86796, 88079, 123075, 39795, 76604, 168054, 73488, 124527, 128417, 7965, 73232, 65997, 101562, 33768]
5984C3768l452K5165O6644l822j24779Q8732M176L7878l983K172q1158k4600P9066
5971I5807J3877J4711j1610n2112j2783J4629M739J5105J33002j48328K8123l000
5959I2160m8525P5955J1888p1249l4330Q6201m4877N7072m6037N90o8133K8997
5947C9712P4751m9787M3658m4077m1121j2446J03621k4534q738k9726q014P0930
5935A14229K1075l4512J8860L8578m8060J1579q089L633l7485R474J5756m8668
5923E6370L5377K2892l4276k0952J2769R6890r1087N2805m9498l0604J51692q0596
5911A21782j6261j8608k3621P8698k7694n6777p3316J42197l3519j42155K08760
5900A59486p3819J0374o7586O1735J0724p7145R2190n1233K7156p7984L7047K0371
$$ y = [33768, 30316, 55481, 122125, 118303, -6476, 82256, 86432, 124310, 120327, 122499, 41341, 16741, 95807, 109684, 124395, 112785, 60673, 47890, 62519, 67258, 82363, 215365, 67037, 95160, 92160, 43635, 119590, 131478, 60229, 25899, 112100, 67223, 124295, 78258, 78848, 10715, 39712, 114463, 64676, 108334, 64257, 23136, 10690, 114311, 89777, 81039, 51313, 43299, 114229, 135304, 100792, 119652, 158230, 110170, 121749, 113660, 117293, 79808, 89282, 105038, 56370, 91747, 114639, 80363, 59411, 72180, 169070, 77983, 130788, 81290, 50686, 202378, 121782, 105521, 86913, 63292, 141990, 114296, 57519, -15797, 126400, 92881, -49274, 159486, 85667, 96041, 28455, 90190, 100914, 23769, 115959, 64726, 91882, 13898, 50945, 71316]
5888G1316R1178p2888J6786l8990l946j22517M1635Q9314o4576j2318M8213j651
5876D1556M4345n8504J18321q7727K0982L8618j7683j5363L06m7809Q6813k4474
5864I9381n0210k531R794k3479L8583m065Q024n2258J969M9733J4414j6617J20127
5851A92865l3722j30628R720l1207Q8304j12988O0887P1098r8396J00385o1661
5840E4657m8724k7003j2985N0375P7415n1421l9243o9683R8780m9784l1412J65175
5828A16147j22325K1619n2128O5245M0027j217P482N8316K603p0836l1114l4771
5816i52p5669J59420J2053j42714Q3761p6376l9115Q8725L5593K2920k4897J03660
5804A46409n2885j02106O5605J0729j30801J41798k1443o2318N3655j7793K4377
$$ y = [71316, 162494, 89606, 106392, 67402, 63456, -59061, -17426, 71888, 7312, -5006, 43207, 41556, 85901, 27397, 145718, 57991, 78973, 117591, 99908, 84545, 84851, 37042, 123855, 99381, 49171, 46640, 56434, 32955, 71538, 67473, 75497, 23239, 25208, 74941, 89355, 72738, 192865, 159143, 28515, 38235, 7028, 95332, -17656, 43231, 114329, 15933, 116318, 54657, 5933, -21070, -34055, 16320, 93735, 42314, 3071, -66612, 32168, -17616, -49028, 116147, -6178, 15441, -36687, 28558, 68585, 67368, 74850, 133166, 135769, 64933, 33819, -952, -76621, 82799, 94852, -47862, 35899, -40477, -79592, 9133, 44726, 67646, 42749, 146409, 93524, -8582, 57023, 67752, -63049, 78749, 57306, -5012, 48643, 30850, 55227]
5793E5227O3880j43520J02324n838P5121m4317N6538k7432M3315j2402k1208R5775
5781B37463J8369L4612p8269o491n9344J6728j30563j0626J26195r1557R288N310
5769G1115n1362j5041P8095m0382p658O3887p6181J56772k0135j79407M0777K0990
5757D1470n3556L2105J18086o4107n7731Q8744R229k0452l7176k0561k6057J9375
5745B9369m5094L5054R4310q0716N946o863O895N6320R571q9969l6640J49148
5733A27331j0416J20915j29801j1224j8202n1498j6866R1812l7609o0785K5052
5722B8709M2462o5079P1193q9517k3230J60929n5680j6179k6645M7463J6244m8818
5710D1852n6952J0472L2985J5972n8630J40872n2121N8926m6316l1535J6437K7285
$$ y = [55227, 119107, -24413, 77911, 72073, 147194, 102877, 159415, 131983, 175298, 162896, 141688, 237463, 255832, 290444, 212175, 205684, 146340, 163068, 32505, 21879, 148074, 56517, 65805, 71115, 19753, 4712, 82807, 42425, 34767, 98654, 22473, 179245, 159110, -20297, 20480, 41470, -12086, 20019, 138105, 73998, 16267, 105011, 114240, 93788, 56612, 36051, 9994, 29369, -15725, 19329, 113639, 32923, 38869, 32006, 38901, 95221, 104792, 14823, -21817, 127331, 116915, 237830, 108029, 96805, 78603, 27105, 10239, 102051, 64442, 3657, 28709, 71171, 6092, 77285, -12232, -35462, 125467, 69787, 53608, 26963, 74426, 90670, 41852, -15100, -4628, 28357, 44329, -14301, 126571, 74450, 133376, 87060, 55525, 71962, 99247]
5698I9247o8357L5409J828o1376J2375M011m796k7580M6777k5356Q6564L7258
5686A36004o9374j9061k6500N4871Q3419n5909J5934m9438N2117r8072J876P3016
5674I8883m1105P450j2731k484p202M8548k7398j08043J15799k1589n5872J2363
5662F619O4981l3047k8526n9586J16838j4841q187o529L5493p923o0698K7511
5650C2105o721k4007Q1528M9908k3803o9031M4286L7750q6256Q0768o0785N2045
5638A07787O716J2653Q015O0826Q4375l9536J68797J26647K74324l3024o8775
5627G08805k72929m0023q9479n3917j7510n7374k1805m9801k087O006J5245K4734
5615A49865m9299l6677l1753Q6727o0462L8115m7584L104O7608l2319p988O5476
$$ y = [99247, 30890, 66299, 68127, 6751, 19126, 23137, 18341, -9239, 37538, 12182, 98746, 136004, 66630, 47569, 21069, 75940, 159359, 103450, 119384, 69946, 122063, 23991, 25867, 98883, 57778, 65228, 52497, 50013, 42811, 91359, 63961, -44082, 71717, 50128, -5744, 6619, 71600, 38553, 10027, -49559, 67279, 52438, 44251, 37722, 73215, 65292, 4594, 32105, 25384, 1377, 82905, 132813, 109010, 39979, 84265, 122015, 35759, 116527, 55742, 107787, 114503, 127156, 135171, 195997, 280372, 240836, 409633, 536280, 810604, 777580, 708805, 435876, 395853, 306374, 252457, 234947, 177573, 155768, 105967, 103880, 109886, 125131, 149865, 100566, 63889, 32136, 118863, 58401, 96516, 48932, 52036, 119644, 87325, 79337, 144813]
5603A44813j13062J6245O6084o9042j4346k8644J29639r3625O100k7200L7759
5592E4721o6934J6997K4939M3758q704P53k5415j9371J9897N4604L9980r443j10451
5579A5331P4913P4105m7068K832m4700J00614n7546K6580M6023o6187l9050l2574
5567E3273q043j9460J2396L5069m744m829R1772l7743M4000p047O8622j03463
5555A19803L4614K8883M0617k20405R235O5231j29368P6012j9819J5731J72669
5544A93203j9593N9179l9352l8190m5316m4473J6182Q1611j04306j8584O4472
5533A04833q5200Q8533M532R6990L7545M0962J02931K26806K98367K18139j12802
5522A021636k10902k27776j06501j6110j32700p185j23113k6955R3478r9595N9687
$$ y = [144813, 31751, 47996, 114080, 45038, 30692, 2048, 131687, 38062, 44162, 16962, 54721, -12213, 4784, 29723, 73481, 64777, 65530, 40115, 20744, 40641, 95245, 135225, 125782, 15331, 90244, 164349, 117281, 120113, 75413, 176027, 118481, 145061, 191084, 124897, 85847, 53273, 45230, 25770, 38166, 73235, 68491, 63662, 155434, 117691, 161691, 154644, 223266, 119803, 154417, 183300, 223917, 3512, 12747, 77978, -51390, 24622, 4803, 20534, 193203, 173610, 232789, 193437, 155247, 109931, 65458, 81640, 163251, 58945, 40361, 104833, 19633, 108166, 112698, 209688, 247233, 288195, 391126, 617932, 916299, 1134438, 1021636, 810734, 582958, 476457, 460347, 327647, 320462, 197349, 170394, 263872, 164277, 223964]
5511B23964r4052m9355K2679J9216O961M2661p0334J46570j2807O1532P7841R7251
5499D72127K6219K35315K35622L96866J14464M11289J22622o1501j80865k57536
5489A514622k09245k92752k52089q7317j50954p3478J85304l43186K12m4354q8080
5478A58683O5302p0590j4055J17011j26680K0896k8722O570n5003J12593j03097
5467H2908J23555j06051m4641M4256k9024L272M0926k341j9481R0112j8727o3319
5455A01445L8463K3508r6627J45725q2999R5789j31804M9412M4113j03167q1169
5444B689J15515n5226L7984m1176M2951j1748R5676j24469P1054q1986J01341
5433A52605J7591o1396q4320M2287K7114j250o228Q48N725l881o6358N9284k4310
$$ y = [223964, 129912, 80557, 103236, 122452, 129413, 172074, 101740, 248310, 235503, 297035, 374876, 472127, 498346, 733661, 969283, 1366149, 1480613, 1891902, 2014524, 1953023, 1772158, 1514622, 1305377, 1012625, 760536, 673219, 522265, 448787, 634091, 290905, 291117, 246763, 158683, 223985, 153395, 139340, 256351, 129671, 150567, 121845, 128415, 73412, 186005, 82908, 206463, 100412, 55771, 100027, 71003, 74275, 115201, 112860, 93379, 183491, 164764, 101445, 139908, 163416, 66789, 212514, 129515, 225304, 93500, 142912, 187025, 83858, 2689, 118204, 62978, 100962, 59786, 102737, 90989, 186665, 62196, 133250, 51264, 152605, 170196, 108800, 24480, 66767, 93881, 92631, 86403, 87251, 92976, 89095, 22737, 82021, 57711]
5420E7711J77238j85647O4131K5174m0768K8048N6447j37029l373J51369q9041
5409A04260J3216l4699m3440o5659Q5730l9473J00336L206o7899K6907M7329n4682
5397G5132m5226J077Q4130p1585O659K3873J7908K8042p6563K134P6151R589j6307
5384A15014p727k333L5812N9638j1768j291K133o6485P6834j7248k5543j1563
5372A45473m0152M1941j31199J61454k8013q9280R5659k0804L8110m2401o823
5361A23965L2323l5471l6527N0733l4875K4765N8127j96671J12001J9837q6304
5350C1903L8137Q3991p2832K5063j1288k9216P5520K5590P5706j0511l5512M6544
5338B43095j35586n7439J38329j9625M1878k6135r0337Q8554J9684q007n9098
$$ y = [57711, 234949, 49302, 113433, 138607, 97839, 125887, 182334, 45305, 41932, 193301, 104260, 117476, 82777, 39337, -26322, 59408, 19935, 120271, 123477, 55578, 82485, 129814, 75132, 29906, 30983, 115113, 43528, 50187, 74060, 91968, 120010, 43447, 45581, 121732, 131321, 115014, 107287, 104954, 140766, 200404, 188636, 187345, 189478, 122993, 199827, 182579, 157036, 145473, 105321, 147262, 16063, 177517, 149504, 60224, 155883, 135079, 173189, 130788, 123965, 156288, 120817, 84290, 135023, 100148, 124913, 183040, -13631, 98370, 118207, 31903, 70040, 154031, 81199, 106262, 94974, 65758, 141278, 166868, 242574, 232063, 196551, 243095, 107509, 50070, 188399, 168774, 210652, 184517, 94180, 182734, 202418, 194411, 135313]
5327A35313n9553J27935M1713j51239M8232o3057P8512r3773K6241M0970O7304
5316A98598j3099L4377l6129j6288j3754Q2794M3638k6942j06126J14863m8781
5305B13151o079J884l3660J257k2904j6122Q6754n6789N0034K108n3160M6272
5293B12746K7308R8975q8394L6243j6118l3921j7049L7602J07785K82758K15753
5282H63688K68391n7981j71894l08997m8927j37782K9312k03988R8512n6384Q501
5271B82451K1310J4764o3285l1686P1377j12401J08663j8757l8242K0975M6539
5260C01708j5400r4409J76341n392J44258l9593j17335p895R5309m5940L7921
5249D29573k3909n9206j4892L5767p8448M7566m747K8638L8894q2074p5335N4211
$$ y = [135313, 75760, 203695, 245408, 94169, 142401, 79344, 157856, 64083, 90324, 131294, 198598, 185499, 219876, 183747, 167459, 153705, 236499, 280137, 253195, 147069, 261932, 213151, 207072, 208956, 175296, 176553, 153649, 137527, 224281, 167492, 217526, 219634, 166474, 212746, 240054, 339029, 250635, 286878, 270760, 236839, 219790, 257392, 365177, 647935, 863688, 1132079, 1074098, 902204, 593207, 544280, 406498, 435810, 231822, 330334, 273950, 282451, 303761, 318525, 255240, 223554, 294931, 182530, 291193, 272436, 234194, 255169, 301708, 286308, 191899, 368240, 362848, 507106, 467513, 350178, 342283, 437592, 391652, 429573, 405664, 346458, 331566, 367333, 288885, 336451, 331704, 360342, 399236, 317162, 241827, 296038]
5237B96038J09922p2242j4207N9688j24233Q9365M8304n6908O1578m8165J20085
5226D69225j02601j08890K00044j00859L5650R6895o9855j1687L4833j5314M0672
5215D68113o5594N8466j35383J15750j03916J10386p8877N4006o3978j2773J10569
5204D56769o0182R7009p4434O2881n9672J0756p7292P9178j6579J595J70547p0275
5192E20301K2608K9536l2250k4229M6869Q4900o4765L3392J4453q5368J2166j0219
5180E47394M1301j5615l4586m7624J5748O1828K9656o2496N3773j2397K853O6397
5168F46232J32417q0644K1664m15l5139P5737j3449L3775L2832j2395P052J22832
5156I30499J09616l5997O7314j5977j60866J29310p3555j0441J42991k4124J34312
$$ y = [296038, 405960, 333718, 319511, 379199, 254966, 344331, 392635, 335727, 397305, 349140, 469225, 366624, 257734, 457778, 356919, 392569, 489464, 419609, 407922, 442755, 427441, 468113, 402519, 460985, 325602, 441352, 337436, 447822, 368945, 422951, 358973, 346200, 456769, 396587, 493596, 419162, 482043, 422371, 433127, 355835, 435013, 418434, 420029, 590576, 520301, 542909, 572445, 540195, 515966, 562835, 647735, 582970, 616362, 630815, 545447, 557613, 547394, 588695, 573080, 538494, 490870, 506618, 568446, 598102, 535606, 589379, 576982, 579835, 646232, 778649, 698005, 719669, 719254, 684115, 759852, 746403, 780178, 813010, 800615, 807667, 930499, 1040115, 1004118, 1071432, 1055455, 894589, 1023899, 950344, 939903, 1082894, 1058770, 1193082]
5145A193082n8454Q3583J7206k6984J85285J32518J22860J28312J12201O3854
5135A953463L20774K66316L74109N37010J564115L310482M316416L902660j338240
5126A5207105l299401k971829k354631j592280j110664p34757l88516l31564j69420
5117B254043o1775r0135j48852L624l5611k3244P7054R9219Q6870J68187K63142
5106B592522O69273Q90706O06801M34007j99112m56366o60495l85012l71878k26787
5096B893659j83918j42384j7324L4015J71009J95034L78582R70007J828629K487999
5086H615308K077972m92821j621077j182536r45161r92123j003327o26407m48430
5077C381398j08081k82166J1712m3414n6408r0514J01643M7580R6021K56649L79609
$$ y = [1193082, 1134628, 1218211, 1235417, 1208433, 1393718, 1526236, 1649096, 1777408, 1889609, 1953463, 2274237, 2540553, 2914662, 3451672, 5015787, 8326269, 12642685, 16545345, 15207105, 11907704, 8935875, 6581244, 4988964, 3878300, 3143543, 2755027, 2423463, 2254043, 2192268, 2102133, 1953281, 1956905, 1921294, 1898050, 1975104, 2074323, 2161193, 2329380, 2592522, 3261795, 4152501, 4759302, 5193309, 4994197, 4537831, 3877336, 3492324, 3120446, 2893659, 2709741, 2567357, 2550033, 2584048, 2755057, 2950091, 3328673, 4298680, 6127309, 8615308, 10693280, 10200459, 8579382, 7396846, 6451685, 5459562, 4456235, 3829828, 3381398, 3273317, 2991151, 3002863, 2959449, 2903041, 2812527, 2914170, 2961750, 3057771, 3314420, 3694029]
5066C694029O48648O64464M22235J75714J76728J07830J56879p179k65723m09530
5056E364095l10349l33176j30452p9216l1764P1797J266K18486J48656K77565
5046E196908R6848K61279L09036K94230N53476O45397R66248R73166P66161N40490
5036A0603239N97202R58436J341790J887841K631640L925505P234881J9751054
5028D8931588M1761272N0908162L8762298k8364935m3186102l4145586k0809025
5021E3857672j4365637j0401152p405584m432104k342514j578616j448338j046729
5013A0836998n74488m26589n89012m81117l12267q5314K74732M69730Q67350K251657
5003A2231680N866843J0383086J1951831N231455o307395j0433128p975135n260139
$$ y = [3694029, 4342677, 5007141, 5429376, 5605090, 5781818, 5889648, 6046527, 6039348, 5773625, 5364095, 5053746, 4720570, 4590118, 4510902, 4479138, 4550935, 4552201, 4770687, 4919343, 5196908, 5293756, 5555035, 5864071, 6158301, 6711777, 7357174, 8323422, 9296588, 10062749, 10603239, 11200441, 12158877, 13500667, 15388508, 18020148, 21945653, 29180534, 48931588, 90692860, 141601022, 180363320, 151998385, 108812283, 74666697, 53857672, 39492035, 29090883, 21685299, 17253195, 14910681, 13332065, 11883727, 10836998, 10262510, 9835921, 9246909, 8765792, 8453525, 8368211, 8642943, 9112673, 9980023, 12231680, 18098523, 28481609, 40433440, 45664895, 39357500, 28924372, 20949237, 15689098]
4995A5689098l514994k582803j810724j209820o93718m14101n22362l30809l57398
4986D252369j51423j34282k67977j40299j71961q6540r9344j04149j33157j85692
4976B777545n9234o6313o0878j42091m7566k3022r5667r9118l5261m6486n6566
4965B045343j98714J9063o741j8480q9862K2063j24156J5763q1877p3279K9790
4954A538913p5109r9792K1389K3591m3833k5564j18368L3520n8181l5749L594
4943A164411m6604o8894L6571n2838O3317m2925q7786L3095p8615k7823L7369
4932I29278N2049l3547o3579j7231L1579n0361n1283M7068j3985o1065k6943K06707
4920I48687p7836k6435J23538j16747r1269p0387J381l1835J03918j69628J29724
$$ y = [15689098, 12174104, 9591301, 7780577, 6570757, 5877039, 5462938, 4940576, 4609767, 4252369, 4100946, 3966664, 3698687, 3558388, 3386427, 3299887, 3200543, 3096394, 2963237, 2777545, 2718311, 2651998, 2591120, 2449029, 2401463, 2378441, 2282774, 2183656, 2148395, 2101909, 2045343, 1846629, 1865692, 1858951, 1840471, 1750609, 1772672, 1648516, 1664279, 1582402, 1509123, 1538913, 1463804, 1364012, 1385401, 1408992, 1365159, 1339595, 1221227, 1254747, 1196566, 1160817, 1164411, 1117807, 1048913, 1085484, 1032646, 1095963, 1053038, 965252, 998347, 919732, 891909, 929278, 981327, 947780, 884201, 866970, 898549, 848188, 796905, 843973, 829988, 768923, 741980, 948687, 870851, 844416, 967954, 851207, 759938, 689551, 690932, 659097, 763015, 593387, 723111]
4909G23111j22119k8536J0221O1165r881N1398L7897o3408K7314N6766L7990p5729
4897G06189J14341Q6890O9623J93080L41832N74577O48200N78237K72728P052
4887C592749p1162M5421J95127k00577m63536o60098n25044m06316l12227k16746
4877I77591k15818l8409k5347p5295L9661j29120n955n1288l5700J1181J0183
4866D61684q5116k4824N6558q6047O075N7401q6159O8697L6167r4842Q460n5038
4854B63016O497k9507J2514r0414O5293N5883p4814P546Q297O5694q9560o1801
4842A38644J06728l4358r150P532p1017R6284j06317L4776m192P5935m9031j4001
4830A71833M7791o2182P7177M1578o7631o9924Q98J26243k18715J49600n9173
$$ y = [723111, 600992, 572456, 582677, 643842, 633961, 685359, 723256, 659848, 687162, 743928, 781918, 706189, 820530, 907420, 977043, 1170123, 1511955, 2086532, 2734732, 3312969, 3585697, 3592749, 3521587, 3567008, 3762135, 3561558, 3098022, 2437924, 1912880, 1506564, 1194337, 977591, 761773, 723364, 698017, 622722, 662383, 533263, 527308, 476020, 440320, 451501, 461684, 376568, 351744, 408302, 322255, 328330, 385731, 299572, 368269, 404436, 309594, 318054, 263016, 269513, 240006, 252520, 162106, 227399, 283282, 208468, 216014, 224311, 290005, 200445, 138644, 245372, 211014, 201864, 209396, 138379, 234663, 128346, 163122, 158930, 234865, 185834, 171833, 219624, 157442, 234619, 276197, 208566, 138642, 139540, 265783, 47068, 196668, 137495]
4819A37495k0157Q0355p9981P1375n6848L1744m6041J01287k428n5481j14192
4808D7128N5895M6971M836L584q7587Q5904M894l3017l9863p6595M5014J37891
4796A95055p2805j0854o1537P5403J8809J2423o4458L5222l6476q490k514K3666
4784A03444R326L3110k772M8288q4779K7027K7915J25240j01670q2080j6680J19030
4772B05399L9231L1257J62058K61418K94368m0663k81188j23916k36648k3266
4762B88050o3930K1711j34737Q9712m2817L1757o4814N0862J2712l7552J8456
4751A69410m1046M7021P6916j67380L5392Q4782o0518L4852R6602L8541O5819
4740C80391n6131o5259n2231M160n9296k5438L0916q0748M0667N8170N874o0158
$$ y = [137495, 117338, 197693, 117712, 189087, 132239, 163983, 117942, 219229, 216801, 161320, 47128, 103023, 149994, 154830, 158414, 70827, 156731, 161625, 128608, 88745, 12150, 57164, 195055, 122250, 111396, 49859, 125262, 144071, 156494, 92036, 127258, 90782, 82292, 79778, 103444, 112770, 145880, 143108, 191396, 106617, 133644, 161559, 286799, 185129, 103049, 86369, 205399, 244630, 275887, 437945, 699363, 993731, 953068, 671880, 547964, 311316, 288050, 224120, 245831, 111094, 200806, 157989, 189746, 124932, 175794, 188506, 150954, 169410, 128364, 175385, 252301, 84921, 120313, 205095, 144577, 179429, 276031, 314572, 380391, 324260, 259001, 206770, 210930, 151634, 126196, 157112, 76364, 117031, 175201, 181075, 120917]
4728A20917K1394P1178j63459J01954K4534n6119o7794k0000R6247j917R7993
4717B24928n2766N4865j57175r966P072j5083J4730J29803j48233J25660q3815
4706I0020Q2018M6768j45871O3048M7318p7734L330P4312o0494o6851J40570K9454
4694B25888o8113L6792m8721L1633k1641K8272J0903m6667j2718M071L4667Q029
4682A82395Q5606j40498L9653N0933p9733Q4538n5996n1850M9721N3674n9437
4671A59006O9731p0983q062m078J7056R1261k9147L3911m0303l1822L5570j7317
4659B04823k7807L8096P5876n9691n5645l2141J03153q0283r9138J40712J05612
4648C13567j48111M4277K5827n5770L0346O0795j08287M0726L4589N7427k5285
$$ y = [120917, 142311, 213489, 50030, 151984, 176518, 120399, 52605, 32605, 128852, 126935, 224928, 172162, 227027, 69852, 59886, 66958, 51875, 66605, 196408, 48175, 173835, 90020, 172038, 218806, 72935, 135983, 183301, 105567, 108897, 183209, 122715, 55864, 196434, 225888, 157775, 194567, 145846, 177479, 155838, 184110, 195013, 148346, 135628, 139699, 174366, 182395, 268001, 127503, 167156, 218089, 138356, 222894, 166898, 115048, 164769, 218443, 159006, 228737, 157754, 149692, 145614, 162670, 253931, 224784, 258695, 218392, 186570, 222140, 204823, 177016, 215112, 290988, 231297, 175652, 143511, 246664, 166381, 67243, 207955, 313567, 165456, 209733, 235560, 179790, 210136, 270931, 162644, 203370, 237959, 295386, 270101]
4637B70101L9255J2776N1092l1102P029n8763P3636P9936j68181Q5353m9006K0668
4625C32794J01656o6070j2282M0360k5522P4793O0329J00627K36108K66004j9771
4614A089026Q804k04742j39395j57327o2731r9550j4073o5018j78447L8007K8093
4603B42647N3390K1608J28108K7135o9739M9180k3940n9546r4249J9251n177L7262
4591C25930o3608M7003j4604j7463M5349Q405r0491J7919m876j7508p311o9153
4579A59592O7041l505K253j5751M9889l9382J40070j18732m5794Q4547O5318k6878
4567C18668j1300j10469L8122Q899M6099l3248j5614k7922P1435j11526P3039
4556B46183L9123p044J9345q9438N1481m4235M3469J17113j74291N3792l572J5236
$$ y = [270101, 309356, 322132, 373224, 342122, 349151, 290388, 364024, 443960, 275779, 361132, 312126, 332794, 434450, 368380, 356098, 396458, 370936, 445729, 506058, 606685, 842793, 1108797, 1089026, 1097830, 893088, 753693, 596366, 533635, 434085, 420012, 354994, 176547, 214554, 242647, 296037, 317645, 445753, 472888, 403149, 452329, 428389, 368843, 274594, 293845, 288668, 325930, 262322, 309325, 294721, 277258, 322607, 331012, 240521, 258440, 253564, 236056, 228745, 159592, 226633, 223128, 225381, 209630, 259519, 220137, 360207, 241475, 195681, 280228, 345546, 318668, 307368, 196899, 235021, 243920, 290019, 256771, 241157, 213235, 284670, 173144, 246183, 285306, 278262, 297607, 208169, 259650, 215415, 258884, 375997, 201706, 255498, 251926, 267162]
4544B67162M6251q0454O4295J0457J4739m7002m698k0423o191n5306K7401m0215
4532A76016J19788k0103m8087J13542p2700l1040j5565K3697j16242K8930n9786
4521I8450R5140M9624q3534Q5858M4395r8089P3617R9371o9372R7599M0779J1929
4509D45767n9923M6532l8575j12902n087r0144k7103K1779J0977K04188j36212
4498B59297J65839L0397q4196o895o2548L479q358l3373P1768j5100J8080q3586
4486B54804K2517m6366N7629M2395l3531O0716o2866O1878m3424L4248R384P5082
4474D32466j52572J20949l9472Q7863r128J1954o4951M604O4012p3163q3403J27480
4462D26639r4277K3364M7123Q82J2964K4023l4102P6107m5339P3299o5262n227
$$ y = [267162, 313413, 232959, 297254, 307711, 322450, 275448, 270750, 250327, 244136, 188830, 216231, 176016, 295804, 275701, 227614, 341156, 268456, 237416, 221851, 245548, 129306, 158236, 98450, 193590, 243214, 159680, 245538, 289933, 191844, 265461, 364832, 295460, 393059, 433838, 445767, 385844, 432376, 393801, 280899, 275812, 185668, 158565, 180344, 191321, 395509, 259297, 425136, 455533, 371337, 364442, 301894, 305373, 297015, 263642, 335410, 320310, 338390, 254804, 277321, 230955, 288584, 330979, 297448, 358164, 295298, 357176, 313752, 348000, 357384, 432466, 279894, 400843, 361371, 449234, 440106, 452060, 387109, 391713, 455725, 382562, 299159, 426639, 332362, 355726, 402849, 403731, 416695, 440718, 406616, 482723, 437384, 510683, 445421, 440194]
4450D40194O5250k852R2449n3365J0909p164K05670n3928r6697J2633p2230R5601
4438F36470m826m4243J05031p7581j5181O2969k9636k2897M6753j2498J8448J7035
4426F79844Q598M7031L3186j5852p6682Q6908R7045p2602K6152J94936J54463
4415A163027P4029j86931p95p2738n8230N7220n734k8362n4329M7738P2249l8856
4403I68288m6382J26974n4522J05651j39603K20482l567R4402R3949J54674j23720
4392A396626P480K32473J48622Q0049K55852K13602J43333K48552J15887K23927
4382C066403J89278L97264R29323K082245L731376M836910K995649p34917k607968
4373A4885563l170541k837694k050180j482195r11550n03794l62452l54879k52097
$$ y = [440194, 505444, 502592, 595041, 541676, 552585, 545421, 751091, 697163, 600466, 613099, 540869, 636470, 631644, 587401, 692432, 614851, 599670, 662639, 633003, 610106, 656859, 644361, 662809, 679844, 688442, 735473, 768659, 752807, 676125, 763033, 860078, 787476, 813628, 1008564, 1163027, 1237056, 1050125, 1049330, 976592, 918362, 975582, 969848, 941486, 887157, 934895, 1007144, 968288, 921906, 1048880, 994358, 1100009, 960406, 1180888, 1177321, 1271723, 1365672, 1520346, 1396626, 1404106, 1636579, 1785201, 1865250, 2121102, 2334704, 2478037, 2726589, 2842476, 3066403, 3255681, 3652945, 4582268, 6664513, 10395889, 15232799, 18228448, 17493531, 14885563, 11715022, 8877328, 6827148, 5344953, 4433403, 3929609, 3567157, 3212278, 2960181]
4364B960181j11389r2829m0822o884K3752M250J62420J21814K52458K23336L13281
4353C809568N33178R94785K689437N289539O519512M219704l567595n365403m147874
4344A0974851k595945j800551j291591q82022m09694k22483k30964j85062j44299
4335C212240L1677p1239P6988N4101J00098J24721K17190K29225K58553L40720
4325D574274O18809P81869J334447K548352L339890K870857j082068l016241k708337
4316I261852k176863j348822j143869q60476m52870l81732k08859k92376k63045
4307B132940j92505j56864k2703l2197j35526n0565k0867m5897p7261n9482O0173
4296A399246j20951J7328n2351K3928J736j22583p2911R329L3455p3857p5679
$$ y = [2960181, 2848792, 2755963, 2715141, 2708257, 2732009, 2736259, 2898679, 3020493, 3272951, 3496287, 3809568, 4342746, 5337531, 8026968, 13316507, 19836019, 24055723, 20488128, 15122725, 10974851, 8378906, 6578355, 5286764, 4404742, 3995048, 3772565, 3541601, 3356539, 3212240, 3243917, 3172678, 3249666, 3303767, 3403865, 3528586, 3745776, 3975001, 4233554, 4574274, 5193083, 5974952, 7309399, 9857751, 13197641, 16068498, 14986430, 11970189, 9261852, 7084989, 5736167, 4592298, 3731822, 3278952, 2897220, 2688361, 2395985, 2132940, 1940435, 1783571, 1760868, 1728671, 1593145, 1542580, 1521713, 1475816, 1398555, 1339073, 1399246, 1278295, 1295623, 1243272, 1267200, 1268936, 1146353, 1073442, 1082771, 1116226, 1042369, 966690]
4285I66690J1037j3633p6594l5232m7038M1592J5964r1678k3730L0625p5941Q712
4273G10774n1154N446m4872P0638j62582J08552j48361j5969p318J2868M019R6572
4261E78613r6854Q7563k9172j69535J02765O539l6301J4995N859j32160J8619
4250C50931N5588q8998R9797q157k3403r9092j438K0904j2647O4551o9839P3747
$$ y = [966690, 977727, 964094, 887500, 852268, 805230, 846822, 862786, 771108, 747378, 778003, 702062, 710774, 659620, 665066, 620194, 690832, 528250, 636802, 488441, 472472, 465154, 478022, 482041, 578613, 481759, 569322, 540150, 370615, 473380, 479919, 443618, 458613, 464472, 332312, 350931, 406519, 317521, 417318, 409161, 385758, 286666, 285228, 306132, 293485, 358036, 288197, 361944]
$$ [...]
##END NTUPLES=NMR SPECTRUM
##END=
