##TITLE=abcd
##JCAMPDX= 6.0         $$ Bruker NMR JCAMP-DX V2.0
##DATA TYPE= NMR SPECTRUM
##DATA CLASS= NTUPLES
##ORIGIN= UXNMR, Bruker Analytische Messtechnik GmbH
##OWNER= root
$$ XWIN-NMR		Version 3.5
$$ Wed Apr  1 18:29:15 2026 Russian Standard Time (UT+4h)  servis@DPX200
##.OBSERVE FREQUENCY= 200.131235884673
##.OBSERVE NUCLEUS= ^1H
##.ACQUISITION MODE= SIMULTANEOUS
##.ACQUISITION SCHEME= undefined
##.AVERAGES= 32
##.DIGITISER RES= 18
##SPECTROMETER/DATA SYSTEM= spect
##.PULSE SEQUENCE= zg
##.SOLVENT NAME= MeOD
##.SHIFT REFERENCE= (INTERNAL, MeOD, 0, 16.4885)
##AUDIT TRAIL= $$ (NUMBER, WHEN, WHO, WHERE, WHAT)
$$ ##TITLE= Audit trail, XWIN-NMR		Version 3.5
$$ ##JCAMPDX= 5.01
$$ ##ORIGIN= Bruker BioSpin GmbH
$$ ##OWNER= servis
$$ F:\spectra/data/av/nmr/H1/1/pdata/1/auditp.txt
$$ ##AUDIT TRAIL=  $$ (NUMBER, WHEN, WHO, WHERE, WHAT)
(   1,<2026-04-01 18:28:18.73 +0400>,<servis>,<DPX200>,
      <created by zg, POWCHK disabled, PULCHK disabled
       configuration hash MD5:
       00 E9 B6 7A A2 85 ED C7 34 08 36 98 17 FE 4E 26
       data hash MD5: 32K
       F9 A3 F2 3A 37 74 85 89 76 7A 29 A3 0D A5 00 50>)
(   2,<2026-04-01 18:28:23.56 +0400>,<servis>,<DPX200>,
      <Start of raw data processing
       efp BC_mod = 2 LB = 0.05 FT_mod = 6 PKNL = 1 PHC0 = -264.1951 PHC1 = -0.898437 SI = 16K 
       data hash MD5: 16K
       08 0C DD F9 41 90 3B B1 78 C2 09 A3 3C 58 21 95>)
(   3,<2026-04-01 18:28:42.67 +0400>,<servis>,<DPX200>,
      <pk PHC0 = -2.6 PHC1 = 0 
       data hash MD5: 16K
       CE 46 B8 72 82 D0 25 EC C1 CB C2 50 08 DF 25 3B>)
$$ ##END=
$$ 
$$ hash MD5
$$ 13 C2 E2 AF C9 1C 72 13 24 69 DB F0 11 73 5C 68
##$RELAX= 
##$RELAX= 
##$RELAX= 
##$RELAX= 
##$RELAX= 
##$RELAX= 
##$RELAX= 
##$RELAX= 
$$ Bruker specific parameters
$$ --------------------------
##$DU= <F:\spectra>
##$EXPNO= 1
##$NAME= <H1>
##$PROCNO= 1
##$TYPE= <nmr>
##$USER= <av>
##$AMP= (0..31)
100 100 100 100 100 100 100 100 100 100 100 100 100 100 100 100 100 100 
100 100 100 100 100 100 100 100 100 100 100 100 100 100 
##$AQSEQ= 0
##$AQ_mod= 1
##$AUNM= <au_zg>
##$AUTOPOS= <>
##$BF1= 200.13
##$BF2= 200.13
##$BF3= 200.13
##$BF4= 200.13
##$BF5= 500.13
##$BF6= 500.13
##$BF7= 500.13
##$BF8= 500.13
##$BYTORDA= 1
##$CFDGTYP= 0
##$CFRGTYP= 5
##$CHEMSTR= <none>
##$CNST= (0..31)
1 1 145 1 1 1 1 1 1 1 1 1 1 1 1 1 1 1 1 1 1 1 1 1 1 1 1 1 1 1 1 1 
##$CPDPRG= <>
##$CPDPRG1= <>
##$CPDPRG2= <>
##$CPDPRG3= <>
##$CPDPRG4= <mlev>
##$CPDPRG5= <mlev>
##$CPDPRG6= <mlev>
##$CPDPRG7= <mlev>
##$CPDPRG8= <mlev>
##$CPDPRGB= <>
##$CPDPRGT= <>
##$D= (0..31)
0 2 0 0 0 0 0 0 0 0.06 0 0 0 0 0 0 0.0002 0 0 0 0 0 0 0 0 0 0 0 0 0 0 
0 
##$DATE= 1775053698
##$DBL= (0..7)
120 120 120 120 120 120 120 120 
##$DBP= (0..7)
150 150 150 150 150 150 150 150 
##$DBP07= 0
##$DBPNAM0= <>
##$DBPNAM1= <>
##$DBPNAM2= <>
##$DBPNAM3= <>
##$DBPNAM4= <>
##$DBPNAM5= <>
##$DBPNAM6= <>
##$DBPNAM7= <>
##$DBPOAL= (0..7)
0.5 0.5 0.5 0.5 0.5 0.5 0.5 0.5 
##$DBPOFFS= (0..7)
0 0 0 0 0 0 0 0 
##$DE= 6
##$DECBNUC= <off>
##$DECIM= 32
$$ [...]
##$SUBNAM4= <"">
##$SUBNAM5= <"">
##$SUBNAM6= <"">
##$SUBNAM7= <"">
##$SUBNAM8= <"">
##$SUBNAM9= <"">
##$SW= 20.6817932712277
##$SWIBOX= (0..15)
0 0 3 0 0 0 0 0 0 0 0 0 0 0 0 0 
##$SW_h= 4139.07284768212
##$TD= 32768
##$TD0= 1
##$TE= 0
##$TE2= 300
##$TE3= 300
##$TEG= 300
##$TL= (0..7)
0 120 120 120 120 120 120 120 
##$TP= (0..7)
150 150 150 150 150 150 150 150 
##$TP07= 0
##$TPNAME0= <>
##$TPNAME1= <>
##$TPNAME2= <>
##$TPNAME3= <>
##$TPNAME4= <>
##$TPNAME5= <>
##$TPNAME6= <>
##$TPNAME7= <>
##$TPOAL= (0..7)
0.5 0.5 0.5 0.5 0.5 0.5 0.5 0.5 
##$TPOFFS= (0..7)
0 0 0 0 0 0 0 0 
##$TUNHIN= 0
##$TUNHOUT= 0
##$TUNXOUT= 0
##$USERA1= <user>
##$USERA2= <user>
##$USERA3= <user>
##$USERA4= <user>
##$USERA5= <user>
##$V9= 5
##$VALIST= <valist>
##$VCLIST= <CCCCCCCCCCCCCCC>
##$VD= 0
##$VDLIST= <DDDDDDDDDDDDDDD>
##$VPLIST= <PPPPPPPPPPPPPPP>
##$VTLIST= <TTTTTTTTTTTTTTT>
##$WBST= 1024
##$WBSW= 30
##$XGAIN= (0..3)
0 0 0 0 
##$XL= 0
##$YL= 0
##$YMAX_a= 3717079
##$YMIN_a= -2274610
##$ZGOPTNS= <>
##$ZL1= 120
##$ZL2= 120
##$ZL3= 120
##$ZL4= 120
##$ABSF1= 0
##$ABSF2= 0
##$ABSG= 0
##$ABSL= 0
##$ALPHA= 0
##$AQORDER= 0
##$ASSFAC= 0
##$ASSFACI= 0
##$ASSFACX= 0
##$ASSWID= 0
##$AUNMP= <proc_1d>
##$AZFE= 0.1
##$AZFW= 0.1
##$BCFW= 0
##$BC_mod= 2
##$BYTORDP= 0
##$COROFFS= 0
##$CY= 18.4799938201904
##$DATMOD= 1
##$DC= 0
##$DFILT= <>
##$DTYPP= 0
##$F1P= 9.9274215381318
##$F2P= -0.165520771350173
##$FCOR= 1
##$FTSIZE= 16384
##$FT_mod= 6
##$GAMMA= 0
##$GB= 0
##$INTBC= 1
##$INTSCL= 4.127829e-11
##$ISEN= 128
##$LB= 0.05
##$LEV0= 0
##$LPBIN= 0
##$MAXI= 10000
##$MC2= 0
##$MEAN= 0
##$ME_mod= 0
##$MI= 50
##$NCOEF= 0
##$NC_proc= 0
##$NLEV= 6
##$NOISF1= 3.799351
##$NOISF2= 2.8
##$NSP= 0
##$NTH_PI= 0
##$NZP= 0
##$OFFSET= 16.48848
##$PC= 4
##$PHC0= -266.7951
##$PHC1= -0.898437
##$PH_mod= 1
##$PKNL= yes
##$PPARMOD= 0
##$PSCAL= 4
##$PSIGN= 0
##$REVERSE= no
##$SF= 200.130005582386
##$SI= 16384
##$SIGF1= 3
##$SIGF2= 2
##$SINO= 400
##$SIOLD= 16384
##$SREGLST= <1H.CDCl3>
##$SSB= 0
##$STSI= 16384
##$STSR= 0
##$SW_p= 4139.07284768211
##$SYMM= 0
##$S_DEV= 0
##$TDeff= 32768
##$TDoff= 0
##$TI= <>
##$TILT= no
##$TM1= 0
##$TM2= 0
##$TOPLEV= 0
##$USERP1= <user>
##$USERP2= <user>
##$USERP3= <user>
##$USERP4= <user>
##$USERP5= <user>
##$WDW= 1
##$XDIM= 16384
##$YMAX_p= 374819515
##$YMIN_p= -74980
$$ End of Bruker specific parameters
$$ ---------------------------------
##NTUPLES= NMR SPECTRUM
##VAR_NAME=  FREQUENCY,     SPECTRUM/REAL,   SPECTRUM/IMAG
##SYMBOL=    X,             R,               I
##VAR_TYPE=  INDEPENDENT,   DEPENDENT,       DEPENDENT
##VAR_FORM=  AFFN,          ASDF,            ASDF
##VAR_DIM=   16384,         16384,           16384
##UNITS=     HZ,            ARBITRARY UNITS, ARBITRARY UNITS
##FACTOR=    0.252644378177508, 1,           1
##FIRST=     3299.83951724647, 0,            0
##LAST=      -839.233330435636, 0,           0
##MIN=       -839.233330435636, -74980,      0
##MAX=       3299.83951724647, 374819515,    0
$$ Real data points
##PAGE= N=1
##DATA TABLE= (X++(R..R)), XYDATA
$$ [...]
13477 -58220 -59003 -54152 -54790 -53394 -56085 -55183 -52155 -55122 -55235 -53919 -56673 -58173 -55714 -52949 -58882
13462 -58882 -58258 -54948 -55934 -53991 -51944 -57394 -59159 -57383 -57390 -55422 -54773 -58595 -53439 -49887 -51688 -54416
13446 -54416 -54658 -56839 -59527 -54617 -57100 -63431 -57438 -55071 -56068 -54077 -56152 -57118 -54024 -61874 -59238
13431 -59238 -57577 -54866 -55521 -57405 -54304 -51182 -51037 -50918 -54892 -52496 -56675 -59346 -54890 -54407 -56078
13416 -56078 -58187 -59694 -58572 -59657 -52690 -56494 -52509 -53647 -58107 -53386 -59450 -58709 -59886 -58816 -55356
13401 -55356 -53492 -57593 -56386 -55655 -62219 -56214 -58279 -57835 -58921 -52609 -49854 -54440 -55700 -53778 -56831
13386 -56831 -57447 -57285 -58475 -56379 -60852 -59162 -49722 -57365 -58421 -53947 -60632 -58826 -55999 -55342 -56270
13371 -56270 -57757 -61520 -56097 -55944 -61203 -59447 -55737 -52166 -53566 -55476 -48924 -52066 -59304 -62413 -58358
13356 -58358 -57539 -55793 -56905 -48064 -56457 -58834 -54173 -54014 -58588 -55659 -62037 -60237 -56738 -60947 -57326
13341 -57326 -52247 -54338 -53979 -54958 -58008 -56325 -54951 -60119 -55839 -56101 -52936 -53419 -54040 -53601 -57915 -58003
13325 -58003 -57115 -58149 -60152 -54995 -61567 -58702 -60376 -57528 -57827 -56151 -55901 -55265 -56903 -56762 -53808 -57563
13309 -57563 -57544 -61745 -57058 -58421 -53692 -52125 -55857 -60604 -53429 -57222 -53005 -58440 -57366 -55046 -54351
13294 -54351 -57189 -59248 -53409 -60616 -65321 -55017 -55232 -60104 -59377 -63008 -55696 -51755 -59024 -61000 -59090
13279 -59090 -62548 -55924 -50669 -52246 -55563 -58608 -57611 -56970 -48906 -58215 -57493 -62074 -58261 -59288 -52075
13264 -52075 -55424 -59058 -58730 -56359 -55329 -52596 -52919 -54340 -52398 -52907 -58382 -60733 -56516 -56250 -55902 -56141
13248 -56141 -62033 -53322 -56538 -60500 -56554 -55139 -60153 -58013 -54384 -55063 -54041 -52729 -53415 -57001 -57190
13233 -57190 -59373 -51320 -55518 -64125 -55591 -62343 -55966 -58407 -51116 -54697 -53730 -53010 -50699 -54713 -57363
13218 -57363 -56940 -61339 -58548 -57539 -55252 -56197 -58320 -54275 -56637 -58516 -59727 -54373 -58205 -58869 -54023
13203 -54023 -53808 -53567 -62465 -55668 -56436 -59616 -61084 -54996 -52436 -62522 -52893 -50183 -53288 -58129 -60944
13188 -60944 -57077 -57211 -58115 -55527 -56146 -57625 -59323 -58170 -56874 -53857 -64850 -57603 -53404 -53190 -53707
13173 -53707 -60178 -59462 -53604 -54736 -54325 -53080 -52280 -60412 -58598 -57869 -58870 -61558 -60709 -59974 -52715 -56872
13157 -56872 -59610 -53535 -56950 -58270 -56231 -52177 -59810 -61654 -53922 -53735 -56639 -58930 -57173 -58320 -56573
13142 -56573 -66763 -55570 -56221 -63608 -51940 -53071 -60482 -55309 -59416 -61021 -57880 -60851 -56841 -53781
13128 -53781 -57516 -56379 -53134 -55008 -56855 -58393 -55501 -57211 -60348 -54143 -57667 -56550 -58950 -61673
13114 -61673 -58050 -53824 -55641 -56655 -57995 -58869 -56891 -62730 -60572 -49715 -51707 -63422 -56045 -58035
13100 -58035 -56906 -56297 -58827 -55839 -59326 -64728 -56881 -53589 -57318 -54953 -56671 -60731 -58225 -57980 -58504
13085 -58504 -61986 -56144 -53156 -60554 -57119 -51684 -52190 -54002 -60685 -51590 -52531 -63813 -57847 -54438 -57950
13070 -57950 -58257 -56572 -53515 -55149 -57331 -58295 -58524 -60291 -56501 -58904 -63088 -57314 -56937 -57772 -52992 -55407
13054 -55407 -48464 -57271 -59002 -61314 -56077 -57174 -61045 -54202 -58188 -63566 -59026 -56036 -58657 -53916
13040 -53916 -54833 -58251 -63792 -59898 -54709 -55411 -55327 -59260 -56825 -55669 -59223 -49735 -56021 -59752 -59352 -58720
13024 -58720 -57838 -57347 -58385 -56434 -56221 -60205 -54791 -58193 -62304 -54821 -59211 -56240 -57871 -57579 -56526
13009 -56526 -53389 -52679 -57556 -55987 -58546 -58950 -58905 -56012 -55677 -54362 -56028 -60714 -52710 -63065 -57315
12994 -57315 -57124 -55918 -55073 -58025 -55812 -60343 -56950 -58474 -57080 -53645 -56407 -55357 -56239 -57930 -56907
12979 -56907 -57291 -62540 -57584 -60229 -59131 -56702 -54910 -55080 -59899 -61876 -56898 -53110 -56361 -54280 -55594
12964 -55594 -54091 -51790 -54534 -56219 -59105 -56080 -56029 -59325 -62335 -63795 -59558 -61680 -58051 -57334 -59396
12949 -59396 -62578 -59782 -53137 -50301 -52131 -56758 -56063 -57208 -54690 -55316 -58789 -58916 -56160 -57954 -53336
12934 -53336 -55631 -58417 -62227 -62904 -57998 -56710 -54730 -59529 -59615 -58454 -58413 -52593 -57044 -59996 -60700 -59743
12918 -59743 -52837 -56818 -59493 -60640 -60440 -52642 -54295 -56516 -52108 -52917 -58467 -59679 -50276 -62010 -52300
12903 -52300 -57543 -59447 -54648 -58231 -49554 -56088 -53474 -60653 -60865 -56492 -58148 -58202 -53086 -59287 -61490
12888 -61490 -50361 -48354 -52897 -56039 -57176 -56901 -61537 -63016 -55886 -51929 -53710 -57307 -54164 -58427
12874 -58427 -56931 -57342 -55833 -53174 -61167 -62499 -60713 -55923 -52167 -53361 -52471 -55498 -55821 -56397 -55922 -58982
12858 -58982 -58637 -58078 -55833 -53901 -50678 -57403 -50720 -51147 -57100 -56999 -57373 -59524 -58642 -55055 -55518 -62286
12842 -62286 -56802 -54806 -56110 -54089 -55577 -56598 -58496 -59166 -60807 -58029 -59947 -58099 -53147 -60310 -55766
12827 -55766 -47499 -58945 -56072 -56182 -59941 -59641 -57487 -57042 -59365 -56047 -51837 -52185 -56802 -62274 -57505
12812 -57505 -49259 -65561 -61098 -53254 -59166 -56412 -52684 -56882 -63678 -60571 -57366 -52926 -50896 -58315
12798 -58315 -52237 -56359 -55098 -56059 -52691 -57419 -61996 -58240 -55372 -56717 -53756 -57045 -56162 -56280 -58559
12783 -58559 -58180 -53661 -58836 -58533 -54895 -50984 -53886 -55092 -57591 -58292 -57698 -57069 -54730 -50952 -59754 -57343
12767 -57343 -52973 -52711 -52950 -59643 -55775 -56727 -54875 -55936 -53518 -56377 -55786 -57098 -57226 -52341 -56413 -55351
12751 -55351 -53924 -60513 -59212 -51377 -57523 -59427 -56127 -58019 -54350 -51076 -51011 -57247 -55180 -56622 -57417
12736 -57417 -56083 -57531 -56185 -52583 -54047 -52627 -61162 -56854 -54843 -55639 -55986 -58040 -60152 -57495 -58171
12721 -58171 -53944 -56669 -53913 -56623 -59874 -56784 -57935 -54697 -54646 -51955 -53870 -65162 -52876 -52184 -46972
12706 -46972 -52306 -61452 -54672 -56292 -61104 -57820 -54745 -58344 -59202 -58211 -53597 -60002 -55716 -55781 -55830 -56778
12690 -56778 -59236 -54951 -52363 -54287 -52126 -53350 -56467 -52644 -53959 -55955 -53623 -56902 -58301 -56310
12676 -56310 -54652 -56872 -61620 -63361 -58245 -57187 -57420 -57195 -57912 -54544 -51617 -51473 -51880 -59505 -58462 -57138
12660 -57138 -61938 -56201 -52965 -53283 -53404 -61231 -58330 -49319 -57638 -64940 -53971 -60180 -60265 -57866 -58089
12645 -58089 -50749 -56646 -60382 -52395 -55775 -61334 -62242 -56686 -56245 -58938 -55789 -55970 -57715 -55745 -53182
12630 -53182 -55803 -58255 -60818 -59688 -55028 -52757 -52329 -56501 -62654 -60420 -55770 -59983 -56929 -55890 -57880
12615 -57880 -52843 -56412 -51058 -50706 -57130 -58764 -58217 -57602 -57537 -56688 -52460 -55341 -55601 -52119 -55864 -57501
12599 -57501 -53943 -62062 -60707 -60190 -54599 -49485 -56643 -53105 -53809 -53017 -54641 -58141 -57971 -54993 -57166
12584 -57166 -55847 -54434 -54367 -55505 -52558 -51847 -51912 -55393 -53907 -53296 -53119 -55441 -53308 -51063 -55976 -58123
12568 -58123 -54442 -54441 -57052 -55044 -54272 -52374 -53308 -55761 -52080 -51828 -55872 -58666 -54600 -55366 -54650 -47009
12552 -47009 -53112 -52484 -52994 -57198 -53001 -53213 -56843 -56806 -61587 -50369 -55522 -52897 -52905 -55805 -54257 -57172
12536 -57172 -56930 -52741 -62724 -57262 -49854 -55313 -53868 -52541 -51486 -55173 -58705 -56981 -53674 -60321 -55498
12521 -55498 -54589 -50986 -50898 -54978 -55812 -59483 -60627 -51175 -56615 -58627 -59346 -56916 -49252 -51985 -56194 -53167
12505 -53167 -61685 -55813 -47599 -55798 -51777 -52590 -58055 -54449 -53166 -57375 -54785 -58832 -57125 -53274 -51500
12490 -51500 -52330 -47547 -52927 -61847 -55191 -58024 -54080 -56162 -50730 -52931 -57041 -53793 -55406 -50913 -53374
12475 -53374 -55108 -54166 -56565 -63972 -52789 -53441 -55662 -56714 -61825 -55073 -55614 -53259 -50981 -55472 -59636
12460 -59636 -60464 -53454 -52993 -50084 -54243 -56765 -55922 -55479 -56155 -53302 -49002 -56798 -55291 -55730 -57963 -51429
12444 -51429 -57264 -56702 -52872 -60455 -58138 -54000 -59717 -56286 -50791 -54378 -52561 -55278 -50506 -53193 -57699
12429 -57699 -56908 -57182 -55926 -57072 -52039 -55760 -57235 -59477 -61578 -48794 -54641 -55967 -52047 -54285 -56676
12414 -56676 -53673 -56785 -52739 -53516 -58936 -52757 -52264 -54771 -53885 -57130 -56299 -56184 -54123 -56014 -53821 -54114
12398 -54114 -64494 -56051 -55464 -55506 -49044 -56511 -59749 -56640 -61012 -55336 -51949 -65387 -58763 -54492 -54051
12383 -54051 -51224 -56693 -54880 -51608 -53740 -57994 -53766 -58062 -59573 -61561 -54834 -56514 -60306 -51004
12369 -51004 -55117 -54931 -54670 -56678 -53313 -56862 -56867 -53696 -51577 -54947 -53964 -55483 -55627 -59551 -54346 -53398
12353 -53398 -56892 -54989 -62599 -55285 -54859 -55324 -49673 -55718 -62568 -53699 -55714 -57350 -54418 -57950 -59913
12338 -59913 -56188 -53865 -51608 -51584 -58063 -59526 -60506 -57852 -57240 -51752 -58193 -56005 -56452 -55376 -51364 -51936
12322 -51936 -53225 -56245 -54803 -57586 -56091 -52910 -52474 -52304 -54565 -57611 -57413 -51904 -58133 -58940 -57891
12307 -57891 -53974 -58026 -60196 -58282 -55124 -53690 -59577 -52156 -54676 -58640 -52868 -48329 -53876 -54840 -57670
12292 -57670 -56235 -60454 -57602 -54056 -50210 -58298 -55293 -50720 -63667 -59506 -55533 -55283 -54113 -54845 -57302
12277 -57302 -52770 -59050 -58526 -51728 -56646 -55855 -56332 -57152 -54669 -51230 -52912 -53508 -56780 -61287 -64468 -55731
12261 -55731 -49848 -56145 -51534 -54010 -53595 -52101 -60081 -60899 -57755 -60760 -62270 -54395 -56875 -54104 -48902
12246 -48902 -53309 -53978 -55346 -59920 -56326 -51273 -52609 -61547 -63207 -55315 -59364 -54148 -56421 -56238 -52227
12231 -52227 -57480 -56928 -54151 -56631 -60514 -55310 -59229 -55154 -59599 -58294 -53692 -60293 -56327 -57452 -60034
12216 -60034 -51991 -53477 -56220 -56411 -59214 -57863 -52461 -54774 -50955 -53290 -54125 -55380 -57485 -54462 -55390
12201 -55390 -55514 -61365 -62115 -61933 -61015 -55627 -54503 -52807 -57877 -57315 -54852 -54217 -55346 -55642 -57234 -57718
12185 -57718 -53250 -52760 -54831 -53945 -55092 -57234 -54920 -55454 -55608 -50444 -54821 -57160 -54373 -57356 -54613
12170 -54613 -58106 -57678 -54460 -58163 -59283 -56154 -55491 -52118 -55192 -60408 -55583 -57662 -54109 -54573 -62830
12155 -62830 -62129 -58612 -56168 -59469 -55424 -53902 -57485 -61927 -54161 -49341 -56147 -55824 -57385 -54546 -61540
12140 -61540 -56396 -51520 -54525 -52400 -54044 -58065 -61554 -59434 -60861 -53761 -59773 -61053 -52011 -55351
12126 -55351 -60692 -55976 -54438 -56990 -53447 -62262 -58707 -58760 -59966 -58416 -57772 -54295 -60631 -54700 -53686
12111 -53686 -52324 -59778 -60642 -59643 -57880 -60202 -52691 -49614 -53720 -53790 -55725 -52564 -54117 -57647 -58542 -60989
12095 -60989 -56511 -52578 -52811 -62221 -61356 -55055 -57041 -56178 -55936 -60811 -58695 -57845 -60294 -53213 -61566 -61380
12079 -61380 -58674 -54958 -58359 -56891 -54624 -62037 -56264 -50908 -60246 -60962 -60224 -60156 -54715 -56070 -54297
12064 -54297 -54377 -52763 -59794 -60670 -57109 -59996 -53250 -55237 -58199 -55220 -56805 -57548 -57408 -58413 -61868 -56444
12048 -56444 -53189 -56797 -57744 -53947 -57403 -57583 -55991 -57239 -55037 -55308 -52518 -50926 -56287 -59264 -58268
12033 -58268 -55729 -57366 -52798 -57492 -55616 -54255 -50309 -50011 -49760 -51650 -56144 -60504 -58912 -56746 -55720
12018 -55720 -50490 -54911 -61172 -59631 -59698 -53095 -54612 -55798 -53942 -56211 -53676 -59163 -53080 -57072 -58690
12003 -58690 -59456 -55133 -55923 -59418 -55732 -53695 -54435 -59205 -58929 -60426 -57317 -56791 -54920 -51794 -56846 -56301
11987 -56301 -54433 -55281 -57706 -50689 -54185 -54466 -54250 -57886 -54479 -59154 -58806 -53436 -57117 -55340 -59003
11972 -59003 -57415 -53051 -55726 -54270 -56356 -62897 -55334 -53096 -51226 -52538 -53549 -58612 -48626 -52302
11958 -52302 -52812 -52867 -60031 -55270 -54189 -57009 -51873 -54527 -52425 -55064 -54777 -54468 -52916 -57759 -53291 -56458
11942 -56458 -52668 -54568 -56434 -54192 -51693 -53530 -55946 -51377 -56381 -55645 -56423 -52596 -51896 -52783 -51072
11927 -51072 -53656 -53037 -53673 -55479 -58369 -51940 -53977 -55644 -53182 -61581 -52480 -53192 -50829 -54434 -55109
11912 -55109 -58586 -53113 -49478 -53181 -52720 -57646 -61009 -55139 -53294 -57799 -53621 -55924 -56798 -53752 -54175
11897 -54175 -54532 -56350 -53082 -50731 -53452 -52126 -55984 -53053 -47892 -53017 -58882 -49765 -57007 -55184 -49168
11882 -49168 -53461 -52244 -56249 -56805 -54029 -56249 -53862 -55077 -58665 -56940 -54386 -54213 -52432 -52120 -58678
11867 -58678 -55405 -56965 -52521 -54468 -51049 -53656 -52156 -55727 -56025 -53876 -54070 -49892 -51021 -48412 -52306
11852 -52306 -56155 -51479 -55965 -51320 -58506 -58704 -55538 -56886 -51698 -53638 -57698 -57614 -56751 -54161 -53543 -55642
11836 -55642 -49866 -50123 -52408 -53407 -57379 -53919 -58124 -54782 -55133 -53449 -54107 -53427 -51903 -54507 -52774 -58236
11820 -58236 -53965 -53096 -58010 -54110 -51687 -55140 -54388 -53201 -51246 -53165 -55506 -54589 -59328 -56695 -52444
11805 -52444 -54828 -53500 -55288 -57324 -55587 -56736 -53156 -54337 -61520 -54153 -54616 -59995 -59164 -55730 -56357
11790 -56357 -54839 -51443 -51099 -50619 -55320 -53197 -52038 -57817 -50625 -51860 -57467 -52435 -54772 -54609 -56182
11775 -56182 -63427 -54102 -52438 -54365 -52076 -55946 -60759 -57668 -54976 -52242 -52455 -54090 -54205 -52127 -55365
11760 -55365 -51687 -50706 -60210 -60742 -53377 -62092 -54830 -56957 -54770 -51994 -52927 -49638 -53307 -59569 -57897
11745 -57897 -51576 -55809 -56394 -52729 -51273 -52011 -54311 -49942 -54959 -54778 -55699 -53199 -52248 -60313 -55801 -54616
11729 -54616 -53295 -57584 -53937 -55895 -60031 -56355 -53539 -53767 -54745 -57157 -56060 -56181 -54569 -51543 -50183
11714 -50183 -57422 -54302 -54467 -54232 -51816 -51450 -50501 -56832 -58171 -55899 -54621 -53066 -51460 -49904 -54008
11699 -54008 -53001 -56859 -53504 -55674 -58027 -56245 -57982 -52305 -54640 -56353 -52225 -52066 -49630 -56425 -57762
11684 -57762 -57200 -50693 -56400 -53394 -56512 -60360 -56492 -54027 -53788 -55339 -56446 -60120 -47023 -51483 -55237
11669 -55237 -52380 -62651 -60247 -56062 -57190 -55667 -55716 -60885 -51576 -51557 -57383 -53362 -57836 -58658 -57457
11654 -57457 -57791 -47770 -48303 -53577 -54178 -56745 -53956 -53376 -57639 -55023 -51833 -51296 -50456 -51982 -56009 -54811
11638 -54811 -55416 -56198 -54960 -59671 -60053 -59436 -49894 -55885 -55623 -55875 -57359 -50970 -51159 -57542 -55329 -51467
11622 -51467 -53229 -50841 -52537 -53022 -54551 -60847 -56887 -53351 -55067 -55093 -54999 -54145 -56429 -62409 -53423 -52123
11606 -52123 -60137 -54212 -52296 -57444 -52109 -54139 -52979 -55197 -58480 -52174 -50315 -56327 -55746 -56268 -55741
11591 -55741 -59277 -58759 -53853 -54302 -52383 -50400 -56943 -56647 -59138 -61627 -50654 -57829 -66138 -53995 -56037
11576 -56037 -58818 -46098 -49290 -55227 -53702 -56319 -50765 -55489 -59598 -53185 -55924 -56174 -55216 -54887 -47310
11561 -47310 -53261 -55474 -57192 -58917 -58259 -59433 -55975 -52402 -57229 -57583 -51031 -55577 -54001 -51835 -53265
11546 -53265 -57142 -50493 -55986 -54275 -52945 -54536 -53888 -55772 -53017 -58655 -54973 -51982 -57197 -52221 -56528
11531 -56528 -56970 -57365 -54890 -57429 -54408 -54316 -56471 -51815 -53000 -50626 -53810 -56180 -56971 -54863 -59749 -56471
11515 -56471 -54953 -60391 -54448 -55643 -51979 -56734 -57246 -51611 -53536 -55349 -56252 -53728 -56348 -56229 -51967
11500 -51967 -54211 -53581 -53659 -53843 -51225 -52994 -56365 -55305 -50031 -58455 -49664 -60577 -58087 -57838 -52834
11485 -52834 -51981 -53932 -54049 -61878 -52834 -56956 -58851 -50072 -58899 -54969 -57525 -53536 -53006 -54840 -56627
11470 -56627 -52267 -48889 -51105 -54849 -57249 -55126 -61234 -51880 -55667 -56944 -55093 -55549 -51655 -51874 -55849
11455 -55849 -53306 -53161 -61244 -50646 -48687 -59336 -53560 -54775 -54168 -58221 -57928 -57027 -58557 -59002 -54317
11440 -54317 -51896 -55600 -59530 -55985 -49214 -54744 -57242 -54688 -54612 -56555 -48964 -55444 -57089 -57007 -59681
11425 -59681 -55394 -58396 -59795 -55660 -55493 -50244 -51922 -54487 -58206 -55475 -52934 -53645 -54940 -54607 -54689 -57786
11409 -57786 -52407 -47015 -52064 -55635 -58415 -54803 -56844 -54223 -57154 -57592 -52135 -57290 -55863 -59617 -55859
11394 -55859 -55014 -54765 -48220 -56659 -58312 -55324 -51433 -52127 -51151 -56273 -55783 -53634 -58498 -55773 -53788 -59637
11378 -59637 -57504 -56543 -59784 -59594 -54206 -51785 -50523 -57108 -53852 -56442 -57669 -52683 -53933 -56255 -55661
11363 -55661 -56180 -52989 -57339 -54549 -52133 -53379 -54930 -54022 -54866 -56532 -56160 -57309 -52959 -59665 -59906 -52968
11347 -52968 -54227 -51196 -54261 -51791 -56606 -53855 -59853 -56356 -59513 -56899 -52289 -59955 -54419 -53766 -52767
11332 -52767 -52547 -55568 -52984 -56959 -56076 -56791 -50082 -56943 -54767 -51187 -57253 -54450 -60899 -56532 -56651
11317 -56651 -57634 -59671 -54716 -56764 -54152 -52483 -54006 -52698 -57852 -54349 -52368 -54332 -54288 -52770 -52991
11302 -52991 -53939 -55173 -57600 -56686 -54166 -56134 -51959 -51172 -60416 -57566 -52942 -52664 -48709 -55189 -57932
11287 -57932 -52640 -58377 -50322 -51210 -47411 -53964 -60961 -55728 -60521 -57242 -53927 -54219 -54937 -54139 -54540 -54269
11271 -54269 -53378 -55887 -50054 -57231 -57451 -57818 -57007 -57841 -54339 -53574 -46004 -60058 -58283 -56733 -53522 -52986
11255 -52986 -52586 -57124 -57839 -55719 -51324 -53064 -54602 -54175 -57341 -61864 -56297 -53457 -54064 -60874 -52712
11240 -52712 -52035 -54072 -55805 -53424 -50258 -57576 -53608 -54697 -58335 -58193 -51439 -55297 -54235 -56147 -58853
11225 -58853 -50806 -61144 -56193 -49290 -61573 -57985 -52959 -55539 -55872 -58147 -53905 -50625 -53800 -57618
11211 -57618 -49871 -53080 -53385 -54867 -57939 -58681 -60252 -53696 -54116 -51878 -53333 -54622 -51856 -51511 -59522
11196 -59522 -54394 -56738 -59464 -57276 -57103 -56587 -53490 -51956 -54970 -54713 -54781 -56409 -52972 -56737 -56238 -53630
11180 -53630 -54333 -56214 -55323 -55877 -57398 -55637 -55940 -55483 -56289 -50641 -50412 -55093 -56097 -58588 -59682 -63740
11164 -63740 -54108 -50988 -55867 -51068 -52046 -54704 -51522 -54950 -59431 -57452 -57661 -58741 -51226 -57806 -57570
11149 -57570 -48531 -58875 -61429 -54939 -52563 -54098 -55359 -56752 -53713 -58279 -57565 -53070 -53362 -54394 -61609
11134 -61609 -56503 -54374 -59749 -55202 -53150 -59019 -54823 -55561 -52735 -56945 -49568 -51002 -55574 -53697 -51649
11119 -51649 -56029 -53696 -57910 -55082 -54062 -58440 -58897 -55042 -57716 -60599 -57360 -53014 -57271 -57705 -55162
11104 -55162 -54171 -57460 -49200 -54756 -59500 -52814 -59568 -56286 -50903 -55120 -55233 -55389 -51583 -54435 -52167
11089 -52167 -48820 -54532 -56036 -59203 -62501 -54307 -62491 -59140 -57051 -54783 -52941 -54757 -52227 -53979
11075 -53979 -58314 -58615 -57280 -56193 -53994 -57539 -53451 -55113 -52661 -46984 -53969 -55436 -58968 -62541 -63108
11060 -63108 -58828 -54271 -56713 -55412 -59247 -52598 -60929 -59768 -55736 -58152 -54275 -58692 -61590 -60842 -54699
11045 -54699 -54989 -51417 -60354 -63880 -56757 -58557 -54468 -52871 -54491 -61596 -54459 -53011 -52980 -58608 -57890
11030 -57890 -53843 -61380 -60946 -56808 -49856 -50003 -56485 -58625 -60546 -60132 -63324 -61217 -56930 -62277 -58553
11015 -58553 -63428 -60440 -58198 -57593 -60077 -60461 -56129 -55193 -59531 -58753 -58680 -60756 -59147 -57635 -54303 -50687
10999 -50687 -47872 -43983 -46151 -45112 -55294 -56108 -57301 -50336 -48952 -53158 -49569 -55233 -54527 -50950 -52288
10984 -52288 -50214 -55399 -55710 -52716 -50719 -52107 -46751 -53873 -51718 -57362 -53577 -51004 -52150 -49667 -52762
10969 -52762 -53486 -53677 -55517 -57510 -58867 -56149 -50036 -55752 -51481 -48590 -48219 -45901 -51468 -45777 -52685
10954 -52685 -61112 -56728 -52873 -50413 -56726 -50470 -55026 -57098 -53245 -55505 -56955 -56129 -59183 -56274 -51084
10939 -51084 -53381 -50841 -55252 -53903 -55409 -49630 -54503 -57525 -50620 -53573 -51668 -50264 -55027 -55479 -49388
10924 -49388 -57424 -47511 -44616 -53859 -52490 -50184 -50522 -54631 -55826 -58920 -51934 -53061 -52812 -51032 -54530
10909 -54530 -52298 -57563 -60617 -53490 -54597 -56171 -52074 -49742 -49089 -53241 -55809 -50060 -57113 -58148 -54189
10894 -54189 -53823 -58854 -52963 -49008 -56789 -54674 -55030 -50933 -53311 -57696 -55750 -55740 -54849 -54984 -51908 -49008
10878 -49008 -53240 -52807 -53767 -55505 -53228 -54759 -49317 -51394 -56588 -49070 -53845 -53657 -50929 -55050 -56750
10863 -56750 -55004 -58389 -54687 -47327 -58394 -50881 -51139 -54081 -49866 -54314 -57306 -57881 -55166 -52140 -51874
10848 -51874 -53340 -50980 -51272 -49902 -60688 -52489 -54723 -55892 -55074 -50593 -54376 -56724 -52850 -49662 -47848
10833 -47848 -59595 -52697 -52498 -62389 -56288 -49412 -50723 -51173 -50990 -57080 -49254 -56586 -55711 -56333 -60593
10818 -60593 -56277 -52518 -49427 -51560 -53323 -56336 -49532 -54580 -59108 -52577 -55508 -49602 -48403 -52114
10804 -52114 -51596 -52600 -55807 -54286 -55041 -53935 -56708 -55325 -54216 -53040 -47352 -45976 -55273 -55120 -56977
10789 -56977 -55850 -55369 -56273 -49051 -46587 -60936 -48763 -53709 -52522 -57399 -56457 -55574 -56264 -57536 -53493
10774 -53493 -48985 -55609 -51510 -48965 -52950 -51522 -56227 -52817 -47979 -55469 -55191 -54664 -62431 -53961 -49200
10759 -49200 -59491 -53583 -54880 -54635 -50578 -50732 -52540 -52880 -56388 -53589 -46277 -52321 -53979 -53868 -48372
10744 -48372 -49385 -55701 -56998 -60242 -56932 -50498 -49127 -54911 -58556 -55029 -53914 -53848 -52905 -53351 -57448
10729 -57448 -55169 -56982 -52898 -54283 -51101 -51491 -51321 -54669 -54501 -52991 -56243 -54370 -50756 -50105 -50547 -51001
10713 -51001 -53815 -54522 -55127 -50599 -54888 -56800 -58627 -59897 -48129 -49844 -53590 -56516 -61022 -56418 -51538
10698 -51538 -52460 -54487 -54785 -53136 -50486 -49786 -48020 -56702 -55835 -53665 -53897 -53017 -57461 -50336 -51215 -51256 -52422
10681 -52422 -55750 -52020 -57675 -50619 -49941 -53619 -52002 -52146 -54631 -52671 -49905 -52875 -55794 -59594 -51657
10666 -51657 -53096 -54054 -51682 -51170 -56601 -54114 -49931 -54867 -50533 -54936 -58905 -52672 -53365 -52734 -57629
10651 -57629 -57573 -50927 -49224 -52303 -57396 -52353 -51683 -57135 -52931 -56406 -60319 -54037 -57830 -46768 -54859
10636 -54859 -54194 -50022 -49229 -48471 -55296 -50819 -55736 -55792 -52744 -56141 -55683 -55378 -50801 -53228 -53670 -55496
10620 -55496 -58301 -64339 -57760 -50773 -53635 -55828 -52499 -50113 -45907 -45626 -46137 -50223 -49583 -52794 -48580
10605 -48580 -52753 -54843 -52064 -47643 -57597 -57129 -54942 -53351 -54948 -56376 -53806 -54098 -55103 -53619 -50629
10590 -50629 -52198 -51259 -52031 -52767 -52148 -53597 -56591 -58527 -55108 -53736 -56602 -53443 -49734 -54630 -55330 -54551
10574 -54551 -50789 -53823 -54978 -57300 -57752 -52062 -50846 -55695 -53143 -54269 -50207 -48172 -51509 -57513 -55462
10559 -55462 -55679 -54071 -54586 -50685 -54078 -58240 -57747 -52028 -50371 -55968 -51139 -51012 -53766 -57460 -54099
10544 -54099 -52410 -52701 -54249 -56380 -50709 -53775 -48421 -49003 -55693 -56797 -56405 -51721 -48331 -50582 -52913
10529 -52913 -49717 -57484 -54638 -48083 -55385 -62280 -60031 -50877 -51842 -50191 -48748 -47359 -53670 -61088 -51947
10514 -51947 -54594 -54744 -59077 -54671 -52624 -50767 -48334 -47083 -55370 -54410 -56359 -51868 -51582 -55045 -56835
10499 -56835 -50584 -47289 -50375 -53387 -54038 -53262 -60508 -50963 -54626 -55796 -59521 -56195 -45962 -51925 -59044
10484 -59044 -54005 -48954 -58494 -50705 -51128 -55779 -51349 -55163 -53393 -51392 -55328 -58110 -49189 -53552 -49241
10469 -49241 -46579 -52438 -52681 -52477 -54922 -57230 -47509 -50152 -54768 -53563 -52164 -46334 -50729 -55291 -58391
10454 -58391 -61514 -50479 -50804 -52021 -52421 -56584 -53627 -50460 -58906 -58181 -53581 -57596 -56528 -53283 -55543
10439 -55543 -55267 -54100 -49136 -51374 -54496 -55725 -51096 -50452 -53983 -46295 -50013 -54049 -54014 -48449 -51759
10424 -51759 -54263 -52772 -57818 -51646 -56704 -50518 -50403 -56549 -52966 -54049 -56524 -52523 -53168 -52245 -52754
10409 -52754 -59755 -58152 -51149 -50162 -52856 -51492 -48357 -53484 -54094 -53687 -54458 -53772 -56546 -51165 -49283 -58041
10393 -58041 -54559 -45369 -49228 -52717 -54377 -52580 -53265 -55341 -57911 -52155 -57953 -57161 -50425 -47873 -54109
10378 -54109 -52469 -55042 -53628 -53357 -54119 -57361 -54752 -57699 -55308 -52736 -54669 -53425 -52061 -52751 -54450
10363 -54450 -48565 -51265 -52942 -59329 -58865 -57678 -50191 -48955 -52393 -50519 -58942 -56340 -52601 -51235 -48211
10348 -48211 -51704 -56913 -51758 -50512 -53526 -54721 -51776 -49195 -50499 -56657 -53869 -52322 -57103 -51557
10334 -51557 -48236 -58383 -60163 -58421 -57274 -49170 -51440 -51934 -54576 -52426 -50599 -48310 -50714 -54688
10320 -54688 -57859 -52503 -51445 -54713 -47469 -48216 -52693 -54535 -49518 -55017 -52447 -56768 -56876 -52708 -55326
10305 -55326 -52921 -53737 -57226 -51585 -53357 -54394 -51627 -52571 -54559 -49766 -51519 -47747 -56163 -56257 -54112
10290 -54112 -53848 -55761 -55408 -51195 -53481 -49145 -52718 -48010 -56177 -52745 -49196 -53900 -49339 -56157 -56868
10275 -56868 -52190 -52433 -54082 -43583 -50788 -54239 -54077 -45085 -50574 -54758 -55660 -57330 -53678 -53824 -49726
10260 -49726 -50735 -53737 -50789 -54606 -51809 -53479 -57541 -56431 -55679 -52492 -50863 -57619 -54387 -50980 -55181
10245 -55181 -48940 -51768 -53823 -56280 -56317 -55691 -50026 -52761 -52855 -51982 -51210 -47210 -51835 -57186 -53516 -56411
10229 -56411 -60437 -53524 -57361 -52579 -51661 -56627 -52577 -54079 -53256 -49765 -47581 -57400 -56355 -56400 -53667
10214 -53667 -53290 -47047 -51139 -57696 -55905 -50597 -54279 -52571 -50224 -59838 -48555 -51216 -54579 -49215
10200 -49215 -54164 -51741 -54749 -55728 -58438 -58504 -57133 -52515 -49930 -53784 -49723 -51825 -51221 -52196 -53074 -56146
10184 -56146 -56635 -54212 -52633 -47577 -51461 -49046 -53337 -55734 -56438 -52026 -55482 -58462 -51967 -49050 -51954
10169 -51954 -54329 -50488 -51870 -48987 -52396 -55327 -55582 -56538 -56466 -55319 -53026 -52971 -52414 -52029 -53010 -50397 -52157
10152 -52157 -51008 -49944 -49904 -53695 -51196 -53279 -50862 -55212 -48698 -46055 -52267 -58016 -52463 -50987 -55617
10137 -55617 -54575 -58308 -54053 -53999 -53578 -46952 -48366 -51056 -52783 -48158 -52330 -51146 -52460 -52102 -54023
10122 -54023 -56427 -54648 -60012 -51718 -50283 -50649 -46746 -59159 -56261 -56645 -53682 -50588 -46748 -49290 -53120
10107 -53120 -50546 -49269 -43684 -51710 -49453 -55296 -55679 -58915 -56320 -50011 -50597 -52742 -52071 -54247 -51009
10092 -51009 -46182 -53863 -48708 -49447 -54641 -48816 -50831 -46933 -45596 -50361 -48973 -52745 -49147 -51290 -48673
10077 -48673 -40390 -48499 -49103 -48766 -51373 -55783 -54455 -54002 -52783 -51608 -56452 -52756 -50365 -53968 -51773
10062 -51773 -47690 -50383 -55796 -58008 -52544 -48416 -54157 -51189 -47036 -53984 -52271 -57334 -56874 -56160 -54581
10047 -54581 -58530 -49540 -52370 -50763 -48592 -52972 -53360 -49147 -51608 -53021 -53358 -54778 -50500 -52399 -53413
10032 -53413 -58408 -53685 -51171 -50608 -47736 -50578 -59393 -55905 -52975 -49444 -45245 -53184 -59433 -50845 -54064
10017 -54064 -55294 -54188 -50165 -55210 -51849 -54336 -51915 -50662 -48985 -46803 -52429 -44003 -56634 -54792
10003 -54792 -51955 -55254 -49468 -54414 -55935 -50573 -40204 -55461 -55395 -55714 -51793 -51122 -55463 -53976 -52939
9988 -52939 -54416 -56379 -54888 -52510 -46274 -50673 -47281 -45635 -55197 -51727 -54863 -55768 -54676 -57092 -56444
9973 -56444 -52183 -48819 -45213 -49004 -55101 -54152 -55921 -51298 -52492 -51705 -51575 -55132 -51062 -46332 -49824
9958 -49824 -50757 -49150 -57772 -61443 -54968 -56320 -58994 -49372 -54197 -52549 -55089 -53646 -46179 -46183 -48155 -48350
9942 -48350 -49077 -50672 -51096 -50388 -52059 -54886 -55713 -54894 -52076 -52933 -47312 -47219 -57647 -57995 -53490 -54746 -53984
9925 -53984 -50861 -49945 -52362 -54342 -52739 -49307 -49898 -54496 -53202 -53786 -59032 -54439 -50010 -49693 -50808 -53624
9909 -53624 -48281 -54058 -54305 -52615 -49473 -53849 -53478 -51439 -51285 -52471 -57118 -52317 -46330 -53344 -48458
9894 -48458 -44530 -48135 -49424 -51085 -44762 -48247 -55384 -53678 -50865 -54863 -54310 -54208 -53898 -56955 -56704 -56030
9878 -56030 -56195 -55277 -55510 -49711 -52050 -54114 -50186 -49257 -48312 -47855 -51707 -51540 -52897 -53869 -50459 -48338 -51859
9861 -51859 -56800 -51814 -54673 -50014 -50381 -47298 -53548 -55391 -50616 -53493 -52571 -54138 -56399 -52181 -48642
9846 -48642 -53289 -51658 -48031 -55854 -53497 -56393 -49173 -50029 -50446 -51498 -52579 -45984 -53468 -54150 -48885
9831 -48885 -52007 -52790 -55299 -51963 -53883 -50095 -53375 -55102 -54283 -51066 -45911 -49860 -47916 -51725 -56124
9816 -56124 -50717 -47374 -48351 -50604 -52443 -54353 -54076 -48714 -50847 -53660 -53559 -53483 -51170 -48699 -52477 -48274
9800 -48274 -47908 -54660 -53334 -54311 -47830 -49688 -53593 -53817 -50956 -55242 -51469 -50536 -54401 -52516 -56457 -52269
9784 -52269 -48210 -46873 -44712 -55734 -48136 -43617 -46366 -53218 -48497 -50211 -49253 -50244 -49110 -46303 -49313
9769 -49313 -52179 -52642 -47996 -53375 -54175 -49648 -51226 -56467 -52984 -44869 -48330 -46989 -41228 -43953 -53206
9754 -53206 -44353 -40475 -32713 -32008 -31399 -36834 -42638 -46839 -47315 -39452 -47067 -42118 -46512 -44362 -45603
9739 -45603 -48789 -36191 -35727 -43917 -37988 -28677 -25092 -10683 -4510 5412 14021 4932 7092 -8769
9725 -8769 -19388 -28628 -29002 -33013 -43735 -42898 -45955 -42947 -49382 -42177 -47662 -51001 -54774 -47796 -43345
9710 -43345 -48127 -48658 -45734 -48249 -49340 -48743 -49809 -43987 -49912 -51591 -46016 -50919 -54450 -51830 -50680
9695 -50680 -49866 -47713 -48707 -50368 -49707 -49375 -40934 -44453 -50608 -48937 -51239 -49856 -47008 -50615 -49364 -52836
9679 -52836 -55489 -51935 -48658 -51928 -51713 -56446 -53132 -47168 -49542 -48872 -51191 -48885 -48389 -49904 -48310
9664 -48310 -48346 -50021 -51086 -49586 -49271 -52350 -50890 -46576 -50429 -51815 -41947 -46594 -54303 -50719 -51642 -53494
9648 -53494 -56120 -51528 -44144 -54857 -57678 -49376 -48980 -49611 -53127 -52597 -51395 -55470 -56890 -47064 -45773
9633 -45773 -49448 -46112 -50476 -45809 -47665 -50387 -52725 -54065 -54533 -50205 -51805 -46916 -48272 -45268 -45347
9618 -45347 -46542 -51642 -47319 -46570 -49028 -45258 -46369 -44681 -44102 -43363 -29509 -17883 -12638 -12857 -24982
9603 -24982 -34387 -41648 -43451 -45849 -49317 -50399 -48501 -47840 -47906 -48187 -49103 -47207 -49188 -49725 -42099 -48208
9587 -48208 -53959 -45464 -49690 -51650 -41784 -50821 -45072 -45639 -49691 -49638 -44644 -51557 -52361 -44997 -50479 -52455
9571 -52455 -48751 -48403 -46413 -52688 -49694 -48274 -47528 -56922 -51188 -49480 -48103 -50518 -48826 -47522 -49109
9556 -49109 -46411 -48206 -43530 -46983 -57602 -52332 -51272 -49084 -50025 -49123 -46906 -52611 -48226 -48026 -45685
9541 -45685 -50620 -48640 -48252 -47628 -45365 -46252 -46080 -49193 -49318 -41338 -44943 -50798 -51803 -47730 -53350 -45160
9525 -45160 -47629 -50953 -52526 -46487 -44481 -45562 -47697 -53361 -50579 -51869 -47557 -43995 -55523 -53747
9511 -53747 -51069 -43994 -49830 -47509 -48761 -53013 -52947 -52394 -48127 -50709 -48448 -47367 -45981 -53660 -48859
9496 -48859 -44412 -44486 -42398 -50949 -46886 -50052 -43429 -40250 -42994 -49621 -57103 -47613 -45410 -42264 -51962
9481 -51962 -48907 -47206 -49023 -43197 -43537 -46389 -53410 -49902 -53733 -46407 -49919 -48115 -46673 -50754 -50757 -45866
9465 -45866 -49987 -55151 -48226 -47238 -54422 -52236 -44700 -42361 -51442 -52396 -46653 -48796 -46914 -46337 -44995
9450 -44995 -39902 -48100 -42242 -43091 -47263 -52464 -51317 -49168 -43866 -45677 -48238 -49080 -49857 -47117 -53017
9435 -53017 -53121 -49729 -52451 -50759 -50259 -46516 -50335 -44666 -49242 -48742 -51388 -47493 -45236 -53524 -47508
9420 -47508 -50620 -40344 -46735 -50653 -48651 -47871 -48868 -48383 -46081 -47521 -43871 -50503 -44907 -44476 -48341
9405 -48341 -50290 -52748 -51852 -47091 -48922 -55299 -49382 -51991 -53350 -49572 -45353 -41081 -47374 -45930 -49376
9390 -49376 -51614 -47076 -51396 -50906 -50423 -49675 -40338 -47102 -49868 -47047 -51569 -53196 -44849 -49684 -45153
9375 -45153 -50500 -45140 -39870 -45469 -46874 -48947 -47254 -51439 -49018 -43199 -49429 -46985 -48121 -42107 -48283
9360 -48283 -50103 -45998 -51059 -56402 -51826 -50988 -51660 -55056 -49493 -46505 -52370 -49881 -46785 -51293 -45281
9345 -45281 -44355 -42343 -45901 -46524 -44842 -41777 -47782 -44755 -44712 -50356 -51382 -47918 -47109 -45873 -55380 -52038
9329 -52038 -43553 -44332 -45217 -51292 -52123 -48681 -44859 -45971 -45255 -47838 -49401 -50684 -44715 -46445 -45818 -49705
9313 -49705 -53577 -48941 -49173 -48509 -48165 -50476 -46773 -51239 -47112 -40686 -46535 -48436 -45845 -48126 -47043
9298 -47043 -45731 -45178 -48858 -48935 -47574 -43281 -50043 -45770 -42208 -44264 -47386 -49774 -49921 -47694 -49610 -45914
9282 -45914 -45036 -46406 -48293 -47718 -42167 -42971 -49176 -50005 -49109 -52152 -45179 -46334 -48613 -46192 -46926 -45545
9266 -45545 -45303 -47924 -50869 -46790 -45903 -44369 -42950 -44483 -46713 -48640 -42971 -42577 -43168 -47108 -47683 -52283
9250 -52283 -50258 -44448 -45162 -47642 -49083 -49484 -52615 -43931 -42013 -43348 -46268 -50939 -49025 -46802 -43736
9235 -43736 -45654 -43488 -44429 -45324 -41438 -44071 -45208 -46188 -50885 -46227 -50538 -50547 -46330 -48563 -46847 -43477
9219 -43477 -46365 -43695 -44496 -45297 -46869 -47371 -45465 -45027 -45563 -48727 -44662 -43020 -41088 -42627 -48434 -47538
9203 -47538 -47957 -47530 -46046 -45334 -47239 -45971 -52490 -46785 -41847 -50872 -46223 -44202 -49436 -53844 -48174
9188 -48174 -45731 -46096 -45648 -51234 -45140 -47353 -45880 -45182 -43791 -45564 -45671 -45990 -42826 -46546 -47693 -49358
9172 -49358 -40745 -41238 -44232 -41532 -48082 -50054 -43138 -43938 -42605 -45288 -47586 -38360 -44948 -46022 -40696
9157 -40696 -44616 -46642 -41390 -46471 -45167 -40393 -47040 -47253 -49589 -52758 -48177 -45851 -45746 -48467 -40024
9142 -40024 -45694 -47750 -40104 -42718 -41862 -37386 -36000 -40232 -39175 -39184 -33213 -29356 -38483 -41553 -55173
9127 -55173 -66232 -56789 -43627 -45472 -45405 -47490 -44996 -40919 -43261 -43198 -46933 -46330 -46847 -43158 -45218 -50922
9111 -50922 -47817 -45682 -41903 -48634 -43442 -47450 -48676 -43398 -43884 -44702 -45293 -44540 -43496 -33576 -39160 -48519
9095 -48519 -46592 -45813 -44968 -44904 -41191 -44423 -45608 -40870 -39728 -39742 -39753 -45739 -44688 -46552 -44648 -42646 -44250
9078 -44250 -47427 -49040 -41207 -42298 -48814 -47334 -48198 -48061 -43615 -44527 -40457 -42161 -45485 -40510 -46197
9063 -46197 -47337 -45734 -40996 -42032 -46129 -37835 -39655 -47747 -44732 -43475 -43619 -41240 -45837 -45799 -38407
9048 -38407 -41388 -38807 -40274 -40833 -45573 -41296 -40399 -46971 -40346 -43021 -48425 -37206 -37985 -40677 -34018
9033 -34018 -43621 -43382 -38586 -47049 -41696 -42625 -46250 -37626 -40373 -37380 -32161 -36430 -35235 -41366 -42037
9018 -42037 -37907 -41985 -46749 -45904 -42652 -41900 -38500 -37457 -35306 -44167 -40787 -39263 -41756 -39676 -43531
9003 -43531 -43019 -40012 -43149 -36325 -43998 -43096 -41585 -44909 -39963 -40903 -44571 -38704 -39422 -39431 -37565 -34654
8987 -34654 -37028 -41435 -39624 -36873 -42720 -48601 -38800 -36222 -42007 -41270 -37721 -43087 -41997 -44928 -38270
8972 -38270 -37814 -46589 -42525 -40239 -39001 -43418 -36913 -34709 -39671 -41942 -40715 -33603 -40397 -43955 -41732
8957 -41732 -43866 -46898 -41115 -40042 -39954 -38209 -39179 -36259 -38234 -41377 -36582 -39829 -41909 -39794 -39796 -42412
8941 -42412 -39416 -37152 -37481 -44082 -43771 -39260 -46932 -42052 -44073 -45398 -38288 -39856 -40340 -37441 -43545
8926 -43545 -35923 -38399 -37553 -32786 -38779 -36629 -36789 -33701 -35909 -46737 -41416 -34077 -37609 -38700 -40313
8911 -40313 -40971 -42684 -47791 -45091 -40903 -45125 -50269 -40083 -39019 -42572 -37343 -37122 -39703 -37697 -36633
8896 -36633 -34101 -39070 -38481 -40064 -44261 -40313 -38903 -40493 -38576 -41054 -48994 -41531 -39888 -42033 -39849
8881 -39849 -42578 -44431 -38218 -37592 -37316 -37794 -36679 -38765 -38756 -36357 -43451 -42310 -36938 -36319 -32214 -37739
8865 -37739 -39316 -35361 -37732 -37222 -34248 -40129 -39621 -40070 -40010 -39644 -38026 -42165 -37460 -40129 -40403 -36363
8849 -36363 -36866 -32784 -35515 -34332 -37232 -31367 -31590 -30914 -34184 -39797 -34466 -35867 -37264 -31541 -33790
8834 -33790 -37894 -39506 -35210 -36415 -33309 -34810 -35190 -33393 -40832 -36374 -31061 -34523 -42584 -41247 -36644
8819 -36644 -37800 -39988 -41221 -38802 -37846 -35102 -33648 -29220 -32490 -38890 -32929 -34311 -36071 -31545 -37049
8804 -37049 -38155 -36668 -35166 -33972 -40639 -39573 -34459 -35999 -33728 -35824 -36096 -38764 -39361 -33737 -34065
8789 -34065 -39031 -34153 -32513 -40000 -35575 -39648 -41689 -33067 -35114 -38675 -35075 -38931 -37708 -33976 -32611
8774 -32611 -34631 -34755 -33079 -35757 -38110 -35046 -36938 -37116 -45122 -36594 -36402 -41981 -34621 -31975 -30889
8759 -30889 -36667 -33752 -33567 -37751 -32479 -37116 -33959 -33585 -34915 -26727 -35010 -35599 -38516 -43249 -38088
8744 -38088 -39544 -41521 -35150 -39024 -36530 -34129 -40225 -36675 -33158 -37821 -35686 -31656 -29021 -34891 -35328
8729 -35328 -29450 -29672 -36951 -38993 -37143 -35161 -34053 -37953 -33082 -38251 -41997 -35659 -36705 -32252 -36289
8714 -36289 -36132 -28466 -35711 -32143 -30563 -36556 -38883 -35187 -34945 -37563 -36064 -37394 -38931 -34191 -34225 -43184
8698 -43184 -33545 -33071 -32662 -31459 -30629 -33420 -31875 -39336 -34770 -33754 -35685 -36136 -37339 -31880 -30678 -30417
8682 -30417 -30488 -30235 -36223 -39931 -33348 -40926 -33110 -34737 -30472 -37025 -38688 -32105 -37005 -35284 -33094
8667 -33094 -34250 -33817 -33332 -30702 -33422 -33715 -35592 -40271 -39029 -39538 -36400 -25282 -34392 -33236 -32372 -35171
8651 -35171 -33355 -33263 -34552 -31952 -36746 -34658 -26973 -34458 -31521 -28488 -35222 -34250 -34441 -37500 -39312 -34688
8635 -34688 -32616 -42853 -44724 -39364 -39094 -32754 -31396 -28004 -32312 -33628 -30058 -23176 -30039 -37700 -39772
8620 -39772 -34146 -32951 -36832 -32450 -31039 -34594 -29906 -31198 -38135 -38831 -34386 -36173 -33400 -33032 -35564
8605 -35564 -32038 -36059 -29528 -24730 -35044 -36285 -35763 -37472 -33775 -36769 -33842 -32551 -38473 -30280 -31594
8590 -31594 -26402 -30808 -31297 -31791 -39477 -34822 -29849 -35495 -38798 -34460 -38716 -31582 -29591 -26216 -34054
8575 -34054 -34402 -29389 -35106 -34326 -31882 -35487 -37697 -33541 -36340 -32792 -28737 -31806 -26942 -33280 -31183
8560 -31183 -31137 -28254 -28155 -39367 -40304 -40852 -43510 -36661 -31706 -28019 -31013 -29107 -25849 -32203 -32898 -33166
8544 -33166 -38067 -35588 -39460 -32792 -31072 -28717 -34608 -29432 -22683 -30844 -31795 -30984 -37792 -32184 -34372
8529 -34372 -34734 -32573 -35104 -32711 -33219 -32863 -30896 -33663 -38527 -39046 -31035 -36362 -32738 -32480 -36616 -37086
8513 -37086 -38023 -37181 -29086 -27175 -33406 -32617 -40323 -39949 -31629 -30277 -30329 -34547 -31056 -33375 -35519 -36796
8497 -36796 -31404 -34037 -37758 -33667 -32778 -34129 -27273 -29587 -34497 -34665 -40035 -38701 -42858 -35027 -36634
8482 -36634 -30545 -36039 -35797 -29207 -35209 -31756 -33568 -34463 -36079 -38641 -32750 -28365 -33968 -32863 -34389
8467 -34389 -34890 -35079 -42314 -28771 -33157 -31730 -30025 -36079 -36447 -33396 -32762 -34485 -32616 -36811 -40008
8452 -40008 -34625 -34286 -35695 -31832 -33557 -34383 -29661 -25885 -28132 -32275 -30233 -34315 -36314 -36152 -39696
8437 -39696 -37322 -36437 -35214 -34555 -37371 -38621 -34830 -34985 -34014 -34260 -37745 -31716 -34399 -30787 -27698 -25322
8421 -25322 -38069 -36159 -26477 -32538 -33253 -37192 -31232 -35664 -33543 -35672 -41351 -35620 -39777 -39007 -29870
8406 -29870 -29625 -33159 -30586 -34085 -30675 -31465 -35381 -34493 -32569 -28915 -33065 -33458 -36173 -34946 -31863 -39981
8390 -39981 -34718 -31225 -32652 -33913 -38160 -32181 -33275 -28808 -36104 -29517 -24020 -37722 -36637 -35294
8376 -35294 -34317 -34931 -36651 -33207 -36078 -38352 -33119 -30868 -31809 -30103 -36637 -34004 -38047 -36374 -29926
8361 -29926 -34379 -30335 -31364 -27890 -30179 -32703 -31395 -25803 -26763 -29949 -24485 -33225 -24675 -30486 -31078
8346 -31078 -33412 -39245 -33883 -38089 -28546 -22255 -31330 -34547 -30558 -37468 -31809 -37137 -39625 -28130
8332 -28130 -32181 -30826 -25852 -28839 -26978 -30458 -31150 -30038 -40459 -38499 -38784 -40180 -34159 -28795 -30528
8317 -30528 -31287 -33153 -32041 -29723 -26781 -28881 -26701 -36456 -31866 -33254 -30154 -34880 -38305 -29817 -31928
8302 -31928 -28869 -32972 -31545 -27980 -36410 -31992 -28981 -35417 -34695 -29393 -27889 -26048 -29637 -31525 -33171
8287 -33171 -34934 -35524 -34223 -34530 -36414 -37528 -33285 -27745 -25824 -30060 -24616 -29399 -38524 -35507 -31589
8272 -31589 -33372 -34350 -31047 -30786 -32443 -28521 -35241 -28153 -31437 -38575 -32390 -33192 -37104 -32945 -28058
8257 -28058 -33930 -28846 -30536 -26884 -26425 -31033 -32529 -31334 -36061 -39774 -34774 -36816 -31404 -30235 -31960
8242 -31960 -28403 -28935 -24838 -28782 -29453 -31674 -30907 -25782 -31657 -33473 -36104 -36446 -37527 -29443 -28420 -30375
8226 -30375 -31305 -33467 -25358 -24989 -24576 -23143 -32617 -30812 -26250 -27601 -30653 -30559 -27818 -27426 -30108 -32251
8210 -32251 -28347 -32458 -30312 -26989 -22597 -23035 -30225 -31056 -31353 -26340 -24679 -26371 -22820 -27800 -30120
8195 -30120 -25642 -25345 -17980 -8274 -40762 -34618 -31832 -29282 -32841 -31878 -27455 -30715 -27313 -25325 -36970
8180 -36970 -35676 -31221 -28118 -26071 -26057 -25065 -27837 -25443 -29321 -29658 -31025 -37204 -32855 -21725 -21401 -28568
8164 -28568 -19578 -26802 -27161 -24899 -29409 -31994 -37465 -37199 -31113 -31142 -32342 -25728 -27567 -24112 -25682 -25561
8148 -25561 -26659 -26883 -27680 -23746 -28810 -27125 -26730 -26289 -29175 -29649 -27898 -28619 -27201 -27717 -23618 -23020 -26883
8131 -26883 -23860 -22631 -22395 -27336 -21110 -26212 -29366 -20179 -24830 -24217 -24901 -25232 -25165 -34187 -34181 -28804 -29402
8114 -29402 -26804 -25932 -29327 -25597 -23198 -22592 -18056 -27473 -23726 -26182 -25889 -24530 -26269 -20072 -24353
8099 -24353 -28305 -25947 -22956 -20835 -20245 -22605 -18575 -21669 -23862 -21402 -22458 -22855 -21166 -24018 -22971
8084 -22971 -30706 -25609 -24597 -21297 -23456 -28655 -27564 -21918 -16182 -17523 -21633 -21543 -22689 -25908 -20298
8069 -20298 -19518 -19953 -18461 -13661 -13763 -15070 -8719 -6922 -4749 -4500 -7159 -1672 14629 21756 26928
8054 26928 20659 6550 -689 1847 17132 22046 20003 9433 4770 -3545 -5765 -2911 -6148 -6236
8040 -6236 -10561 -11545 -11524 -18209 -24048 -20805 -21738 -22952 -21352 -15197 -18978 -21575 -19457 -19382 -24899 -27804
8024 -27804 -27984 -22312 -23797 -21195 -19242 -18631 -20861 -15313 -18634 -23324 -26411 -29085 -26791 -23811 -26672
8009 -26672 -20528 -21053 -28828 -21914 -17722 -25012 -23095 -19703 -20536 -18870 -25218 -28042 -24303 -27370 -21974
7994 -21974 -24137 -24654 -27886 -28201 -19619 -17724 -18945 -18775 -21197 -24738 -17586 -19585 -20839 -20916 -22767 -26193
7978 -26193 -19826 -18641 -21518 -27152 -23481 -25781 -32364 -26829 -23736 -24773 -22842 -25360 -18620 -18812 -23302
7963 -23302 -19182 -17669 -25781 -21583 -21019 -24790 -22534 -25732 -16889 -15507 -17035 -21182 -24348 -26171 -24247
7948 -24247 -21946 -23307 -25840 -22036 -19889 -20364 -16706 -17912 -20189 -27444 -23984 -27224 -25254 -30245 -26422
7933 -26422 -27833 -27183 -27437 -21629 -16533 -17830 -18874 -19626 -23026 -23094 -23090 -22340 -23311 -19233 -23700 -15717 -18882
7916 -18882 -18186 -16293 -10896 -17351 -23723 -20403 -26850 -13637 -25217 -25037 -19543 -17511 -20424 -25467 -18907
7901 -18907 -27433 -25047 -29767 -22214 -22544 -25268 -27551 -25538 -19159 -26941 -18738 -22616 -11910 -24908
7887 -24908 -21625 -21231 -14349 -16099 -23522 -15433 -16878 -16009 -17058 -12562 -13315 -23817 -28894 -18324 -14193
7872 -14193 -22574 -18082 -24144 -18196 -17196 -18599 -16844 -20492 -21639 -19635 -19395 -27880 -24912 -19947 -14546
7857 -14546 -12847 -11726 -12230 -13641 -13012 -17036 -4443 -22644 -26011 -23781 -13526 -14991 -15875 -16617 -19262
7842 -19262 -13404 -14003 -13828 -17172 -17233 -16115 -17766 -14464 -8091 -13064 -14382 -16243 -19282 -22939 -21007 -23951
7826 -23951 -23060 -15836 -19507 -13201 -18273 -22184 -12583 -16164 -15846 -12805 -20631 -17193 -16374 -12626 -12880 -17249
7810 -17249 -11774 -1748 -5292 -3417 -4520 -11782 -12376 -17071 -8714 -10934 -18067 -11865 -8487 -9178 -7722
7795 -7722 -1082 -9533 -13302 -16506 -12071 -17383 -21845 -19104 -14357 -9983 -12165 -9587 -8561 -7340 -6159
7780 -6159 -6865 -1759 -8650 -5479 -9246 -6344 -11195 -10189 -9039 -11045 -4804 -4164 -6214 -8823 -4962
7765 -4962 -13700 -11364 -7579 -11138 -3241 -9845 -6221 -1865 1683 -9005 -11782 -9022 -10599 -7341 -5860
7750 -5860 -1040 -3620 -2454 -4199 -2686 699 -2889 303 -3005 -2648 -277 -3438 -1212 -3120 -3798
7735 -3798 -2488 -3313 -4075 -929 3454 33 3110 5272 7829 8628 12773 19197 14086 22856 31171 39089
7719 39089 47931 40913 41288 31788 32063 35033 45757 41783 32046 24287 24393 27410 23569 22340 18611
7704 18611 11051 7691 8089 4222 -1237 195 -633 5850 -6310 897 5439 4793 11583 3157 11715
7689 11715 3536 4436 4583 7046 6642 -1612 -2203 2926 8087 6654 8150 5397 8077 12965 12195 19281
7673 19281 15007 13115 10846 15272 14259 14643 19314 17894 18799 20722 18253 14665 11731 10799 9160
7658 9160 12625 12702 8549 14004 12702 23915 26001 26067 24145 19186 10553 16905 13481 12392 16329 9702
7642 9702 18013 22489 18894 26763 26974 31071 30387 32969 30144 32110 28391 24540 29717 30485 28275 23719
7626 23719 26657 23944 22377 20520 20492 24575 20947 24517 28923 26038 30583 36596 31949 30267 35621
7611 35621 24637 26386 24624 29113 29100 25928 26915 28126 35695 41234 47550 52270 43276 45858 52290
7596 52290 50093 46976 48312 39105 37704 44294 54338 56297 52949 55923 56389 51693 50055 46276 42791
7581 42791 42616 40304 40239 48086 45079 52593 55690 55504 55260 47848 49090 53020 52900 49702 53390 52061
7565 52061 59882 64057 70997 76071 81932 81674 83602 89338 87907 86078 82148 78789 80402 79988 77128
7550 77128 78155 84509 87367 95174 105091 102794 103456 102794 106675 112520 106548 104993 104271 104725 106301 112868
7534 112868 121787 117687 110817 117769 119853 120105 122109 117652 121629 126082 130041 141389 137842 129939
7520 129939 134759 144012 137676 135973 134825 134349 130564 125707 139220 136350 136295 139442 141571 142900 136443
7505 136443 132458 139040 135470 139823 157093 156672 156129 154511 154212 164421 160040 164143 166115 165918 164801
7490 164801 173524 180416 183506 179019 187739 202972 203764 205824 212001 209788 211696 213541 219340 225259
7476 225259 225221 230763 235859 236473 239533 242024 241695 247153 246374 247339 256626 252819 249571 251603 246765 248046
7460 248046 253568 256877 268237 274288 270798 290751 293835 304199 308747 303448 305029 303329 296616 311435
7446 311435 320043 323283 333210 338838 342528 343411 344960 357662 367401 374828 377251 382101 383160 380161
7432 380161 378562 371750 372242 376447 383798 390258 410247 419265 428504 432218 431686 433352 444202 460420
7418 460420 494879 525064 540503 555479 560127 571475 583033 596704 614426 620734 629032 627297
7406 627297 615601 596510 588163 606870 632438 647013 661460 682228 705713 728644 743017 754331
7394 754331 756766 763591 768214 778107 793920 811775 821839 831913 849428 871932 902419 924083
7382 924083 945001 963813 970395 980011 976878 974121 973500 975084 988285 1005611 1009269 1017309 1037378
7369 1037378 1049739 1070243 1089786 1120617 1159637 1195548 1242576 1281044 1305366 1324314 1338723
7358 1338723 1344792 1369244 1394432 1421454 1438558 1445799 1454577 1477456 1505266 1546949 1577412 1611154
7346 1611154 1642502 1667153 1697043 1717483 1737686 1775976 1832601 1888109 1939752 1969321 1990312
7335 1990312 2012677 2038870 2094049 2159193 2222363 2281944 2338251 2391976 2442337 2484333 2521884
7324 2521884 2556137 2587964 2625980 2655851 2707906 2761230 2817874 2899276 2975367 3068696 3164475
7313 3164475 3269603 3375648 3469365 3566677 3658777 3758517 3836281 3913232 4001411 4097204 4221580
7302 4221580 4360707 4505666 4626846 4741998 4826188 4927649 5053881 5188139 5343124 5524714
7292 5524714 5737349 5945908 6130293 6297338 6476686 6667369 6912701 7196026 7511257 7882758
7282 7882758 8270488 8713604 9178038 9709929 10377600 11258582 12350640 13497834 14682411
7273 14682411 15937539 17287879 18785094 20484564 22528078 25049306 28079516 31471520
7265 31471520 35414063 40161583 46626322 56205132 71322332 101469804 162966577 250861529
7257 250861529 334266539 374819515 339726679 264982726 192657989 137550003 99950667
7250 99950667 73865214 55458238 42762907 34010170 28024388 24015986 21324232 19443987
7242 19443987 18044104 16871433 15783689 14766473 13864859 13063115 12363831 11761087 11212990
7233 11212990 10699272 10226814 9800728 9403226 9035115 8690754 8360285 8081664 7819671
7224 7819671 7564029 7291116 7006355 6753494 6532600 6324377 6115813 5912589 5707889 5509451
7214 5509451 5318627 5123784 4945276 4805656 4685559 4559824 4426653 4290063 4162501 4041284
7204 4041284 3927958 3809461 3694499 3576714 3460154 3365308 3291835 3221751 3150392 3094920
7194 3094920 3035181 2967190 2885354 2790307 2702317 2622324 2553917 2475550 2402303 2317751 2238600
7183 2238600 2167712 2101317 2048677 2006121 1974330 1939285 1915602 1883153 1845300 1821047 1800374
7172 1800374 1781252 1767318 1739547 1697151 1654744 1594425 1548734 1512461 1480693 1463855 1446310
7161 1446310 1428066 1409996 1385607 1357708 1336299 1308102 1273617 1237570 1193215 1163251 1149690
7150 1149690 1143259 1158287 1168947 1172136 1174108 1163340 1154051 1136648 1118308 1107369 1080187 1050194
7138 1050194 1010498 969072 919021 879163 845468 830791 812879 801334 794608 788081 796122 795990
7126 795990 811387 833141 854290 887109 917486 940132 951762 965559 967835 980740 986803 986418
7114 986418 974899 930225 850874 763592 689444 644486 625285 612781 605139 592350 580540 576609
7102 576609 576954 583893 572483 535608 503653 478082 457816 452042 437835 424289 409248 398802
7090 398802 381833 367165 355175 344763 354177 353413 341650 328796 320697 305968 296297 283336 270333
7077 270333 265236 256100 252151 243161 225426 207836 198493 186263 182742 183810 179725 180662 185278 191709
7063 191709 189015 178314 168106 164166 146658 132651 127885 112370 109130 108316 112594 121699 117320
7050 117320 106948 103176 93320 73430 67485 63091 60734 57547 63203 67127 71560 67082 59959 60571
7036 60571 54941 48257 43711 38785 27203 36901 42992 44607 52581 52592 47862 40450 42508 38197 33738
7021 33738 31890 28939 20958 18724 21930 16074 17956 17061 19888 17543 16193 15851 11552 5213 -1802
7006 -1802 -1113 3910 7016 2757 2344 2523 -4508 -4859 -6493 -7953 -8204 -6225 -5012 -2033 -64 -4288
6990 -4288 -2979 -11160 -12659 -10605 -15295 -21284 -24274 -25946 -30164 -34491 -40644 -43527 -43901 -49897 -42776
6975 -42776 -41022 -43974 -38295 -43980 -44333 -48142 -45637 -44365 -43736 -42536 -36750 -27122 -26045 -22908 -22755
6960 -22755 -23252 -31858 -33062 -26827 -24457 -18377 -15920 -10229 -10356 -11403 -11120 -16228 -20215 -25980 -30400
6945 -30400 -31291 -37494 -37090 -34683 -35802 -40125 -28863 -36479 -40832 -35016 -33122 -36428 -31003 -31536 -26052
6930 -26052 -28328 -28225 -24626 -23864 -26767 -25755 -23173 -19111 -20205 -23005 -23672 -34683 -30333 -29804 -28479
6915 -28479 -26808 -28084 -23169 -29132 -29651 -30751 -35783 -35989 -29931 -34087 -39845 -39074 -42908 -29369 -27075
6900 -27075 -35940 -34510 -30934 -31029 -29376 -33760 -38445 -32712 -38271 -30395 -26837 -30745 -32141 -36026 -28963
6885 -28963 -23733 -31730 -28776 -21774 -26265 -21330 -18467 -20561 -22423 -19778 -13970 -16651 -23048 -22367 -27081
6870 -27081 -27618 -27532 -29604 -27560 -32799 -34927 -36603 -38611 -32004 -39370 -37234 -32717 -28866 -25310 -23751
6855 -23751 -26402 -26527 -17992 -20406 -11902 -11408 287 1255 1713 1059 740 5487 6924 11163 15820 16710
6839 16710 15661 18106 28074 30429 27004 25150 41938 44916 47669 59299 65426 70210 77026 87406
6825 87406 93512 88543 90629 89370 84923 74800 70107 69211 66160 64425 65478 81466 83249 84132 98943
6810 98943 109409 112723 124547 134215 145242 167350 189243 219792 242436 238520 229716 213804 196063
6797 196063 185531 181100 180656 186477 190435 190134 188421 173562 153962 145274 140409 136397 132359 123934
6783 123934 117878 108188 105030 102942 100008 106317 117336 119952 129402 140997 174995 210086 231201
6770 231201 242485 235428 222314 204752 187041 172154 148534 125891 111426 106258 95824 83998
6758 83998 75607 64920 65240 61063 62167 67140 71647 73969 72600 62383 57031 46519 41261 41876
6744 41876 42260 41583 37108 31588 33026 34814 30758 31760 29146 27108 29983 29126 30359 25847 27193
6729 27193 40164 49864 49517 41298 26807 17990 13345 15334 10768 11759 2796 2267 4008 6262 10718
6714 10718 9614 8072 7025 9427 5074 2218 6080 2629 -1541 -838 6900 5427 2604 2960 5905
6699 5905 431 -8338 -1771 2454 -3508 -5687 -6575 -3063 -2452 240 1742 1985 100 1422 8335 10602
6683 10602 6364 8676 7863 8497 11982 8188 12043 10186 7206 17205 16939 14265 14559 9946 12225 16949
6667 16949 15091 14799 14095 9073 7804 8863 3998 13124 12803 16771 25142 29935 32617 27775 21122
6652 21122 21161 14659 18100 13916 12098 15224 16756 23177 27874 27930 30376 31606 30589 30212 25436 24576
6636 24576 24549 19894 27128 24115 24454 29555 33676 27849 26315 30556 31746 37224 31663 34582 37134
6621 37134 35999 36095 35404 37274 35733 39380 37791 40981 42453 42832 45312 61944 83269 96479 115483
6606 115483 109723 113386 122148 137097 167981 171260 159910 136585 134691 133526 146241 154063 144746
6593 144746 150964 153202 154814 158567 138607 123440 114701 103163 106914 109479 104930 102356 95878 96965
6579 96965 97088 101927 111540 114084 125187 137797 150686 175035 186746 193883 195567 191648 176116
6566 176116 167712 152356 142256 127957 118651 120876 107498 103378 106238 106503 108372 107773 116221 118517
6552 118517 121316 139859 167753 181482 188421 187901 168327 148169 141036 133613 126916 111326 114265
6539 114265 112719 114106 109511 116970 118674 115580 128420 136654 141904 133891 137449 143473 137505 135533
6525 135533 139551 147139 146395 150943 161246 165116 160982 166989 177896 172076 178530 176011 188934 192351
6511 192351 200309 217111 225025 230499 238610 254522 278451 290980 307450 331852 350517 363162
6499 363162 378120 383157 391360 396147 410495 430558 442270 445126 446291 450816 470926 496221 530604
6486 530604 571884 625766 669002 706329 728147 727048 715714 689911 662134 641368 628902 626391
6474 626391 644487 674938 719952 773528 819226 857728 857618 834721 821911 825488 841989 861371
6462 861371 868628 853245 814489 763686 732622 692315 672619 656781 630726 618556 601425 590670
6450 590670 589179 594411 614277 662658 736051 798127 836214 803679 751845 690903 640513 592764
6438 592764 551813 526444 504829 495171 488006 481539 481592 482382 495163 503246 513368 533808 553729
6425 553729 579190 624300 684099 757567 831472 873734 880196 851312 810497 785939 765443 753729
6413 753729 747221 751542 765228 785008 811965 859508 917106 977515 1045073 1102611 1139650 1154066
6401 1154066 1148711 1127006 1104973 1098890 1110303 1125324 1144948 1168937 1213870 1285174 1376854 1494335
6389 1494335 1601299 1663357 1681872 1652780 1593315 1521780 1460960 1415671 1387812 1386606 1405326
6378 1405326 1446866 1519410 1623671 1759308 1913692 2058102 2150205 2162952 2097733 2004677 1904497
6367 1904497 1811405 1735766 1687199 1679014 1689325 1733331 1828681 1953583 2116631 2258085 2337918
6356 2337918 2346738 2287071 2198151 2102927 2013555 1947262 1906228 1892209 1906970 1915398 1930322 1965861
6344 1965861 2014685 2097224 2199491 2296497 2361629 2381297 2357026 2319321 2286770 2252042 2240330
6333 2240330 2236235 2243042 2269701 2312265 2389073 2488842 2605175 2745098 2902811 3078047 3274955
6322 3274955 3477367 3719431 3992930 4327298 4786175 5443392 6513255 8433292 11631995
6313 11631995 15562349 18716193 19488534 17471366 14423892 11745426 9791842 8427142
6305 8427142 7484045 6896455 6606500 6582257 6840010 7491758 8605026 9962010 11403161
6296 11403161 12972020 15208165 18327747 22067260 25165524 26847146 26805686 25142105
6288 25142105 23112400 21291368 19380019 16935593 14813029 13252649 11904827 10396222
6280 10396222 9088239 8214219 7730571 7576915 7685035 8057564 8748443 9976418 12244159
6271 12244159 15861627 19884778 22537106 22148715 18891500 15025680 11868543 9571517
6263 9571517 7911494 6710086 5869739 5294240 4903864 4644170 4500557 4473724 4531287 4573079
6253 4573079 4505591 4341879 4147838 4016194 3959778 3933583 3903984 3829153 3724795 3631810 3584637
6242 3584637 3581694 3629097 3707521 3804942 3902623 4004569 4133297 4293563 4529556 4873000 5372125
6231 5372125 6051373 6883500 7664431 8132848 8140829 7749420 7194874 6686126 6313311 6096110
6221 6096110 6025337 6097184 6323342 6765975 7473980 8449612 9523428 10482478 11150366 11575293
6211 11575293 11945094 12375161 12744178 12820376 12448922 11887462 11509423 11458984 11625921 11732475
6201 11732475 11575922 11189153 10762925 10550879 10786052 11627541 13194334 15273185 17181323
6192 17181323 18070120 17519267 15884020 13958678 12389452 11457053 11053130 10977823 10880018
6183 10880018 10657901 10392217 9943053 9269234 8540350 7912072 7502931 7362082 7534348
6174 7534348 8040725 8783424 9510435 9835064 9542938 8706800 7634468 6579133 5628423
6165 5628423 4816975 4160926 3634283 3228224 2918086 2683902 2499615 2351220 2237183 2156471
6155 2156471 2082142 2031201 2006917 2005685 2053899 2168101 2364895 2619126 2802585 2816000 2624093
6144 2624093 2326761 2053291 1826870 1655586 1526534 1416243 1329500 1261299 1207086 1176821
6134 1176821 1155555 1136625 1135675 1145834 1174327 1238818 1309974 1374171 1400323 1346025 1249816 1133292
6122 1133292 1022243 933735 863796 804399 758749 727978 702462 671865 655249 637395 625477
6111 625477 608791 596077 583577 572057 555790 549744 538201 518707 501433 478307 455654 443301
6099 443301 429377 422496 412868 407359 408503 405634 396220 389910 385972 392804 396382 400435 407408 403219
6085 403219 393248 386068 375116 360866 340510 330277 313721 294581 285051 281158 272697 270099 263354
6072 263354 258668 250993 242267 239066 243131 244972 247056 256089 259976 251905 243280 242258 227266 219753
6058 219753 222526 216914 209959 204568 207023 206532 194909 186036 182650 174537 172834 173228 171980 169508 162251
6043 162251 163753 166197 166880 165516 165272 166271 171546 176415 180511 183122 194584 200777 217885 227597 232073
6028 232073 229764 215325 207222 196447 183803 180014 169088 171828 175228 176965 179668 180486 184920 199280
6014 199280 209090 230546 245305 268230 294908 309679 302853 292673 285632 267778 265636 258148 251591
6001 251591 239221 232808 229349 221412 218287 213489 215002 220085 231884 245787 256859 264418 293058
5988 293058 321860 343105 353631 356496 351604 336316 322095 320571 318570 315046 322945 343960 373802
5975 373802 402532 429004 452641 471409 506933 566483 662753 887160 1227091 1518031 1693539
5964 1693539 1543304 1386787 1446296 1899808 2472022 2899435 2831002 2318304 2022573 2265762
5954 2265762 2995873 3675231 4051578 3346833 2543057 2156190 2307143 2690099 2949801 2766548
5944 2766548 2118051 1626412 1452815 1539771 1646872 1685672 1409662 1099823 879240 736856
5934 736856 631350 547776 487247 438748 409276 387870 365543 355081 352011 343797 341221 339101
5922 339101 333745 333864 337955 337978 335909 336608 339751 350230 365915 365324 361583 349664 326682 308319
5908 308319 290040 268462 256163 238459 222573 215352 212050 212177 203945 201690 206131 205878 212809 218790
5894 218790 228857 233287 224594 212997 206060 197295 181844 172073 163755 154640 137989 136877 132241
5881 132241 118824 120974 113717 113552 109342 106709 103629 104216 105818 106952 104892 102477 103567 105512 106156
5866 106156 104157 107202 103325 103509 102594 100642 100150 93130 100401 97948 100120 100005 98887 99184 98178 97861
5850 97861 102667 107994 109599 120500 136441 142303 152941 154658 147922 141284 130746 125571 124717 115922
5836 115922 112145 113399 111437 119674 116106 121130 117101 115412 121921 123596 125026 126408 136612 141230
5822 141230 136910 141587 145593 142583 144558 144749 147575 145001 144173 150241 159144 159056 166816 168367 176522
5807 176522 178850 177529 185647 178724 177056 178112 180692 187424 196565 203786 211727 221484 220094 225411
5793 225411 223944 227247 216272 221009 221291 222864 230589 237831 245200 251592 260543 265806 269340 271613
5779 271613 276985 276047 273508 280538 282543 285070 281178 286741 294868 299474 305823 306234 307826 308359 311517
5764 311517 321466 320286 327103 335116 337766 341219 348861 354531 361097 365115 365966 378219 383457 392637
5750 392637 410748 422061 426816 433346 430487 438432 443555 448002 466711 482562 497033 501665 502065
5737 502065 508537 509900 512682 524676 535109 534544 535261 553720 568635 582763 601624 619665 632274
5724 632274 645612 664211 689531 709529 722864 737711 755517 776463 782900 801406 810788 811877
5712 811877 813388 812825 817874 825143 832699 850484 873264 894306 917718 954765 978706 1008690 1037360
5699 1037360 1063086 1097540 1129794 1169630 1214775 1249382 1284147 1319186 1350894 1385995 1431054
5688 1431054 1481145 1553411 1623969 1714742 1813498 1915693 2034929 2170065 2314325 2478172
5678 2478172 2662226 2882655 3153584 3470694 3873653 4388552 5051757 5997087 7507918
5669 7507918 10156388 14173200 18464384 21212317 20849541 17840330 14377292 11636170
5661 11636170 9718163 8400189 7510705 6959096 6717483 6807212 7349029 8360918 9609916
5652 9609916 10879312 12116454 13726906 15716967 17843806 19864476 22242925 24845991
5644 24845991 26644117 26366236 24252599 21349952 18152951 15523227 13554012 11842066
5636 11842066 10050758 8502270 7408940 6723547 6342171 6203383 6291799 6606505 7273866
5627 7273866 8570311 10941591 14368019 17623846 19162335 17853491 14641032 11406157
5619 11406157 8906305 7107013 5775434 4794678 4047607 3493896 3088235 2805331 2593019
5610 2593019 2422214 2297650 2188424 2099345 2016545 1947196 1876953 1818306 1765998 1720511 1689414
5599 1689414 1644646 1608194 1580556 1546065 1515067 1482904 1450289 1423918 1401252 1374851 1359474
5588 1359474 1339015 1332354 1329809 1323921 1326509 1335944 1343321 1352318 1361449 1380855 1403893 1438306 1498881
5575 1498881 1582308 1694131 1861919 2063962 2257953 2378423 2377507 2273866 2106548 1938487
5565 1938487 1795108 1682119 1598426 1534018 1512282 1499333 1495561 1510238 1536033 1581483 1666435
5554 1666435 1788542 1977239 2238543 2541847 2816433 2955076 2934403 2830277 2752997 2741751
5544 2741751 2729499 2666693 2527820 2339543 2148177 2001416 1891376 1819601 1786628 1772094
5534 1772094 1782821 1821404 1877193 1969049 2076046 2203402 2335301 2498320 2710320 2973198
5524 2973198 3268028 3549944 3801814 4053023 4382088 4828387 5367756 5816019 5988084 5836536
5514 5836536 5419468 4899921 4404732 4000380 3700878 3496628 3365259 3300332 3289130 3312285
5504 3312285 3383727 3517502 3727944 4055117 4544586 5240906 6114796 7036460 7775689 8145911
5494 8145911 8181107 8097134 8080179 8106116 8042513 7776927 7329226 6807159 6357019 6063683
5484 6063683 5984478 6163268 6530987 6983104 7402578 7754623 8084997 8392617 8552014 8517509
5474 8517509 8353842 8216360 8209818 8317862 8422080 8386719 8132927 7718890 7277784 6934198
5464 6934198 6779362 6866477 7283389 8064275 9189569 10494021 11736673 12638499 12934581
5455 12934581 12502398 11434786 10006848 8581653 7368196 6399775 5655537 5100369 4692862
5446 4692862 4416833 4244918 4154842 4151711 4250780 4459855 4840221 5424738 6196926 6977809
5436 6977809 7513732 7608920 7290371 6748548 6123620 5512107 4935814 4426051 4028978 3762776
5426 3762776 3622656 3611947 3659420 3681554 3627568 3478234 3315005 3184604 3142184 3177365 3230693
5415 3230693 3252442 3177032 3026574 2848512 2696157 2578526 2525226 2532373 2609863 2798303 3108235
5404 3108235 3504990 3875823 4075346 3999188 3695970 3319985 2970517 2716579 2524555 2391474
5394 2391474 2326383 2292102 2288958 2310745 2359933 2428859 2544217 2712540 2948462 3277765 3709235
5383 3709235 4257076 4893380 5533634 6104354 6452953 6485703 6196179 5702314 5148597 4654779
5373 4654779 4266571 3982724 3819196 3734175 3745930 3845717 4065763 4420950 4913770 5490015
5363 5490015 6021735 6405069 6558235 6573090 6568381 6640155 6767139 6802052 6616696 6162327
5353 6162327 5534618 4852532 4223772 3682798 3249120 2892195 2595674 2349694 2152389 2009598
5343 2009598 1888045 1799465 1738438 1700325 1671523 1659499 1657359 1662379 1691918 1739762 1813753 1915637
5331 1915637 2060765 2265726 2538008 2906877 3359685 3855611 4285528 4492887 4400099 4046523
5321 4046523 3551836 3048657 2597308 2224020 1923427 1683948 1501225 1364142 1257240 1177116
5311 1177116 1113616 1065303 1050271 1049614 1084416 1162932 1273638 1392477 1493595 1508792 1423775
5300 1423775 1294604 1139866 1008027 888282 789506 727830 668266 619592 590487 561957 534691
5289 534691 521671 506426 501070 491841 487887 489003 489462 497457 515239 533768 558820 584947 630977
5276 630977 699872 803066 957728 1143526 1305684 1387623 1349600 1210516 1035739 867499
5266 867499 724248 615424 531526 471147 423307 385817 357658 329080 306638 279482 264749
5255 264749 246958 234118 224489 217346 203167 190147 190000 178418 171924 168937 169104 169245 170997 163935
5241 163935 154298 144033 131346 133686 130198 125825 125103 126733 132779 142728 155353 165459 167880 162312
5227 162312 156220 132193 117234 109942 98739 95382 86896 83480 80362 74195 74318 73268 72569 68226
5213 68226 65776 64900 62635 56478 59537 61087 57709 60932 54481 50312 49639 48480 46459 42366 37164
5198 37164 41893 48161 52634 56378 59872 55381 48363 45906 44248 37182 28184 26475 22975 16387 13887
5183 13887 12157 9671 10266 2759 2388 7002 8320 3630 14239 12548 12826 20443 11836 13240 5763
5168 5763 3384 4575 -331 -5192 -5449 -9931 -11286 -11280 -8490 -13645 -16887 -16604 -23317 -24526 -20749 -20488
5152 -20488 -16693 -21006 -24332 -24402 -22215 -25904 -28645 -29419 -35029 -28223 -24964 -22174 -18942 -20880 -24156
5137 -24156 -22626 -23516 -25951 -26190 -28206 -31718 -29721 -27988 -31850 -30857 -38101 -38789 -26979 -33451 -32405
5122 -32405 -31788 -31628 -21925 -26198 -24667 -18218 -22222 -26086 -24477 -27293 -27197 -31721 -36111 -33653 -39101 -39356
5106 -39356 -34301 -26256 -33662 -27667 -24823 -23830 -26543 -22462 -24252 -23844 -27241 -27473 -23975 -26275 -33403
5091 -33403 -29135 -27548 -36941 -34983 -36504 -39784 -39044 -38989 -42909 -43868 -42734 -50334 -45620 -52639 -52133 -43418
5075 -43418 -51991 -51339 -46505 -46632 -44410 -46057 -44853 -42474 -45814 -48619 -42506 -41350 -38643 -43287 -34920
5060 -34920 -36743 -37118 -38499 -39834 -40977 -46890 -44088 -47601 -48140 -49182 -43435 -40394 -44127 -44008 -46851
5045 -46851 -48747 -49561 -48254 -49590 -45356 -50302 -42812 -43079 -46477 -52152 -51813 -51135 -54269 -50418 -47116 -52312
5029 -52312 -47757 -54161 -42757 -43132 -46612 -43898 -43894 -46324 -43958 -47179 -52639 -47824 -54210 -52692 -52494 -54869
5013 -54869 -51240 -52427 -55077 -49236 -49393 -50445 -54861 -54963 -48435 -52554 -55999 -53885 -56529 -57915 -53889
4998 -53889 -60920 -59243 -59793 -57543 -53175 -53919 -54118 -59834 -59614 -57128 -58643 -55968 -60229 -60175 -58829 -60101
4982 -60101 -65246 -60115 -59100 -59530 -57127 -61929 -58736 -58183 -61518 -59484 -57169 -61264 -67087 -61414 -56443
4967 -56443 -60704 -62971 -60870 -62624 -61905 -65757 -59620 -59652 -61875 -62959 -61019 -59621 -60303 -61981 -57168 -57695
4951 -57695 -60198 -58069 -54518 -56850 -64755 -58654 -61733 -59591 -60366 -57965 -37715 -30935 -21712 -27197 -37162
4936 -37162 -47556 -51273 -53203 -60271 -56800 -60437 -49468 -58716 -56985 -57357 -60613 -53704 -60218 -59137
4922 -59137 -66159 -68529 -64628 -55139 -63801 -60810 -59084 -57816 -56866 -58884 -61344 -61213 -66106 -64734 -61664
4907 -61664 -57393 -60379 -61519 -55068 -55999 -58683 -56160 -59817 -57874 -59316 -60171 -52650 -59491 -57654 -54682
4892 -54682 -58626 -53492 -57547 -58870 -56250 -58633 -57683 -53235 -54646 -55772 -58416 -56256 -54285 -56302 -59493
4877 -59493 -60102 -58905 -60589 -61973 -62363 -61445 -63264 -60356 -61839 -57057 -57434 -63930 -58014 -59873 -65255 -55230
4861 -55230 -65658 -64453 -53945 -60271 -58160 -60216 -57225 -57134 -58773 -62370 -58416 -56463 -61817 -62047 -56144
4846 -56144 -58523 -56776 -51795 -55003 -54658 -54295 -56004 -45801 -37595 -27310 -20350 -26417 -39477 -45073
4832 -45073 -41741 -47321 -54981 -55157 -51166 -56573 -53456 -56715 -52793 -51324 -55836 -53614 -54328 -51744 -55736
4817 -55736 -55228 -54663 -53725 -60088 -59684 -57863 -55144 -56416 -58697 -59420 -58764 -54678 -55630 -56810 -56047 -58711 -60365
4800 -60365 -56597 -59013 -56671 -56374 -59489 -56012 -56114 -57612 -55826 -56202 -56793 -54479 -52968 -55161 -52029 -54044
4784 -54044 -55557 -57009 -58876 -60195 -50786 -60048 -56055 -50234 -58477 -55100 -54936 -55573 -59125 -59466 -60527
4769 -60527 -54343 -58212 -57085 -52637 -60371 -57082 -58522 -52688 -55488 -60137 -56673 -58715 -57528 -51888 -52986
4754 -52986 -53920 -52116 -59787 -54172 -56609 -58227 -52537 -52554 -55983 -56424 -54917 -59281 -55941 -57899 -55933 -56016
4738 -56016 -56737 -57882 -59535 -55551 -55770 -49036 -54607 -57700 -54455 -52992 -55122 -56074 -55214 -60065 -64180 -63237
4722 -63237 -58597 -57639 -56835 -53403 -54716 -59880 -54316 -54030 -55774 -53342 -53629 -57597 -57809 -53399 -53097 -51512
4706 -51512 -53341 -54839 -51861 -56245 -57534 -55369 -59112 -58544 -51643 -50891 -52452 -56052 -54130 -49267 -50652
4691 -50652 -53452 -52858 -55669 -56604 -52204 -53619 -60803 -56660 -59214 -54989 -54357 -53227 -47975 -55994 -55212 -48462
4675 -48462 -48838 -50920 -54784 -53048 -49465 -51567 -56253 -49627 -50042 -53379 -50071 -50307 -53184 -54047 -52561 -56278
4659 -56278 -55202 -57052 -45093 -44308 -49192 -46263 -48994 -48134 -55316 -51663 -46888 -52402 -53738 -43079 -45727
4644 -45727 -43556 -49537 -47251 -42267 -52961 -54777 -51633 -50512 -48192 -48004 -46357 -49025 -49357 -46005 -48760
4629 -48760 -46156 -46627 -51724 -46595 -44561 -42997 -41407 -47948 -44697 -42277 -39780 -41219 -43246 -47631 -43448
4614 -43448 -43635 -45110 -45398 -46357 -41236 -45056 -39634 -39800 -45874 -47182 -41252 -41640 -41137 -38265 -41979 -37791
4598 -37791 -40270 -38434 -38344 -37828 -44384 -41879 -41629 -41314 -32706 -34613 -34364 -36609 -34884 -35571 -34527 -38942
4582 -38942 -42086 -43153 -41247 -34943 -41828 -40936 -37064 -38676 -36014 -38231 -36489 -39458 -39451 -40492 -35365 -34245
4566 -34245 -36779 -40553 -33423 -38746 -36801 -31823 -39058 -37562 -43136 -45239 -41205 -43231 -41585 -35085 -43890
4551 -43890 -46474 -36230 -43521 -38812 -36057 -39963 -36925 -38486 -39224 -33616 -38883 -42540 -40429 -39921 -41590
4536 -41590 -37299 -42501 -33228 -39049 -42987 -40325 -42263 -39026 -40730 -39716 -35176 -41388 -42584 -39552 -40453
4521 -40453 -39255 -41173 -43673 -43419 -42920 -47265 -45684 -44207 -44166 -42603 -37612 -39914 -41435 -43273 -39266 -38391
4505 -38391 -35406 -32595 -33858 -28655 -31982 -34361 -36008 -35525 -35906 -36204 -42793 -38352 -39612 -40070 -39312 -42279
4489 -42279 -40548 -40085 -40821 -44760 -41607 -45086 -40691 -42121 -38842 -36232 -34022 -32300 -27718 -28725 -32803
4474 -32803 -36691 -31412 -34341 -38399 -40645 -43298 -43093 -42137 -44389 -37764 -42444 -42888 -34013 -37011 -39810
4459 -39810 -42609 -39228 -37268 -31805 -36296 -35557 -31175 -36270 -37811 -34730 -33921 -42776 -39592 -36714 -39269
4444 -39269 -39373 -43893 -32705 -30656 -40588 -36734 -36961 -36324 -34106 -35273 -32611 -30087 -33684 -28237 -26392
4429 -26392 -33806 -30820 -29119 -31672 -33641 -30322 -28184 -26017 -26203 -24292 -23355 -21073 -18981 -14975 -14622
4414 -14622 -14584 -14464 -7142 -3239 -2212 -4902 -3379 -7197 -7008 -7300 -12899 -16021 -14138 -12824 -12664 -12007
4398 -12007 -5646 -8185 -15102 -11965 -8875 -10133 -12897 -7371 1780 -1878 -1340 7898 11020 13258 20422
4383 20422 23507 23162 21909 20976 24928 24822 17165 23720 25442 19807 20620 25511 26019 31073 31246 33827
4367 33827 38020 39251 34309 43941 47856 48870 57255 56498 61909 63231 63429 65796 73674 74380 79758
4352 79758 84355 98290 105886 112051 121568 126574 130165 137229 139515 131316 122469 106084 91749 78239
4338 78239 66592 55397 44853 36682 36814 38378 36638 28384 27475 27376 19927 26419 29212 26261 33896
4323 33896 34465 34415 25262 21759 23794 16331 13795 7655 10809 13757 14080 12886 14958 8470 5063 11475
4307 11475 14293 15769 17275 23376 28373 32606 24281 29328 20676 22635 16349 16917 16489 20253 23819
4292 23819 19442 20591 14408 20217 19639 23389 29523 26878 25229 27221 30791 33704 34265 38150 43222
4277 43222 49141 54220 57436 67594 78109 77505 92428 93505 104760 120540 137512 164458 181708
4264 181708 205657 224596 255549 295850 357757 513620 961252 1639619 2178628 2396495 1812197
4253 1812197 1232982 854006 617381 470300 360976 295461 258688 233432 216181 210648 209991
4242 209991 217706 239804 250992 267153 288214 327532 373594 464155 765966 1382104 1989331
4231 1989331 2376172 2012629 1381330 933065 645846 470473 349138 254899 208357 171872
4221 171872 142903 121789 106038 93822 85675 74192 68106 62301 61163 56523 54603 59478 58005
4208 58005 61514 62508 51834 41265 37084 29567 23324 19858 12355 13705 13803 9749 13209 6036 163
4193 163 3715 7046 3062 -451 -5402 -2744 -3896 -7380 -7651 -8543 -12300 -7839 -4724 -3140 -4536 -9658
4177 -9658 -9519 -8316 -15325 -14975 -18090 -22678 -21612 -20219 -19988 -18241 -18561 -19438 -21037 -27238 -27720 -29079
4161 -29079 -25000 -26536 -26002 -27306 -27141 -29709 -34555 -38087 -35949 -31323 -37390 -30202 -29987 -31765 -35439
4146 -35439 -33477 -32533 -35789 -40183 -35663 -31916 -30780 -36485 -33847 -30835 -38578 -39742 -30811 -35315 -35021
4131 -35021 -33056 -33230 -27461 -31123 -36172 -30107 -32951 -38830 -38125 -33518 -36942 -33938 -30954 -36177 -38071
4116 -38071 -42885 -34584 -35749 -32798 -33205 -34342 -35922 -33843 -34975 -34414 -33840 -36639 -27302 -32935 -31308
4101 -31308 -26496 -29379 -27401 -23372 -25461 -31831 -29676 -29024 -25024 -28035 -33408 -34340 -28458 -30717 -35145
4086 -35145 -28432 -26769 -25684 -27503 -26594 -21742 -27902 -31442 -27488 -19639 -26590 -24224 -16526 -18724 -18910
4071 -18910 -18377 -12399 -10073 -14580 -19531 -15150 -13453 -10283 -7637 -7304 -13954 -15207 -15115 -8897 -12126 -8961
4055 -8961 -13896 -12731 -9816 -9656 -7368 -10358 -4264 -8892 -4270 -7908 -5955 -4721 2948 -4805 -621
4040 -621 7005 690 12108 15946 11923 15407 8703 3696 3695 -593 428 224 3067 -2389 -3505 -4017
4024 -4017 -8535 -771 480 -7691 -4915 -7375 -8894 -11985 -4806 -4778 -4136 -4046 -2618 -708 -3133 -3984
4008 -3984 -3714 -1117 -5697 -5147 -5337 -5304 -11041 -13839 -16343 -22663 -16602 -16177 -22726 -23426 -19717 -21526 -20542
3991 -20542 -26220 -28519 -28171 -31860 -31405 -29168 -29408 -33056 -27907 -20994 -26902 -25324 -30884 -33354 -35320
3976 -35320 -36670 -37984 -37231 -40793 -43024 -42105 -45074 -43852 -49088 -46531 -39702 -45347 -43278 -45957 -45564
3961 -45564 -39581 -47330 -48670 -43782 -48024 -46810 -43465 -44520 -47445 -50450 -48109 -47457 -47707 -49849 -53790
3946 -53790 -45440 -48511 -49746 -46671 -51100 -51019 -55959 -50869 -50814 -49383 -52803 -52330 -50864 -56702 -54721 -51899
3930 -51899 -54791 -54414 -51397 -48770 -48384 -49831 -52161 -52721 -50021 -55010 -57923 -55654 -53521 -55097 -52094
3915 -52094 -57889 -55859 -59552 -62795 -54014 -50287 -55843 -55925 -56765 -53173 -52122 -56645 -58415 -59954 -54475
3900 -54475 -54336 -57058 -52448 -57655 -58756 -56509 -60839 -63112 -63199 -58805 -54644 -56741 -60890 -61393 -56869 -54346
3884 -54346 -51840 -55097 -56182 -60136 -55967 -49141 -56821 -55088 -57754 -57612 -57719 -58125 -56156 -57292 -56647 -55949
3868 -55949 -54986 -58218 -65253 -61587 -53322 -59296 -58579 -55994 -60908 -52611 -50059 -51051 -58741 -62780 -64018
3853 -64018 -58402 -61961 -52635 -53822 -54260 -53732 -55374 -52288 -55452 -67138 -64129 -59223 -57246 -58401 -55904
3838 -55904 -58735 -57230 -56702 -53587 -54403 -64650 -59372 -60286 -57975 -53196 -54836 -57590 -52478 -60202 -58850
3823 -58850 -57517 -63885 -60077 -58953 -58831 -56969 -56288 -52032 -52156 -52526 -58129 -60408 -59524 -52488 -54535 -55434
3807 -55434 -57650 -61084 -58023 -56247 -57445 -56743 -60034 -65244 -58537 -52896 -52335 -53801 -62953 -56436 -59641
3792 -59641 -56791 -55405 -56915 -59062 -55952 -54610 -55369 -57537 -57546 -53261 -60109 -58998 -62695 -57998 -54569 -57302
3776 -57302 -53624 -57586 -58158 -60386 -63341 -60072 -61869 -58231 -57599 -55413 -51633 -55276 -57627 -55419 -55090
3761 -55090 -52139 -55053 -61618 -59475 -58991 -56377 -54590 -54849 -57500 -58965 -59358 -57306 -56998 -60626 -57780 -57708
3745 -57708 -59261 -56863 -59163 -56585 -58781 -58038 -53559 -54010 -57991 -55284 -56762 -59616 -61406 -63496 -60542
3730 -60542 -55614 -60872 -52924 -57207 -62282 -60902 -57290 -59664 -62051 -57399 -62676 -55203 -59127 -53690 -55685
3715 -55685 -54154 -54391 -60279 -53265 -56133 -59172 -61826 -55850 -57719 -56831 -55771 -60427 -57736 -56399 -61579
3700 -61579 -59655 -58815 -61369 -54057 -58699 -57028 -58853 -61739 -56023 -62200 -57732 -54425 -59318 -58118 -60199
3685 -60199 -57105 -52906 -56045 -53689 -54453 -56016 -59628 -57098 -55875 -56261 -57477 -61198 -61272 -56555 -58269 -56750
3669 -56750 -58044 -55211 -60356 -59107 -59063 -59596 -59119 -55325 -61255 -59758 -57193 -58758 -54044 -52940 -54226 -62723
3653 -62723 -60807 -62503 -58246 -56393 -61342 -57316 -57434 -58521 -55167 -55391 -52457 -61114 -57930 -59536 -57894
3638 -57894 -58208 -57702 -55823 -50500 -54221 -55933 -56641 -57818 -54497 -60720 -62622 -57774 -56093 -58588 -56746
3623 -56746 -56850 -60075 -61839 -64067 -58115 -54569 -57538 -59308 -56182 -58765 -56156 -57531 -56602 -60686 -57646
3608 -57646 -53675 -56829 -54817 -56285 -53548 -51434 -61938 -53377 -54662 -61314 -62590 -60033 -55470 -57090
3594 -57090 -54830 -57338 -57903 -54212 -53769 -58673 -55613 -58698 -52245 -55394 -63293 -54814 -60484 -60547 -55792 -59838
3578 -59838 -55518 -57600 -58343 -51320 -59508 -62172 -51499 -63992 -59867 -53217 -63103 -59315 -65250 -58646
3564 -58646 -55245 -57861 -59369 -58572 -59291 -55298 -56523 -59712 -55249 -60758 -53907 -56096 -55783 -48877 -53707
3549 -53707 -57817 -58343 -57423 -60408 -62176 -58115 -54052 -54735 -60142 -58814 -52663 -55725 -51087 -52085 -55792 -57289
3533 -57289 -59120 -56680 -54279 -57833 -52741 -58060 -58787 -55897 -64104 -58737 -55368 -54147 -47417 -52184 -51863
3518 -51863 -49936 -51490 -52403 -37853 -45317 -49093 -49018 -57141 -47502 -54783 -53974 -55849 -49977 -52789 -52181 -43702
3502 -43702 -49501 -51371 -55683 -54058 -49730 -49169 -46597 -51762 -55272 -53452 -49563 -50195 -45936 -52640 -48144
3487 -48144 -52240 -57374 -55310 -51495 -56627 -55262 -50083 -55848 -57385 -54908 -56379 -56631 -55381 -64042 -49947
3472 -49947 -50120 -56601 -51196 -56818 -58173 -55001 -52475 -52596 -55314 -60356 -56420 -59145 -54682 -54505 -62206
3457 -62206 -53597 -53615 -57132 -57903 -57954 -59446 -57352 -59554 -61226 -56205 -56379 -51806 -54208 -48473 -56424 -54357
3441 -54357 -47196 -53240 -53344 -51055 -55174 -51954 -53613 -51848 -45392 -52854 -55637 -50695 -60056 -57412 -56047
3426 -56047 -47088 -48166 -49252 -47640 -40367 -33625 -28018 -28124 -35383 -43583 -44540 -44065 -54650 -50743 -46338
3411 -46338 -49411 -46581 -49011 -44559 -47929 -48056 -48514 -48533 -56601 -52710 -48927 -49917 -51476 -57407 -50595 -58955
3395 -58955 -55922 -54010 -49157 -57475 -52097 -51463 -54795 -55168 -52873 -51491 -52399 -59571 -56925 -56966 -55104 -60957
3379 -60957 -54629 -55989 -52733 -53664 -56113 -58346 -57058 -57611 -58857 -52481 -56176 -60566 -56867 -58540 -51206
3364 -51206 -56003 -51976 -56065 -57217 -54929 -58090 -59040 -55660 -55461 -56223 -56325 -58335 -56800 -51822 -52998 -55923
3348 -55923 -61067 -59370 -58318 -56451 -55930 -53419 -57524 -60910 -58080 -52327 -53919 -59738 -59363 -53124 -57834
3333 -57834 -59185 -55377 -57195 -54365 -54820 -54527 -53093 -62122 -58152 -56918 -58152 -57781 -56841 -56139 -59833 -58132
3317 -58132 -57502 -58106 -53770 -59671 -51494 -52484 -59672 -56254 -48613 -58784 -57877 -55934 -57465 -55621 -60559
3302 -60559 -60863 -56326 -52959 -58056 -55718 -57348 -58718 -52254 -58305 -55659 -59823 -56465 -56527 -54385 -53905 -61910
3286 -61910 -56700 -58467 -61377 -56813 -55396 -58027 -55530 -56915 -56616 -57298 -64034 -51151 -53906 -52703 -57065
3271 -57065 -60555 -53350 -54069 -58606 -54127 -55265 -60353 -55718 -52170 -51026 -56754 -55829 -54561 -56215 -56386
3256 -56386 -58487 -59125 -56428 -58782 -58976 -53095 -58576 -51971 -54129 -56625 -54856 -59839 -60345 -55954 -58305
3241 -58305 -57480 -56290 -61594 -55892 -55828 -62482 -56552 -56616 -52094 -62194 -58654 -58008 -58494 -58591 -55642 -58307 -59087
3224 -59087 -55468 -57785 -50576 -56921 -58885 -54293 -56978 -55047 -57616 -55980 -59019 -57360 -57083 -54355 -62940
3209 -62940 -58009 -55651 -57103 -57916 -60843 -56861 -56543 -56515 -51568 -56396 -60381 -58548 -53789 -59702 -53867 -58444
3193 -58444 -58516 -53106 -53890 -49495 -56108 -54248 -55075 -57271 -59903 -57575 -57816 -53243 -61079 -56468 -53577 -55685
3177 -55685 -57496 -52541 -58299 -60851 -57856 -60878 -59273 -52965 -55394 -54839 -58051 -57032 -50446 -54777 -61836
3162 -61836 -59987 -60587 -57756 -52980 -53885 -58687 -54334 -54809 -56799 -58814 -56026 -53077 -60658 -57072 -49502
3147 -49502 -53145 -57706 -54186 -58105 -59920 -56535 -60228 -52102 -62576 -59032 -48795 -51914 -53696 -52522
3133 -52522 -59918 -65796 -55430 -59421 -53847 -54181 -59733 -57518 -60289 -54052 -55431 -57422 -54214 -53687 -56800
3118 -56800 -58969 -54208 -51614 -53973 -59777 -56002 -56979 -59877 -57781 -55369 -51531 -62392 -59305 -50897 -55085
3103 -55085 -59849 -57386 -57188 -55139 -54296 -57460 -51385 -51366 -60088 -51197 -60865 -60238 -55639 -61775 -58334 -52641
3087 -52641 -58546 -58353 -56983 -59705 -51562 -56892 -54690 -55446 -57885 -59204 -59729 -53967 -51963 -58438 -56379
3072 -56379 -59447 -56928 -54194 -55768 -56672 -54021 -62230 -56303 -56037 -58730 -48736 -57847 -51909 -53877 -63955
3057 -63955 -53306 -53517 -56724 -57177 -58529 -56331 -52808 -59024 -57254 -53180 -54225 -54964 -58280 -53252 -58476
3042 -58476 -65883 -60055 -57153 -54649 -62854 -58820 -53467 -51856 -57607 -51985 -55619 -60397 -56079 -58028 -54539
3027 -54539 -55008 -54448 -51732 -52172 -56413 -52060 -53190 -59365 -61941 -60114 -50750 -61274 -51570 -49370 -58639
3012 -58639 -51378 -55552 -54913 -55805 -58083 -59046 -57661 -59702 -59396 -56770 -61781 -56957 -57308 -56158 -61926 -58280
2996 -58280 -57722 -54424 -53438 -57102 -49838 -60678 -56814 -52988 -57175 -52735 -53946 -56639 -53290 -57501 -58478
2981 -58478 -54165 -57244 -56538 -55127 -58715 -56945 -54274 -56099 -58199 -51630 -57136 -57543 -59159 -57978 -60441
2966 -60441 -55483 -52250 -59018 -55548 -54481 -54239 -47712 -57726 -57856 -55913 -63678 -55956 -57375 -61015 -56397
2951 -56397 -55590 -54312 -58334 -53244 -52245 -61106 -56801 -56093 -57937 -57267 -54798 -54235 -52286 -59152 -57161 -53748
2935 -53748 -50342 -57247 -54863 -51194 -61074 -58287 -60923 -56924 -55716 -61090 -57322 -55172 -55712 -52654 -54223
2920 -54223 -64973 -63459 -59905 -55935 -51501 -57052 -48748 -56296 -55433 -51181 -53453 -57202 -55957 -53931 -54125
2905 -54125 -52602 -53100 -55622 -64497 -62050 -58564 -57075 -59341 -63731 -51956 -52556 -57578 -50764 -56010 -53618
2890 -53618 -50936 -54792 -58224 -55633 -56747 -52640 -56751 -57694 -58228 -58405 -60883 -56824 -54962 -56487 -56840 -52374
2874 -52374 -52733 -56973 -53947 -54598 -56458 -57313 -56281 -58390 -52761 -54814 -55282 -52847 -59502 -57650 -52469 -50198
2858 -50198 -56859 -55362 -57545 -57988 -55301 -58859 -54607 -57394 -58806 -54284 -55602 -57252 -58859 -57082 -53218
2843 -53218 -55278 -62635 -56324 -56562 -57308 -54664 -52890 -55842 -56174 -52860 -56176 -60407 -61171 -58305 -58166 -53165
2827 -53165 -56945 -52797 -52797 -54678 -54510 -53146 -55486 -59648 -54636 -56652 -53251 -58871 -60929 -50467 -54069
2812 -54069 -59852 -55603 -62682 -58516 -55228 -55862 -57189 -55692 -52134 -57114 -54292 -56706 -54993 -56655 -54284
2797 -54284 -55778 -56078 -50708 -53123 -56707 -56121 -58075 -57299 -51080 -58336 -55273 -57423 -59945 -56566 -54731
2782 -54731 -52271 -57648 -55154 -56631 -52822 -51241 -59141 -55910 -56018 -58155 -57594 -54669 -53911 -55695 -54639
2767 -54639 -54814 -57305 -56111 -50851 -54367 -54726 -55527 -54192 -55631 -53534 -55374 -59293 -61532 -64423 -56262
2752 -56262 -52853 -53371 -54226 -57046 -51311 -55992 -58385 -53445 -55578 -59738 -56040 -56487 -52730 -55120 -58783
2737 -58783 -53895 -60604 -57444 -56465 -61094 -56828 -54664 -55103 -50015 -52423 -57709 -52943 -55053 -59450 -52847
2722 -52847 -59300 -60253 -53920 -61629 -58719 -57541 -58137 -54733 -58710 -52173 -53470 -55045 -53232 -55421 -55536
2707 -55536 -59327 -56661 -50684 -59454 -58528 -53395 -53466 -53507 -52059 -54439 -53235 -56721 -61574 -53218 -57200 -57527
2691 -57527 -51902 -60097 -57606 -55597 -52215 -51668 -55871 -60342 -58876 -60951 -58907 -52584 -60220 -60235 -56585
2676 -56585 -52386 -52045 -51637 -61856 -54788 -56460 -64005 -53828 -56290 -58398 -50550 -51223 -55448 -55472 -58803
2661 -58803 -52178 -52379 -58628 -57204 -60229 -57501 -54523 -50898 -55401 -59414 -59526 -64146 -50706 -52375 -59096
2646 -59096 -52161 -57397 -60417 -53492 -52361 -57595 -55827 -58147 -57587 -57300 -50547 -51243 -51220 -58873 -60156 -56276
2630 -56276 -58731 -53950 -59628 -53328 -59224 -51931 -55186 -59544 -58986 -59955 -50089 -60100 -54279 -50108 -52201
2615 -52201 -53525 -47953 -54690 -59880 -57973 -60157 -52572 -64179 -63922 -54972 -55698 -56507 -54109 -48717 -59861
2600 -59861 -52441 -56924 -52576 -59246 -59639 -57546 -59227 -52528 -52415 -51966 -56260 -53014 -56008 -59091 -56688
2585 -56688 -59953 -52975 -57878 -54965 -53623 -54338 -55720 -51436 -50444 -58497 -57670 -55547 -52986 -54298 -55603
2570 -55603 -58753 -56092 -60691 -57399 -52246 -51983 -53811 -56575 -58524 -55460 -52677 -50926 -53213 -63674 -62453
2555 -62453 -54424 -52885 -53837 -57520 -53724 -59904 -57139 -52784 -55566 -54776 -53219 -61039 -54809 -51844 -59400
2540 -59400 -55264 -57691 -54656 -54921 -55509 -56101 -55404 -54824 -58252 -55136 -57996 -58730 -59616 -55121 -51720 -54304
2524 -54304 -54763 -54816 -57807 -52539 -56019 -56575 -55193 -56069 -49256 -54359 -60301 -52601 -54379 -55506 -56767 -56941
2508 -56941 -54965 -57073 -55761 -53700 -56750 -57808 -53964 -53889 -58448 -51701 -58076 -54665 -54869 -64767 -55228
2493 -55228 -53153 -60212 -57729 -51274 -56401 -52210 -54811 -54965 -50343 -58408 -59719 -51703 -53137 -58418 -48497
2478 -48497 -51070 -56140 -53233 -62719 -57099 -54446 -56250 -55833 -56127 -54576 -52425 -53751 -56448 -58855 -58385
2463 -58385 -58638 -58895 -53061 -55812 -55500 -59735 -53730 -51771 -58620 -56045 -52589 -52988 -53472 -55145 -51700 -55618
2447 -55618 -57837 -56886 -50433 -59570 -58449 -53759 -58262 -55916 -53666 -58623 -56256 -62214 -56887 -51340 -54455
2432 -54455 -56555 -55186 -57432 -58562 -52701 -55374 -52235 -56608 -51903 -55805 -53725 -54744 -59628 -57767 -55171
2417 -55171 -49612 -54525 -58624 -57783 -50873 -51535 -50282 -56744 -55965 -53137 -57667 -52963 -55056 -54451 -57866 -58767
2401 -58767 -60340 -50763 -51539 -60137 -55301 -56379 -58560 -55925 -56904 -55276 -56259 -52807 -51311 -53960 -57671
2386 -57671 -58155 -53252 -56155 -55984 -54380 -58597 -55723 -54697 -54922 -48776 -60549 -63185 -57982 -55375 -53540
2371 -53540 -52596 -57600 -53966 -55922 -54851 -49021 -61372 -57754 -57068 -58128 -54337 -51077 -57740 -54399 -56415
2356 -56415 -58199 -50579 -61662 -59325 -52974 -52345 -49868 -62822 -59561 -62717 -57824 -54311 -54313 -53524 -51511
2341 -51511 -51552 -55358 -49310 -59998 -61616 -59677 -55929 -54728 -58236 -51015 -53716 -55048 -52521 -52821 -54130
2326 -54130 -55311 -58197 -54061 -52177 -61228 -55532 -49927 -56452 -52569 -55402 -55262 -55327 -55770 -51764 -53895 -59704
2310 -59704 -58043 -54723 -57181 -58006 -54477 -54361 -54000 -54523 -57563 -54198 -53250 -58340 -54838 -56137 -59533 -53621
2294 -53621 -53588 -56739 -58332 -55375 -51811 -54082 -55491 -53574 -54238 -65052 -54190 -55697 -58207 -58856 -58819 -49929
2278 -49929 -51761 -53900 -55022 -55573 -55848 -57080 -51197 -54700 -55986 -54943 -52654 -53044 -56309 -56417 -54523 -60196
2262 -60196 -64339 -54429 -55626 -51429 -53546 -57254 -59463 -56720 -54144 -56650 -59951 -55001 -53200 -57480 -51543
2247 -51543 -49473 -54377 -55968 -56446 -53617 -48946 -54176 -54904 -54029 -51512 -53437 -57857 -50236 -49553 -52864 -50431
2231 -50431 -50849 -58442 -56226 -56032 -56647 -57325 -59206 -56267 -55557 -56063 -51426 -52979 -57450 -60458 -50197 -50872
2215 -50872 -55274 -55250 -56693 -51813 -58881 -52733 -56324 -56855 -53369 -58243 -53726 -55774 -61016 -56790 -55793 -59763
2199 -59763 -53749 -53929 -56316 -54002 -58225 -52567 -51908 -58472 -52749 -58606 -51341 -54019 -53562 -54668 -55193 -57166
2183 -57166 -54250 -57595 -57697 -56772 -56759 -53147 -50222 -51430 -53896 -53946 -55042 -59576 -55638 -53359 -55993 -51660
2167 -51660 -53286 -50944 -58080 -56750 -58499 -54613 -55982 -57825 -54061 -53454 -56023 -56810 -53062 -53245 -55807
2152 -55807 -51026 -53866 -59296 -54798 -60286 -58737 -55596 -54728 -54077 -57015 -57933 -51078 -53871 -57153 -51210
2137 -51210 -57952 -54935 -55214 -55896 -53737 -52894 -57633 -48104 -50300 -58875 -54475 -53832 -56896 -60431 -57781 -55948
2121 -55948 -54852 -52409 -49910 -49134 -56209 -57974 -51103 -52072 -54596 -53530 -56354 -60378 -54885 -58307 -53532
2106 -53532 -58173 -51662 -54579 -55772 -50158 -53680 -57936 -56880 -53819 -56403 -53325 -50621 -56125 -55364 -52531
2091 -52531 -55477 -50362 -53596 -59598 -52779 -53808 -53926 -52404 -53773 -57535 -58386 -55426 -52941 -52392 -56213
2076 -56213 -58532 -53312 -58593 -59013 -56458 -56817 -51045 -56126 -53816 -49379 -53573 -57158 -55074 -50330 -57834
2061 -57834 -59184 -50050 -51492 -56584 -60886 -51158 -53079 -52504 -54831 -56579 -55953 -57228 -55206 -53180 -50928
2046 -50928 -57817 -58338 -57184 -57840 -54340 -51141 -52079 -52501 -52230 -51966 -50439 -53073 -51820 -49596 -56445 -55320
2030 -55320 -53081 -55243 -55670 -54714 -55705 -58042 -53596 -57883 -58747 -55683 -57208 -53420 -52860 -58354 -50747 -54888
2014 -54888 -54164 -48992 -56440 -63060 -55756 -51840 -54630 -54871 -55763 -54635 -55348 -54528 -54280 -55800 -57375 -56090
1998 -56090 -56606 -54375 -53880 -51685 -53383 -52107 -53111 -55599 -58842 -59281 -59293 -53218 -51671 -56942 -51155 -52701
1982 -52701 -52828 -51156 -53290 -61501 -54170 -57238 -57060 -54402 -59922 -52288 -58006 -54965 -49850 -54854 -60355
1967 -60355 -51832 -53256 -56158 -55100 -53773 -51093 -56678 -57508 -51354 -54882 -57648 -55779 -55855 -54517 -54925 -53191
1951 -53191 -54956 -56867 -57160 -54315 -56602 -48033 -52069 -55476 -51716 -57915 -50664 -55818 -60335 -53217 -53513
1936 -53513 -55025 -59855 -54077 -53960 -57360 -53207 -53433 -61496 -54832 -52480 -55706 -49315 -55710 -51418 -57894
1921 -57894 -52954 -50880 -51597 -53976 -58303 -59938 -54780 -53501 -56000 -49393 -58527 -55750 -54859 -60875 -56043
1906 -56043 -56931 -52733 -52502 -52953 -55301 -50978 -54206 -56903 -56234 -51469 -50796 -59422 -56510 -58724 -50769 -51914
1890 -51914 -58267 -54379 -56278 -59318 -55733 -46292 -53941 -56307 -60391 -59781 -50852 -55547 -55201 -57389 -55000
1875 -55000 -51530 -49549 -50346 -51585 -55823 -57207 -60226 -62269 -55365 -57408 -54980 -48219 -53842 -53452 -55120
1860 -55120 -55275 -58186 -56433 -58712 -63372 -56257 -54753 -54859 -50693 -53283 -55490 -54888 -54131 -63098 -52740
1845 -52740 -51464 -56656 -52268 -53637 -48092 -50622 -55796 -55820 -58692 -58411 -57802 -56441 -56008 -52511 -56747 -56090
1829 -56090 -52906 -57078 -55505 -56010 -53237 -49821 -55513 -56732 -54805 -55924 -51409 -48442 -57801 -56648 -59484
1814 -59484 -54095 -53894 -56182 -50810 -56445 -50188 -50764 -55215 -53456 -54033 -59086 -51626 -52733 -58198 -55604
1799 -55604 -56347 -54912 -54302 -52233 -56992 -53981 -49505 -51673 -54438 -54680 -56199 -55821 -57141 -55845 -57426 -51807
1783 -51807 -54562 -51565 -57305 -57889 -52343 -53414 -52645 -58325 -55447 -54291 -55133 -51847 -50253 -53934 -59822
1768 -59822 -56144 -51829 -54009 -59049 -54857 -56000 -52686 -56710 -57930 -53202 -61194 -55108 -54242 -57353 -54227
1753 -54227 -52856 -54421 -53267 -60742 -57468 -49725 -52711 -48951 -51332 -55982 -59391 -59676 -49352 -58268 -54498
1738 -54498 -58410 -57057 -46804 -51890 -54648 -51873 -56206 -60629 -48913 -54692 -57214 -49960 -54074 -54866
1724 -54866 -55028 -54409 -54080 -50744 -57891 -54636 -56598 -57144 -52472 -55424 -49758 -59358 -53866 -48746 -53243 -47960
1708 -47960 -53577 -51626 -60396 -57696 -59705 -55295 -57744 -57058 -51683 -52904 -48187 -49376 -52452 -55897 -58294
1693 -58294 -53849 -57665 -51738 -53881 -51879 -59865 -51976 -52972 -47961 -58701 -57731 -50690 -57869 -52798 -57578
1678 -57578 -55005 -57154 -53125 -51650 -52960 -52477 -57091 -54449 -54885 -57541 -58025 -57114 -52994 -52031 -53446 -56967
1662 -56967 -55877 -49362 -51428 -55016 -52950 -55762 -58105 -56047 -48342 -49913 -55902 -60453 -50437 -45037
1648 -45037 -56608 -53521 -56834 -54513 -52488 -58231 -52153 -54949 -60391 -57017 -50552 -55035 -57281 -55923
1634 -55923 -54643 -56156 -55287 -51854 -54258 -52810 -52757 -50729 -51300 -50971 -52936 -52278 -57226 -53402 -56314 -60205
1618 -60205 -55995 -54486 -52790 -52891 -58125 -56591 -57211 -51809 -50535 -52242 -60800 -56901 -55576 -56626 -49279
1603 -49279 -57110 -56627 -51745 -54414 -50014 -51004 -54893 -55778 -54421 -56735 -51290 -60825 -53509 -55328 -51746
1588 -51746 -47622 -48965 -54020 -53943 -57028 -62332 -57212 -58840 -55436 -46899 -57606 -50378 -49858 -52287 -58022
1573 -58022 -59512 -60488 -60453 -52374 -54386 -49563 -56492 -52499 -54433 -57817 -51553 -54964 -51613 -54627 -60833
1558 -60833 -55305 -54317 -54783 -51204 -56627 -57232 -51474 -53681 -47351 -51269 -54355 -61488 -52077 -54079 -60583
1543 -60583 -58156 -56156 -51245 -53981 -54663 -50829 -52929 -56840 -56629 -53193 -50776 -57671 -53057 -48529 -50671
$$ [...]
##END NTUPLES=NMR SPECTRUM
##END=
