##TITLE=abcd
##JCAMPDX= 6.0         $$ Bruker NMR JCAMP-DX V2.0
##DATA TYPE= NMR SPECTRUM
##DATA CLASS= NTUPLES
##ORIGIN= UXNMR, Bruker Analytische Messtechnik GmbH
##OWNER= root
$$ XWIN-NMR		Version 3.5
$$ Wed Jul 29 16:17:22 2026 Russian Standard Time (UT+4h)  servis@DPX200
##.OBSERVE FREQUENCY= 200.131235884673
##.OBSERVE NUCLEUS= ^1H
##.ACQUISITION MODE= SIMULTANEOUS
##.ACQUISITION SCHEME= undefined
##.AVERAGES= 32
##.DIGITISER RES= 18
##SPECTROMETER/DATA SYSTEM= spect
##.PULSE SEQUENCE= zg
##.SOLVENT NAME= CDCl3
##.SHIFT REFERENCE= (INTERNAL, CDCl3, 0, 16.4885)
##AUDIT TRAIL= $$ (NUMBER, WHEN, WHO, WHERE, WHAT)
$$ ##TITLE= Audit trail, XWIN-NMR		Version 3.5
$$ ##JCAMPDX= 5.01
$$ ##ORIGIN= Bruker BioSpin GmbH
$$ ##OWNER= servis
$$ F:\spectra/data/av/nmr/H1/1/pdata/1/auditp.txt
$$ ##AUDIT TRAIL=  $$ (NUMBER, WHEN, WHO, WHERE, WHAT)
(   1,<2026-07-29 16:16:04.06 +0400>,<servis>,<DPX200>,
      <created by zg, POWCHK disabled, PULCHK disabled
       configuration hash MD5:
       00 E9 B6 7A A2 85 ED C7 34 08 36 98 17 FE 4E 26
       data hash MD5: 32K
       82 49 0B 24 5E 3E B7 D3 62 F4 22 57 D3 D7 37 20>)
(   2,<2026-07-29 16:16:58.54 +0400>,<servis>,<DPX200>,
      <Start of raw data processing
       efp BC_mod = 2 LB = 0.05 FT_mod = 6 PKNL = 1 PHC0 = -415.5518 PHC1 = 3.101563 SI = 16K 
       data hash MD5: 16K
       32 90 3C E5 69 E3 F8 98 EB B0 7A AB EB B7 F3 77>)
$$ ##END=
$$ 
$$ hash MD5
$$ E6 E3 E7 F5 47 85 C9 A7 B2 15 C4 26 42 BC 55 CC
##$RELAX= 
##$RELAX= 
##$RELAX= 
##$RELAX= 
##$RELAX= 
##$RELAX= 
##$RELAX= 
##$RELAX= 
$$ Bruker specific parameters
$$ --------------------------
##$DU= <F:\spectra>
##$EXPNO= 1
##$NAME= <H1>
##$PROCNO= 1
##$TYPE= <nmr>
##$USER= <av>
##$AMP= (0..31)
100 100 100 100 100 100 100 100 100 100 100 100 100 100 100 100 100 100 
100 100 100 100 100 100 100 100 100 100 100 100 100 100 
##$AQSEQ= 0
##$AQ_mod= 1
##$AUNM= <au_zg>
##$AUTOPOS= <>
##$BF1= 200.13
##$BF2= 200.13
##$BF3= 200.13
##$BF4= 200.13
##$BF5= 500.13
##$BF6= 500.13
##$BF7= 500.13
##$BF8= 500.13
##$BYTORDA= 1
##$CFDGTYP= 0
##$CFRGTYP= 5
##$CHEMSTR= <none>
##$CNST= (0..31)
1 1 145 1 1 1 1 1 1 1 1 1 1 1 1 1 1 1 1 1 1 1 1 1 1 1 1 1 1 1 1 1 
##$CPDPRG= <>
##$CPDPRG1= <>
##$CPDPRG2= <>
##$CPDPRG3= <>
##$CPDPRG4= <mlev>
##$CPDPRG5= <mlev>
##$CPDPRG6= <mlev>
##$CPDPRG7= <mlev>
##$CPDPRG8= <mlev>
##$CPDPRGB= <>
##$CPDPRGT= <>
##$D= (0..31)
0 2 0 0 0 0 0 0 0 0.06 0 0 0 0 0 0 0.0002 0 0 0 0 0 0 0 0 0 0 0 0 0 0 
0 
##$DATE= 1785327363
##$DBL= (0..7)
120 120 120 120 120 120 120 120 
##$DBP= (0..7)
150 150 150 150 150 150 150 150 
##$DBP07= 0
##$DBPNAM0= <>
##$DBPNAM1= <>
##$DBPNAM2= <>
##$DBPNAM3= <>
##$DBPNAM4= <>
##$DBPNAM5= <>
##$DBPNAM6= <>
##$DBPNAM7= <>
##$DBPOAL= (0..7)
0.5 0.5 0.5 0.5 0.5 0.5 0.5 0.5 
##$DBPOFFS= (0..7)
0 0 0 0 0 0 0 0 
##$DE= 6
##$DECBNUC= <off>
##$DECIM= 32
##$DECNUC= <off>
##$DECSTAT= 4
##$DIGMOD= 1
##$DIGTYP= 9
##$DL= (0..7)
0 120 120 120 120 120 120 120 
##$DP= (0..7)
150 150 150 150 150 150 150 150 
##$DP07= 0
##$DPNAME0= <>
$$ [...]
##$SUBNAM4= <"">
##$SUBNAM5= <"">
##$SUBNAM6= <"">
##$SUBNAM7= <"">
##$SUBNAM8= <"">
##$SUBNAM9= <"">
##$SW= 20.6817932712277
##$SWIBOX= (0..15)
0 0 3 0 0 0 0 0 0 0 0 0 0 0 0 0 
##$SW_h= 4139.07284768212
##$TD= 32768
##$TD0= 1
##$TE= 0
##$TE2= 300
##$TE3= 300
##$TEG= 300
##$TL= (0..7)
0 120 120 120 120 120 120 120 
##$TP= (0..7)
150 150 150 150 150 150 150 150 
##$TP07= 0
##$TPNAME0= <>
##$TPNAME1= <>
##$TPNAME2= <>
##$TPNAME3= <>
##$TPNAME4= <>
##$TPNAME5= <>
##$TPNAME6= <>
##$TPNAME7= <>
##$TPOAL= (0..7)
0.5 0.5 0.5 0.5 0.5 0.5 0.5 0.5 
##$TPOFFS= (0..7)
0 0 0 0 0 0 0 0 
##$TUNHIN= 0
##$TUNHOUT= 0
##$TUNXOUT= 0
##$USERA1= <user>
##$USERA2= <user>
##$USERA3= <user>
##$USERA4= <user>
##$USERA5= <user>
##$V9= 5
##$VALIST= <valist>
##$VCLIST= <CCCCCCCCCCCCCCC>
##$VD= 0
##$VDLIST= <DDDDDDDDDDDDDDD>
##$VPLIST= <PPPPPPPPPPPPPPP>
##$VTLIST= <TTTTTTTTTTTTTTT>
##$WBST= 1024
##$WBSW= 30
##$XGAIN= (0..3)
0 0 0 0 
##$XL= 0
##$YL= 0
##$YMAX_a= 156866
##$YMIN_a= -314314
##$ZGOPTNS= <>
##$ZL1= 120
##$ZL2= 120
##$ZL3= 120
##$ZL4= 120
##$ABSF1= 0
##$ABSF2= 0
##$ABSG= 0
##$ABSL= 0
##$ALPHA= 0
##$AQORDER= 0
##$ASSFAC= 0
##$ASSFACI= 0
##$ASSFACX= 0
##$ASSWID= 0
##$AUNMP= <proc_1d>
##$AZFE= 0.1
##$AZFW= 0.1
##$BCFW= 0
##$BC_mod= 2
##$BYTORDP= 0
##$COROFFS= 0
##$CY= 18.4799938201904
##$DATMOD= 1
##$DC= 0
##$DFILT= <>
##$DTYPP= 0
##$F1P= 9.9274215381318
##$F2P= -0.165520771350173
##$FCOR= 1
##$FTSIZE= 16384
##$FT_mod= 6
##$GAMMA= 0
##$GB= 0
##$INTBC= 1
##$INTSCL= 4.127829e-11
##$ISEN= 128
##$LB= 0.05
##$LEV0= 0
##$LPBIN= 0
##$MAXI= 10000
##$MC2= 0
##$MEAN= 0
##$ME_mod= 0
##$MI= 50
##$NCOEF= 0
##$NC_proc= -7
##$NLEV= 6
##$NOISF1= 3.799351
##$NOISF2= 2.8
##$NSP= 0
##$NTH_PI= 0
##$NZP= 0
##$OFFSET= 16.48848
##$PC= 4
##$PHC0= -415.5518
##$PHC1= 3.101563
##$PH_mod= 1
##$PKNL= yes
##$PPARMOD= 0
##$PSCAL= 4
##$PSIGN= 0
##$REVERSE= no
##$SF= 200.130005582386
##$SI= 16384
##$SIGF1= 3
##$SIGF2= 2
##$SINO= 400
##$SIOLD= 16384
##$SREGLST= <1H.CDCl3>
##$SSB= 0
##$STSI= 16384
##$STSR= 0
##$SW_p= 4139.07284768211
##$SYMM= 0
##$S_DEV= 0
##$TDeff= 32768
##$TDoff= 0
##$TI= <>
##$TILT= no
##$TM1= 0
##$TM2= 0
##$TOPLEV= 0
##$USERP1= <user>
##$USERP2= <user>
##$USERP3= <user>
##$USERP4= <user>
##$USERP5= <user>
##$WDW= 1
##$XDIM= 16384
##$YMAX_p= 281773823
##$YMIN_p= -881770
$$ End of Bruker specific parameters
$$ ---------------------------------
##NTUPLES= NMR SPECTRUM
##VAR_NAME=  FREQUENCY,     SPECTRUM/REAL,   SPECTRUM/IMAG
##SYMBOL=    X,             R,               I
##VAR_TYPE=  INDEPENDENT,   DEPENDENT,       DEPENDENT
##VAR_FORM=  AFFN,          ASDF,            ASDF
##VAR_DIM=   16384,         16384,           16384
##UNITS=     HZ,            ARBITRARY UNITS, ARBITRARY UNITS
##FACTOR=    0.252644378177508, 1,           1
##FIRST=     3299.83951724647, 0,            0
##LAST=      -839.233330435636, 0,           0
##MIN=       -839.233330435636, -881770,     0
##MAX=       3299.83951724647, 281773823,    0
$$ Real data points
##PAGE= N=1
##DATA TABLE= (X++(R..R)), XYDATA
$$ [...]
7254F936051m00467m82794J29507k8241j93679l18276J056K51350j6617n235k71728
7243E600927l49895j4388Q9468Q7772j6622l74312K26286n05835j630N2017l42593
7232D451195K07730l26047N4813j44212j17467J83424j495k59165M36289l25130
7222D159935L28319n13516L66632m71840K83957k35827k41047J99339k11688N58012
7212D222276l43714L1j93466M6377N9320l10244M79967l65495L11083m39863j33689
7201C332583K50870l62944J35103r8820J40637n940k2200j11940j84148L80192
7191C453393k21167M02919o3682m01758M99792j36095o45742L60809N61372o22106
7181C187735K15172k2477K2800m2684k59798r9527m2867p4621K66316r7699J66318
$$ plain form
7254 6936051 6535584 6052790 6182297 6154056 5960377 5642101 5643157 5894507 5877890 5872655 5600927
7243 5600927 5251032 5236644 5326112 5413884 5397262 5022950 5249236 4743401 4741771 4793788 4451195
7232 4451195 4658925 4332878 4387691 4243479 4126012 4309436 4307941 4048776 4485065 4159935
7222 4159935 4488254 3974738 4341370 3869530 4153487 3917660 3676613 3875952 3664264 4222276
7212 4222276 3878562 3878593 3685127 3731504 3790824 3480580 3960547 3595052 3906135 3466272 3332583
7201 3332583 3583453 3220509 3355612 3256792 3397429 3391489 3369289 3257349 3073201 3453393
7191 3453393 3232226 3635145 3571463 3169705 3669497 3533402 2887660 3248469 3809841 3187735
7181 3187735 3402907 3380430 3403230 3360546 3100748 3001221 2958354 2883733 3150049 3052350 3218668
7170C218668k79488N03464n26759O04015m28563j1747j24995L97942l55346O3646
7160C060837L17520n32658J57418k22970L14019k09245J35931J16339J31543l86171
7150B882563J11133j54571K06146k73532J97974m7632L79109m6703N15592r28249
7140B841830M44091k99012K09087k48452O9044L36638j43181J7851n1623k12411
7130B963862n2868L9423K21449R4980j20305k60357k0764J67251K70527l79936
7120B923262L63306k69408M1143J8982K2011q7856Q2166r9813j24010N40846l27123
7109C083506R2738m6502m24714J24447K61813j05929K16521j5068q7348k95907
7099B803557P8908K60508o475J9573j29553p9366K15381j74641J50060r3374j44436
$$ plain form
7170 3218668 2939180 3442644 2915885 3519900 3091337 3079590 2954595 3352537 2997191 3060837
7160 3060837 3378357 2845699 3003117 2780147 3094166 2884921 3020852 3137191 3268734 2882563
7150 2882563 2993696 2839125 3045271 2771739 2969713 2922081 3301190 3254487 3770079 2841830
7140 2841830 3285921 2986909 3195996 2947544 3016588 3353226 3210045 3227896 3176273 2963862
7130 2963862 2910994 2950417 3171866 3266846 3146541 2886184 2865420 3032671 3303198 2923262
7120 2923262 3286568 3017160 3058303 3077285 3099296 3011440 3093606 2993793 2869783 3410629 3083506
7109 3083506 3176244 3129742 2705028 2829475 3091288 2985359 3201880 3186812 3099464 2803557
7099 2803557 2882465 3142973 3136498 3156071 3026518 2947152 3162533 2987892 3137952 3044578 2900142
7088B900142P0578L35420M7945k98055J57843n06955Q1376P5349K48220r8587
7078C013276P7774O33447n29077j79467J72336l09381o8206J59567K91426k65343
7068B996352K50700k41377M16953k9966k93012K27969l10816M50875j60105M0773
7058C348346q8413J92764j22383N1768j81752j20978L79829N5132j36613L82969
7048C760669l76286N5117j90229j98261J01889L71803L7528j80071o2540L8670
7038C358289J50247j52633M2556O7675r0772J30898K03606k67263J15417j10021
7028C447999k04507K35971M0443j48938Q2359j12535k197N6063j63179O8265M70329
7017C770073j45033l56975L31542k8617K36353n13165Q0774p9127J73184L0347
$$ plain form
7088 2900142 2970720 3306140 3354085 3056030 3213873 2706918 2788294 2863643 3111863 3013276
7078 3013276 3091050 3724497 3195420 3015953 3188289 2878908 2810702 2970269 3261695 2996352
7068 2996352 3247052 3005675 3422628 3392662 3099650 3327619 3016803 3467678 3307573 3348346
7058 3348346 3259933 3452697 3330314 3382082 3200330 3079352 3459181 3514313 3377700 3760669
7048 3760669 3384383 3439500 3249271 3051010 3152899 3524702 3562230 3382159 3319619 3358289
7038 3358289 3508536 3355903 3398459 3466134 3375362 3506260 3709866 3442603 3558020 3447999
7028 3447999 3243492 3479463 3519906 3370968 3453327 3340792 3338595 3394658 3231479 3299744 3770073
7017 3770073 3625040 3268065 3599607 3570990 3807343 3294178 3374952 3295825 3469009 3499356
7007C499356L38527k20289l64735M51155J34279m66024M91239j32160j80220l849
6997C547279L28324l31531j6043j4908L5319o8843L13722k99826J35343l12659
6987C316177L44238k30966k39834M49665k84799j4508L0465j49724O63186l94204
6977C489696K46388l24567Q5469j9088j50037K91807k87189l9613K19409J83623
6967C695898k40381l02386K05357K87775j86677L17387j71546J38620q9012j92713
6957C462322J52037j77031j10702L31765k15976L33664K15735m02008n0865J36614
6947C675555l56751N6187J65817j98374N61292o77962L51446P3217k54989N06258
6937C901696k18042O793j7244J47092k31586K33143k23921N19019j37389j49124
$$ plain form
7007 3499356 3837883 3617594 3252859 3704014 3838293 3372269 3863508 3731348 3551128 3547279
6997 3547279 3875603 3544072 3528029 3513121 3548440 3479597 3793319 3493493 3628836 3316177
6987 3316177 3660415 3429449 3189615 3639280 3354481 3339973 3370438 3220714 3883900 3489696
6977 3489696 3736084 3411517 3496986 3477898 3327861 3619668 3332479 3292866 3512275 3695898
6967 3695898 3455517 3153131 3358488 3646263 3459586 3776973 3605427 3744047 3655035 3462322
6957 3462322 3614359 3437328 3326626 3658391 3442415 3776079 3991814 3589806 3538941 3675555
6947 3675555 3318804 3374991 3540808 3342434 3903726 3225764 3577210 3650427 3395438 3901696
6937 3901696 3683654 3690447 3673203 3820295 3588709 3821852 3597931 4116950 3979561 3830437
6927C830437K04197m3978k30231J43260N2081k37935L54078l38390l37285N05848
6917C902082k56187R2954J38644k16161r4640P3238K77802P8049m16794P2840
6907C651827K36041K99505l57972J47591j06587L2744K85734k72401k72333K17373
6897C861522M2885K23315j21613q6807J78144k08859M7050j25733M80817l88379
6887C902342K11999k67700K01523J16522j04773O0721k75949J38626k72136L84118
6877D095293p6974P942n7704K83471Q3894k81925K98807k90236M58912k36308
6867D285172k27079K00042l25853k91593J54177N29742J26810R751j35683J02393
6857D427879j72988L1939K18082l20297J11914J31324l2370k90410K00461j61332
$$ plain form
6927 3830437 4034634 3990656 3760425 3903685 3955766 3717831 4071909 3733519 3396234 3902082
6917 3902082 3645895 3738849 3877493 3661332 3566692 3639930 3917732 3995781 3578987 3651827
6907 3651827 3887868 4187373 3829401 3976992 3870405 3903149 4188883 3916482 3644149 3861522
6897 3861522 3904407 4127722 4006109 3919302 4097446 3888587 3935637 3809904 4290721 3902342
6887 3902342 4114341 3846641 4048164 4164686 4059913 4120634 3844685 3983311 3711175 4095293
6877 4095293 4018319 4026261 3968557 4252028 4335922 4053997 4352804 4062568 4521480 4285172
6867 4285172 4058093 4258135 3932282 3640689 3794866 4324608 4451418 4461169 4325486 4427879
6857 4427879 4254891 4286830 4504912 4184615 4296529 4427853 4395483 4105073 4305534 4144202
6847D144202K76096O9920l32610M77569l07243k81084N97307k00125m10535M30236
6837D463733L6365j65577K81109j76795L3855J80184q0267k28904L54449L3189
6827D731341n02235L75196l46558L76426K803J40376l51382k5301N53047n15567
6817D438146J17727J35782k58518M38416l30361K01252k97090j03854J64502O69751
6807E175753n37894k29111m8229L1321K33841J31871k18991m44625P12158l91598
6797D414496M60444l42051J19698J37718m9043K3073j93990L84739l68662M21052
6787E007474k60711L67695K3302M7167M110l8197k66431L29422p3863J66898o10521
6776D696345O95978k56067k98682j44834J11928j60928O84326P9859j7318j39413
$$ plain form
6847 4144202 4420298 4490218 4157608 4635177 4327934 4046850 4644157 4444032 4033497 4463733
6837 4463733 4500098 4334521 4615630 4438835 4472690 4652874 4572607 4343703 4698152 4731341
6827 4731341 4229106 4604302 4257744 4634170 4636973 4777349 4425967 4400666 4953713 4438146
6817 4438146 4555873 4691655 4433137 4871553 4541192 4742444 4445354 4341500 4506002 5175753
6807 5175753 4637859 4408748 4360519 4391840 4625681 4757552 4538561 4093936 4806094 4414496
6797 4414496 4874940 4532889 4652587 4790305 4741262 4764335 4570345 4955084 4586422 5007474
6787 5007474 4746763 5114458 5137760 5184927 5189037 5150840 4884409 5213831 5139968 5306866 4696345
6776 4696345 5392323 5136256 4837574 4692740 4804668 4643740 5328066 5407925 5390607 5251194
6766E251194j91939K70131m46745L20104R9895L20297n02112r2j79887K79253
6756E220099L79279n125Q3662L8002l8239P7845k67180K16213m31428j01114J58125
6745E330139L06615O2831k80746J82092k868l9841k4970J82857k3475l96494J70057
6734E466197J56892K87960k16701j1617j1718L13003o226K0873j5611m11883L33654
6723E904823k23421K45424n0006j94806Q3596L42936m09223p1815K65211j37859
6713E754860p7137k47443O17016l46040K69498o4427j66L21546l66511n3446K89202
6702F096952k51190Q6433J99265R0259j42181j21376p4034M64483n12971P2697
6692E908337K97757P3169l03966L54375j68857K15813p5110m18769L04872j33997
$$ plain form
6766 5251194 5059255 5329386 4882641 5202745 5302640 5622937 5120825 5120733 4940846 5220099
6756 5220099 5599378 5594253 5677915 5715917 5677678 5755523 5488343 5704556 5273128 5172014 5330139
6745 5330139 5636754 5699585 5418839 5600931 5598063 5558222 5533252 5716109 5692634 5296140 5466197
6734 5466197 5623089 5911049 5694348 5682731 5671013 5984016 5977790 5998663 5983052 5571169 5904823
6723 5904823 5681402 5926826 5876820 5682014 5765610 6108546 5699323 5627508 5892719 5754860
6713 5754860 5677723 5430280 6047296 5701256 5970754 5906327 5906161 6227707 5861196 5807750 6096952
6702 6096952 5845762 5932195 6131460 6221719 6079538 5958162 5884128 6348611 5835640 5908337
6692 5908337 6206094 6279263 5975297 6329672 6160815 6376628 6301518 5882749 6187621 6053624
6682F053624J68962K0172L35488l08428Q0316k79616K5195N02528K02139k76472
6672F523908k12297J59900j77101M7727o0656L26621P0085o3437k34481M2993
6662F423262J10023L1850J03322J84885j0183k34899m0857L1937N9954j41185
6652F518109k92452N22270j91413M51510j59689n9029q4128K83461k64910l96219
6642F327510P48246n47745L52990Q7860j25972k08471L15987j37261R1950k7513
6632F877581r5096Q4706K34002l01054j56971n5182L53866J34658m99768J42375
6622F719117J61401P1225k38871J43626J78701l22855L65522r2519j13533n6914
6612F814900N0440j02489K46797j62554K22781M9983j02044J34031K83458j23089
$$ plain form
6682 6053624 6222586 6242758 6578246 6269818 6350134 6070518 6095713 6598241 6800380 6523908
6672 6523908 6311611 6471511 6294410 6342137 6281481 6608102 6678187 6614750 6380269 6423262
6662 6423262 6533285 6565135 6668457 6853342 6843159 6608260 6567403 6599340 6659294 6518109
6652 6518109 6225657 6747927 6556514 7008024 6848335 6789306 6705178 6988639 6723729 6327510
6642 6327510 7075756 6528011 6881001 6968861 6842889 6634418 6950405 6813144 6905094 6877581
6632 6877581 6782485 6867191 7101193 6800139 6643168 6587986 6941852 7076510 6576742 6719117
6622 6719117 6880518 6951743 6712872 6856498 7035199 6712344 7077866 6985347 6871814 6814900
6612 6814900 6865340 6762851 7009648 6847094 7069875 7119858 7017814 7151845 7435303 7312214
6602G312214j9168j61066N1170j2479j32068J49674J89374l18294K78936J05468
6592G443761k48525J45969r0135K89655q6980j07858K41052J09477j15725j00528
6582G480163K10469L32307m88844K28843r1726K17827J70050m22370L11672j37554
6572G810837k2105m32543L85316l46045N90531l46701K69225k0615n9367M66975
6562H295508j46407j29756K86670m13358l2454K74787J22497M1232K76837K70244
6552H845800K7673N8276J00593k15652j9876Q4532J58780m3540K42586k18605
6542I020567N7358J90499J14722k40162R7642k96206O84825o65442j57618K40607
6532I046792J58574L54077p8336J97056j47614N43438o9431L55246j7492K28221
$$ plain form
6602 7312214 7293046 7131980 7183150 7170671 7038603 7188277 7377651 7059357 7338293 7443761
6592 7443761 7195236 7341205 7251070 7540725 7453745 7345887 7586939 7696416 7580691 7480163
6582 7480163 7690632 8022939 7534095 7762938 7671212 7889039 8059089 7636719 7948391 7810837
6572 7810837 7788732 7356189 7741505 7395460 7985991 7639290 7908515 7887900 7828533 8295508
6562 8295508 8149101 8019345 8306015 7892657 7860203 8134990 8257487 8298719 8575556 8845800
6552 8845800 8873473 8931749 9032342 8816690 8796814 8881346 9040126 8996586 9239172 9020567
6542 9020567 9077925 9268424 9383146 9142984 9240626 8944420 9629245 8963803 8806185 9046792
6532 9046792 9205366 9559443 9481107 9678163 9530549 10073987 10004556 10359802 10342310 10570531
6522A0570531j32612L61651j422K62237l7532k05196K69490K1144K67068M30077
6512A1805436n78895K71960j60516k0361K67603j39560J07860K41919R363Q2567
6502A1887376p6955K43143J72505M14889j25609J31999O11359Q9939P16362k09433
6492A3855575M64043q3612N87351M51428J56240J33511k14804L44086O6395l7634
6482A5722579N2601O53076p0735k74017j78975M18532J68317J62948J47338j6420
6472A6785244M91807l63925N01323l24786Q60297L04477N94029j67567O15774
6463A9296673N90043J67225M40743M60866L04908P29181J25312N04946N78181
6454B3198078j34472K68839L52347K64934K78125j64415Q2976j64246J07549L27192
$$ plain form
6522 10570531 10437919 10799570 10798148 11060385 11022853 10817657 11087147 11108291 11375359 11805436
6512 11805436 11226541 11498501 11337985 11317624 11585227 11445667 11553527 11795446 11804809 11887376
6502 11887376 11810421 12053564 12226069 12640958 12515349 12647348 13258707 13348646 14065008 13855575
6492 13855575 14319618 14236006 14823357 15274785 15431025 15564536 15349732 15693818 15760213 15722579
6482 15722579 15775180 16428256 16357521 16083504 15904529 16323061 16491378 16654326 16801664 16785244
6472 16785244 17277051 16913126 17414449 17089663 17949960 18254437 18848466 18680899 19296673
6463 19296673 19886716 20053941 20494684 20955550 21260458 21989639 22114951 22619897 23198078
6454 23198078 23063606 23332445 23684792 23949726 24227851 24063436 24146412 23982166 24089715 24416907
6444B4416907j38282j57451P9662k56886K10198K35750M04300k20545N99153L75757
6434B5548563M62059O76822L26223J064701J93883R74666Q28056O90744P23836
6425C1489553O77886P31289N41685L59126K62905l54346N11176J41546p59296
6416C3601524l2600n72336o72876p90705m21804o84457j19324k29426p90112j4524
6406B9273360j95612o49486J85169p3408K35288L87611J53010J59885O89896M12607
6396C0578320k8198N41660O65917L09095k2017M00798P5271m44479J89960o5878
6386C2200449J26895j99533o09013k83029n98349n45038o44863k62101j145478
6377B8039940m11055o53069n01531q07020n08019j82794n39894j485p24013N18702
$$ plain form
6444 24416907 24278625 24121174 24200836 23943950 24154148 24389898 24794198 24573653 25172806 25548563
6434 25548563 26010622 26687444 27013667 28078368 28272251 29246917 30074973 30765717 31489553
6425 31489553 32167439 32898728 33440413 33799539 34062444 33708098 34219274 34360820 33601524
6416 33601524 33568924 32996588 32323712 31533007 31111203 30426746 30307422 30077996 29287884 29273360
6406 29273360 29077748 28428262 28613431 28540023 28775311 29162922 29315932 29475817 30165713 30578320
6396 30578320 30550122 31091782 31757699 32066794 32044777 32445575 32520846 32076367 32266327 32200449
6386 32200449 32327344 32127811 31518798 31235769 30637420 30092382 29447519 29185418 28039940
6377 28039940 27628885 26975816 26474285 25667265 25159246 24976452 24436558 24435073 23711060 24229762
6367B4229762m2204l44257L07189J42728L11732l73763N07884k6348p2932L26533
6357B4966324K66308k4025j9830k75298j42448n16799n09633q76351m13373q75216
6347B1579659m44810j82527m33355p52448o50820j04247k56879k705m25074o8643
6337A8258151R88188r25887N39568J5279k33975J00415N06822j55676K15292N22437
6327A9830614j01659M3793m66955l60417N2326l03884m27244J74358k82434K5362
6317A8183860k32171J9172k7249J74713J43146J31983P69050j90931N20564M72219
6307A9964356L70458R7938O51207q881L68979j04863J46672K08050k21277l38449
6297B1134190O4527m55054p04144M29778l67142n52167p6323Q3407l1710K57580
$$ plain form
6367 24229762 24187558 23843301 24150490 24293218 24604950 24231187 24739071 24712723 24639791 24966324
6357 24966324 25232632 25208607 25188777 24913479 24771031 24254232 23744599 22868248 22454875 21579659
6347 21579659 21134849 20952322 20518967 19766519 19115699 19011452 18754573 18751868 18326794 18258151
6337 18258151 19246339 18320452 18860020 18875299 18641324 18741739 19248561 19092885 19308177 19830614
6327 19830614 19728955 19772748 19305793 18945376 18997702 18693818 18266574 18440932 18158498 18183860
6317 18183860 17951689 17970861 17943612 18118325 18261471 18393454 19162504 18971573 19492137 19964356
6307 19964356 20334814 20432752 21083959 21075078 21444057 21339194 21485866 21693916 21472639 21134190
6297 21134190 21198717 20743663 20039519 20469297 20102155 19549988 19473665 19557072 19525362 19782942
6287A9782942m419n7152L57490N50992O00175L88356M58709O77611Q8329J142407
6277B3985440K96275L43601N71226O37645n6543J18773K82785L57427j43994n7968
6267B6334667p2824n1472l01793k64199n29966J48361m50197L48296k53123K25155
6257B5132905k74565K26210k0398L64210M22108M84123M23263J089391J82335
6248B8029582J065009Q28998K37782J066969R48655R78169Q55291R58103J08065
6239C5076623O97653L04664K96332k43260J79234j76367n10906J16330m94876
6230C5245427l98661k21726m91178L5659l39849k63401j8923n53862N40914L01053
6220C3835453N04831K44166P53904O3729Q32297J115889J103981L86361Q28735
$$ plain form
6287 19782942 19778523 19721371 20078861 20629853 21230028 21618384 22077093 22754704 22843033 23985440
6277 23985440 24281715 24625316 25196542 25834187 25777644 25896417 26179202 26536629 26392635 26334667
6267 26334667 26261843 26210371 25908578 25644379 25114413 25262774 24812577 25160873 24907750 25132905
6257 25132905 24858340 25084550 25064152 25428362 25850470 26334593 26757856 27847247 28029582
6248 28029582 29094591 29923589 30161371 31228340 32176995 33155164 34010455 34968558 35076623
6239 35076623 35774276 36078940 36375272 36132012 36311246 36134879 35623973 35740303 35245427
6230 35245427 34846766 34625040 34133862 34169521 33829672 33566271 33547348 32993486 33534400 33835453
6220 33835453 34340284 34584450 35338354 35402083 36234380 37350269 38454250 38840611 39669346
6211C9669346M75257L27787O98849k63532M78002j84700j72863l66984m21680
6202D0239482k87128j24078r22610p00668O5759j252366q29813j020697m99548
6193C4668333o53657J37760j289624J81441o13899l47505j55770r1179j32709
6184C1703191O03065j06150m3398J72846J27938J46327p0795l73196K22074q8235
6174C2293667k14391l49698j96119o77786q39031l12495o56070n49468j063109
6165B7435500n97591j299903q88981m64097j105046j63287o88226k45103m56981
6156B1526285J9841j018046J81334m54950k57296M2490p332j64253j39638k53229
6146A9475206M8826K3237q31897n1913O4488n38149k27698j70040p31963k62107
$$ plain form
6211 39669346 40144603 40472390 41171239 40907707 41385709 41201009 41028146 40661162 40239482
6202 40239482 39952354 39828276 38905666 38204998 38270757 37018391 36188578 35167881 34668333
6193 34668333 34014676 34152436 32862812 33044253 32430354 32082849 31927079 31835900 31703191
6184 31703191 32306256 32200106 32156708 32329554 32457492 32603819 32533024 32159828 32381902 32293667
6174 32293667 32079276 31729578 31533459 30855673 30016642 29704147 29048077 28498609 27435500
6165 27435500 26837909 25538006 24649025 24184928 23079882 22916595 22228369 21983266 21526285
6156 21526285 21546126 20528080 20709414 20254464 19997168 20039658 20032326 19868073 19728435 19475206
6146 19475206 19524032 19547269 18715372 18663459 18727947 18189798 17962100 17792060 17060097 16797990
6136A6797990k03548r27488P9619m88136k65463j17359k24808l72393k3771n42243
6126A3712400K60303m97448k75414o3805p9282j23354J26495n6597l44299m18151
6116A2240848M66435m4000k85113J05560N8907l61975K80645j17792n8887j31078
6106A2153550J51461O819J11125N8166m16231J52994j81888j69590L72149K28456
6096A2467011j11013k34924J24847l27905m2283l25788K49149j89120j48662m3503
6086A1417809O8186m90835j08112j63042l07450K11942J72811k2444P7280l80293
6076A0475852K88465k9327n5425K0629j19609q1724J59521l20851j42756K0548
6066A0215323n9174n5611J54745K5289O2960j44957L16768l52740N9385q2890
$$ plain form
6136 16797990 16594442 15666954 15746573 15258437 14992974 14875615 14650807 14278414 14254643 13712400
6126 13712400 13972703 13475255 13199841 13136036 13056754 12933400 13059895 13003298 12658999 12240848
6116 12240848 12707283 12663283 12378170 12483730 12542637 12180662 12461307 12343515 12284628 12153550
6106 12153550 12305011 12311830 12422955 12481121 12064890 12217884 12035996 11866406 12238555 12467011
6096 12467011 12355998 12121074 12245921 11918016 11875733 11549945 11799094 11609974 11461312 11417809
6086 11417809 11485995 10995160 10887048 10724006 10416556 10628498 10801309 10778865 10856145 10475852
6076 10475852 10764317 10734990 10679565 10700194 10580585 10498861 10658382 10337531 10194775 10215323
6066 10215323 10156149 10100538 10255283 10280572 10343532 10198575 10515343 10162603 10221988 10139098
6056A0139098L00759l77105J92966J8184j42267j73468L12331O6468j38285J91413
6046A0390094j34674k70040o5614N13611j42904l6952l15930M8190j10126L71602
6036A0247257r7549J32552K02632n60086J16361j10479j33723M03858m7966m2720
6026A0110137k03646J73430r3818O48885n86804J4558N3398Q1293k00136q7918
6016I909379l5124p0551L67628m60449K25127n2905r6935p1714N4106j72980J94403
6005I789985j92504J57237p5677l30657J12285J70849r008l41485J16219N24612
5995I921856l20742k5508K22491m1112l64848Q1095Q7257l40588M79539j75314
5985I524126J45912m65531K16094j90775L13117j76054L91849m14751R2160j30169
$$ plain form
6056 10139098 10439857 10062752 10255718 10273902 10131635 9958167 10270498 10336966 10198681 10390094
6046 10390094 10255420 9985380 9919766 10433377 10290473 10253521 9937591 9985781 9875655 10247257
6036 10247257 10149708 10282260 10484892 9924806 10041167 9930688 9796965 10200823 10152857 10110137
6026 10110137 9906491 10079921 9986103 10634988 10048184 10062742 10116140 10197433 9997297 9909379
6016 9909379 9874255 9803704 10171332 9710883 9936010 9883105 9786170 9714456 9768562 9595582 9789985
6005 9789985 9597481 9754718 9679041 9348384 9460669 9631518 9622510 9281025 9397244 9921856
5995 9921856 9601114 9575606 9798097 9756985 9392137 9473232 9560489 9219901 9699440 9524126
5985 9524126 9670038 9204507 9420601 9229826 9542943 9366889 9758738 9343987 9436147 9305978
5975I305978o9130l4110J31250o8721K86163l24422M42273l91132K30876l0366
5965I478659m45763K57997L60029n42120m7091J81833K93825k48741j49207j05249
5955I034172M54599l20066J71630j96609M8967J66473j31378j62667J40387K64739
5945I470247m90086N31724l01527L62537l26361Q2258M9797O301J57251O3501
5935I605642r3929J77903k59116K82116m25973O6135K83434l18974M30552O797
5925I754587o2458k13640L80117P8075j59795n61886O40179j81527J50310O471
5915I830433M0207j36278j22288J45719K20268j56654k15577K72361j4816l76056
5905I487319l6512J16606P5400j76064J88897R9205k62188m32602J44227N25762
$$ plain form
5975 9305978 9236848 9202738 9333988 9265267 9551430 9227008 9669281 9278149 9509025 9478659
5965 9478659 9032896 9290893 9650922 9108802 9061711 9243544 9537369 9288628 9139421 9034172
5955 9034172 9488771 9168705 9340335 9143726 9192693 9359166 9227788 9065121 9205508 9470247
5945 9470247 8980161 9511885 9210358 9572895 9246534 9328792 9378589 9384890 9542141 9605642
5935 9605642 9511713 9689616 9430500 9712616 9286643 9352778 9636212 9317238 9747790 9754587
5925 9754587 9692129 9478489 9858606 9936681 9776886 9215000 9855179 9673652 9823962 9830433
5915 9830433 9870640 9734362 9612074 9757793 9978061 9821407 9605830 9878191 9863375 9487319
5905 9487319 9450807 9567413 9642813 9466749 9655646 9754851 9492663 9060061 9204288 9730050
5895I730050m54165N84583k09627j60030J38891l72230L07662J55827k48970k12686
5885I259305L26259n23911M00964l94393K21500J70687l99124M03998j37946j81438
5875I145901Q3058k23351K13826o9898j2701j96253l5570L83950m35414r0720
5865H762828M06366j19639j05068k89792L94964K5333m75124K96508q5732o6534
5855H744110K42214O7638n62002M18823l69027N06797l23885R5538k1m6463q7836
5844H685886j70008J77547k17662M44231J8933k48809m0232O4967j39086k51054
5834H324713L37336k44452N32533k09667r8964m37157K04766M06969l43753Q6897
5824H559221J76638q7973K55723o97740N48902j18209l21076N43521k75909k66693
$$ plain form
5895 9730050 9275885 9860468 9650841 9490811 9629702 9257472 9565134 9720961 9471991 9259305
5885 9259305 9585564 9061653 9462617 9068224 9289724 9460411 9061287 9465285 9327339 9145901
5875 9145901 9228959 9005608 9219434 9149536 9136835 8940582 8905012 9288962 8853548 8762828
5865 8762828 9169194 9049555 8944487 8654695 9049659 9074992 8599868 8896376 8810644 8744110
5855 8744110 8986324 9053962 8491960 8910783 8541756 9048553 8724668 8820206 8820185 8773722 8685886
5844 8685886 8515878 8693425 8475763 8919994 8938927 8690118 8649886 8714853 8575767 8324713
5834 8324713 8662049 8417597 8950130 8740463 8641499 8204342 8409108 8816077 8472324 8559221
5824 8559221 8735859 8647886 8903609 8205869 8754771 8636562 8315486 8859007 8583098 8316405
5814H316405J85207N7511k56446J91224J87126k08248J07216k24376J93519r129
5804H540009m3774O4464L53124k90855q6295l34666K55494K5625K75103j48339
5794H609890j292L33551j59520L40345l15910o30192O85708N40912o47480j75808
5784H580204M30050o90643L13688K10295m2318k11764n9570K10936k9434k11969
5774H499475M59451k41986k97412J51225Q0301j83681J18835K59934o4213J41946
5764H923875J52013n5524j96964l1150R1542m08j66703L49835J34270k11078O1178
5753I050886l4225P7962k10640M49560m13560K41790K72264O2694o8333R1796
5743I520194k12374K91858M6734j28570j73364O92995j46751m3865M10807j04351
$$ plain form
5814 8316405 8501612 8559123 8302677 8493901 8681027 8472779 8579995 8355619 8549138 8540009
5804 8540009 8496235 8560699 8913823 8622968 8536673 8202007 8457501 8483126 8758229 8609890
5794 8609890 8608598 8942149 8782629 9122974 8807064 8176872 8862580 9403492 8756012 8580204
5784 8580204 9010254 8319611 8633299 8843594 8801276 8589512 8529942 8740878 8711444 8499475
5774 8499475 8958926 8716940 8419528 8570753 8651054 8467373 8586208 8846142 8781929 8923875
5764 8923875 9075888 9020364 8823400 8792250 8883792 8883384 8716681 9066516 9200786 8989708 9050886
5753 9050886 9016661 9094623 8883983 9333543 8919983 9161773 9434037 9496731 9428398 9520194
5743 9520194 9307820 9599678 9646412 9517842 9344478 10037473 9890722 9846857 10257664 10153313
5733A0153313L40980j89700q042K51168L62253l18357J34321L20403J76488K44805
5723A1467632K59234N72020n86963N97793m79696r1546L89531m12499o1093j99587
5713A1454826p3375k59130J0837k19181o3860J10227k24766l67903J29110q118
5703A0488667o0384m5356n65032N95216r6693p5764r8470L50905n76449Q1856
5693I998496l0862k608L5333k8683j2123J45501j78554k39342K71516r6007p6502
5682I786165Q7837m31235N1702O9646O99k67685J66260o7063j38036J07648L42279
5671I708217j96140k98740k93163L3690o4147J03927l47987j91076O01685M3591
5661I099857l64709M67623m10905o760M1702l4872j5419k61746K55503l78125
$$ plain form
5733 10153313 10494293 10304593 10296551 10547719 10909972 10591615 10725936 11046339 11222827 11467632
5723 11467632 11726866 12298886 11711923 12309716 11830020 11738474 12128005 11715506 11654413 11454826
5713 11454826 11381451 11122321 11133158 10913977 10850117 10960344 10735578 10367675 10496785 10488667
5703 10488667 10428283 10382927 9817895 10413111 10316418 10240654 10142184 10493089 9916640 9998496
5693 9998496 9967634 9965026 10000359 9971676 9959553 10105054 9926500 9687158 9958674 9862667 9786165
5682 9786165 9874002 9442767 9494469 9564115 9564814 9297129 9463389 9396326 9258290 9365938 9708217
5671 9708217 9512077 9213337 8920174 8953864 8889717 8993644 8645657 8454581 9056266 9099857
5661 9099857 8735148 9202771 8791866 8785106 8826808 8791936 8776517 8514771 8770274 8392149
5651H392149R6041K59006j79276L472j28195o2302K15732J89l01425j48038L23400
5640H470753P1283j05427K15706j89975j44836K02581l03373j22540L26811j41546
5630H279437k1424N7487j86391l03894M16942j32198j84956N3092L724r0749k51241
5619G639829K44266J88241R2899o0295m26612N26610R1673J63185q60788L01666
5609G900674K70969K5116j19343k17410k6092M30591P9392m24545J66042n0140
5599H035254J35604l03585l41010M15020o7179M57929m92406N79308k83322p5273
5589H060340l50249k65050L00671K47764j34076J03872l61913L57057L44430o94954
5579G607892L45136J18825j30483p5833M28930r9837Q1405l60434J08863k07947
$$ plain form
5651 8392149 8488190 8747196 8567920 8571392 8443197 8380895 8596627 8596816 8295391 8147353 8470753
5640 8470753 8542036 8436609 8652315 8462340 8317504 8520085 8216712 8094172 8420983 8279437
5630 8279437 8258013 8315500 8129109 7825215 8242157 8109959 7925003 7978095 7981819 7891070 7639829
5619 7639829 7884095 8072336 8165235 8104940 7678328 8204938 8296611 8459796 7599008 7900674
5609 7900674 8171643 8196759 8077416 7860006 7833914 8264505 8343897 7919352 8085394 8035254
5599 8035254 8170858 7867273 7526263 7941283 7874104 8332033 7839627 8418935 8135613 8060340
5589 8060340 7710091 7445041 7745712 7993476 7859400 7963272 7601359 7958416 8302846 7607892
5579 7607892 7953028 8071853 7941370 7865537 8294467 8194630 8276035 7915601 8024464 7816517
5569G816517k93330K49178M4326j35439L49722k3445k28978K7874L38960m11422
5559G733963L88818k42385J99330J00321m67089J15565k33251K91931m1765J78536
5549H023974M5015k2266j32268L909J1923j08424L24742p0712L7205m59525J5075
5538G668648J04989q1996o3923Q1495Q1739k88043L70331j44328K67315j05699
5528G890528j39508J60071K81119k58162j62376L3389j09855M48510m3986k13809
5518G885921j0514k09174J84081J21203Q6337k86918J78N35359m72266J58937
5508G993144k02041K39344l9030k98625O24031j01835l34956K67758o60069P03754
5498H191475l3620J27229j06464j2466j14642j6925p3481k27737K8541K54459
$$ plain form
5569 7816517 7523187 7772365 7816691 7681252 8030974 8007529 7778551 7806425 8145385 7733963
5559 7733963 8122781 7880396 8079726 8180047 7712958 7828523 7595272 7887203 7845438 8023974
5549 8023974 8068989 8046723 7914455 7918364 7930287 7821863 8146605 8075893 8113098 7653573 7668648
5538 7668648 7773637 7691641 7627718 7709213 7790952 7502909 7873240 7728912 7996227 7890528
5528 7890528 7751020 7911091 8192210 7934048 7771672 7805061 7695206 8143716 8099730 7885921
5518 7885921 7875407 7666233 7850314 7971517 8057854 7770936 7771114 8306473 7834207 7993144
5508 7993144 7791103 8030447 7991417 7692792 8316823 8214988 7880032 8147790 7487721 8191475
5498 8191475 8157855 8285084 8178620 8166154 8051512 8034587 7961106 7733369 7761910 8016369
5488H016369J50678J43330m1968m19471M99537p0351j82728j62014K5148M11883
5478H370413m27001J78673q8189J37847J11852K7886j53982j05679J30760J24315
5468H306895j78513N40314m32181J49605K41892j60161J59559r8845N8980Q6478
5458H674023l43656K50420m31773P13375p9245p7924k15865K26059L17657j42856
5448H890215K06337j60772k42490L04689m61869M05635k60574K76763K20617j25044
5438I053507j09601J32806k33773K82333k41336j19449O84458n27704j26348O5375
5428H860268J1553K5145q0502N2494N58677k29000o23991K37078k48710J33317
5418H696329k47838L78784k17106j81011K87206Q6306k0244o29364N64641l28165
$$ plain form
5488 8016369 8167047 8310377 8268409 7848938 8348475 8278124 8095396 7933382 7958530 8370413
5478 8370413 7943412 8122085 8033896 8171743 8283595 8311481 8157499 8051820 8182580 8306895
5468 8306895 8128382 8668696 8236515 8386120 8628012 8467851 8627410 8528565 8587545 8674023
5458 8674023 8330367 8580787 8149014 8862389 8783144 8705220 8489355 8715414 9033071 8890215
5448 8890215 9096552 8935780 8693290 8997979 8536110 8941745 8681171 8957934 9178551 9053507
5438 9053507 8943906 9076712 8842939 9125272 8883936 8764487 9448945 8921241 8794893 8860268
5428 8860268 8871821 8896966 8816464 8868958 9427635 9198635 8574644 8811722 8563012 8696329
5418 8696329 8448491 8827275 8610169 8429158 8716364 8802670 8782426 8153062 8717703 8389538
5408H389538m8061k40291M5780O0956J03992j71037K6570p1860K8915J2595m0059
5397H097038j54419o7723M8160K3963J5719K08701m19205M12438n9221M3369m22396
5386G726424l57086J96137K99646j50408n6007n3497J18527j90341m1909N7541
5376G549027j56003K5100J47108P8577o4288L05829l43286n551j89017l94038
5366F953458M99351j91037J06308O44576n68801P4014K7424j51286J94739K05068
5356G793814j94636J41713k71414n3068j38302m5052L01233l23626M04622l10457
5346G304827J02932j45963N01725j68989J60771j95589k82480r2917j3774J93884
5336G364427k65950R10086r02022J23423P4237J746o7468N1188k85389N19223
$$ plain form
5408 8389538 8341477 8101186 8146966 8207922 8311914 8140877 8167447 8095587 8124502 8137097 8097038
5397 8097038 7942619 7874896 7923056 7947019 7962738 8171439 7752234 8164672 8105451 8148820 7726424
5386 7726424 7369338 7565475 7865121 7714713 7658706 7605209 7723736 7533395 7491486 7549027
5376 7549027 7393024 7418124 7565232 7643809 7579521 7885350 7542064 7536513 7347496 6953458
5366 6953458 7452809 7261772 7368080 8012656 7443855 7517869 7545293 7394007 7588746 7793814
5356 7793814 7599178 7740891 7469477 7416409 7278107 7233055 7534288 7210662 7615284 7304827
5346 7304827 7407759 7261796 7763521 7594532 7755303 7559714 7277234 7184317 7170543 7364427
5336 7364427 7098477 8008563 7106541 7229964 7304201 7305947 7238479 7289667 7004278 7523501
5326G523501m82968k824l05150N80583m1181k40495K60011m25364K83462l01116
5316F848459K18951J0371L11701k83302n3457q0776J84847j83954J36458n39152
5306F570146P21320L1732l12910j49304m5311O37230m73571Q1321j68646K03830
5296G095837L75891o65611K98659R3460j37951J1729J84890l03156k45481K43276
5286F951543O0022J94627k20062K14902j61082j82145K26148J55900P9521k50551
5276G068823n11787M81068m06993P59404J0213j62027P6058j57133M0022l46998
5266F850650K59180K58527j05896J57623j33078L07919k76391K25318k99964J18166
5256G362054j96055L61529k59504K16323O6473j06663J79496J74340n7010m21729
$$ plain form
5326 7523501 7040533 7037709 6732559 7313142 7271961 7031466 7291477 6866113 7149575 6848459
5316 6848459 7067410 7077781 7389482 7106180 7052723 6971947 7156794 6972840 7109298 6570146
5306 6570146 7291466 7323198 7010288 6860984 6815673 7452903 6979332 7060653 6892007 7095837
5296 7095837 7471728 6806117 7104776 7198236 7060285 7072014 7256904 6953748 6708267 6951543
5286 6951543 7011565 7206192 6986130 7201032 7039950 6857805 7083953 7239853 7319374 7068823
5276 7068823 6557036 7038104 6631111 7390515 7400728 7238701 7314759 7157626 7197648 6850650
5266 6850650 7109830 7368357 7262461 7420084 7287006 7594925 7318534 7543852 7243888 7362054
5256 7362054 7165999 7527528 7268024 7484347 7550820 7444157 7623653 7797993 7740983 7319254
5246G319254j14777M42059k75097j29123L72796J03554l34798l1600j2697N67022
5236G906593n76373J07824k07901n0150j43266L23596K42898l07730J39539m40129
5226F994901J77180k10997M26473K71570m14745q9908j55547K00975J31306J29459
5216G460667R5879p5879K18728j94350P9117l59205L36514j60755J47474K33247
5206G781437L01284k61833m01587M59928o1785k29789l9973R0356K59169p9233
5196G817974R9845l54431M69737k30173P7092M2346K69066J88935n93732J7934
5186G804593K55195L31281j38834j9601K1189j85272N42151l19617J65143k35023
5176H221205L444Q2200M95453l13758K44967l08374L95146q8561l8739j29335
$$ plain form
5246 7319254 7204477 7646536 7371439 7242316 7615112 7718666 7383868 7352268 7339571 7906593
5236 7906593 7330220 7438044 7230143 7179993 7036727 7360323 7603221 7295491 7435030 6994901
5226 6994901 7172081 6961084 7387557 7659127 7244382 7154474 6998927 7199902 7331208 7460667
5216 7460667 7556546 7480667 7699395 7505045 7584162 7224957 7561471 7400716 7548190 7781437
5206 7781437 8082721 7820888 7419301 7879229 7817444 7587655 7547682 7638038 7897207 7817974
5196 7817974 7917819 7563388 8033125 7802952 7880044 7922390 8191456 8380391 7786659 7804593
5186 7804593 8059788 8391069 8252235 8232634 8253823 8068551 8610702 8291085 8456228 8221205
5176 8221205 8224649 8306849 8802302 8488544 8733511 8425137 8820283 8731722 8692983 8563648
5166H563648J33757L30004l66779K79990J87075L03074k38425j5250J32277k66873
5156I042498K71286J25193J3756N91787k18293n7978o736k54846J45327J93976
5146I845970k97564L19627L80557o6673K54253m554J76858r1907J8873K88576
5136A0824016p0561P33306l97296K56336k70757O22632k90997L08286J94002j36727
5126A1772240N01175q095J65796N49505j44279N88073m962L82279N53669j60959
5116A4194442N88239q6751O97997j85679J135207J26748K85884J333229J63020
5107A8252336M49534J047829J294420Q53695O80566J400248R23406J641257J776916
5098B8320207J524710J987679J960509J560344K461034J223653J364806J301489
$$ plain form
5166 8563648 8697405 9027409 8660630 8940620 9127695 9430769 9192344 9177094 9309371 9042498
5156 9042498 9313784 9438977 9452733 10044520 9826227 9768249 9761513 9506667 9651994 9845970
5146 9845970 9548406 9868033 10248590 10181917 10436170 10431616 10608474 10516567 10535440 10824016
5136 10824016 10753455 11486761 11089465 11345801 11075044 11697676 11406679 11714965 11908967 11772240
5126 11772240 12273415 12265320 12431116 12980621 12836342 13424415 13419453 13801732 14355401 14194442
5116 14194442 14782681 14695930 15393927 15208248 16343455 16470203 16756087 18089316 18252336
5107 18252336 18701870 19749699 21044119 21897814 22578380 23978628 24902034 26543291 28320207
5098 28320207 29844917 31832596 33793105 35353449 37814483 39038136 40402942 41704431
5090D1704431R26985O48802N65674j10514M7182l5248J45167k05167j26086l60993
5080D3200233r66885p80010j233334j513032j931084j320410k566044j498218
5072C1391216j742908j466585j428367j048490p67152j436575q73864j075220
5064B1552055n02144j144763J25039l90697p36486l0975r73559J25815p22399
5055A7301886j25523m80665r5618n6505q90259m4414Q4668l13497m29411J59477
5045A5110139r8734p2995J54918k27103K16909j60153N4384P6176R0293K78562
5035A5422396k31369O95946P6930L00196K09789M88082J48523L12110J13318O23935
5025A8159856N68439M51907O06756M45519K61797M63399j40291O54720K69409
$$ plain form
5090 41704431 42631416 43280218 43845892 43735378 43782560 43747312 43892479 43687312 43561226 43200233
5080 43200233 42233348 41453338 40220004 38706972 36775888 35455478 32889434 31391216
5072 31391216 29648308 28181723 26753356 25704866 24937714 23501139 22627275 21552055
5064 21552055 21049911 19905148 20030187 19639490 18903004 18872029 17898470 18024285 17301886
5055 17301886 17176363 16695698 16600080 16543575 15653316 15608902 15693570 15380073 14950662 15110139
5045 15110139 15011405 14938410 15093328 14866225 15083134 14922981 14977365 15053541 15143834 15422396
5035 15422396 15191027 15886973 15963903 16264099 16473888 16961970 17110493 17422603 17535921 18159856
5025 18159856 18728295 19180202 19786958 20232477 20494274 20957673 20817382 21472102 21741511
5016B1741511M06333O28798M49801J182575M22462J273708R31870N66764J639795
5007B9243617J837197J404828J861575J299672K544599K730364K816668K668107
4999D6406627K647274L511053K698276K980362K271968K255037J520150L02382
4991F4593129P3850j181549j476764k275147l001855k873330l273726l459572
4983D7125036k803364l562479k228407l337885k341755k642684j412950k225655
4975B6569857q76227j595491j112972j109871r88090j041723q01144p09285k79211
4966A8055843r25250n92251n81697j95366p60588l36128L40536l60844k62679
4957A4381576k23508n12418J22870l71861j40954l75158l709k16960l25281o72046
$$ plain form
5016 21741511 22147844 22776642 23226443 24409018 24831480 26105188 27037058 27603822 29243617
5007 29243617 31080814 32485642 34347217 35646889 38191488 40921852 43738520 46406627
4999 46406627 49053901 52564954 55263230 58243592 60515560 62770597 64290747 64593129
4991 64593129 64666979 63485430 62008666 59733519 56731664 53858334 50584608 47125036
4983 47125036 44321672 40759193 38530786 35192901 32851146 30208462 28795512 26569857
4975 26569857 25693630 24098139 22985167 21875296 20887206 19845483 19044339 18335054 18055843
4966 18055843 17130593 16538342 15956645 15761279 15000691 14664563 15005099 14644255 14381576
4957 14381576 14158068 13645650 13768520 13396659 13255705 12880547 12876838 12659878 12334597 11662551
4947A1662551N6547o03416o9232Q1863k89306j51094j11355m06825J20110k04295
4937A0085548n38989J17542k5438O9380o72269L0804L15400r17461M16011J88948
4927I069476l11969k55339J92103n7576k64556N5486j98633k45893K85934O1927
4917H330960r3346m8035j96585J0368j92759L06499K9693l36414J61524j44905
4907G827000k78626L79808l30243K03036J08919j41134j98562J54330n8008j08307
4897G558213K54839k10840j5617j34141J28688J59318j11282m58754L10487K15517
4887G696428Q5949k75212K57783p1205r8401K26615l6203l94657N54762j23589
4877G822270K26899R5709j08086j85936M61219k52944N56744l47712r9135J39634
$$ plain form
4947 11662551 11719098 11115682 11046450 11128313 10839007 10687913 10576558 10169733 10289843 10085548
4937 10085548 9546559 9664101 9638663 9708043 9035774 9066578 9381978 8464517 8880528 9069476
4927 9069476 8757507 8502168 8694271 8636695 8372139 8427625 8228992 7983099 8269033 8330960
4917 8330960 8237614 8189579 7992994 8003362 7810603 8117102 8146795 7810381 7971905 7827000
4907 7827000 7548374 7928182 7597939 7800975 7909894 7768760 7570198 7724528 7666520 7558213
4897 7558213 7813052 7602212 7586595 7452454 7581142 7740460 7629178 7170424 7480911 7696428
4887 7696428 7782377 7507165 7764948 7693743 7595342 7821957 7785754 7391097 7945859 7822270
4877 7822270 8049169 8144878 8036792 7850856 8312075 8059131 8615875 8268163 8169028 8308662
4867H308662m3636K76942q316L93M64397p4788M55107l86724N15992k50447j00286
4856I157296L14501K58249k27869N11279j01731l8216Q398j2803L60619m49156
4846I780567M15680j63581L78055n84162N54566j13393j39456j51402K27588M0284
4836A0244746n3435K11063j07212m21911K680J30600k92246k26629J58445r4548
4826I551553o6426j64275k70923k87407L83036l09558J31009j01170K8684m34918
4816H459605K87252m89701L83183j89850l79143j58501M7146J99438l85541l5145
4806G738743j51160n5065O9498R5119L14326q72752L61466k67343N48495m94942
4796G286385N6800N3740n0656m83759K58725j26446K5039R0206J98700l88525
$$ plain form
4867 8308662 8265026 8541968 8533652 8534045 8998442 8923654 9378761 8992037 9508029 9257582 9157296
4856 9157296 9471797 9730046 9502177 10013456 9911725 9873509 9881907 9869104 10229723 9780567
4846 9780567 10196247 10032666 10410721 9826559 10381125 10267732 10128276 9976874 10204462 10244746
4836 10244746 10191311 10402374 10295162 9873251 9875931 10006531 9714285 9487656 9646101 9551553
4826 9551553 9485127 9320852 9049929 8762522 9145558 8836000 8967009 8865839 8894523 8459605
4816 8459605 8746857 8257156 8640339 8450489 8071346 7912845 7959991 8159429 7773888 7738743
4806 7738743 7587583 7532518 7602016 7697135 8011461 7138709 7500175 7232832 7781327 7286385
4796 7286385 7343185 7396925 7346269 6862510 7121235 6994789 7019828 7110034 7308734 6920209
4786F920209J8433O6562j45741l18024j95499M58279J96274j47913j64099j0567
4776F677914L07330l37709M02907o5465n6266j89348J85206k31640l8298J81387
4766F836018k81528K94469K32976l96961J04181r4367n8218M48191q49220N47586
4756F783127j30789M98102k53532j36469K13194j02391J96473k44596M7973J29229
4746G000321J59904K06625n33787K61609J14063M38359n23385j52823M17712K79069
4736G667667k01908J77916p6184m57083L24156j55155L06915j43272O03190m11456
4726G634786J97144K50776q03317L54240J43874k02699L56265p1677K41124J36033
4716H236549M4550j76708K5828j67988M38265k82081j57706M81445J8768p1616
$$ plain form
4786 6920209 6938642 7005204 6859463 6541439 6345940 6804219 7000493 6852580 6688481 6677914
4776 6677914 6985244 6647535 7050442 6984977 6928711 6739363 6924569 6692929 6654631 6836018
4766 6836018 6554490 6848959 7081935 6684974 6789155 6694788 6636570 7084761 6235541 6783127
4756 6783127 6652338 7150440 6896908 6760439 6973633 6871242 7067715 6823119 6871092 7000321
4746 7000321 7160225 7366850 6833063 7094672 7208735 7647094 7123709 6970886 7388598 7667667
4736 7667667 7465759 7643675 7567491 7110408 7434564 7279409 7586324 7443052 8046242 7634786
4726 7634786 7831930 8082706 7279389 7633629 7777503 7574804 7931069 7859392 8100516 8236549
4716 8236549 8281099 8104391 8130219 7962231 8400496 8118415 7960709 8442154 8460922 8389306
4706H389306K95249K2883k3155k24390K33520N0814k87183J56579N6846K23961
4696H894430K12669r401P1852J41359j84209J43409k83489L83600k66136M17687
4686I521771J13863p2278L34163M5745Q8073O3209l02125q2726M5403J34987R7067
4675I987152M54278j94368k6711o6452K59977J95511j03235j21132K46084l12115
4665A0318989N89926Q4003n06046O32050m51949J56296K98423M912j25985K42088
4655A1242707k18551R3499K676K00790J46635J53547j61534j0988K87105m00942
4645A1334944K77095m07094J00297K50950n4264R6571L08565k53980J46212J88279
4635A1987575M4023K69425j391p0623Q0184M26372N8593m25441K44409M9852l73002
$$ plain form
4706 8389306 8684555 8707438 8684283 8459893 8693413 8744227 8457044 8613623 8670469 8894430
4696 8894430 9107099 9097698 9169550 9310909 9126700 9270109 8986620 9370220 9104084 9521771
4686 9521771 9635634 9563356 9897519 9943264 10031337 10094546 9792421 9709695 9755098 9890085 9987152
4675 9987152 10441430 10247062 10220351 10153899 10413876 10609387 10506152 10385020 10631104 10318989
4665 10318989 10908915 10992918 10486872 11118922 10666973 10823269 11121692 11126604 11000619 11242707
4655 11242707 11024156 11117655 11120331 11321121 11467756 11621303 11459769 11448781 11735886 11334944
4645 11334944 11612039 11204945 11305242 11556192 11501928 11598499 11907064 11653084 11799296 11987575
4635 11987575 12031598 12301023 12299632 12229009 12309193 12735565 12794158 12368717 12613126 12662978 12289976
4624A2289976N90023K09856k82222M49450n02595K47411P3889O7297L60751n03750
4614A3000086N71330m28046M01321j12260J76996q0086J56520L86580q2271K20143
4604A4210313k43943q4005L57311J6090j25620K92464j11319N09640m92867N27252
4594A4855316j09491K85834J11372L76505k73500K16880L05462K7314L31792m3073
4584A6084411k16801N1747M63428J10039K27853j83263L44217K03033J86487K57399
4574A7528550L61477q4667Q4374J80354K87223n1491K38774J60796L46472J68009
4564A9219871L09212L3823j03094L07391P01938k77325J65479J61747L55586K95936
4554B1170564Q2216K46624M41921K13451L83647K01885K58935J40800M76867L12055
$$ plain form
4624 12289976 12879999 13089855 12807633 13257083 12754488 13001899 13075788 13143085 13503836 13000086
4614 13000086 13571416 13143370 13544691 13432431 13609427 13529341 13685861 14072441 13990170 14210313
4604 14210313 13966370 13882365 14239676 14255766 14130146 14422610 14311291 14820931 14328064 14855316
4594 14855316 14745825 15031659 15143031 15519536 15246036 15462916 15768378 15795692 16127484 16084411
4584 16084411 15867610 15919357 16382785 16492824 16720677 16537414 16881631 17084664 17271151 17528550
4574 17528550 17890027 17805360 17889734 18070088 18357311 18305820 18544594 18705390 19051862 19219871
4564 19219871 19529083 19562906 19459812 19767203 20469141 20191816 20357295 20519042 20874628 21170564
4554 21170564 21252780 21499404 21941325 22154776 22538423 22740308 22999243 23140043 23616910 23928965
4544B3928965j8179N39381M40377N25916L69225m4565O68158L13387M74821M35175
4534B7632661P22255L50944N98239L41465M06654R94238N69148N81646Q58398
4525C3055648O99671L45457R09720O29746O39239O71988P72621O25453Q70813
4516C9220356R69852P57898L89769P01514K20507R96624Q88639P44222J193819
4507D6083200N57947J511557Q86323J075599J244513J808846J204652J188135
4499E5560772J307775J620513J451417J707649J305749J098257J363884J540092
4491F6956108J390306J686518J339623J616021J880629J818501J874611J809117
4483H0371434K543782K124496K131537K619757K502655K452330L700369L050364
$$ plain form
4544 23928965 23910786 24450167 24890544 25416460 25785685 25741120 26409278 26722665 27197486 27632661
4534 27632661 28354916 28705860 29304099 29645564 30052218 31046456 31615604 32197250 33055648
4525 33055648 33755319 34100776 35010496 35640242 36279481 36951469 37724090 38349543 39220356
4516 39220356 40190208 40948106 41337875 42039389 42259896 43256520 44145159 44889381 46083200
4507 46083200 46641147 48152704 49039027 50114626 51359139 53167985 54372637 55560772
4499 55560772 56868547 58489060 59940477 61648126 62953875 64052132 65416016 66956108
4491 66956108 68346414 70032932 71372555 72988576 74869205 76687706 78562317 80371434
4483 80371434 82915216 85039712 87171249 89791006 92293661 94745991 98446360 101496724
4475A01496724L151414L492141L867595L708087L972825L915659M395965M508096
4467A32508506M955987N175664M781310N270871N069810M889067M956113L736766
4459A71344094M166369K854289K684893K385045J977736K170536J792167J901570
4451A91276699K415667K441745L111507L238011M425916M566596M679378N146018
4443B21301537M835112N227104N231828M227040M667937L233535L378198K842850
4435B54945141K559282K269757J796632K616793K343134J710132K529237K054389
4427B72824497J459775J682489M90704J92704o95039j064339j284306j820414
4419B71786071k325677k146920j740577k081771j118077q28198l55821M46820
$$ plain form
4475 101496724 104648138 108140279 112007874 115715961 119688786 123604445 128000410 132508506
4467 132508506 137464493 142640157 147421467 152692338 157762148 162651215 167607328 171344094
4459 171344094 175510463 178364752 181049645 183434690 185412426 187582962 189375129 191276699
4451 191276699 193692366 196134111 199245618 202483629 206909545 211476141 216155519 221301537
4443 221301537 226136649 231363753 236595581 240822621 245490558 248724093 252102291 254945141
4435 254945141 257504423 259774180 261570812 264187605 266530739 268240871 270770108 272824497
4427 272824497 274284272 275966761 276457465 276650169 275955130 274890791 273606485 271786071
4419 271786071 269460394 267313474 265572897 263491126 262373049 261544851 261189030 261635850
4411B61635850J917940J698890K681392L560579K602126K724289K858676J689218
4403B81368960M04863j30049j438318j803411k349555l736008l547376l471200
4395B65297906l834123l649184l270310k919356l167440k108086k094412j741260
4387B42513735j608645j387287j725545j527371j724953j843015k017011j899426
4379B28780482k075979k244926k770120k657328k650099l287832k995983l382609
4371B06715606k866177l033176l109314l721910k517068l393601k471335l283230
4363A82319795k609017k753239k498230j940395j792507j166609j339269p64929
4355A67455600L5419q4778P90178R7655O38170n54343k23787q62660m91034j877145
$$ plain form
4411 261635850 263553790 265252680 267934072 271494651 274096777 276821066 279679742 281368960
4403 281368960 281773823 281643774 280205456 278402045 276052490 272316482 268769106 265297906
4395 265297906 261463783 257814599 254544289 251624933 248457493 246349407 244254995 242513735
4387 242513735 240905090 239517803 237792258 236264887 234539934 232696919 230679908 228780482
4379 228780482 226704503 224459577 221689457 219032129 216382030 213094198 210098215 206715606
4371 206715606 203849429 200816253 197706939 193985029 191467961 188074360 185603025 182319795
4363 182319795 179710778 176957539 174459309 172518914 170726407 169559798 168220529 167455600
4355 167455600 167491019 167406241 168196419 168294074 168932244 168377901 168154114 167291454 166800420 164923275
4345A64923275j486537k208320j941819k018143j808316k209061j706802j130602
4337A50413675m33818r41248L54092Q20748P40752J697824J873402K499434K712586
4328A59737447K946586L105018L918986L541678L551265K786093K995876J501462
4320A84084411J004276j03140j026897k028638k266272k936344l323727m437378
4312A68966291l664321m361494l307493m108186l024253l186743k679635k473969
4304A42160197l101618j612783k319851k130284k007693j895986j877842j578477
4296A25635663j380632k114328j630536k006795k051170k487805l111750k690793
4288A08161854l420877k885329l317709l239548l471471k988968k900507l105194
$$ plain form
4345 164923275 163436738 161228418 159286599 157268456 155460140 153251079 151544277 150413675
4337 150413675 149979857 149038609 149392701 150213449 150954201 152652025 154525427 157024861 159737447
4328 159737447 162684033 165789051 169708037 173249715 176800980 179587073 182582949 184084411
4320 184084411 185088687 184985547 183958650 181930012 179663740 176727396 173403669 168966291
4312 168966291 165301970 160940476 157632983 153524797 150500544 147313801 144634166 142160197
4304 142160197 139058579 137445796 135125945 132995661 130987968 129091982 127214140 125635663
4296 125635663 124255031 122140703 120510167 118503372 116452202 113964397 110852647 108161854
4288 108161854 104740977 101855648 98537939 95298391 91826920 88837952 85937445 82832251
4280H2832251k894710k596262k347014k417454k461831k398976k910818j925488
4272F2879698k842206k441547k513509k560943k301430k497783j911930j960631
4264D3849719j859335j725817j455238k036915p53325j534685j207459j270011
4256C2006934q86823j236219q14107n53359r91981q74694p90707r39252k71251
4247B4648541r55460m58330m13540m49492j094296m8936m92683j97163n61474
4238A9977167n17222q20615m54735j15459l93799n52424k12008j55816j86513
4229A6568576o41272l79910k21283k81037m37474n39019L25682o55951M42762
4220A4181074q20908j98180j44210l94777L8477m59508J04633P3328k46481l56047
$$ plain form
4280 82832251 79937541 77341279 74994265 72576811 70114980 67716004 64805186 62879698
4272 62879698 60037492 57595945 55082436 52521493 50220063 47722280 45810350 43849719
4264 43849719 41990384 40264567 38809329 36772414 36019089 34484404 33276945 32006934
4256 32006934 31120111 29883892 29069785 28516426 27524445 26649751 25859044 24919792 24648541
4247 24648541 23693081 23234751 22821211 22371719 21277423 21228487 20735804 20538641 19977167
4238 19977167 19459945 18639330 18184595 18069136 17675337 17122913 16910905 16755089 16568576
4229 16568576 15927304 15547394 15326111 15045074 14607600 14068581 14394263 13738312 14181074
4220 14181074 13360166 13161986 13017776 12622999 12661476 12201968 12306601 12379929 12133448 11777401
4210A1777401J7976l68739n34830K49000m4452m44770P1407R9641l36991j83896
4200A0301747j73515l34720N5305j25578l74689J59627j50094l39079J09109p1739
4190I056374l85353L78973n5457m18717R4751j69994k94382K77066j92612L52995
4180H643644o24802p800J04944J06706k09941l04233J18323j06436K40761o09447
4170G351719K69376l33694p151p1241j38725l0912J95312k42263r0978j58891
4160F742552l4594j55715l78937P95895l99603j25782L2396J66666k22991k48026
4150F171861J57692k00960L34294k30876L35151k91318k00693j88311O0930J1721
4140E959491J55136n77126L30121l42822K24290j47273j38670l6925M14081k49367
$$ plain form
4210 11777401 11795377 11426638 10891808 11140808 11096356 10651586 10722993 10822634 10485643 10301747
4200 10301747 10128232 9793512 9848817 9723239 9348550 9508177 9358083 9019004 9128113 9056374
4190 9056374 8671021 9049994 8994537 8575820 8670571 8500577 8206195 8483261 8290649 8643644
4180 8643644 8018842 8011042 8115986 8222692 8012751 7708518 7826841 7720405 7961166 7351719
4170 7351719 7621095 7287401 7280250 7209009 7070284 7039372 7234684 6992421 6901443 6742552
4160 6742552 6707958 6552243 6173306 6969201 6569598 6443816 6476212 6642878 6419887 6171861
4150 6171861 6329553 6128593 6462887 6232011 6567162 6275844 6075151 5886840 5947770 5959491
4140 5959491 6114627 5537501 5867622 5524800 5749090 5601817 5463147 5426222 5840303 5590936
4130E590936K66029k43213q3708k00353j52185j21114M75609k24995N62061m80010
4120E389057m7416j30662J9509l39822P0540N13314o53448K69522p9574J36861
4110E147881j48034q8776k62211O81016j14936n5429m92701L39545l13890L48619
4100E041084m86167P49471k22471K63354l64069K79801m03399r6241L96947j36325
4090E021985K8145o3368M7585J85415k43148n5141L24579l64581j85647L98468
4080E094292K39611n14351L00870k9600L32326m1413L4648j73666q2841R502K52299
4069E421677P2167j27585L44996k44106K63058K4069M902K57523k41695J50351
4059E925357J90058k55294K33493l1630K00328m89355K95277Q1264m0250K25603
$$ plain form
4130 5590936 5856965 5613752 5530044 5329691 5177506 5056392 5532001 5307006 5869067 5389057
4120 5389057 5341641 5210979 5230488 4890666 4961206 5474520 4821072 5090594 5011020 5147881
4110 5147881 4999847 4911071 4648860 5329876 5214940 5159511 4666810 5006355 4692465 5041084
4100 5041084 4554917 5304388 5081917 5345271 4981202 5261003 4857604 4761363 5158310 5021985
4090 5021985 5050130 4986762 5034347 5219762 4976614 4921473 5246052 4881471 4695824 5094292
4080 5094292 5333903 4819552 5120422 5090822 5423148 5381735 5416383 5242717 5159876 5169378 5421677
4069 5421677 5493844 5366259 5711255 5467149 5730207 5754276 5759178 6016701 5775006 5925357
4059 5925357 6115415 5860121 6093614 6061984 6262312 5772957 6068234 6149498 6109248 6334851
4049F334851k73120K19726m26410L8634J60468L97523m10698N23933m3842j75748
4039F345317J35097K26030l97191q3618L41893q8177M51490j77393o2612l00388
4029F390448J94231j20349M08887j12242k53122P1935j43438q4573K48885j69787
4019F430875k26448q6M8000K56282l48691m61153m8545J08159n00572N07749k10375
4008E555195J09961j07329k97293J05065K04288j54815j86365R0132M2915L997
3998E365751k1452J36120m15717j48026k30319r7018j79716L57487K06796o64877
3988D309029k0840m53952O57712l95978k35311K43554k96984n7503j30570K11902
3978C831059j06642m15931J98721j04960K93757k84486O4357m24753L30641p8602
$$ plain form
4049 6334851 6061731 6281457 5855047 5893681 6054149 6451672 6040974 6564907 6521065 6345317
4039 6345317 6480414 6706444 6309253 6225635 6567528 6479351 6930841 6753448 6690836 6390448
4029 6390448 6584679 6464330 6873217 6760975 6507853 6579788 6436350 6351777 6600662 6430875
4019 6430875 6204427 6204341 6252341 6508623 6159932 5698779 5650234 5758393 5257821 5765570 5555195
4008 5555195 5665156 5557827 5260534 5365599 5569887 5415072 5228707 5318839 5361754 5365751
3998 5365751 5344299 5480419 5064702 4916676 4686357 4589339 4409623 4767110 4973906 4309029
3988 4309029 4288189 3834237 4491949 4095971 3860660 4104214 3807230 3749727 3619157 3831059
3978 3831059 3724417 3308486 3507207 3402247 3696004 3411518 3475875 3051122 3381763 3303161
3968C303161l92166o6666K7479k8121J01304m35746o1348k29628O54648l31906
3958B541011k19465j58189n6796J19259l63637M04280J78992k61414n19618L65619
3948B030042k63794M72121l55566J75419J07416k67343j54143j4758j48792K49039
3938A829641l00115j34780J11610M7807k8830L95109j32685n80271O91053k02100
3928A696439m91374M9183K01444l73760j27012L35212O475p2720l05974K36963
3918A154876M37037k26953Q7858m71106L40133n30075P31393l17518m5378p0610
3908A089657N10879l27397k7096O948j3901l9682j40008L80245j95320k29845
3898A014480K409j02121l173M3325k78852K48209O4447K1518l03533J56453J62605
$$ plain form
3968 3303161 2910995 2844329 2871808 2843687 2944991 2509245 2447897 2218269 2872917 2541011
3958 2541011 2321546 2163357 2106561 2225820 1862183 2266463 2445455 2184041 1664423 2030042
3948 2030042 1766248 2238369 1882803 2058222 2165638 1898295 1744152 1729394 1580602 1829641
3938 1829641 1529526 1394746 1506356 1554163 1525333 1920442 1787757 1207486 1898539 1696439
3928 1696439 1205065 1254248 1455692 1081932 954920 1290132 1296607 1223887 917913 1154876
3918 1154876 1591913 1364960 1452818 981712 1321845 791770 1523163 1205645 1160267 1089657
3908 1089657 1600536 1273139 1246043 1252991 1239090 1199408 1059400 1439645 1244325 1014480
3898 1014480 1016889 914768 911595 954920 676068 924277 988724 1010242 706709 863162 1025767
3887A025767j81659j21155j22362M26707j82191M6319n5891j18972M28765J98971
3877A344299l60729m53340J51848J92753n93124M56927j31693m5415K21750l47570
3867D35706K32666L6796K84994m18616J73841k12283P0827k40722K83032j0739
3857F35502K17076m28918J63777j12405K40438J66144k89121M27540m28131J98954
3847G90856J08260n61072K54402k26547M1233N44260m21331m17938K96934o9874
3837C39183L59908j2236Q9695j36678j5980N2118k15885L3388K5524J87514k62330
3826D44221k31086L24245N2892K1811Q2392J30926m32497M5114j9741P1602R4228
3815E84107k3005J40890j50771J61762r0629j41866K5739J19047K86511k77395
$$ plain form
3887 1025767 844108 722953 600591 1027298 845107 891426 835535 716563 1145328 1344299
3877 1344299 983570 530230 682078 874831 281707 738634 606941 561526 783276 435706
3867 435706 668372 705168 990162 571546 745387 533104 603931 363209 646241 635502
3857 635502 852578 423660 587437 475032 715470 881614 592493 1020033 591902 790856
3847 790856 899116 338044 592446 365899 407132 951392 530061 112123 409057 339183
3837 339183 699091 686855 776550 639872 623892 676010 460125 493513 519037 706551 444221
3826 444221 213135 537380 590272 612083 694475 825401 392904 438018 418277 489879 584107
3815 584107 561102 701992 551221 712983 622354 480488 506227 625274 911785 634390
3805F34390k84832J30610k5707o4897L73395l76507O9933j05868J40429j70811
3795C20135J86545R938J14162j73642K32137k94836K15426l02488j62322J83107
3785C28162M010L1298L69177m09917j42621K01334j73725P6480j62896K69343
3775C90645k13637J31843N7922Q6022l2911l66010L81671j9497P2114p34664P93659
3764E47157k55486j28960K778K03394k11806K37565k1051m42817O40141m91547
3754G9368j42957L4486P74311l17397J39777j35145r6303l84729L29139L1966
3744C12516k57586l9782K76655J84457j32115p14k39067J42577l39998M37260
3734C44203M8824m9121j71767q3469Q5463J53576n4484J44502p6589n2160M2440
$$ plain form
3805 634390 349558 480168 454461 389564 762959 386452 456385 350517 490946 320135
3795 320135 506680 516618 630780 457138 689275 394439 609865 307377 145055 328162
3785 328162 332172 363470 732647 322730 180109 381443 207718 284198 121302 390645
3775 390645 177008 308851 366773 452795 419884 53874 435545 416048 488162 -246502 547157
3764 547157 291671 162711 165489 368883 157077 394642 373591 -69226 570915 79368
3754 79368 -63589 -29103 745208 427811 567588 432443 336140 -48589 280550 312516
3744 312516 54930 15148 291803 476260 344145 343431 104364 246941 -93057 344203
3734 344203 393027 343906 172139 88670 174133 327709 273225 417727 341138 288978 331418
3723C31418j65536n0563K29201L48411k87846j90362J11832J14658r7622J85459
3713E29050n41270L09364P9715K57228m30875j31383O4321Q4235J47862j45494
3703B22753r5665K833j54184j08198L069M29119M6207P841J45158m34924M43864
3692E07873k59160K4502M4558o1275j39250j56553N38005k58145J93361k50686
3682A83230M86516n6945j28100j58924l9923j11964J78707j95367J59969j85454
3672A31745r837J01186K40004n01J11846n53051J33604j01318Q9687l4566N4539
3661A63338k59778J15755O7400N3210L7981M50988m45646M61766k41093k40985
3651A62936j25628J23621J05775m30635L66130l33540M1022J71619J46772J19120
$$ plain form
3723 331418 165882 115319 344520 692931 405085 214723 326555 441213 343591 529050
3713 529050 -12220 297144 376859 634087 203212 71829 136150 220385 368247 222753
3703 222753 127088 129921 -24263 -132461 -129392 299727 345934 353775 498933 64009 507873
3692 507873 248713 273215 317773 256498 117248 -39305 498700 240555 433916 183230
3682 183230 669746 612801 484701 325777 285854 173890 352597 157230 317199 131745
3672 131745 121908 223094 463098 462597 574443 21392 154996 53678 143365 108799 163338
3661 163338 -96440 19315 86715 139925 177906 628894 183248 645014 403921 162936
3651 162936 37308 160929 266704 -163931 202199 -131341 -90319 81300 228072 347192
3641C47192J14635l68939o7764J12083K89968j68433j95884n8538L03929j20187
3631A88062M9673j21462P7333j65827N3150K48596K5227l9138j02417J6903j10310
3620A19790k3148j8568l06706M22736j93522j43857J54834J12478P047l68446
3610b37362L69202O9222K05646m15844L27958M5781k96990L5304J25748K17623
3600D46288k62314J13660j68710L19875m52722K83691j53102k15640K00206j67210
3590e5978K11855P7630j33998j08530J60046j19355K23788k53528N44768j26524
3580D20174N5530r7479j97082J21042N2018m41596M23262o8135j34550R9712n923
3569B26973K16732r5045j95917J64515l79205L72060j72158k46018O46175o60595
$$ plain form
3641 347192 461827 92888 25124 137207 427175 258742 62858 4320 308249 188062
3631 188062 237735 116273 193606 27779 80929 329525 354752 315614 213197 230100 119790
3620 119790 96642 78074 -228632 194104 582 -143275 11559 124037 131084 -237362
3610 -237362 131840 201062 406708 -9136 318822 364603 67613 102917 228665 446288
3600 446288 183974 297634 128924 448799 -3923 279768 126666 -88974 111232 -55978
3590 -55978 155877 233507 99509 -9021 151025 31670 255458 1930 546698 420174
3580 420174 475704 378225 181143 302185 354203 -87393 335869 267734 133184 232896 226973
3569 226973 443705 348660 152743 317258 -61947 310113 137955 -108063 538112 -122483
3559a22483K65990K59402k16287k96794L40929J19170m240l0709k93167K6802
3549D8613N83962m886m44365J20965j76162K00306L34361n39683K08743k15433
3539A16421M2423r6131M04388l43490L11304l27378K75723M8644k54149j13150
3529F4605P972Q0519P372k8626K14792K43446l50674O0793j08671L72695k45369
3518C18854J28083P1810J3711J99806j51649j85703M69511k09748J07519q8223
3508F73971M32699k86061J64241J66030M07895l21466L68801K0365j92456L42227
3498A776246k47854J87555k43083n8951q6720q5450J88642m08679k08537N3390
3488H66559L95875j83051n98257Q1479j02688J85858k95880O10035j14049k04027
$$ plain form
3559 -122483 143507 402909 186622 -110172 230757 349927 345687 314978 21811 48613
3549 48613 632575 627689 183324 304289 128127 328433 662794 123111 331854 116421
3539 116421 158844 62713 467101 123611 434915 107537 383260 431904 177755 64605
3529 64605 72577 153096 160468 131842 346634 590080 239406 300199 191528 564223 318854
3518 318854 446937 518747 532458 732264 580615 394912 864423 654675 762194 673971
3508 673971 1106670 820609 984850 1150880 1558775 1237309 1606110 1626475 1434019 1776246
3498 1776246 1528392 1715947 1472864 1413913 1327193 1241743 1430385 1021706 813169 866559
3488 866559 1262434 1079383 481126 562605 459917 645775 349895 959930 845881 641854
3478F41854k42390n1944k0590M60732k06309j76578Q0793j41558j24512M34426
3468F53924l81381M30041k35897p8125J31152j62784J00008j55456O71174k39861
3458G32795l37856M2531L92506K81325o89320q7638k34908M00102O2551J71302
3448G33390n57826M68290P6830L25158n20052J17592k0323L676L23128j25648
3438H24215J38967j5473K64616m64734j50213L25909l15955J50394m6005M82145
3428A193866k30028j91981j07327K50460m3232P5251j16565L92254j76428N6303
3418A102573l8414O4719L76543l74469J36285J05377j00744L532L95833J01451
3408A772686J16947l05958N5878l9031L61020M05147l37800L17036M77457k41622
$$ plain form
3478 641854 399464 347520 326930 787662 581353 404775 485568 344010 219498 653924
3468 653924 272543 702584 466687 388562 519714 356930 456938 301482 972656 732795
3458 732795 394939 437470 829976 1111301 421981 334343 99435 499537 562088 733390
3448 733390 175564 643854 720684 1045842 525790 643382 623059 626735 949863 824215
3438 824215 963182 947709 1212325 747591 597378 923287 607332 757726 711721 1193866
3428 1193866 963838 771857 664530 914990 871758 947009 830444 1222698 1046270 1102573
3418 1102573 1064159 1128878 1505421 1130952 1267237 1372614 1271870 1275402 1671235 1772686
3408 1772686 1889633 1583675 1639553 1600522 1961542 2366689 2028889 2345925 2823382 2581760
3398B581760L65149J73754J30248J11986J69235P03895j01821M30341N71902M2255
3388E178704Q67421j81550P59450P99755L8751O59P31173j05152N27310k76282
3378H340239r2928l36078k9866l7442q01612p43739o24625J38349m42912l45835
3368E023551n99758j46587n47230N6067n70657Q7078k14025k12707j211m74659
3358B399862R1962k65322k08765M63117l34840j27044j04198K72575l29224j08653
3348A749470P537K31731k08504K28231l08816M11590j25045j15694J63986K51744
3338B286230j06909J27727j47822M10132L19007N4603J03820P143J11833L65235
3328C530999J58099O58381m08934J83407J91486j04900j62403P842L16424o09448
$$ plain form
3398 2581760 2946909 3120663 3250911 3362897 3532132 4236027 4134206 4564547 5136449 5178704
3388 5178704 6046125 5864575 6624025 7423780 7462531 7463190 8194363 8089211 8616521 8340239
3378 8340239 8247311 7911233 7881367 7843925 7042313 6298574 5673949 5812298 5369386 5023551
3368 5023551 4423793 4277206 3729976 3786043 3215386 3302464 3088439 2875732 2874521 2399862
3358 2399862 2491824 2226502 2017737 2480854 2146014 2018970 1914772 2187347 1858123 1749470
3348 1749470 1757007 1988738 1780234 2008465 1699649 2111239 1986194 1870500 2034486 2286230
3338 2286230 2179321 2307048 2159226 2569358 2888365 2942968 3046788 3053931 3165764 3530999
3328 3530999 3689098 4347479 3938545 4121952 4313438 4208538 4046135 4053977 4370401 3760953
3318C760953p21381o8992k8475r3618o38065n0728j7160k77793p1211m78010M71256
3307A786776r7352o64769J88915j40646j78323M56499n83127M4869j25444m638
3297F82760L54283k17344o832j91034j99424j69196M16367J39727j66313o2442
3287E80552j60732M41535m97601P0622M8290l0949j10889p1041J38592l36675
3277G1704J24913L13717Q1842n4977j80177J42852k24399Q1145j54716k08020
3267f116J49267p0384J23073j0226J25278m27362L01278l08679K15277M34987
3257E26393m34165k8621m00304P78839m03089K05679k72376M9832L28853n73673
3247b22632K85061k72645q0067M54954q2489K89078p6260n48397K16740R9892
$$ plain form
3318 3760953 3039572 2970580 2942105 2848487 2210422 2159694 2142534 1864741 1793530 1315520 1786776
3307 1786776 1689424 1024655 1213570 1072924 894601 1351100 767973 812842 687398 682760
3297 682760 1037043 819699 812867 621833 422409 253213 669580 809307 642994 580552
3287 580552 419820 861355 363754 434376 482666 451717 340828 269787 408379 71704
3277 71704 196617 510334 592176 537199 357022 499874 275475 356620 201904 -6116
3267 -6116 143151 72767 195840 185614 310892 -116470 184808 -123871 91406 526393
3257 526393 92228 63607 -336697 442142 39053 244732 -27644 22188 351041 -222632
3247 -222632 62429 -210216 -290283 164671 82182 371260 295000 -253397 -36657 63235
3237F3235K81768l65052J36014L0253J92254P8837m45717L8935r7125P5269j28910
3226a40239K36203L11190l99052q7207K17040l81933L57763k73365K66631Q9049
3216A96080n1431j27964J80275o0070l58468J94494L60482m49945L57558l16963
3206g5952l17364N13423o4316K42186k50339j05627K9999L85158l87577j70752
3196b01161M17859k92344L27827L7134j16645k35794K95167n68563P85600o00498
3186a51418o8185L09763L4053K30811k6516n03708j37197L52881J84497L29815
3176E54796r02949L31488k04713K75198k21181j0558J78764N9920J5200m43710
3166c67745K33555K38161k86804J52715l16768L58084K58868o10184o6633K97944
$$ plain form
3237 63235 345003 -20049 115965 146218 338472 417309 -28408 10527 -86598 -11329 -140239
3226 -140239 95964 407154 8102 -79105 137935 -243998 113765 -159600 107031 196080
3216 196080 144649 16685 196960 136890 -221578 -27084 333398 -116547 241011 -75952
3206 -75952 -393316 120107 55791 297977 47638 -57989 -27990 357168 -30409 -201161
3196 -201161 216698 -75646 252181 289315 172670 -63124 232043 -336520 449080 -151418
3186 -151418 -219603 90160 124213 355024 328508 -175200 -312397 40484 224981 554796
3176 554796 -348153 -16665 -221378 53820 -167361 -177919 845 60765 75965 -367745
3166 -367745 -134190 103971 -182833 -30118 -346886 11198 270066 -340118 -406751 -108807
3156a08807J67103k69028N0595R117J16269J17654l8989R7766M0979j3342j02798
3145F6519l2813K23551n07895J79955R2817P7310m3019k92748L37266q4873L7278
3134E3348R4758j76428q7648j82858L37004K6026l07267j32108L69059L77103
3124C70989l69316l27398K89526l05543P16501l74656q1096p1924J51865l03060
3114c04112Q5349J45720R9335P2950j05007j82111L16280k65605p8175J90109
3104b5267J49063r4371j64919J36408M62J45557j19853J24883P4955j17129N0990
3093A60779m70118J83722J8369J57712j42855J78190k85408J68710p2949J98437
3083I4589q2062k37005l5642N80315o66335J79937Q2264k09716j07824J72829
$$ plain form
3156 -108807 58296 -210732 -160137 -151020 -34751 82903 43914 141680 182659 169317 66519
3145 66519 33706 257257 -250638 -70683 22134 99444 56425 -236323 100943 16070 53348
3134 53348 148106 -28322 -115970 -298828 38176 64202 -243065 -375173 -6114 370989
3124 370989 1673 -325725 -36199 -341742 374759 103 -80993 -152917 -1052 -304112
3114 -304112 -218763 -73043 26292 99242 -5765 -187876 128404 -137201 -215376 -25267
3104 -25267 123796 29425 -135494 914 1376 146933 27080 151963 226918 109789 160779
3093 160779 -309339 -125617 -107248 50464 -92391 85799 -199609 -30899 -103848 94589
3083 94589 12527 -224478 -260120 320195 -346140 -166203 -83939 -293655 -401479 -228650
3073b28650k6263K24640l95999P3772J98777N3509L17417k86164J59902l49597
3063b58656L26543l93602j51144j12350N53374O9720q2258j45089K70614j2968
3053F4184q5897J12873j47972k23996K98805j42160P8439j10836n760j84662Q7830
3042b59152m4443J24316K25504n75298K49138k78439M75596K63685k48790k65878
3032c33761n692R2514L34684k25017j58874N55253k05878l94204L58030J62473
3022A79528j79355l59948O84318l28262j86744K47248K7146j15779j76900n2926
3012b61674K70626J29650k40307k01312J07871J43073k2663J05526m16690J59626
3002b26274J13654k24465L24462j90530l36072K31287L50983k65957L35979k22384
$$ plain form
3073 -228650 -254913 -30273 -426272 -352500 -153723 -100214 217203 -68961 90941 -258656
3063 -258656 67887 -325715 -476859 -589209 -35835 33885 -48373 -193462 77152 64184
3053 64184 -21713 91160 -56812 -280808 17997 -124163 -45724 -156560 -162320 -346982 -259152
3042 -259152 -303595 -179279 46225 -529073 -279935 -558374 -82778 180907 -67883 -333761
3032 -333761 -339453 -246939 87745 -137272 -296146 259107 53229 -340975 17055 179528
3022 179528 173 -359775 324543 -3719 -190463 56785 83931 -31848 -208748 -261674
3012 -261674 8952 138602 -101705 -303017 -195146 -52073 -74736 30790 -385900 -226274
3002 -226274 -112620 -337085 -12623 -203153 -539225 -307938 43045 -222912 113067 -109317
2992a09317k62370M8384L67608l60200M88583l15858j80897L7775L62395j52417
2982g6314k83964K85362K07206k99524O5598r8108K2022L37633J2462k93282j95868
2971c16777Q6220k804J89756j68661K9655K18433n65555J69318M54095q5512Q0384
2960H8552L4581j58525r2563J35585l89496J68636j93425K64898m6270J70909
2950a7118l04648L75571r4991p5785M8265j13129j26833J01287R3931J14253K25828
2939B26631l10685J66034m0225J5886m02656K16184j12920M31823q2227j10618
2929b773k30138P700J61743N8641l00968J65286j69894L09556N9807J44504j16003
2918H7461k34863J20538m1800Q8423J09268j95637k82508N31410q627o26547K54324
$$ plain form
2992 -109317 -371687 -323303 44305 -315895 172688 -143170 -324067 -286292 76103 -76314
2982 -76314 -360278 -74916 132290 -167234 -101636 -199744 -177722 159911 172373 -120909 -316777
2971 -316777 -230557 -233361 -43605 -212266 -182611 35822 -529733 -360415 93680 8168 88552
2960 88552 123133 -35392 -127955 7630 -381866 -213230 -406655 -141757 -188027 -17118
2950 -17118 -321766 53805 -41186 -116971 -68706 -181835 -308668 -207381 -113450 803 226631
2939 226631 -84054 81980 41755 57641 -345015 -128831 -241751 190072 107845 -2773
2929 -2773 -232911 -225211 -63468 -4827 -305795 -140509 -310403 -847 58960 203464 87461
2918 87461 -147402 -26864 -68664 19759 129027 -66610 -349118 182292 173665 -452882 -198558
2907a98558l10692L24734J23287l97351L1488M79593K43629m21343p2153L62319
2897A64953k65198L9123l54703K60545L48039m74153Q1464K07082k84777K00072
2887g7553r0651K259O69332p17148o0079L9085Q4662j75039J57192P9334J08932
2876B0326O2861j80405j72905P1612J0000j39094J18794q5292p9692N03409m15895
2865b86281K38778k019O5305m56134m5707P9517R4264j68836K31272j03411Q9280
2854b63972L42218l21807K38600k64913J55024J34989N1418m91692L64384j73580
2844b29331O8358Q7073J03538l21808J8157m9491M08198l05601q3772k25236O61530
2833A31615j23405m76562M07427n3430J83203m76679K14656k2032J97374p0646
$$ plain form
2907 -198558 -509250 -184516 -61229 -458580 -427092 52501 296130 -125213 -197366 164953
2897 164953 -100245 -61122 -415825 -155280 192759 -281394 -199930 7152 -277625 -77553
2887 -77553 -168204 -165945 503387 -213761 -273840 -234755 -150093 -325132 -167940 -88606 20326
2876 20326 83187 -97218 -270123 -198511 -188511 -327605 -208811 -294103 -373795 129614 -286281
2865 -286281 -47503 -49522 15783 -440351 -486058 -406541 -312277 -481113 -249841 -353252 -263972
2854 -263972 78246 -243561 -4961 -269874 -114850 20139 71557 -420135 -55751 -229331
2844 -229331 -160973 -73900 29638 -292170 -274013 -323504 84694 -220907 -304679 -529915 131615
2833 131615 8210 -468352 -60925 -114355 68848 -407831 -193175 -215207 -17833 -88479
2823h8479j86516J72236L5204j04825j14519R0178K14403k90357m6073j07972
2813d26720k5255M98090m94230R8294j07042K83488k41067K21939r8065J75884
2803a14684m11867L25069K9011k40969J39297j57545K3305k02626N21656R581
2793g9772K55429l61530j18893l6955J54024K5797j12198Q3600k1760m9935k88471
2782e50664M62619l0362J3842K07955m19869o3089l549O80522p27160L41302j69482
2771b57935K70523m36181q8009K51332M6434k06029N7221J30404J18075l3707
2761a47872K95384o25727J77489J96543J48470k23447o3598L0636m7120P1123
2751a88119K38839m9826r3861r7863O3540k2335J20972k12371J95434J93458k58785
$$ plain form
2823 -88479 -274995 -102759 -67555 -172380 -286899 -196721 17682 -272675 -318748 -426720
2813 -426720 -451975 46115 -448115 -349821 -456863 -173375 -414442 -192503 -290568 -114684
2803 -114684 -526551 -201482 -172471 -413440 -274143 -431688 -408383 -611009 -89353 -79772
2793 -79772 175657 -185873 -304766 -341721 -187697 -161900 -274098 -190498 -212258 -262193 -550664
2782 -550664 -88045 -118407 -104565 103390 -316479 -379568 -383117 297405 -429755 -88453 -257935
2771 -257935 12588 -423593 -511602 -260270 -213836 -419865 -362644 -232240 -114165 -147872
2761 -147872 147512 -478215 -300726 -104183 44287 -179160 -242758 -212122 -259242 -188119
2751 -188119 50720 894 -92967 -190830 -127290 -149625 -28653 -241024 -45590 147868 -110917
2740a10917J89235K33604l34093j85270k2043k64437K94303l2834l12444N09114
2730c5782k04773K13577J09039p9936j85166J8371J09790k42421M19177j17779
2720D097p2213l41968K41043l3057r6005M20490m06901Q0631L0788R2840J73404
2709I3149m37410K30612j82687M34669n00649L62764L5197l90967J98344K95166
2699A38188P6416m29897m086J05526j54375K8483K78208m6465P0058l99969L01187
2688c6726j24366J29865k95669j03523K69323o5859P0515l04948P8876J790K5983
2677c54739L82268o8075k00810M6118k04544J15230j25702M66675o2177m3059
2667d8815m23063L82267o32l41150K92133n7124N3228j14532q2852K8167K45966
$$ plain form
2740 -110917 78318 311922 -22171 -207441 -229484 -493921 -199618 -232452 -544896 -35782
2730 -35782 -240555 -26978 82061 2125 -183041 -164670 -54880 -297301 121876 4097
2720 4097 -68116 -410084 -169041 -202098 -298103 122387 -284514 -203883 -173095 -80255 93149
2709 93149 -344261 -113649 -296336 138333 -362316 448 35645 -355322 -156978 138188
2699 138188 214604 -215293 -219379 -113853 -268228 -239745 38463 -8002 62056 -337913 -36726
2688 -36726 -161092 -31227 -326896 -430419 -161096 -226955 -156440 -461388 -382512 -380722 -354739
2677 -354739 27529 -40546 -241356 -195238 -399782 -284552 -410254 56421 -5756 -48815
2667 -48815 -471878 -89611 -90243 -431393 -139260 -196384 -143156 -257688 -340540 -312373 -66407
2656f6407r3264k08882J22334m4900K22528j911k00518Q6747J65572j66351n80822
2645g65874K54028K28639L8031O04503m05321o7984k73925o1748K32677q8j16518
2634c33580N6388K85524k13795l45992N67926l92618L43231J65958k10418o7856
2624a45232J00355j23823P5016J89746n02576R0451K25715K70441n65123Q8868
2614b96162K11364j05432j00569m5478Q4199K63107k80460o0421Q9788o6748N5246
2603b51566J07426m5387K83442k32705J67720Q8630j22307j75997k03311j21890
2593e05945L37340R3485o5403p6914j15737N7273M4169J29065Q6061j63029J04922
2582g4713j64565P0377L10656j45451r3284l15671J06906M2520J96343l63963
$$ plain form
2656 -66407 -159671 -368553 -246219 -291119 -68591 -70502 -271020 -184273 -18701 -185052 -765874
2645 -765874 -511846 -283207 -245176 359327 -45994 -113978 -387903 -449651 -216974 -217062 -333580
2634 -333580 -277192 8332 -205463 -551455 16471 -376147 -32916 133042 -77376 -145232
2624 -145232 -44877 -168700 -93684 96062 -406514 -316063 -90348 180093 -385030 -296162
2614 -296162 -84798 -190230 -290799 -336277 -252078 11029 -269431 -329852 -240064 -306812 -251566
2603 -251566 -144140 -189527 93915 -138790 28930 117560 -4747 -180744 -384055 -505945
2593 -505945 -168605 -75120 -140523 -217437 -333174 -275901 -231732 -102667 -16606 -179635 -74713
2582 -74713 -239278 -168901 141755 -3696 -96980 -412651 -305745 -263225 -66882 -430845
2572d30845M9761R1627O7148J57121R8815j53606p2051j21079j73388L40069n9870
2561b06298p743k8613n76623P97313J23874k42177O5485Q4730k15830R8254j00198
2550b07826k19027L36125J22400n1778J14386n88728L61168l1791k22447N68146
2540A80628L15887o02014J40056k82429M21341j93694L25652n76491K16211J54515
2530I9662j90981J09518j49282J73413m72191L54791l05928K38310O2952j03317
2520a83053K74147M6788J50214m06232k31981K7797J70314j40688L05204l91933
2510c79423J60325J5984L1093j56405N069K69151k64025J58348J3677k43646j67733
2499e57585J97368K26897M42119n64995N3896k77241N43608m46144J49762l69184
$$ plain form
2572 -430845 -381084 -289457 -222309 -65188 33627 -119979 -192030 -313109 -486497 -146428 -206298
2561 -206298 -214041 -242654 -819277 -21964 101910 -140267 -74782 9948 -205882 -107628 -207826
2550 -207826 -426853 -90728 31672 -20106 94280 -494448 -133280 -165071 -387518 180628
2540 180628 496515 -105499 34557 -247872 173469 -20225 305427 -271064 -54853 99662
2530 99662 -91319 18199 -131083 42330 -429861 -75070 -380998 -142688 -79736 -183053
2520 -183053 91094 137882 288096 -118136 -350117 -322320 -152006 -292694 12510 -379423
2510 -379423 -219098 -203114 -172021 -328426 -323357 -54206 -318231 -159883 -146206 -389852 -557585
2499 -557585 -360217 -133320 308799 -256196 -202300 -479541 64067 -382077 -232315 -601499
2489f01499N44211l82218K20040N9580r8795K69401N8496m06453J72014k85437
2479d50660N65110k05236j5482k11253M07128l54924N3388L98581n90519M95876
2469I2009m78667K53654j48619K80931N9867m29852J45505N8914l47397J31930
2459c81725J38973R855L08737k49698L674l29293N17120j35478l18819K70660
2449a65994J02688k80374m0133k03315J37880J91552L6027J73877o8445J10862
2439e375k27389Q2090m3039K06286l76399O29671p43923J94997l5224K85121j2348
2428d5532J63836k36838j28002M4025M5619K38415p56108P77049j55874j35863
2418a89273k90996K80180l11696N05790j81271L70491n64387J69390k08629J79200
$$ plain form
2489 -601499 -57288 -439506 -219466 -159886 -258681 10720 69216 -337237 -165223 -450660
2479 -450660 114450 -90786 -106268 -317521 89607 -265317 -211929 186652 -403867 92009
2469 92009 -386658 -133004 -281623 -692 59175 -370677 -225172 -166258 -513655 -381725
2459 -381725 -242752 -232897 75840 -173858 -170184 -499477 17643 -117835 -436654 -165994
2449 -165994 -63306 -343680 -383813 -587128 -449248 -257696 -221669 -47792 -116237 -5375
2439 -5375 -232764 -150674 -193713 12573 -363826 265845 -478078 -283081 -318305 -33184 -45532
2428 -45532 118304 -118534 -246536 -202511 -156892 81523 -674585 102464 -53410 -189273
2418 -189273 -480269 -200089 -511785 -5995 -187266 183225 -381162 -211772 -420401 -241201
2408b41201J65209M343n13563P92939o40967J54353m8989J27620J18481P6225
2398e550o3047K04888l83042K36427k16250N2443j29320N9385J04535K18106o26335
2387e47760N67794k59168K72987k21197L6495L93852m88770Q0709j34963j31417
2377d31438M18526l37718M97449m13364l15698K68145L45871j39716J86641l3506
2367D5192k05570j81722J09920K10622L2867o1164j61560K33527j1044J87200
2357A98268n73182L75501k61968J82036j78707K42271L4350j77362J66250k33132
2347b25675r0472N9238L69249n7898K18342n44606M980J07354l5683K20303m81484
2336d56352L38686m48459M99890k86181J76751L42129l12145m18323O21484l5731
$$ plain form
2408 -241201 -75992 -71649 -585212 207727 -433240 -278887 -327876 -200256 -81775 -5550
2398 -5550 -68597 136291 -246751 -10324 -226574 -174131 -303451 -244066 -139531 78575 -547760
2387 -547760 20034 -239134 33853 -187344 -150849 243003 -245767 -165058 -300021 -431438
2377 -431438 -12912 -350630 146819 -266545 -582243 -314098 31773 -107943 78698 45192
2367 45192 -160378 -342100 -232180 -21558 11309 -49855 -211415 22112 11068 198268
2357 198268 -374914 587 -261381 -79345 -258052 -15781 18569 -158793 7457 -225675
2347 -225675 -316147 -256909 112340 54442 272784 -271822 -266842 -159488 -195171 25132 -456352
2336 -456352 -117666 -566125 -66235 -352416 -175665 166464 -145681 -564004 57480 21749
2326B1749o21639N94087O5266l70906J91145j54124O6266j0201j52547N31475
2316A60571k62859K959K96311k98644K74785m05619j11833K7882J23317j63368
2306c56498K58831M11120n64082J36395K83661k36221n42284J41044O7615J00116
2296c00303J44750K83539m21012j87501J93598j17932K24037Q0895K02602N7175
2286A59848l47163o4657j15339L90348k85113L55292l25743K05430J31158n86416
2276d82355K64878Q7164J40447m79844M01869j33110K55822m11348J07887L18828
2266G0238j36913o1978J5241q1275j94299K09265M37752p49975J33698m9898K4009
2255c84135J1617J42789L22411m97916K15857K81133k19821j76065l5100k21479
$$ plain form
2326 21749 -599890 -5803 59463 -311443 -120298 -274422 -208156 -218357 -370904 160571
2316 160571 -102288 -99329 196982 -101662 173123 -232496 -344329 -316447 -193130 -356498
2306 -356498 -97667 313453 -250629 -114234 169427 -66794 -609078 -468034 -400419 -300303
2296 -300303 -155553 127986 -293026 -480527 -286929 -404861 -180824 -99929 102673 159848
2286 159848 -187315 -251972 -367311 23037 -262076 93216 -232527 -27097 104061 -482355
2276 -482355 -217477 -130313 10134 -469710 -67841 -200951 54871 -356477 -248590 70238
2266 70238 -66675 -128653 -113412 -194687 -388986 -179721 258031 -491944 -358246 -408144 -384135
2255 -384135 -372518 -229729 92682 -405234 -189377 91756 -128065 -304130 -339230 -560709
2245e60709M93362j09420q7762J66954K57487o94854N43233l19712m9381L30768
2235c0034j96526k03226K41647J91142k24862J58884J15390P3383k66830j15562
2225b56594Q2983J10517m30157M33752J1257j11687j67492j45680K0730O8290
2215c84081L04619J02846k41041K64328j02556R6218j77201k82706P00117l96393
2205a15850J08152o5218j05295L46079o30923M27219l14285p5319J98780J40466
2195h6194j48056K15740k77255o596j91781J4406M36997k42450Q7177n9678O6232
2184a91458m67525L51833L23218l19979K04246k48031K67308J13422q3371j51972
2174b02309j21875L61058j099n3466n02304K48601J46641n95725N02002N0098
$$ plain form
2245 -560709 -67347 -176767 -264529 -97575 159912 -534942 8291 -311421 -360802 -30034
2235 -30034 -226560 -429786 -188139 3003 -221859 -62975 52415 125798 -141032 -256594
2225 -256594 -173611 -63094 -493251 -59499 -48242 -159929 -327421 -473101 -452371 -384081
2215 -384081 -79462 23384 -217657 46671 -55885 40333 -136868 -419574 280543 -115850
2205 -115850 -7698 -72916 -178211 167868 -463055 -35836 -350121 -425440 -226660 -86194
2195 -86194 -234250 -18510 -295765 -302361 -494142 -479736 -42739 -285189 -198012 -257690 -191458
2184 -191458 -658983 -307150 16068 -303911 -99665 -347696 -80388 33034 -50337 -202309
2174 -202309 -324184 36874 35775 -17691 -519995 -271394 -124753 -720478 -218476 -168378
2164a68378l24061O8514J96696J44515k55633j49608J63333J85832q4240L3099
2154a89931K04552j71255k47454M08610r3464J58419l68874M90072o43204J33258
2144c19271J6814K09896l62565N47444n51o10288N98587j45378l68675M6863K88788
2133i8336m97782M73655K1490j51549P6937j2664R2754l35011K23366r0062K16661
2122h0541k8438n3579k56150j86249L08971J46529j03119j6955o6900J79996o3298
2111b19733p6514L29201n69653M28238m19055M68579m40518L40701k81481l0342
2101d70577K65899L52429l48785j28320M54880j43414J7685r7114P4435l27497
2091c50379R5976J33310j2949m19950N53552j88797J26844j23575N15257r43747
$$ plain form
2164 -168378 -492439 -423925 -227229 -82714 -338347 -487955 -324622 -138790 -223030 -189931
2154 -189931 14621 -156634 -404088 4522 -88942 69477 -299397 190675 -452529 -319271
2144 -319271 -302457 -92561 -455126 92318 91767 -518521 80066 -65312 -433987 -387124 -98336
2133 -98336 -596118 -122463 -100973 -252522 -175585 -188249 -95495 -430506 -207140 -297202 -80541
2122 -80541 -108979 -162558 -418708 -604957 -295986 -149457 -252576 -269531 -336431 -156435 -219733
2111 -219733 -296247 32954 -536699 -108461 -527516 -58937 -499455 -158754 -440235 -470577
2101 -470577 -204678 147751 -201034 -329354 125526 -17888 -203 -97317 -22882 -350379
2091 -350379 -254403 -121093 -134042 -553992 -440 -189237 -62393 -185968 329289 -614458
2081f14458K56231K56915j66191J70012k36999L67781k38519j48211M8039M8335
2071b57065K71652j69333j65148m68210M39430M00369l24285j00822K2260K70852
2061h0300k19158k27n8420L49281J1620k48214j23072K31769j62975n2998N44596
2050A91902m20896J90481P6540m65610M19547j79048k02285N08877k02669l70747
2040d53908M16061j87939P0623l23797L97427J23533k26459L0486K35146m74869
2030c93696K03858j04412j84003J02319J10897J17789l0674m92500K60194K47722
2020a62506l5250r8642r5181q572L20261l46564L08722K3354O9713m28914L60264
2009i3315m26049R9048p827J512K50139n9555k55606J12966L19295J63041k6436
$$ plain form
2081 -614458 -358227 -101312 -267503 -97491 -334490 33291 -205228 -353439 -305400 -257065
2071 -257065 14587 -154746 -319894 -788104 -348674 51695 -272590 -373412 -351152 -80300
2061 -80300 -299458 -299685 -358105 -8824 2796 -245418 -368490 -136721 -299696 -352694 191902
2050 191902 -228994 -38513 38027 -427583 -8036 -187084 -389369 119508 -83161 -453908
2040 -453908 -37847 -225786 -155163 -478960 -81533 42000 -184459 -153973 81173 -393696
2030 -393696 -189838 -294250 -478253 -375934 -265037 -147248 -177922 -670422 -410228 -162506
2020 -162506 -197756 -296398 -391579 -400151 -79890 -426454 -117732 -94378 -24665 -453579 -93315
2009 -93315 -519364 -420316 -428143 -426631 -176492 -236047 -491653 -378687 -59392 103649 77213
1998G7213m16125M83980l56226M18712l82929q885M39430k88524k35396J83068
1988h5682q5537n4294K60717K95246n87853K09849l45467K13549R2785k08527
1978b95214J55250q6429n4439m9252O6408K91682m3911l19054K8002p2396L6849
1967c42504J37027j6392K54300k04961L91862n46643n9525O9555j52238M27222
1957d2297k83809O8024L84210p4585Q1918k92348o7766n0350K0339K41754k81761
1946b96671K5717L4140j76548P1154N5311J18268l54872Q69979p41400P51411
1936C56489l79985m92513m4878J3487N72555j41098m23184J52402L81611K2050
1926A6936Q2877m12028J47356n19469L9654O17939r4801j99723k57160L14155
$$ plain form
1998 77213 -338912 145068 -211158 207554 -175375 -184260 255170 -33354 -268750 -85682
1988 -85682 -171219 -225513 35204 330450 -257403 -47554 -393021 -179472 -86687 -295214
1978 -295214 -139964 -226393 -280832 -330084 -263676 28006 -15905 -334959 -306957 -379353 -342504
1967 -342504 -205477 -221869 32431 -172530 219332 -327311 -386836 -317281 -469519 -42297
1957 -42297 -326106 -258082 126128 51543 133461 -158887 -226653 -277003 -256664 -14910 -296671
1946 -296671 -270954 -236814 -413362 -342208 -286897 -168629 -523501 346478 -394922 356489
1936 356489 -23496 -516009 -560887 -547400 25155 -115943 -539127 -386725 -5114 16936
1926 16936 99813 -312215 -164859 -684328 -644674 -26735 -121536 -321259 -578419 -264264
1916b64264K83074l45483K72194l4326j27833Q8784k4954j1363j40201n3415J59664
1905a98123k70051K38205J62115k50364o0281K69044R2393O83n75059L56052m7746
1894b83132K69638j77386N0389N5903k63555J78717j08986n13907L81873j08337
1884e18783R504l9162M38626l47524K70927k15612j69782O31933l28573L7457
1874b30989q8726J5522n05503P82319l75394j08364n9359K31181J06954J5105
1864b17254m31092N12576k79916k587k78299L46191j7691L09471K6494j89138
1854b21245r3260L01404k92158j15582M91436n8722l00118p7959N59991m92443
1844b98656L2815k81182M16900k08562r8546K12002L67166R450l20149K1332j72600
$$ plain form
1916 -264264 18810 -326673 -54479 -88805 -216638 -127854 -152808 -164171 -304372 -357787 -198123
1905 -198123 -468174 -229969 -67854 -318218 -378499 -109455 -17062 -16379 -591438 -235386 -283132
1894 -283132 -13494 -190880 -140491 -84588 -348143 -169426 -278412 -792319 -410446 -518783
1884 -518783 -509279 -548441 -109815 -457339 -186412 -402024 -571806 60127 -268446 -230989
1874 -230989 -319715 -304193 -809696 -27377 -402771 -511135 -570494 -339313 -232359 -217254
1864 -217254 -648346 -135770 -415686 -418273 -696572 -350381 -368072 -58601 -32107 -221245
1854 -221245 -314505 -13101 -305259 -420841 70595 11873 -288245 -366204 193787 -298656
1844 -298656 -265841 -547023 -130123 -338685 -437231 -225229 141937 151387 -168762 -147430 -320030
1833c20030m8214K89589k65515J76174L40504l94452p8467O2309m4084j623k4752
1822c08561L9304l33320O58165k08267j66376k32035L55076j43078k13429L86144
1812a66377j89866k57042N21737m2816n9915K20217j48483J68094m43156j2536
1802d10143L77832j04767n32096L84360J65803j78016L36019n67625K26072L38533
1792C5972l94930J33473L09135k83846K25973Q2536m42045K57343k7378m6120
1782a49887l2264L37173n97842p1623K71926K95987j57571l36534J73423K21913
1772d5299j96338j58917J31060J58017k39522N4690M88938m10211N6301j82745
1762c44026m6197M90443k201q07241O10249j24844K5138J18113k03327J00092
$$ plain form
1833 -320030 -368244 -78655 -344170 -167996 172508 -221944 -300411 -238102 -282186 -283809 -308561
1822 -308561 -269257 -602577 55588 -152679 -319055 -551090 -196014 -339092 -552521 -166377
1812 -166377 -356243 -613285 -91548 -134364 -194279 25938 -122545 45549 -397607 -410143
1802 -410143 -32311 -137078 -669174 -284814 -119011 -297027 38992 -528633 -302561 35972
1792 35972 -358958 -225485 83650 -200196 25777 108313 -333732 -76389 -103767 -149887
1782 -149887 -182151 155022 -442820 -514443 -242517 53470 -104101 -440635 -267212 -45299
1772 -45299 -241637 -400554 -269494 -111477 -350999 -296309 192629 -217582 -161281 -344026
1762 -344026 -390223 100220 98019 -709222 -98973 -223817 -198679 -80566 -283893 -183801
1752a83801L62034o01708K62294k84258M09633k95459J34706k43635J51779o0839
1742c49254K95126j39878J33038q4315Q5750k76261K65693m57765R6558k4280
1732d55588K40269p0120K9109J82918k16370J88296j69136P3444J22400n47564
1722f22342j08335Q52407k19938m41604L26951J3340j54051L87606m41006M82256
1712G5284k91050k92366M5367M75071k79620r7709KK74071k49405o3652J05138
1701b98869k7769m1310k47943K17649K54415j03635J50639J69576M6829o19920
1691e00338J44977j79259K54702l6908L43124j04770k97476K21790j41144J74350
1681a20952q1745k99451L27204k14601Q3018l2662j9293J74402j3958o6432L07979
$$ plain form
1752 -183801 178233 -423475 -161181 -445439 -35806 -331265 -196559 -440194 -288415 -349254
1742 -349254 -54128 -194006 -60968 -145283 -59533 -335794 -70101 -527866 -431308 -455588
1732 -455588 -215319 -285439 -256330 -73412 -289782 -101486 -270622 -197178 -74778 -622342
1722 -622342 -730677 121730 -98208 -539812 -212861 -199521 -353572 34034 -406972 75284
1712 75284 -215766 -508132 -462765 12306 -267314 -365023 -365021 -90950 -340355 -404007 -298869
1701 -298869 -326638 -367948 -615891 -398242 -143827 -247462 -96823 72753 119582 -500338
1691 -500338 -355361 -534620 -279918 -316826 26298 -78472 -375948 -154158 -295302 -120952
1681 -120952 -202697 -502148 -174944 -389545 -306527 -339189 -358482 -184080 -198038 -264470 43509
1670D3509l33203K7512j95334L42339m6858k84555M28208k96752q4571L55557
1660d4148J14990n17045K58174K16721j11996R8271o56638O33386k51333j112
1650b60730M3946K57955k56165k2024n2938J9126j07251j4192L32409l56116L96796
1639a9184J27002m72666J17674Q6072K97710p37662R18847l56328N2807k98750
1629b84478J67151m7923o4986m8845K01970R2401p9134j77905l3351Q6133j59550
1618c48517k0772j9908N3256J40725q4945k20557J44140L3476N5705m0048K5506
1607b81939J43996k28394j09103M35772j672J21086n75424M67055j32055q8569
1597b49247j67155k3206J88635m2927j49175k23692K79306N23463j18158q3207
$$ plain form
1670 43509 -289694 -262182 -457516 -115177 -162035 -446590 -18382 -315134 -399705 -44148
1660 -44148 70842 -446203 -188029 28692 -83304 14967 -641671 -8285 -259618 -260730
1650 -260730 -216784 41171 -214994 -237018 -289956 -270830 -378081 -392273 -59864 -415980 -19184
1639 -19184 107818 -364848 -247174 -161102 136608 -601054 317793 -38535 14272 -284478
1629 -284478 -117327 -165250 -230236 -279081 -77111 15290 -63844 -241749 -275100 -188967 -348517
1618 -348517 -369289 -389197 -335941 -195216 -280161 -500718 -356578 -323102 -267397 -307445 -281939
1607 -281939 -137943 -366337 -475440 -39668 -41340 79746 -495678 -28623 -160678 -249247
1597 -249247 -416402 -439608 -250973 -293900 -443075 -666767 -387461 136002 17844 -65363
1587f5363K52934o63562Q2338K56031k28100K56284n5126j01773J42072j47793
1577b72058P3071k51868J00495K31335m93435M11752k4251R1410j6699J5303J51182
1566A6237k65335J50805m03802L89660Q5280l53214N12301n20696O69417l43021
1556f2368m65565J27305k17890j73674L88228J36708J95864n2305K76295k65898
1546a13300r7800O3376l15278L51059r6393j62834K27236P8037l00414j76407
1536e42718N32461q5648j22328k85577K43693K61759M59247j300772L67415L5428
1526d37040J76494J9306K12131j19876o6734J87798j4330N1559m24974J40132
1516b75534L39187n23605M88914p9512k53622K02200l08828J99077q9726j13486
$$ plain form
1587 -65363 187571 -475991 -393653 -137622 -365722 -109438 -164564 -266337 -124265 -272058
1577 -272058 -198987 -450855 -350360 -119025 -612460 -200708 -224959 -133549 -150248 -134945 16237
1566 16237 -249098 -98293 -502095 -112435 -27155 -380369 131932 -388764 280653 -62368
1556 -62368 -527933 -400628 -618518 -792192 -403964 -267256 -71392 -123697 152598 -113300
1546 -113300 -211100 -147724 -463002 -111943 -208336 -371170 -143934 -65897 -366311 -542718
1536 -542718 -10257 -95905 -218233 -503810 -260117 1642 460889 -839883 -472468 -437040
1526 -437040 -260546 -241240 -29109 -148985 -215719 -27921 -42251 9308 -415666 -275534
1516 -275534 63653 -459952 28962 -50550 -304172 -101972 -410800 -211723 -301449 -414935
1506d14935J63794K77853o13179K69811N314j55125L72089j44511K61975l79495
1496c56409M2752j78421M40892R1455m45292k17763K99284M40811p3309l12757
1486b68757K03904k46328N8572J32379Q513m5927J39220p477j38914J50428j52822
1475a67209K17244k29981j32258L05298n06141O45277m16674p2383K23097k12640
$$ plain form
1506 -414935 -251141 26712 -586467 -316656 -311342 -466467 -94378 -238889 23086 -356409
1496 -356409 -313657 -492078 -51186 40269 -405023 -622786 -323502 117309 44000 -268757
1486 -268757 -64853 -311181 -252609 -120230 -111717 -157644 -18424 -25901 -164815 -14387 -167209
1475 -167209 50035 -179946 -312204 -6906 -513047 132230 -284444 -356827 -133730 -346370
$$ [...]
##END NTUPLES=NMR SPECTRUM
##END=
