##TITLE=abcd
##JCAMPDX= 6.0         $$ Bruker NMR JCAMP-DX V2.0
##DATA TYPE= NMR SPECTRUM
##DATA CLASS= NTUPLES
##ORIGIN= UXNMR, Bruker Analytische Messtechnik GmbH
##OWNER= root
$$ XWIN-NMR		Version 3.5
$$ Mon Apr 13 18:07:22 2026 Russian Standard Time (UT+4h)  servis@DPX200
##.OBSERVE FREQUENCY= 200.131235884673
##.OBSERVE NUCLEUS= ^1H
##.ACQUISITION MODE= SIMULTANEOUS
##.ACQUISITION SCHEME= undefined
##.AVERAGES= 32
##.DIGITISER RES= 18
##SPECTROMETER/DATA SYSTEM= spect
##.PULSE SEQUENCE= zg
##.SOLVENT NAME= CDCl3
##.SHIFT REFERENCE= (INTERNAL, CDCl3, 0, 16.4885)
##AUDIT TRAIL= $$ (NUMBER, WHEN, WHO, WHERE, WHAT)
$$ ##TITLE= Audit trail, XWIN-NMR		Version 3.5
$$ ##JCAMPDX= 5.01
$$ ##ORIGIN= Bruker BioSpin GmbH
$$ ##OWNER= servis
$$ F:\spectra/data/av/nmr/H1/1/pdata/1/auditp.txt
$$ ##AUDIT TRAIL=  $$ (NUMBER, WHEN, WHO, WHERE, WHAT)
(   1,<2026-04-13 18:06:30.00 +0400>,<servis>,<DPX200>,
      <created by zg, POWCHK disabled, PULCHK disabled
       configuration hash MD5:
       00 E9 B6 7A A2 85 ED C7 34 08 36 98 17 FE 4E 26
       data hash MD5: 32K
       63 07 B8 06 48 8C 8D 29 8C 44 F0 33 57 A4 F5 E4>)
(   2,<2026-04-13 18:06:35.04 +0400>,<servis>,<DPX200>,
      <Start of raw data processing
       efp BC_mod = 2 LB = 0.05 FT_mod = 6 PKNL = 1 PHC0 = -264.2274 PHC1 = 3.101563 SI = 16K 
       data hash MD5: 16K
       57 53 6F E8 69 3A 8E 0C 16 39 90 21 78 A0 55 C3>)
(   3,<2026-04-13 18:06:57.93 +0400>,<servis>,<DPX200>,
      <pk PHC0 = 1.6 PHC1 = 0 
       data hash MD5: 16K
       64 84 DF 95 90 A1 42 A8 A4 FE 38 B0 5D FF 99 E2>)
$$ ##END=
$$ 
$$ hash MD5
$$ 58 F1 D7 19 7A 18 CA 11 37 7B FA 84 61 4A A5 D6
##$RELAX= 
##$RELAX= 
##$RELAX= 
##$RELAX= 
##$RELAX= 
##$RELAX= 
##$RELAX= 
##$RELAX= 
$$ Bruker specific parameters
$$ --------------------------
##$DU= <F:\spectra>
##$EXPNO= 1
##$NAME= <H1>
##$PROCNO= 1
##$TYPE= <nmr>
##$USER= <av>
##$AMP= (0..31)
100 100 100 100 100 100 100 100 100 100 100 100 100 100 100 100 100 100 
100 100 100 100 100 100 100 100 100 100 100 100 100 100 
##$AQSEQ= 0
##$AQ_mod= 1
##$AUNM= <au_zg>
##$AUTOPOS= <>
##$BF1= 200.13
##$BF2= 200.13
##$BF3= 200.13
##$BF4= 200.13
##$BF5= 500.13
##$BF6= 500.13
##$BF7= 500.13
##$BF8= 500.13
##$BYTORDA= 1
##$CFDGTYP= 0
##$CFRGTYP= 5
##$CHEMSTR= <none>
##$CNST= (0..31)
1 1 145 1 1 1 1 1 1 1 1 1 1 1 1 1 1 1 1 1 1 1 1 1 1 1 1 1 1 1 1 1 
##$CPDPRG= <>
##$CPDPRG1= <>
##$CPDPRG2= <>
##$CPDPRG3= <>
##$CPDPRG4= <mlev>
##$CPDPRG5= <mlev>
##$CPDPRG6= <mlev>
##$CPDPRG7= <mlev>
##$CPDPRG8= <mlev>
##$CPDPRGB= <>
##$CPDPRGT= <>
##$D= (0..31)
0 2 0 0 0 0 0 0 0 0.06 0 0 0 0 0 0 0.0002 0 0 0 0 0 0 0 0 0 0 0 0 0 0 
0 
##$DATE= 1776089189
##$DBL= (0..7)
120 120 120 120 120 120 120 120 
##$DBP= (0..7)
150 150 150 150 150 150 150 150 
##$DBP07= 0
##$DBPNAM0= <>
##$DBPNAM1= <>
##$DBPNAM2= <>
##$DBPNAM3= <>
##$DBPNAM4= <>
##$DBPNAM5= <>
##$DBPNAM6= <>
##$DBPNAM7= <>
##$DBPOAL= (0..7)
0.5 0.5 0.5 0.5 0.5 0.5 0.5 0.5 
##$DBPOFFS= (0..7)
0 0 0 0 0 0 0 0 
##$DE= 6
##$DECBNUC= <off>
##$DECIM= 32
$$ [...]
##$SUBNAM4= <"">
##$SUBNAM5= <"">
##$SUBNAM6= <"">
##$SUBNAM7= <"">
##$SUBNAM8= <"">
##$SUBNAM9= <"">
##$SW= 20.6817932712277
##$SWIBOX= (0..15)
0 0 3 0 0 0 0 0 0 0 0 0 0 0 0 0 
##$SW_h= 4139.07284768212
##$TD= 32768
##$TD0= 1
##$TE= 0
##$TE2= 300
##$TE3= 300
##$TEG= 300
##$TL= (0..7)
0 120 120 120 120 120 120 120 
##$TP= (0..7)
150 150 150 150 150 150 150 150 
##$TP07= 0
##$TPNAME0= <>
##$TPNAME1= <>
##$TPNAME2= <>
##$TPNAME3= <>
##$TPNAME4= <>
##$TPNAME5= <>
##$TPNAME6= <>
##$TPNAME7= <>
##$TPOAL= (0..7)
0.5 0.5 0.5 0.5 0.5 0.5 0.5 0.5 
##$TPOFFS= (0..7)
0 0 0 0 0 0 0 0 
##$TUNHIN= 0
##$TUNHOUT= 0
##$TUNXOUT= 0
##$USERA1= <user>
##$USERA2= <user>
##$USERA3= <user>
##$USERA4= <user>
##$USERA5= <user>
##$V9= 5
##$VALIST= <valist>
##$VCLIST= <CCCCCCCCCCCCCCC>
##$VD= 0
##$VDLIST= <DDDDDDDDDDDDDDD>
##$VPLIST= <PPPPPPPPPPPPPPP>
##$VTLIST= <TTTTTTTTTTTTTTT>
##$WBST= 1024
##$WBSW= 30
##$XGAIN= (0..3)
0 0 0 0 
##$XL= 0
##$YL= 0
##$YMAX_a= 677467
##$YMIN_a= -654938
##$ZGOPTNS= <>
##$ZL1= 120
##$ZL2= 120
##$ZL3= 120
##$ZL4= 120
##$ABSF1= 0
##$ABSF2= 0
##$ABSG= 0
##$ABSL= 0
##$ALPHA= 0
##$AQORDER= 0
##$ASSFAC= 0
##$ASSFACI= 0
##$ASSFACX= 0
##$ASSWID= 0
##$AUNMP= <proc_1d>
##$AZFE= 0.1
##$AZFW= 0.1
##$BCFW= 0
##$BC_mod= 2
##$BYTORDP= 0
##$COROFFS= 0
##$CY= 18.4799938201904
##$DATMOD= 1
##$DC= 0
##$DFILT= <>
##$DTYPP= 0
##$F1P= 9.9274215381318
##$F2P= -0.165520771350173
##$FCOR= 1
##$FTSIZE= 16384
##$FT_mod= 6
##$GAMMA= 0
##$GB= 0
##$INTBC= 1
##$INTSCL= 4.127829e-11
##$ISEN= 128
##$LB= 0.05
##$LEV0= 0
##$LPBIN= 0
##$MAXI= 10000
##$MC2= 0
##$MEAN= 0
##$ME_mod= 0
##$MI= 50
##$NCOEF= 0
##$NC_proc= -6
##$NLEV= 6
##$NOISF1= 3.799351
##$NOISF2= 2.8
##$NSP= 0
##$NTH_PI= 0
##$NZP= 0
##$OFFSET= 16.48848
##$PC= 4
##$PHC0= -262.6274
##$PHC1= 3.101563
##$PH_mod= 1
##$PKNL= yes
##$PPARMOD= 0
##$PSCAL= 4
##$PSIGN= 0
##$REVERSE= no
##$SF= 200.130005582386
##$SI= 16384
##$SIGF1= 3
##$SIGF2= 2
##$SINO= 400
##$SIOLD= 16384
##$SREGLST= <1H.CDCl3>
##$SSB= 0
##$STSI= 16384
##$STSR= 0
##$SW_p= 4139.07284768211
##$SYMM= 0
##$S_DEV= 0
##$TDeff= 32768
##$TDoff= 0
##$TI= <>
##$TILT= no
##$TM1= 0
##$TM2= 0
##$TOPLEV= 0
##$USERP1= <user>
##$USERP2= <user>
##$USERP3= <user>
##$USERP4= <user>
##$USERP5= <user>
##$WDW= 1
##$XDIM= 16384
##$YMAX_p= 361168071
##$YMIN_p= -6133562
$$ End of Bruker specific parameters
$$ ---------------------------------
##NTUPLES= NMR SPECTRUM
##VAR_NAME=  FREQUENCY,     SPECTRUM/REAL,   SPECTRUM/IMAG
##SYMBOL=    X,             R,               I
##VAR_TYPE=  INDEPENDENT,   DEPENDENT,       DEPENDENT
##VAR_FORM=  AFFN,          ASDF,            ASDF
##VAR_DIM=   16384,         16384,           16384
##UNITS=     HZ,            ARBITRARY UNITS, ARBITRARY UNITS
##FACTOR=    0.252644378177508, 1,           1
##FIRST=     3299.83951724647, 0,            0
##LAST=      -839.233330435636, 0,           0
##MIN=       -839.233330435636, -6133562,    0
##MAX=       3299.83951724647, 361168071,    0
$$ Real data points
##PAGE= N=1
##DATA TABLE= (X++(R..R)), XYDATA
$$ [...]
7570a61628K03623K77303q29430Q37090j026306P12076J00160o6532l31809Q41787
7560E56334k92453r3935j28700k64553L11653n87938O42960o89278Q01804p3848
7550A82046J30829p20276P06499q31416K64409O00178m56956J47738K33526n29601
7540b73024n63432J151197n02396K85854l23912J008948m92246M29741n91413
7531A29317K72865p11781J282030j073084J94647L80289r05660m11916J017938
7522A74645L04469k95194m82261M18429K77968l29309J1430L48132j93686k93242
7512e8619p25287O12677m17742K87037L13814J65838K53192p39012J3542j00443
7502c95003J496309j103881J5180J54927j94583k86066k8929o56032Q76540k2381
$$ plain form
7570 -161628 41995 319298 -510132 326958 -699348 12728 112888 46356 -285453 556334
7560 556334 263881 169946 41246 -223307 88346 -499592 143368 -545910 255894 182046
7550 182046 312875 -407401 299098 -532318 -267909 332269 -124687 23051 256577 -273024
7540 -273024 -836456 314741 -187655 98199 -225713 783235 290989 720730 129317
7531 129317 402182 -309599 972431 -100653 93994 474283 -431377 -843293 174645
7522 174645 479114 183920 -298341 120088 398056 68747 80177 428309 234623 -58619
7512 -58619 -783906 -171229 -588971 -301934 11880 177718 430910 -308102 -294560 -395003
7502 -395003 1101306 -2575 12605 167532 -27051 -313117 -342046 -998078 -121538 -143919
7492a43919K88828j10756J01733K14698j8094k10399N83696o97395n14661K93531
7482b12738j38990k59880J219998o38331j14773r44503J092951l49393O77157
7473C31498L1546n18837K46422k23159J57945j031280M41648O28791o45561J12827
7463d68160J119799m83460J42428j85919K49177j39186m70286l71682P73905m99453
7453c32837m93470O32530n33687O47538p8080k97962M49813J06541q11748N79917
7443a31445r8187L32809k67841Q96851p71805q2305J32274J31766j080658J136585
7433A98044n68055M19894K67928J3578m52273j066923R83637n29986J136560k15846
7423A86558L29823k07382k84270K83488k53641N58625p67274K90996k47085j063289
$$ plain form
7492 -143919 144909 34153 135886 350584 332490 122091 705787 8392 -506269 -212738
7482 -212738 -351728 -611608 608390 -29941 -144714 -1089217 3734 -345659 331498
7473 331498 363044 -155793 90629 -132530 25415 -1005865 -564217 64574 -580987 -468160
7463 -468160 651639 168179 310607 124688 373865 234679 -235607 -607289 166616 -332837
7453 -332837 -826307 -193777 -727464 -79926 -158006 -455968 -6155 100386 -711362 -131445
7443 -131445 -229632 103177 -164664 732187 -39618 -121923 10351 142117 -938541 198044
7433 198044 -370011 49883 317811 331389 -120884 -1187807 -204170 -734156 402404 186558
7423 186558 516381 308999 24729 308217 54576 613201 -154073 136923 -110162 -1173451
7413a173451L82600j41326P07459Q03818q8597n39237J51942k61311j84505O25947
7403B83339n79494K19620O314m8155K43976O458M7543r0303l4537j83453l95387
7392e24079L55024J93422p73364J285558o3947p12657M29980n92340J232745n06842
7382C23500l30445R1424m51506m64936M11312j29856R71539j048432p0767L31578
7372c66589N96235n80898L14127N4211q1577j78480K95418J37670j5447M72100
7362F46770j149219k29041P12342O30599J73725k96457n88739m47821M82617J38526
7352G3302L62477m19714l45093J61982j050049J160084r13108J114991l9773j49806
7342d4707m71906J17730L91455l61178N26306o54975M22650O9798j98116j26604
$$ plain form
7413 -1173451 -790851 -932177 -224718 579100 490503 -48734 103208 -158103 -342608 283339
7403 283339 -296155 -76535 -70221 -118376 125600 132058 179601 89298 54761 -128692 -524079
7392 -524079 -169055 24367 -748997 536561 472614 -240043 189937 -402403 830342 323500
7382 323500 -6945 84479 -367027 -831963 -420651 -550507 421032 -627400 -698167 -366589
7372 -366589 229646 -351252 -37125 17086 -64491 -242971 52447 190117 174670 646770
7362 646770 -502449 -731490 -19148 611451 785176 488719 -100020 -547841 -65224 73302
7352 73302 435779 16065 -329028 -167046 -1217095 -57011 -970119 144872 105099 -44707
7342 -44707 -516613 -398883 -7428 -368606 157700 -497275 -74625 -4827 -202943 -329547
7332c29547n76091J245729r09521L37604J10468M70614q80649L11607o74753J408152
7322E13613m69036j067405J520996n19108l81715P47457r99311J066877n74186
7313a61818N26538j92703p33950K91284L86647K99764L52470r68342K23838k80603
7303b56875K8189j22146J73925j03691M51753m97015k23637N16935k75396M30008
7293A22050l42912O37526K13452k62355j322836P80238j6711L95376K3333l24311
7283i7150L10482N1317r44081R8230M72617L20767J66774r13968P03151J18147
7273B86286O1323j3991o35179l56368N30351j170389N25158M25907O3937o9888
7263c52853p52756R28333o42N4206l23247p1707q27867J311706m3049k76823o6839
$$ plain form
7332 -329547 -905638 340091 -569430 -231826 -121358 349256 -531393 -219786 -894539 513613
7322 513613 44577 -1022828 498168 -20940 -402655 344802 -654509 412368 -161818
7313 -161818 364720 172017 -561933 -270649 115998 415762 768232 -200110 23728 -256875
7303 -256875 -228686 -350832 -176907 -280598 171155 -325860 -549497 -32562 -307958 122050
7293 122050 -220862 416664 630116 367761 -955075 -174837 -191548 203828 227161 -97150
7283 -97150 213332 264649 -679432 -581202 -108585 212182 378956 -535012 168139 286286
7273 286286 347609 333618 -301561 -657929 -127578 -1297967 -772809 -346902 -282965 -352853
7263 -352853 -1105609 -177276 -177918 -123712 -446959 -518666 -1346533 -34827 -77876 -354699 -421538
7252d21538L77957J80611j39330k27167r05958J237768o07665L87990j20604m53127
7242f91063m64937O83720l48473J008934n0535k58448M28716l73646o42851P30409
7232B1826k17949J30735k33278Q1994j58512P9468M88693n66111J116854q17225
7222g3505M03233J9650l61440k64931K64988l86239k29791K27534l16048J17519
7212e99030k21206L61488Q68537o33883J40081K82680j396602M02048O35165p02085
7202h62807O88529l72791k29230R51553o98982N21233R145L34018m46383m10874
7192e16589J72159J026942j016253O4941J78214N25959n40519J96677J87449p0094
7182B08886l21977j77811j14403N51506q08966Q76483m26589N37868J38651l53591
$$ plain form
7252 -421538 -43581 137030 -2300 -229467 -1135425 102343 -505322 -117332 -237936 -691063
7242 -691063 -1156000 -472280 -820753 188181 137646 -120802 307914 -65732 -708583 21826
7232 21826 -196123 -65388 -298666 -216672 -375184 -295716 192977 -373134 743720 -73505
7222 -73505 329728 349378 -12062 -276993 -12005 -398244 -628035 -400501 -716549 -599030
7212 -599030 -820236 -458748 409789 -224094 -84013 198667 -1197935 -795887 -160722 -862807
7202 -862807 -174278 -547069 -776299 175254 -523728 -2495 6650 340668 -105715 -516589
7192 -516589 -344430 682512 -333741 -268800 -90586 435373 -105146 91531 278980 208886
7182 208886 -113091 -290902 -405305 146201 -662765 213718 -212871 324997 463648 110057
7172A10057K81367o96288O62899r11710O30430M4413m31702Q17181j174370K27208
7162d40515j57376M14118M80328o58351N27902l55079j13117J08949K14236l25872
7152c04777K40903K13469r9698k69744R75706p33585J81316k7304J98769L87018
7142G62073o39716L17513j074959N06734P5936m54916O03787k59060M6753Q7468
7132b8387l17682P79231j37634j98235o4203M8972k56509k46833P0960N53661
7122B03341m0061p62921J045882p12491M66621L4053K0013p54907j7241J293482
7112G75771q04288m1882n03152M93352J73072m25682M18481k81312K58888m96600
7102d33352Q9275q0779k62740Q51300j35648p1969j02077l61812n48702R73309
$$ plain form
7172 110057 391424 -304864 358035 -553675 76755 121168 -310534 506647 -667723 -440515
7162 -440515 -597891 -183773 296555 -361796 166106 -188973 -302090 -193141 21095 -304777
7152 -304777 -63874 149595 49897 -219847 755859 22274 203590 176286 375055 762073
7142 762073 122357 439870 -635089 -128355 -52419 -507335 96452 -162608 -115855 -28387
7132 -28387 -346069 433162 295528 97293 33090 82062 -174447 -421280 -350320 203341
7122 203341 163280 -599641 446241 -266250 200371 234424 254437 -500470 -517711 775771
7112 775771 -28517 -70399 -573551 -80199 92873 -332809 85672 -195640 63248 -433352
7102 -433352 -344077 -424856 -687596 163704 28056 -43913 -145990 -507802 -1056504 -83195
7092h3195J09667O6117O10193j196194M91048k72102J14252Q5408L50286l27672
7082e2192k36838M25584l74064R06480m95306L54403n41911N6001p35118r8597
7072g91558M69134L77896L8907n57766K12802N34381j069534R77985L32766l39678
7062A85335m17033N85760j84643o6227k68923J65783L4498r0976N86523l78090
7052A52007N87611n23993k46715l08472o7688N40398p65396M5966m00951K69366
7042g17867Q27015L50164l33540J09532j15834m87530J079772j436527J05402
7033f19413L28486M14555N24162n21366M0024J03660r35714Q46353Q959O73221
7023H62927j155546l36540J224938m03289M68649n98837l8330K19946k94908L32931
$$ plain form
7092 -83195 26472 92589 702782 -493412 -2364 -274466 -160214 -74806 275480 -52192
7082 -52192 -289030 136554 -237510 668970 173664 528067 -13844 42157 -692961 -791558
7072 -791558 -322424 55472 94379 -463387 -250585 283796 -785738 192247 525013 185335
7062 185335 -231698 354062 169419 103192 -165731 52 34550 -56426 530097 152007
7052 152007 739618 215625 -31090 -339562 -407250 133148 -632248 -586282 -987233 -717867
7042 -717867 109148 459312 125772 235304 119470 -368060 711712 -724815 -619413
7033 -619413 -290927 123628 647790 126424 166448 270108 -665606 180747 189706 862927
7023 862927 -292619 -629159 595779 192490 661139 62302 23972 243918 -50990 281941
7013B81941K64107N17599r96167O89502N84869l35773j498286L07891N04438M07899
7003G28020k40716r6775L25977j99764j136872J349294q4489K87279j38885M29603
6993A222672q29973l04480J92255L89232Q01076j189979R1621J89429o18204Q66157
6983H09806p99347O04400J097463r30550N21925M90744j225314P33883j50441
6974A152569M52537n41296J43683N93918l71218K46912l52826L1347M14252m09882
6964A359996P84336l77011p3181K00853K33145k96373k62294J61554J13410K01792
6954B046227p75939O46031K68427K53699J79798j452820J352421l931q28886K70561
6944A955588K6785R71689m94424q4806j26679q89129J075797j8484l75652M04105
$$ plain form
7013 281941 546048 1063647 67480 756982 1341851 1006078 -492208 -184317 320121 728020
7003 728020 487304 390529 716506 516742 -620130 729164 644675 931954 793069 1222672
6993 1222672 392699 88219 280474 669706 1470782 280803 372424 561853 -56351 809806
6983 809806 10459 614859 1712322 781772 1303697 1794441 569127 1303010 1152569
6974 1152569 1605106 1063810 1207493 1801411 1430193 1677105 1324279 1355626 1769878 1359996
6964 1359996 2144332 1767321 1694140 1894993 2128138 1831765 1569471 1731025 1844435 2046227
6954 2046227 1270288 1916319 2184746 2438445 2618243 1165423 2517844 2513913 1685027 1955588
6944 1955588 1982373 2954062 2459638 2374832 2248153 1359024 2434821 2416337 2040685 2444790
6934B444790j39360O33200k69631l69877K47174M8107k00366p04354r6867M00935
6924A993751M20266q090o75705P69084p38457k71621O28758r0511L33370j034111
6914A326734l8337K24348J169363o78515k96097m3273J81238l50952n83382O84808
6904A595935m85660j0855M08196j45270k76626N30950m27496k81212R42985p14480
6894A136467o66000M18691J57313L53366r83910O00593m83418K40244M47893n60940
6884F60299O80854j342413L50695M70959M46421k53403p25558R1250l4816n11075
6874a66787j45264J41603L1514j60139L38241k31496L22086m12063J019734r34225
6864a96796J351625j287309L39792L44382j173043P17343k05832Q72677o24923
$$ plain form
6934 2444790 2305430 2938630 2668999 2299122 2546296 2594403 2394037 1689683 1592816 1993751
6924 1993751 2414017 2405927 1730222 2499306 1760849 1489228 2117986 2027475 2360845 1326734
6914 1326734 1288397 1512745 2682108 2003593 1707496 1664223 1845461 1494509 911127 1595935
6904 1595935 1110275 1099420 1507616 1362346 1085720 1616670 1189174 907962 1850947 1136467
6894 1136467 470467 889158 1046471 1399837 415927 1016520 533102 773346 1221239 660299
6884 660299 1341153 -1260 349435 820394 1266815 1013412 287854 379104 344288 -166787
6874 -166787 -312051 -170448 -138934 -299073 39168 -192328 129758 -282305 737429 -196796
6864 -196796 1154829 -132480 207312 551694 -621349 95994 -109838 762839 137916
6855A37916J48843P9828l93312K20186O84388p38305j037239J085291M73358q74192
6845b13238N11469M48182o58842J93818m42609o5262O23802n92646L80663j058367
6835h73030J178320l23800K66456j0157p02449R91438j114906J678958j298064
6826b07234J40332M3077J13920N71861o26404J89792Q2765O12190p16127n43936
6816c39764N19474k08584J37273m72219J014355o7312p09077N66820k77020N17668
6806F81614l58059l27961l78271J69091N07659k49475q837P75890r06861j04864
6796b00074J26043k25370R98201o38127M49689m86292R06957r34094l68043L30745
6786d0365J51636K04621M65449o23965J29009K6930n2998J53655m3949J99930
$$ plain form
6855 137916 286759 366587 -26725 193461 877849 139544 -897695 187596 660954 -213238
6845 -213238 298231 746413 87571 281389 -161220 -226482 397320 -195326 185337 -873030
6835 -873030 305290 -18510 247946 237789 -464660 526778 -588128 1090830 -207234
6826 -207234 -66902 -23825 90095 661956 35552 225344 308109 920299 204172 -339764
6816 -339764 179710 -28874 108399 -363820 650535 583223 -125854 440966 163946 681614
6806 681614 323555 -4406 -382677 -213586 294073 44598 35761 811651 -95210 -200074
6796 -200074 -74031 -299401 698800 60673 510362 24070 931027 -3067 -371110 -40365
6786 -40365 111271 315892 781341 157376 286385 313315 260317 413972 370023 569953
6776E69953j412565R51462J04286j96499P397L35291K4910m22711k04124N3144
6766a89456O41139k07081m43445n60414L27967N01549m55423P27061K45014j280801
6756f93890O35772M8810Q94331k30512J9262K84102r34719K91299q20256J066203
6746E60402k14300k69573J21843l51406K41519j17383L86483J70608m41615J8513
6736A05091N2971l86011J77523k2003m01720N85749q6059N34299k748n86872K74063
6725B44283L09926m0029l41822R53840n27147p9096M7028j114557O33246j56037
6715g0365J171969r14420j44439K39635J36322p56130N44100P48884j335447J210431
6705H30540q69136K97730o95277R91921K06184p16821j98370m37212J560021j034331
$$ plain form
6776 569953 -842612 108850 213136 16637 24034 359325 384235 -38476 -242600 -189456
6766 -189456 451683 244602 -198843 -759257 -431290 70259 -385164 341897 586911 -693890
6756 -693890 -58118 -9308 885023 654511 673773 957875 23156 314455 -505801 560402
6746 560402 346102 76529 198372 -153034 88485 -28898 357585 528193 86578 105091
6736 105091 158062 -227949 -50426 -72429 -474149 111600 25541 559840 557092 -29780 244283
6725 244283 554209 514180 172358 1126198 599051 519955 566983 -547574 85672 -70365
6715 -70365 1101604 187184 42745 282380 418702 -337428 206672 955556 -379891 830540
6705 830540 -38596 259134 -436143 555778 761962 45141 -153229 -590441 969580 -64751
6695f4751L57412j10560O39930o19090J11510N967k19056J21893l44863M80746
6685C59138M58930o39494j21512R7932N05332r28045J193009l39665l26977n34272
6675b75624P44546K01595r32661L97277J61751k16804p32775K62002K44822J68531
6665B2660O34624o79056K38675m94587l9700K18616J59687n50720P84012O96236
6655I90447j276994m08901J166485k62079m61545K38939L35888O992p75920N74289
6645A27601k04971L47983L88920j98327j39983q14712L22661n7052N49441j10079
6635B11482k00340j19384L57389j80984q26350O60470n47039P21043m00035J065288
6625G41540q6484l29281l61555M9763K61158j6442K29400k19453M22859n95638
$$ plain form
6695 -64751 292661 182101 822031 202941 314451 320418 101362 223255 -121608 359138
6685 359138 818068 178574 57062 154994 660326 -267719 925290 585625 258648 -275624
6675 -275624 468922 670517 -262144 135133 296884 80080 -652695 -390693 -145871 22660
6665 22660 657284 -21772 216903 -277684 -317384 -98768 60919 -489801 294211 990447
6655 990447 -286547 -695448 471037 208958 -252587 -13648 322240 329232 -446688 127601
6645 127601 -77370 270613 659533 461206 321223 -493489 -170828 -227880 321561 211482
6635 211482 11142 -108242 249147 68163 -758187 -97717 -644756 76287 -323748 741540
6625 741540 655056 325775 -35780 13983 275141 258699 488099 268646 691505 95867
6615I5867k97625P5992k48822l7304M17848K86489n67193m14063R61082k51386
6605B0885J264141q03805N10242o98441K63623o35733o8674J101924r72349l25913
6595c44100L08575P84989n46792M7304n55397L27976R72857l80334q91139O15955
6585C39894q73529J231242j214059J065103l53495l70287M68408l63406L86533
6576C16404l33949M83654j023228P11178K47082j58987K17591J64877l76242p16457
6566d68077R6298Q26785n03032M01956j46929j09406n60953M86561M89749P0314
6556E83266R9742r18511K50088L59345K05740p31971k96702N23948L41001L54875
6546G70821l14551j34768j007993Q07232j51745m25313O07280r6237O71394l81685
$$ plain form
6615 95867 -201758 -125766 -374588 -411892 5956 292445 -274748 -688811 272271 20885
6605 20885 1285026 481221 991463 293022 556645 -79088 -147762 954162 -18187 -344100
6595 -344100 -35525 749464 202672 249976 -305421 22555 995412 615078 -276061 339894
6585 339894 -533635 697607 -516452 548651 195156 -175131 293277 -70129 316404
6576 316404 -17545 466109 -557119 154059 401141 242154 459745 624622 248380 -468077
6566 -468077 -371779 455006 -48026 353930 207001 97595 -463358 23203 512952 583266
6556 583266 683008 -235503 14585 373930 579670 -152301 -449003 74945 415946 770821
6546 770821 456270 321502 -686491 120741 -31004 -456317 150963 54726 726120 344435
6536C44435p98025J42257l0J212394o88457m19390M45563K61742K19092l93356
6526C26225j11267j05325N79481m04413n60523j21686J231884k60514l71000j69740
6516C3122J98420k54256m35334K50990O16263l90283K19128J93534J23649M65051
6506A020284p44486q9011q3302J78962j058842P18408M55374o84849j13149L50533
6496e0078k95358R43526l42455M53166j58184k61063O82224j006516J32362K02015
6486B99639m98547J197651j020129K6788L08011L75282k31728n20282J70175N43313
6476F50173n15163L75262p13497L23888J40979j86786q06561J52000J043653j54280
6466C09668N75471o18649l85015M02412j79104k02411K81100N33812k01202k79442
$$ plain form
6536 344435 -453590 -311333 -311363 901031 212574 -206816 238747 500489 719581 326225
6526 326225 214958 109633 689114 284701 -275822 -397508 834376 573862 202862 33122
6516 33122 231542 -22714 -458048 -207058 409205 18922 238050 431584 555233 1020284
6506 1020284 275798 186787 103485 282447 -776395 -57987 397387 -287462 -400611 -50078
6496 -50078 -345436 598090 255635 708801 550617 289554 971778 -34738 97624 299639
6486 299639 -198908 998743 -21386 5402 313413 688695 456967 -63315 106860 650173
6476 650173 135010 510272 -203225 120663 261642 74856 -731705 -579705 463948 309668
6466 309668 885139 266490 -118525 283887 104783 -97628 183472 717284 516082 236640
6456B36640n09951M66344L58882o31749J34624P34924r7705l98660o75109K91422
6446i0338l6089L77289L85191o2873l11148k1442m59120m1810K05395m39277l59273
6435h53495Q10958r0129J37623P2565J69420l25974Q28479o87853K75970J71831
6425E09395n21479K31576k11200L22140n01510j85684L18630L33526j48995K80671
6415D27070N30342o54517j49439J58604l1658L9273O74459m22486n82819N44422
6405E33251n98302r8992K33134L40563M95179p45132N4873l69089r4142L99491
6395A50834L44507J77740o55015K22589q7667R4563L53139R4257k76033k21586
6385A97328L41715m32623K84782m13669K2431j16964N35912k55146N73141m61712
$$ plain form
6456 236640 -273311 193033 551915 -79834 54790 789714 692009 293349 -381760 -90338
6446 -90338 -126427 250862 636053 573180 262032 240590 -218530 -260340 -54945 -494222 -853495
6435 -853495 -42537 -132666 4957 77522 246942 -79032 749447 61594 337564 509395
6425 509395 -12084 219492 8292 330432 -171078 -356762 -38132 295394 146399 427070
6415 427070 957412 302895 153456 312060 280402 319675 994134 571648 -11171 533251
6405 533251 -65051 -164043 69091 409654 904833 159701 214574 -154515 -248657 150834
6395 150834 495341 673081 18066 240655 152988 247551 600690 694947 418914 197328
6385 197328 539043 106420 391202 -22467 -36 -117000 418912 163766 736907 275195
6375B75195M12198o46384N71100j89987l05733l65303Q94716n08357M15937n26911
6365B6471K20776k90803o7969P69874l95285P4350o97571J136618q70240p8207
6355a71986L37156j75543J287478q80121o53236M09672k96913L94025N70195j158947
6345c38220J111953k97898o68536k46857k50057K87651Q14025l23775K77163j36389
6335B29060j32044J86899N23283k33819J52867P1610n22943K88793m02070q860
6325A52776J18767N2156Q43224m27411l02093o02094M53098P25309n70520R33974
6315A377186o85902q53368L24562L1730l90119J50602J75887M68528K1658m70499
6305A50265L62813R418j61504M80762m51011P9393k83271L96050q15769N32375
$$ plain form
6375 275195 687393 41009 612109 422122 116389 -248914 645802 137445 553382 26471
6365 26471 247247 -43556 -111525 658349 263064 337414 -360157 776461 -93779 -171986
6355 -171986 165170 -10373 1277105 396984 -256252 153420 -143493 250532 820727 -338220
6345 -338220 773733 475835 -192701 -439558 -689615 -401964 412061 88286 365449 229060
6335 229060 97016 283915 807198 573379 726246 797856 274913 563706 161636 152776
6325 152776 271543 323699 1166923 739512 437419 -164675 288423 1013732 443212 1377186
6315 1377186 691284 -162084 162478 194208 -195911 -45309 130578 599106 620764 150265
6305 150265 513078 522496 360992 841754 390743 470136 186865 582915 -232854 299521
6295B99521n61923M39696K29541P3976j55443K01458l99623K35823l71K58925
6285F21580n15691K10145k95228Q21967k36473p70106J90341N77689p3599o48283
6275a17658P50360p97956R34691n32984N36590o36974O17198n26932M57834o62997
6265B1172L11091M79571k39974k87716k20372j37078O3403L09124N41131Q9050
6255I29402J62191r05049m58326M91073k63085N60902K50849m76086L84353j084439
6245d08215L11860j70285O94618M52890n74147L10099k66802j46523N04126o56881
6235E0740j88789k90631J329583m94313m05408O19531o65407N42541q06632K00020
6225a08765j11117R46807j58819r779M27914q94318M88424R2604P13198r63192
$$ plain form
6295 299521 -262402 177294 406835 480811 325368 526826 127203 363026 362655 621580
6285 621580 105889 316034 20806 842773 606300 -163806 26535 604224 530625 -117658
6275 -117658 632702 -165254 769437 236453 773043 136069 753267 226335 684169 21172
6265 21172 332263 811834 571860 284144 63772 -73306 -9903 299221 840352 929402
6255 929402 1091593 186544 -271782 219291 -43794 517108 767957 291871 676224 -408215
6245 -408215 -96355 -266640 427978 880868 306721 616820 350018 203495 707621 50740
6235 50740 -138049 -428680 900903 406590 1182 620713 -44694 497847 -308785 -108765
6225 -108765 -219882 726925 568106 558327 986241 91923 580347 672951 1386149 422957
6215D22957j40539P727J9962n25078J218739j61346M0109j102484J098219l42241
6205E36025N66649l29210N01213k30731p44420P95673q80264J001958k74353n9096
6195H83444k27623o90160O85622M55578r70235m97537L24568R62911m92826K07801
6185F41543k83530J88074m50113N20842k45634p1914j13400P42799l64856L82010
6175I45821o40964p54643J387259K8823l15625n33722Q8087j96263R5378N65952
6165F70103L34089p09849O48043k45856l85564M29385l96707l00120Q79866j63475
6155G59915n53028m04970O34856M63245o29635K62048n85100O43196p8364m3103
6145D69060j82255N66570k9691o29482m04493Q32417j29o55538M37902m12199
$$ plain form
6215 422957 282418 290145 310107 -214971 1003768 842422 882531 -219953 878266 536025
6205 536025 1102674 773464 1274677 1043946 299526 1095199 214935 1216893 942540 883444
6195 883444 655821 -34339 651283 1106861 136626 -360911 -36343 926568 433742 641543
6185 641543 358013 546087 95974 616816 371182 299268 185868 928667 563811 945821
6175 945821 304857 -449786 937473 966296 650671 116949 205036 8773 104151 670103
6165 670103 1004192 294343 942386 696530 310966 740351 343644 43524 923390 759915
6155 759915 206887 -198083 436773 900018 270383 532431 -52669 590527 512163 469060
6145 469060 286805 853375 823684 194202 -210291 622126 621997 -33541 404361 -7838
6135g838M73478o19361O09321L98581J34913k89513o38602L2442P02978p52966
6125D3433R80327n8868l99397N23251j02529J11510q80212P0059N38514o76617
6115A49471k09959L99545J57776J20397K83656M08521n47628p05397j17865J574374
6105A512891p43327l72737L6387N54404m32185n6965N13484N65038q84925Q79448
6095A571513p73380J49664k69718j67482J48377J084127j225008j91916M50103
6086G76280k13689L1148l09537O83770L2153l20770P31765q17601k13182Q90505
6076A270842j234694J363131j22890O7111j69491J05591j80334j74142J88133
6067A113257l93146Q8887j091202J009810k01279L01166K01670O1236m20060l5180
$$ plain form
6135 -7838 465640 -153721 455600 854181 989094 699581 60979 93421 796399 43433
6125 43433 1023760 964892 565495 1088746 986217 1097727 217515 287574 826088 149471
6115 149471 -60488 339057 496833 617230 900886 1309407 761779 56382 -61483 1512891
6105 1512891 769564 396827 433214 987618 555433 498468 1011952 1576990 692065 1571513
6095 1571513 798133 947797 678079 510597 658974 1743101 518093 326177 776280
6086 776280 562591 593739 284202 967972 1000125 679355 1411120 593519 380337 1270842
6076 1270842 36148 1399279 1276389 1343500 1174009 1279600 1099266 925124 1113257
6067 1113257 720111 808998 -282204 727606 526327 827493 1029163 1090399 670339 635159
6057F35159j04998J347391r85420K42677n75990J06973n00569Q20881N02314j65002
6047A323416o12957J90940K09963m34689J09404j05615R84660j196177K8441N65194
6037A062580R76376j346037R19460R0036n19272j30784o158L92417l65526L6472
6027A109564L36877M46895m10450n66267q841L51786L3684j26325J3771L56745
6017A537439n87149O62815p09983J88328k96680L23708R3007L43635n18403P4790
6007A111507J91893M91112J01194k05925n1461P42178q13176P9647m61613J44209
5997A329565M49770j93453J009970l98309n39082O44860K59838o08869l56049
5988A598241J072581j561612O90517L53288O88367n87157J1535n33363L85534
$$ plain form
6057 635159 530161 1877552 892132 1134809 558819 665792 165223 986104 1488418 1323416
6047 1323416 710459 901399 1111362 676673 786077 680462 1665122 468945 497386 1062580
6037 1062580 2038956 692919 1612379 1702415 1183143 1052359 1046201 1438618 1073092 1109564
6027 1109564 1446441 1893336 1482886 916619 907778 1259564 1293248 1166923 1180694 1537439
6017 1537439 950290 1613105 903122 1091450 794770 1118478 1211485 1555120 1036717 1111507
6007 1111507 1303400 1794512 1895706 1689781 1638320 2380498 1567322 1646969 1185356 1329565
5997 1329565 1779335 1585882 2595852 2197543 1658461 2303321 2563159 1954290 1598241
5988 1598241 2670822 1109210 1799727 2153015 2841382 2254225 2265760 1732397 2117931
5979B117931M15240J19066K31852l31129J05996m04389J65925k23162l001L29661
5969B523990K05849j12194L33843p92677R37012k16223N60523n44207N00534l71903
5959C024547j8790O05588K50207j73361p67425M57431j06556l74024M28786J09039
5949C435442k97658R86807m31529n52850J37744L39416M32274P6920l60858k59703
5939C506005j79368M43139l28642o67387P52270M04786M88937K6966n25010m19789
5929C501907M38245P08535p25725m04950N23914P67174Q0170k62146q13918l06657
5919C506549N25415k97506J094179o76159o27605J02677j60259N55979k70917
5910C752353K20998n79903K80193N97333N97205j437550K0847O43908m9656o5636
$$ plain form
5979 2117931 2533171 2652237 2884089 2552960 2658956 2254567 2420492 2197330 2194329 2523990
5969 2523990 2729839 2617645 2951488 2158811 3095823 2879600 3440123 2895916 3396450 3024547
5959 3024547 3005757 3611345 3861552 3688191 2920766 3378197 3271641 2897617 3326403 3435442
5949 3435442 3137784 4124591 3693062 3140212 3277956 3617372 4049646 4126566 3765708 3506005
5939 3506005 3326637 3769776 3441134 2773747 3526017 3930803 4419740 4446706 3921696 3501907
5929 3501907 3940152 4648687 3922962 3518012 4041926 4809100 4889270 4627124 3813206 3506549
5919 3506549 4031964 3734458 4828637 4152478 3524873 3627550 3467291 4023270 3752353
5910 3752353 3973351 3393448 3673641 4270974 4868179 3430629 3451476 4095384 4045728 3980092
5900C980092o70518O25854N75900n53242k46600J24178J026051m45756k47914
5891D168045M09825p05797L23936j142504J872169n67k48791p82225P92319M29165
5881E115575q10137L10914N9736L04997k8977j001925R74867l06182O88782m65531
5871D842119L59627Q6263p5762K91946J2590j22406r88548Q17207P38142K3356
5861E984534k32283j70999J61780M63763o07389L51423n3606M44235L12992r31944
5851E722506P15588J83709n21285J708236m81267p7985q28688j44800O84815P4988
5841G035817N51537o12210P05501N99988l74245j31612j6789O47444l98365m06140
5831G600926R14543K8666R30368k64101n82051K05192K93567p85288J326136J79970
$$ plain form
5900 3980092 3309574 3935428 4511328 3958086 3711486 3835664 4861715 4415959 4168045
5891 4168045 4577870 3872073 4196009 3053505 4925674 4925107 4676316 3894091 4686410 5115575
5881 5115575 4305438 4616352 4676088 4981085 4952108 3950183 4925050 4618868 5307650 4842119
5871 4842119 5201746 5288009 5212247 5504193 5516783 5394377 4405829 5223036 5961178 5984534
5861 5984534 5752251 5581252 5743032 6206795 5599406 5950829 5897223 6341458 6654450 5722506
5851 5722506 6438094 6621803 6100518 7808754 7327487 7249502 6420814 6276014 6960829 7035817
5841 7035817 7587354 6975144 7680645 8280633 7906388 7774776 7757987 8405431 8007066 7600926
5831 7600926 8515469 8544135 9474503 9210402 8628351 8833543 9127110 8341822 9667958 9847928
5821I847928l57847k9758l63785N67899k2923k05257Q81504K54749L76998j192807
5811I756701J454098m0070P67091p96208J82384m09998J55790P07965J64485K01432
5801A2143670N90242o39623m9373K68097J044412q04292J315831J2359M1497L5374
5791A3958194J41537L71399N55084n5349R50468K58175n39762O17613N74633P87560
5781A7619552J6907J19439Q51664p61902J506043k95950R03675J667266j70824
5772B1455870P40637k98176M18506J079857J36247Q90368J014481K22582J122837
5763B6783209O91112O32516K77283P85375J450838J463063K14447M88583K044907
5754C4831333Q75770J344872J017884Q04463J445818K506147J293492K075752
$$ plain form
5821 9847928 9490081 9460323 9096538 9664437 9641514 9436257 10317761 10572510 10949508 9756701
5811 9756701 11210799 11170729 11937820 11141612 11323996 10913998 11069788 11777753 11942238 12143670
5801 12143670 12733912 12094289 12044916 12313013 13357425 12553133 13868964 13881323 13922820 13958194
5791 13958194 14099731 14471130 15026214 14970865 15921333 16179508 15639746 16257359 16831992 17619552
5781 17619552 17636459 17755898 18607562 17845660 19351703 19055753 19959428 21626694 21455870
5772 21455870 22196507 21898331 22316837 23396694 23532941 24423309 25437790 25660372 26783209
5763 26783209 27474321 28106837 28384120 29169495 30620333 32083396 32297843 32786426 34831333
5754 34831333 35707103 37051975 38069859 38874322 40320140 42826287 44119779 46195531
5746D6195531J752077L018829J914975L832384L570069M961313L521612N088871
5738G3855661N134201O635720O914224O407470O384025O828353O155533O599036
5730A24914223N331348N322464M387812M461702M892330L587006L250765L203520
5722A59351170K739063L488489K545630L074229K912449M226521L200403L558421
5714A85096375M028532N947932N186118P441326O030218P360591R516654J0055878
5706B40663624J0258784J1586972R557333J0790297Q119219R189948O755310N748062
5698C12669549M345384L250626L015050K252571J438684P96886j31273k33803
5690C27403674j16566j703646p25331p28137o35602j141658j504023p89975j85578
$$ plain form
5746 46195531 47947608 50966437 52881412 56713796 60283865 65245178 68766790 73855661
5738 73855661 78989862 85625582 92539806 98947276 105331301 112159654 118315187 124914223
5730 124914223 130245571 135568035 139955847 144417549 149309879 152896885 156147650 159351170
5722 159351170 162090233 165578722 168124352 171198581 174111030 178337551 181537954 185096375
5714 185096375 189124907 195072839 200258957 207700283 213730501 221091092 230607746 240663624
5706 240663624 250922408 262509380 272066713 282857010 290976229 300166177 306921487 312669549
5698 312669549 317014933 320265559 323280609 325533180 326971864 327768750 327637477 327403674
5690 327403674 327287108 325583462 324858131 324129994 323494392 322352734 320848711 320058736 319873158
5681C19873158p25411K013k16964m29221J757930J206913P24563N19948N46763
5672C23259692j01349K43973j096741k347343k408788l025187l309339m511206
5664C06703712l915765m167964m918260m667778n333247m663097n011529o512700
5656B67513372m006430n813062n816380n677885n989077m685044n445658n395911
5648B24683925n808826n028495m528230n485609l305961m358505l902043l613703
5640A88652553l569520k394652k853605j345853k272063q53046j469290p03514
5632A73191010m95804n77071l89291j100917L28226N46874M38243l57328N47600
5623A72131542O03339J329122J129519R58726K657669R92178J036740K104388
$$ plain form
5681 319873158 319147747 319149760 318932796 318503575 320261505 321468418 322192981 322712929 323259692
5672 323259692 323158343 323402316 322305575 319958232 317549444 314524257 311214918 306703712
5664 306703712 302787947 298619983 293701723 289033945 283700698 279037601 274026072 267513372
5656 267513372 263506942 257693880 251877500 246199615 240210538 235525494 230079836 224683925
5648 224683925 218875099 213846604 209318374 203832765 200526804 196168299 192266256 188652553
5640 188652553 185083033 182688381 179834776 178488923 176216860 175363814 173894524 173191010
5632 173191010 172695206 172118135 171728844 170627927 170956153 171503027 171941270 171583942 172131542
5623 172131542 172734881 174064003 175193522 176152248 178809917 179802095 180838835 182943223
5615A82943223J517577J405173J708929J460409J610923J497704J60809J900885
5607A94205632J72898j40711Q62946M23589Q20664j44883Q80860m87787J41112
5598A96734320m27771K37821n60932M40693j012656j433811o16957j674739m33853
5589A91252115j349090k895830j996234l380768j925869l735875k481411l331633
5581A70155405m038120l355251m028253l431239l846132l382463m443317l295019
5573A40335611l848907l552527l726253l825859m126700l306445m636692k943438
5565A10368790m211762l146048l046154m220994k335934m234453k990845k734747
5557H3447853k799747k325298k968028k149927k263834j682518j961866j155629
$$ plain form
5615 182943223 184460800 185865973 187574902 189035311 190646234 192143938 192304747 194205632
5607 194205632 194378530 194237819 195100765 195524354 196345018 196200135 197080995 196593208 196734320
5598 196734320 196306549 196544370 195983438 196424131 195411475 193977664 193360707 191685968 191252115
5589 191252115 189903025 187007195 185010961 181630193 179704324 175968449 173487038 170155405
5581 170155405 166117285 162762034 158733781 155302542 151456410 148073947 143630630 140335611
5573 140335611 136486704 132934177 129207924 125382065 121255365 117948920 113312228 110368790
5565 110368790 106157028 103010980 99964826 95743832 93407898 89173445 86182600 83447853
5557 83447853 80648106 78322808 75354780 73204853 70941019 69258501 67296635 66141006
5549F6141006k078588j730485K55314j014343j179627j129764N44639M1963O09022
5540F0459137N44621R50320P05624J376035R59670K721994J264807J752661J200829
5531G1935698J599727K619594K010929K214122K127916J946685K312680K387281
5523H9154632K643853K421764L698110K636000L639964L188606M276401L639111
5515A15298441M186554M788026M478152M125896N256860L631316M994006M040907
5507A50800158L865463L978398K898384L093153L565297J654286K414132J662424
5499A73931695K468474K144594J531394J197137J439778J555399R69043R20980
5491A86158494K21451J104214M9907o0746m50091m63463n44940j845805j909821
$$ plain form
5549 66141006 64062418 62331933 62587247 61572904 60393277 59263513 59808152 59850115 60459137
5540 60459137 61003758 61954078 62659702 64035737 64995407 67717401 68982208 70734869 71935698
5531 71935698 73535425 76155019 78165948 80380070 82507986 84454671 86767351 89154632
5523 89154632 91798485 94220249 97918359 100554359 104194323 107382929 111659330 115298441
5515 115298441 119484995 124273021 128751173 132877069 138133929 141765245 146759251 150800158
5507 150800158 154665621 158644019 161542403 164635556 168200853 169855139 172269271 173931695
5499 173931695 176400169 178544763 180076157 181273294 182713072 184268471 185237514 186158494
5491 186158494 186379945 187484159 187534066 187473320 187023229 186559766 186014826 184169021 182259200
5482A82259200k317599j220691k497331l635899k094451k866822l720959m168286
5474A59737162k601134l529402l274237l903959m857547l637427l104665m540884
5466A30287907l070215m127728m439407l671732m465333m390991l704829m135459
5458I8282213l292928n332849l934746l969987m328108j808083m757920l923661
5450F6933931m469731k572732j256566m113885k459341l185835k500980l313967
5442D3060894j999531j655774j914255l040202p76774j652722k139684j800575
5434B8081377k069834j004788l56335k776916l98490j916599l39217j144949j191019
5425A6883230j132038j00570R716n93667m84292p16521j024408j9870j008287
$$ plain form
5482 182259200 179941601 178720910 176223579 172587680 170493229 167626407 163905448 159737162
5474 159737162 157136028 153606626 150332389 146428430 141570883 137933456 134828791 130287907
5466 130287907 127217692 123089964 118650557 114978825 110513492 106122501 102417672 98282213
5458 98282213 94989285 89656436 85721690 81751703 77423595 75615512 70857592 66933931
5450 66933931 62464200 59891468 58634902 54521017 52061676 48875841 46374861 43060894
5442 43060894 41061363 39405589 37491334 34451132 33674358 32021636 29881952 28081377
5434 28081377 26011543 25006755 24650420 21873504 21475014 19558415 19219198 18074249 16883230
5425 16883230 15751192 15650622 15660338 15066671 14582379 13865858 12841450 12821580 11813293
5416A1813293j39364m87022J51494m57768l34551P0344j021176J199817o51309
5407A0143758m08461L9470k12837o26684k52341j31564K06169k05587R68714p47114
5397H773523j353751q8517P80738m01975l46951l40752J67007o08798n45332N7659
5387F092851K28840N38293q07654n8961l08782K35838j408361J500565j165433
5378D847196L85227n18439J35118j3661o96182K95414p0253K17191r17007O32530
5368D297134l92244j79923m46838l42369K83569Q80764r84309N20754k53723M37750
5358C820565j126287L19452o80569J12580N89255M04029o90407L70746k69773
5349B849591K8104k82634O88J18629L20959n31896m4862j034540J865329j550394
$$ plain form
5416 11813293 11673929 11186907 11338401 10880633 10546082 10616426 9595250 10795067 10143758
5407 10143758 9735297 9774767 9561930 8935246 8682905 8551341 8757510 8551923 9520637 8773523
5397 8773523 7419772 7331255 8111993 7710018 7363067 7022315 7189322 6580524 6035192 6092851
5387 6092851 6321691 6859984 6052330 5993369 5684587 5920425 4512064 6012629 4847196
5378 4847196 5232423 4713984 4849102 4835441 4139259 4434673 4364420 4581611 3664604 4297134
5368 4297134 3904890 3724967 3278129 2935760 3219329 4100093 3115784 3636538 3382815 3820565
5358 3820565 2694278 3013730 2333161 2445741 3034996 3439025 2748618 3119364 2849591
5349 2849591 2877695 2595061 2595749 2714378 3035337 2503441 2458579 1424039 3289368 1738974
5339A738974N15870P49069j153802k64913k14063J051352n06942j45295K95126
5330B065376l95298M25024o39236M3979L25551O95275l97483m44231L8812P67526
5320B485295m52266k40222N40360p32024l16528P33511j06713K45344m87084L38880
5310B008553j095312Q65620L19723k44305j3811m23222K46908L33310l86608M1977
5300A652833n21217M46656K54217q31158J87613J46553J197826n87476L25775
5291B271622j093532K57358P72927l05836k77979L32187o26338P97115n39955
5282A587569j46734O84149q3201J60515K12526p47130n97023k00277R21247M37177
5272B228818Q5279n19814j95N69033p96300R40180l9107q11302K21828j52003
$$ plain form
5339 1738974 2254844 3003913 1850111 1585198 1371135 2422487 1915545 1770250 2065376
5330 2065376 1670078 2095102 1455866 1499845 1825396 2520671 2123188 1678957 1717769 2485295
5320 2485295 2033029 1792807 2333167 1601143 1284615 2018126 1911413 2156757 1669673 2008553
5310 2008553 913241 1778861 2098584 1854279 1840468 1417246 1664154 1997464 1610856 1652833
5300 1652833 1131616 1578272 1832489 1001331 1188944 1335497 2533323 1945847 2271622
5291 2271622 1178090 1435448 2208375 1902539 1624560 1956747 1330409 2127524 1587569
5282 1587569 1440835 2124984 2041783 2202298 2414824 1667694 1070671 870394 1791641 2228818
5272 2228818 2314097 1794283 1794088 2363121 1566821 2507001 2467894 1656592 1878420 1726417
5262A726417j16747R51983m87093M11667l07402L0858k90530O51317O65088n93376
5252B642182K04623j004009N68303O748P7715l49306L09156J21337J64932K57446
5242B999127m3083k09871N34281Q9827m2850O7357n49779J3837L61090o19991
5232B599945k45951K87161J71398n54761Q24620n14764L93702J60729L09890m93472
5222B938497m7446O12529J2982n44970O97394o17857J05707l18943n55584M34244
5212B716553j25367P79160q93057J081771m93582K56731L64378n8922o32149p95525
5202B199991N94510P2016N8680P7678l82330N84138p71430R02861j054965J425518
5192C706667m87754O2373O5391n57937L04325n50929P18476j47339Q3144m185
$$ plain form
5262 1726417 1609670 2561653 2074560 2486227 2178825 2209683 1919153 2570470 3235558 2642182
5252 2642182 2846805 1842796 2411099 2417847 2495562 2146256 2455412 2576749 2741681 2999127
5242 2999127 2956044 2746173 3280454 3370281 3327431 3394788 2845009 2858846 3219936 2599945
5232 2599945 2353994 2641155 2812553 2257792 3082412 2567648 2961350 3122079 3431969 2938497
5222 2938497 2891051 3503580 3516562 2971592 3668986 3051129 3156836 2837893 2282309 2716553
5212 2716553 2591186 3370346 2477289 3559060 3065478 3322209 3686587 3627665 2995516 2199991
5202 2199991 2794501 2866517 2925197 3002875 2620545 3204683 2433253 3336114 2281149 3706667
5192 3706667 3218913 3281286 3346677 2788740 3093065 2542136 3260612 3113273 3196417 3192232
5182C192232Q98921j085127L15029k9656p360M89030q3967K06050o03124Q28087
5172D120115r4845l63035M71041p26989M73619N4846j97490J29391M22186N60663
5162D849502o73813L90788J0881k1417j12714J451613j180447K23629J76281M77823
5152E592126o86092K26874j13270L60574m7317J041275j371109P21728J065597
5143F790386n73235n30164O05555O16196p84965R20446L76537l13650m79285O06873
5133G234694k47172Q13236k7956K41616M12303L7264k24487k98912M55759Q6325
5123H482670J24200K74180L87486O30222p2318J78712l23201M38066O24021j23567
5113A0620471R30193p64645K037232n0176M4321k68620O12623J227736q77811
$$ plain form
5182 3192232 4091153 3006026 3321055 3291399 3284039 3773069 3689102 3895152 3292028 4120115
5172 4120115 4025270 3662235 4133276 3406287 3879906 3934752 3737262 3866653 4288839 4849502
5162 4849502 4175689 4566477 4577358 4555941 4443227 5894840 4714393 4938022 5114303 5592126
5152 5592126 4906034 5132908 5019638 5380212 5332895 6374170 5003061 5724789 6790386
5143 6790386 6217151 5686987 6292542 6908738 6123773 7044219 7420756 7107106 6627821 7234694
5133 7234694 6987522 7800758 7772802 8014418 8426721 8463985 8239498 7940586 8396345 8482670
5123 8482670 8606870 8881050 9268536 9898758 9826440 10005152 9681951 10120017 10744038 10620471
5113 10620471 11550664 10786019 12823251 12773075 12817396 12548776 13161399 14389135 13511324
5104A3511324R58435K34618J570424K16939L11466J057471J181997J576683Q01458
5095B1420815K025236J957290K049999N10188J903662J803178J93204J306715
5087C3170287K97930Q20819J033932O80888J341989R27883J686220K83721N66169
5078D0809838J588479L66234J243255R43950P48961J511624J181566J925476L620240
5069E3939623J975579L206713L072420L563865M361036L828869L775345N263582
5061H2987032M179907J603405K577508M88280K414802R83897K180870M79395J182336
5052I9077432J755769N72144J454810k21493N6144Q86080R67852J084086N33761
5043A06166585J190997J392750J332026K233422K612565K761110J857863M599101
$$ plain form
5104 13511324 14469759 14704377 16274801 16491740 16803206 17860677 19042674 20619357 21420815
5095 21420815 23446051 25403341 27453340 27963528 29867190 31670368 31863572 33170287
5087 33170287 33468217 34289036 35322968 36003856 37345845 38273728 39959948 40243669 40809838
5078 40809838 42398317 42764551 44007806 44951756 45700717 47212341 48393907 50319383 53939623
5069 53939623 55915202 59121915 62194335 65758200 70119236 73948105 77723450 82987032
5061 82987032 87166939 88770344 91347852 91836132 94250934 95234831 97415701 97895096 99077432
5052 99077432 100833201 101405345 102860155 102638662 102694806 103580886 104548738 105632824 106166585
5043 106166585 107357582 108750332 110082358 112315780 114928345 117689455 119547318 124146419
5035A24146419L142869M378865M393564L645817L045677J289410J904222o23611
5027A45323232N46417k28958M76835r7827J98681j161628j2316j589281j074797
5018A42380358j429561n20098q05867j184365p36935j488093j004409j440769
5010A33770261q69085l28923k71095P8048L8413J086925M81549R59261j029964
5001A33915390q59127p39935j579369j199295k619188j167598j100509k353044
4993A22297325r78751k311331j330110k788598k636900j881223k592185k397318
4985A05380909j346897k907144k687862l070793k457977j473511k224234k881510
4977H6330981k473412j838572k730369j483153j289936l319225l03922k642200
$$ plain form
5035 124146419 127289288 131668153 136061717 139707534 142753211 144042621 145946843 145323232
5027 145323232 145869649 145640691 146117526 146019699 146218380 145056752 145044436 143455155 142380358
5018 142380358 140950797 140430699 139624832 138440467 137703532 136215439 135211030 133770261
5010 133770261 132901176 132572253 132301158 132379206 132417619 133504544 133986093 134945354 133915390
5001 133915390 133056263 132316328 130736959 129537664 126918476 125750878 124650369 122297325
4993 122297325 121318574 119007243 117677133 114888535 112251635 110370412 107778227 105380909
4985 105380909 104034012 101126868 98439006 95368213 92910236 91436725 89212491 86330981
4977 86330981 83857569 82018997 79288628 77805475 76515539 73196314 72892392 70250192
4969G0250192k034968k899700k091800j290225j237602k258895j433534j152159
4961E5851309k462539j248492j566495j255335j908921j486543j095742k011123
4953D2816119j114294k578256j091955j833056j957296o15588k506766p5043j596335
4944B9447530j613509k145446j076926m78309p80890n77117j203397q77190l79593
4935B0315153p20012p54334n37292o86078o90792K88034j302753O92440p14046
4926A5890320j74871o40363L63186o07517n47441K68807o42949j084779o71762
4917A2152631P87566l60663p30301M63589K6050q17692N34926j081419J256907
4908A2231594k86326o55247p47270J032638N299j08052L30072M16719p00801l94134
$$ plain form
4969 70250192 68215224 65315524 63223724 61933499 60695897 58437002 57003468 55851309
4961 55851309 53388770 52140278 50573783 49318448 47409527 45922984 44827242 42816119
4953 42816119 41701825 39123569 38031614 36198558 34241262 33625674 31118908 31043865 29447530
4944 29447530 27834021 25688575 24611649 24133340 23352450 22775333 21571936 20694746 20315153
4935 20315153 19595141 18840807 18303515 17617437 16926645 17214679 15911926 16604366 15890320
4926 15890320 15715449 15075086 15438272 14830755 14283314 14552121 13909172 12824393 12152631
4917 12152631 12940197 12579534 11849233 12312822 12338872 11521180 12056106 10974687 12231594
4908 12231594 11945268 11290021 10542751 11575389 11580688 11472636 11802708 12219427 11518626 11124492
4898A1124492n29Q62529n28947M63257L3665K24237P4631m54154J014295m2058
4888A2771418L90148J16840J78758k20991j44908J287328J18808M8378k91393
4879A4254386Q52988K72219J9377n051Q31540J47099L25738P19773P55829q2490
4869A8091408m90993J683284o4496N15967N72534P52293J293332J96827Q04202
4860B3354358P01206J099295M49277P48901K031256P65435J84473R35195K420921
4851C2690317K07093J483116O71287K165449J228628J370758J680112J499117
4843D2995877Q43768J756645J899469J122316J291337K557773J631968J181797
4835E5280950J161056K180618K598992K821904J693758K654227K902182K272985
$$ plain form
4898 11124492 11123963 11986492 11457545 11920802 11954467 12178704 12253335 11799181 12813476 12771418
4888 12771418 13161566 13278406 13457164 13236173 13091265 14378593 14497401 14545779 14254386
4879 14254386 15107374 15379593 15398970 15393919 16225459 16372558 16698296 17418069 18173898 18091408
4869 18091408 17600415 19283699 19219203 19735170 20307704 21059997 22353329 22550156 23354358
4860 23354358 24055564 25154859 25604136 26353037 28384293 29149728 29334201 30269396 32690317
4851 32690317 32897410 34380526 35051813 37217262 38445890 39816648 41496760 42995877
4843 42995877 43839645 45596290 47495759 48618075 49909412 52467185 54099153 55280950
4835 55280950 56442006 58622624 61221616 64043520 65737278 68391505 71293687 73566672
4827G3566672L409280L745534M599698K666915N047718M773383M038314N072657
4819A06920171M507656M898697M846120M808845M859828M818532N350263O466719
4811A47476831N586471O646960P631385P594751R345338P419547P410708N623370
4803B04735361P232080O188842N687243Q452309Q168777Q866683Q824146R448521
4795B67603962R195684Q192270Q200444P733607O773496O746033N362793N824615
4787C25632904M535393L983912M015658M556088L776580M446494K954703L897055
4779C57798787K716319O52965j073020K85384m42112j304743m28323k076348j239706
4770C54889203k382093k311801k706085m247946m167737m200028n434303m457442
$$ plain form
4827 73566672 76975952 80721486 85321184 87988099 93035817 97809200 101847514 106920171
4819 106920171 111427827 116326524 121172644 125981489 130841317 135659849 141010112 147476831
4811 147476831 153063302 159710262 167341647 174936398 184281736 191701283 199111991 204735361
4803 204735361 211967441 218156283 223843526 232295835 240464612 249331295 258155441 267603962
4795 267603962 276799646 284991916 293192360 300925967 307699463 314445496 319808289 325632904
4787 325632904 330168297 334152209 338167867 342723955 346500535 350947029 353901732 357798787
4779 357798787 360515106 361168071 360095051 360380435 359938323 358633580 358205257 356128909 354889203
4770 354889203 352507110 350195309 347489224 343241278 339073541 334873513 329439210 324981768
4762C24981768o099626n529070o474540o645411p204103o901716p402982p445471
4754B71278849p486657p183793p679412p154160q270359p519585p516457p309073
4746B11159353q617657o911158o670277q345310p081786q295437o747875o243751
4738A52246102o436808o364698o463629n926977n931321n081659o338739n761613
4730A03940658n715356m867256n202335m458747l683787m658108k915409m290145
4722F8149515l084822k407995m011151k620785l990354l091737j632711l283026
4714D4026934j757719j788470k693641j633452l057007r13092j448002k195474
4706B8540077j236558j427252m86590j953407m56093o68535k273129O2537j524218
$$ plain form
4762 324981768 318882142 313353072 306878532 300233121 293029018 286127302 278724320 271278849
4754 271278849 263792192 256608399 248928987 241774827 233504468 225984883 218468426 211159353
4746 211159353 202541696 195630538 188960261 180614951 173533165 165237728 158489853 152246102
4738 152246102 145809294 139444596 132980967 127053990 121122669 116041010 109702271 103940658
4730 103940658 98225302 93358046 88155711 83696964 80013177 75355069 72439660 68149515
4722 68149515 65064693 62656698 58645547 56024762 52034408 48942671 47309960 44026934
4714 44026934 42269215 40480745 37787104 36153652 33096645 32183553 30735551 28540077
4706 28540077 27303519 25876267 25389677 23436270 22980177 22311642 20038513 20101050 18576832
4697A8576832p48186j860783L08427o04688o11028j388994r20680o0779o66696
4688A2023425M64001j333379m17043n19759l31016j120656L44151l70941l89200
4679H349583m72184o89409l64756k18389R5776o70712M99135k96556k18908p50923
4669E262657J80022j037053J116024q20196l23592L41133q72596M03113j5852
4660D233660l16931J46464p17956M57160r82839L98378M64490L19819n77983l53732
4650C070530Q7780L17357l39717J087546n17953r03315k6648l74226k32769N75820
4640B744405o22327K72463m40022q50689N90774K35556L32404j070760O44461
4631A836265j89811m050Q95783J9497j263352J244381q26885J05907j05251K27212
$$ plain form
4697 18576832 17828646 15967863 16276290 15671602 15060574 13671580 12750900 12690121 12023425
4688 12023425 12487426 11154047 10737004 10217245 9886229 8765573 9109724 8738783 8349583
4679 8349583 7877399 7187990 6823234 6604845 6700621 6029909 6529044 6232488 6013580 5262657
4669 5262657 5442679 4405626 5521650 4701454 4377862 4718995 3846399 4249512 4233660
4660 4233660 3916729 4063193 3345237 3802397 2819558 3217936 3682426 4002245 3424262 3070530
4650 3070530 3158310 3475667 3135950 4223496 3705543 2802228 2775580 2401354 2168585 2744405
4640 2744405 2122078 2394541 1954519 1103830 1694604 1930160 2262564 1191804 1836265
4631 1836265 1646454 1642404 2538187 2557684 1294332 2538713 1711828 1817735 1712484 1939696
4621A939696N0407O1316k93159p61259J21283R1519J089235n77319P42855j351261
4611A113313J338555j239678r2538M29205o68899J331179l54416m72904M61406
4602A845223L43685j73992k06964n5182j36146N30652j076104O82313l31533p669
4592A414283P54162r84651J009020k95027K08356q88239J066553k54947m00105
4583A629405J417631j109965L67932k75979J02133n32075j06780J86224q7622
4574A590904J161306q31236j03390N26742n43226r268l20841O19545k69408K29102
4564B050230K01576m08014P13823o24234J62689r936M8621L58851j094476N71706
4554A970836O29276l54341j021940J65499R46866q5662O67190m31304m65426K37465
$$ plain form
4621 1939696 1990103 2051419 1758260 997001 1118284 1209803 2299038 1721719 2464574 1113313
4611 1113313 2451868 1212190 1119652 1548857 879958 2211137 1856721 1383817 1845223
4602 1845223 2188908 2014916 1807952 1752770 1616624 2147276 1071172 1753485 1421952 1414283
4592 1414283 2168445 1183794 2192814 1897787 2106143 1217904 2284457 2029510 1629405
4583 1629405 3047036 1937071 2305003 2029024 2131157 1599082 1492302 1678526 1590904
4574 1590904 2752210 1920974 1817584 2344326 1801100 1791832 1470991 2090536 1821128 2050230
4564 2050230 2251806 1843792 2557615 1933381 2096070 2086134 2134755 2493606 1399130 1970836
4554 1970836 2600112 2245771 1223831 1389330 2336196 2250534 2917724 2486420 2020994 2258459
4544B258459j4640L99515n84758r5258J78086J06587Q0997l39946P85155J12497
4534B886694q2368J70325o80840J00466l53993J257108j576028P15231k53640
4525B182955L09365K40679n75561P21472m32252R54455l81464k39917k22676j42635
4515B414421J840N43862K25885n62149j04365m87396k23268R09924n7921k25899
4505B434934j49156J200535o06994n71634L20915j12282n8537K8054r6991l68806
4495B020038N70049j43735k52955J95732l18771K06654k76087J176271r28053
4486B249143J80230j033002Q46797K22629p74957K62061J92220o28430J147710
4477B664401j219747L81472l87536R45966q95409M48674k60938o8468J82954J046
$$ plain form
4544 2258459 2243819 2643334 2058576 1963318 2141404 2247991 2328988 1989042 2774197 2886694
4534 2886694 2804326 2974651 2293811 2394277 2040284 3297392 1721364 2436595 2182955
4525 2182955 2492320 2732999 2157438 2878910 2446658 3401113 3019649 2779732 2557056 2414421
4515 2414421 2416261 2960123 3186008 2623859 2519494 2032098 1808830 2718754 2660833 2434934
4505 2434934 2285778 3486313 2879319 2307685 2628600 2516318 2457781 2485835 2388844 2020038
4495 2020038 2590087 2446352 2193397 2389129 2070358 2277012 2000925 3177196 2249143
4486 2249143 2429373 1396371 2243168 2465797 1690840 1952901 2145121 1516691 2664401
4477 2664401 1444654 1826126 1438590 2384556 1489147 1937821 1676883 1608415 1791369 1792415
4467A792415r3488m16321R31057n52189n5054n89904R38116R23207j181884J2132
4457A708087l14643K77854L42904l29508Q02813n62930m36449j76796M76289K40698
4447B028319k20567l57488O09550J14710k59054N51118L9402J07228j021766J437173
4437C028625n57446P3961l23937L87087j89426R88365p36634R76090m01837n6789
4427C188059K75653l46925Q98288r45903J020860J1691n63297j54478P66238m55100
4417C695086J5422O77745l38404J19604L14404l30021o30209Q16995Q32809m49849
4407D723582O83531m61411M40272J02399K85303N02594K02674Q8510l00083l41248
4397E926123K64223Q15782o4403k49437J65498L26368l59876M99379k81803q54675
$$ plain form
4467 1792415 1698927 1282606 2213663 1661474 1606420 1016516 1954632 2877839 1695955 1708087
4457 1708087 1393444 1671298 2014202 1684694 2487507 1924577 1488128 1311332 1787621 2028319
4447 2028319 1807752 1450264 2059814 2174524 1915470 2466588 2505990 2613218 1591452 3028625
4437 3028625 2471179 2545140 2221203 2608290 2418864 3407229 2670595 3646685 3244848 3188059
4427 3188059 3463712 3116787 4015075 3069172 4090032 4101723 3538426 3383948 4150186 3695086
4417 3695086 3710508 4388253 4049849 4169453 4483857 4153836 3523627 4340622 5173431 4723582
4407 4723582 5407113 4945702 5385974 5488373 5773676 6276270 6478944 6567454 6267371 5926123
4397 5926123 6190346 7006128 6941725 6692288 6857786 7184154 6824278 7323657 7041854 6187179
4387F187179J714268q59582O76375r32375L33393k1880J114105p22606o4355j34389
4377G290133Q76959k53973N89538k36120K37241k82778O19050j45418m2901k73016
4367H378715L24340L23996p72524k3706O95139j94556L02924m20000l8357K35472
4357H811443L47608L88867n30002P25238M88720n54641L71646j53953R93750o26320
4347A0262356j19078N02573M89773k27880r156J740758R40M34633J93793Q50923
4337A4119635P94894M70376O04397P90166Q66885J139414j98168J801655j08907
4328B0280347J309190m01883o7900J130266l03494o34988Q31844q01516J144115
4319B2485981m03875j049048R39231q71245Q55766j068690L66889q19539N90883
$$ plain form
4387 6187179 7901447 7041865 7718240 6785865 7119258 7097378 8211483 7488877 7424522 7290133
4377 7290133 8167092 7913119 8502657 8266537 8503778 8221000 8840050 8694632 8651731 8378715
4367 8378715 8703055 9027051 8254527 8230821 8925960 8731404 9034328 8614328 8575971 8811443
4357 8811443 9159051 9547918 9017916 9743154 10231874 9677233 10048879 9894926 10888676 10262356
4347 10262356 10143278 10645851 11135624 10907744 10898588 12639346 12640286 13074919 13268712 14119635
4337 14119635 14914529 15384905 15989302 16779468 17646353 18785767 18587599 20389254 20280347
4328 20280347 21589537 21187654 21119754 22250020 21946526 21311538 22143382 21341866 22485981
4319 22485981 22082106 21033058 21972289 21101044 21956810 20888120 21255009 20435470 21026353
4310B1026353k308q0954j062025m59192J67553J96519j200850p1871j234204k33059
4300A7045962j81137l03558r50604M49350q67804j312123K779l13575m51154l22709
4290A2795427M48258q71080j273724M9041o38963n18352L46134k255492j99844
4281G881405N56828o57071J5880j906682R25736k45900r86111M77613j321164
4272D740534L4666j334078R84229m18941M99321r40533m80343N73585k98254P07627
4262D067813j009330M56964j21094l07468m75233N46476L58225o84945K16365
4253C047773K21256L76323n90461o57039J94021P9419M81807j241114N62677l99585
4243B075077o04052K24564K19025L20868m57644M08631p8518J7322J36332J75996
$$ plain form
4310 21026353 21024045 20943091 19881066 19421874 19589427 19785946 18585096 18513225 17279021 17045962
4300 17045962 16864825 16561267 15610663 16060013 15192209 13880086 13882865 13569290 13118136 12795427
4290 12795427 13243685 12372605 11098881 11147922 10508959 9990607 10336741 8081249 7881405
4281 7881405 8438233 7781162 7797042 5890360 6816096 6570196 5584085 6061698 4740534
4272 4740534 4775200 3441122 4425351 4006410 4505731 3565198 3084855 3658440 3360186 4067813
4262 4067813 3058483 3515447 3394353 3086885 2611652 3158128 3516353 2831408 3047773
4253 3047773 3269029 3645352 3054891 2397852 2591873 2671292 3153099 1911985 2474662 2075077
4243 2075077 1471025 1695589 1914614 2235482 1777838 2186469 2107951 2125273 2261605 2437601
4233B437601m15391L14729n75855l91550R71151q54842l44501Q65708l77288l86093
4223A243669J216801q09259K10557j104420O37001K66766p000K22027J99610q9284
4213A986468l75648l89005L53288K91772q27409M66568j94323p93101J147825
4204A666435l5337K82579q7851J46446k11252m60046M65819r03991Q26703m76867
4194A212638M50244q97712j16563M60938j65317j87637N11892M01895p57175J61269
4184A074472L946L72517J11932r825O81581j078451k38255K82097L97534n32154
4174A065394l38276Q87036r0003o38734J90604L10627l71179Q95083q68595J74944
4164A216901k45110k09306Q05009n96737P92863o46909n96236J203794m60695
$$ plain form
4233 2437601 2022210 2336939 1761084 1369534 2340685 1485843 1141342 2007050 1629762 1243669
4223 1243669 2460470 1651211 1861768 757348 1394349 1661115 1654115 1876142 2075752 1986468
4213 1986468 1610820 1221815 1575103 1866875 1039466 1506034 1311711 518610 1666435
4204 1666435 1631098 1913677 1825826 1972272 1761020 1300974 1766793 862802 1689505 1212638
4194 1212638 1662882 765170 648607 1109545 944228 756591 1268483 1670378 913203 1074472
4184 1074472 1078418 1450935 1562867 1553042 2234623 1156172 917917 1200014 1597548 1065394
4174 1065394 727118 1614154 1524151 885417 1076021 1386648 1015469 1910552 1041957 1216901
4164 1216901 971791 762485 1567494 970757 1763620 1116711 520475 1724269 1263574
4155A263574o3562m86245Q68777j107143N35547l35545k88425K40802K82969L50742
4145A261491l89774N4519j08140M56792j00204m35293J254317q84516p41269L01363
4135F69286M42736n93352n68994J207417m29850K03728k44400K68787M99185o33285
4125H21258n43157J022685n85610q26412Q52805p0238P67928j86261l67082k50324
4115F35592N9850M72807l15020M78808Q7097n13921n05241N02388J23209L2240
4105A057809N896m27871O75375o56397k39542L93003O83252k30688j94426O41518
4095A707929p77443N6812m5148o2234P40841k93577l58013N57051k77883j06784
4085A141551l72932K80294L27326r69100J240654j147409J411604k98656o66781
$$ plain form
4155 1263574 1200012 713767 1582544 475401 1010948 675403 386978 627780 910749 1261491
4145 1261491 871717 926236 818096 1274888 1174684 739391 1993708 1109192 367923 669286
4135 669286 1112022 518670 -50324 1157093 727243 930971 686571 955358 1454543 821258
4125 821258 278101 1300786 715176 -111236 741569 671331 1439259 1252998 885916 635592
4115 635592 695442 1168249 853229 1332037 1419134 905213 399972 902360 1025569 1057809
4105 1057809 1063705 635834 1311209 654812 415270 808273 1491525 1260837 1066411 1707929
4095 1707929 930486 987298 942150 879916 1620757 1327180 969167 1526218 1248335 1141551
4085 1141551 768619 1048913 1376239 407139 1647793 500384 1911988 1613332 946551
4076I46551N06673O19273K48226r36068j8194P71802l28643j22801k49748O15043
4066B052114m31573O28495l50443M32235o59687p88586P23713P34154k62538J3549
4056B091433K26715j55001M86840o39999J160534n55494K69867m77199k70347
4047B137349J355705l44008J76340n86921J8711Q34578n28239O85073Q10696m84196
4037D075088j5590m02450M88469J70496L10363m34907L01050n20750M41479L3724
4027D446972L50098k86475l15472J080136j174431J00757M77644N1827m66841
4018D264215k89015J038253l01283k56856M40452k9906O17774J15427p88743J143140
4008E953458q57927K24836j260690M70191J99588J16556J39340o95323J159327
$$ plain form
4076 946551 1453224 2072497 2320723 1384655 1366461 2138263 1809620 1686819 1437071 2052114
4066 2052114 1620541 2249036 1898593 2330828 1671141 882555 1606268 2340422 2077884 2091433
4056 2091433 2318148 2163147 2649987 2009988 3170522 2615028 2884895 2407696 2137349
4047 2137349 3493054 3149046 3325386 2738465 2757176 3591754 3063515 3748588 4559284 4075088
4037 4075088 4059498 3657048 4145517 4316013 4626376 4191469 4492519 3971769 4413248 4446972
4027 4446972 4797070 4510595 4195123 5275259 4100828 4201585 4679229 4731056 4264215
4018 4264215 3975200 5013453 4712170 4455314 4895766 4865860 5483634 5599061 4810318 5953458
4008 5953458 5095531 5320367 4059677 4529868 4729456 4846012 4985352 4290029 5449356
3999E449356j047759M62462l4048J90579k75635j00326m84350J49074P6173j11157
3989D274369J98374K16035j75830o52068m97650J218988j750692J437195l19524
3980C949197q61547L64178j94145M60101q14336R39675p01651r05685J148495
3971C384282p0884r40139k39955L09648N3098o19L2829j044051L84846j08973
3961A760082j07861O50869j87456k83193p46505J26829J05267m08321K50556O78625
3951A838892N77638k014952J136279n69508L15804K84834p68891P94525p77360
3942H17261k00706M42652N69160r75417N31388q34659j36034J17858K32152q28940
3932b65285J88652M61442N35452q00018J035760m76849L07222o50624M4134L49930
$$ plain form
3999 5449356 4401597 4864059 4830011 5020590 4744955 4644629 4160279 4309353 4385526 4274369
3989 4274369 4472743 4688778 4512948 3860880 3363230 4582218 2831526 4268721 3949197
3980 3949197 3087650 3451828 3257683 3717784 2903448 3843123 3141472 2235787 3384282
3971 3384282 3313398 2373259 2133304 2442952 2496050 2495431 2528260 1484209 1869055 1760082
3961 1760082 1652221 2303090 2115634 1832441 1085936 1212765 1318032 909711 1160267 1838892
3951 1838892 2416530 401578 1537857 968349 1284153 1568987 800096 1594621 817261
3942 817261 616555 1059207 1628367 652950 1184338 349679 213645 331503 563655 -265285
3932 -265285 -76633 384809 920261 120243 1156003 679154 986376 335752 379886 729816
3922G29816k14933l18622M66405l436P17048j083182l76303L2277J39860Q96190
3912I85120j005038K91682N03063m38551n52648l26165O09636J42418m32357l01433
3902e24273K17281K28520J81634k23640N17829k55164m33614j33609K30195O3864
3892a30977P2596k56203J051625q06927k03070J7707j85393N19916o46411r0309
3882f57446N77679m86425o90134M47839J56140J89488l16456N10265J89721P7932
3872a397L6749n71464L06522J90238l05771m42817J53073l70743Q77357n83720
3862g11973N19643j66422j8030J9717l42617R4780K40225m37662P58053p0847
3852a15133M44527j402171J327035j201024J053985o24369k22862R75796j452298
$$ plain form
3922 729816 514883 196261 662666 659230 1376278 293096 -83207 -50930 88930 985120
3912 985120 -19918 271764 774827 336276 -216372 -542537 67099 209517 -222840 -524273
3902 -524273 -306992 -78472 103162 -120478 397351 142187 -291427 -425036 -194841 -130977
3892 -130977 -58381 -314584 737041 -69886 -272956 -255249 -440642 79274 -567137 -657446
3882 -657446 -79767 -566192 -1256326 -808487 -652347 -462859 -779315 -269050 -79329 -1397
3872 -1397 35352 -536112 -229590 -39352 -345123 -787940 -634867 -1005610 -128253 -711973
3862 -711973 -192330 -358752 -376782 -357065 -699682 -604902 -364677 -802339 -44286 -115133
3852 -115133 329394 -1072777 254258 -946766 107219 -517150 -740012 235784 -1216514
3843a216514Q39713r33178J569245r52054m72042J149993m38807O61807o21249
3834d13086M07681k12870l96965l3285m63946P22664p6720n05022m7071L43387
3824f75233R15134r02247O75760k33663M49920j149183J045903r65989J12532
3815g27066j08246O24184J84267j60620j092790N52379O4883K24036j54467J81580
3805d11860m1238l12912j76036L03376J67607n9019J03184m82431L27277K49935
3795c32117k1785K611J8816o69242Q15720K41717q25973N47559k76116l75024
3785h73834l65178J581508j133495J59695k00035L9276K18341L55000M79037r02665
3775f42350M38509j05609J23146l5105j69632J00083K5025K15261j013763M63286
$$ plain form
3843 -1216514 -376801 -1309979 259266 -692788 -1164830 -14837 -453644 208163 -413086
3834 -413086 -5405 -218275 -615240 -648525 -1112471 -389807 -466527 -971549 -1018620 -675233
3824 -675233 239901 -662346 13414 -220249 229671 -919512 126391 -839598 -727066
3815 -727066 -835312 -211128 -26861 -187481 -1280271 -727892 -663009 -438973 -593440 -411860
3805 -411860 -453098 -766010 -942046 -638670 -471063 -530082 -426898 -909329 -582052 -332117
3795 -332117 -353902 -351291 -332475 -1001717 -185997 55720 -770253 -222694 -498810 -873834
3785 -873834 -1239012 342496 -790999 -631304 -831339 -792063 -573722 -218722 260315 -642350
3775 -642350 -203841 -309450 -186304 -221409 -391041 -290958 -265933 -50672 -1064435 -601149
3765f01149K39709q9205p8203q29934P95431m08869j4261O68568l30199M69868
3755a78244l21807K15112j07932j31012l55367m72858P91720N5678n41361N64691
3745d81380K5824j90394O30639l3504k05292j02295m17019M84400M29545r24912
3735g84388J66338j55590j12314k36863L86095K15951Q14372j128800P9475N526
3725g50198J2539P63734m0881k46512m65330j44930L01475j25269R80380l72966
3715h7958l0316K90513j63219m72585L6459o90692Q51294k7319k72224j33049
3705f99096M98701K66765P5157k76104K4166j22972N64252m05199k86917m14743
3695g75990K78750J14056k67448K25909M05743l71256k1084N16582r59638K45614
$$ plain form
3765 -601149 -361440 -450645 -528848 -1358782 -563351 -972220 -986481 -317913 -648112 -178244
3755 -178244 -500051 -284939 -392871 -523883 -879250 -1352108 -560388 -504710 -1046071 -481380
3745 -481380 -455556 -645950 -15311 -48815 -254107 -356402 -773421 -289021 140524 -784388
3735 -784388 -618050 -773640 -885954 -1122817 -736722 -520771 293601 -835199 -755724 -750198
3725 -750198 -737659 26075 -14806 -261318 -726648 -871578 -570103 -695372 285008 -87958
3715 -87958 -118274 172239 9020 -463565 -427106 -1117798 -266504 -293823 -566047 -699096
3705 -699096 -200395 66370 141527 -134577 -110411 -233383 330869 -74330 -361247 -775990
3695 -775990 -497240 -383184 -650632 -424723 -18980 -390236 -411320 105262 -854376 -608762
3685f08762L02888L51223o72571J69529q4953n04848N96009O85579l26087k09013
3675c01006M70247l21026k51966R3735Q0953K50626J99464m59885n04509j60877
3665i04244L12723k8006O48900n12168n06593K36763L84100q8120n56542J82791
3655h30396r11763J101457l54346J222139j37883j219091M64968J89746N19383
3646D4214p55192M58647L612M02695k86779m57498O92471q74273J161513l74675
3636A4735k96352r70291M63681K41859J80968k77997L69431m41369K22148l0532
3626e23719N59944j035233J090078j31760K11268J86851p10940n33610Q53442
3617c3679J78853j21488p98511N97768j18368l53236K5058k31897O22724N8638
$$ plain form
3685 -608762 -305874 45349 -627222 -457693 -542646 -1047494 -451485 234094 -91993 -301006
3675 -301006 169241 -151785 -403751 -310016 -229063 21563 221027 -238858 -743367 -904244
3665 -904244 -591521 -619527 29373 -482795 -989388 -752625 -368525 -456645 -1013187 -830396
3655 -830396 -1742159 -640702 -995048 227091 89208 -1129883 -664915 -475169 44214
3646 44214 -710978 -252331 -248719 153976 -132803 -590301 102170 -772103 389410 14735
3636 14735 -281617 -1251908 -788227 -546368 -365400 -643397 -273966 -715335 -493187 -523719
3626 -523719 36225 -999008 91070 -40690 170578 357429 -353511 -887121 -33679
3617 -33679 145174 23686 -774825 -177057 -295425 -648661 -623603 -855500 -232776 -174138
3607a74138J88045r52890N98072o24024L25061r7099k68676K25993o60977J034053
3597d06580K21901L14531l11567o18738M07754J13705O57606j168032L56522j38727
3587e71625o18879M22411L80695K0109j29155k42086Q13017o67696o20732N32764
3577f81177r3097R11019l23362k09815l02026K54727J89077J1003l28996L08266
3567b64381n93171N18921r3548j11140n53475k00274O11273K98563P27299o83597
3557c43530K81816o05606Q8549K90559M16767j084780J057360r82366M67037L26283
3547h7911p63992P4430M89256L02393O19604j107180j17000m00617M92715L67374
3537a30928k89806M04284R62137j590592N35536p74289L40830P42674o92626k36502
$$ plain form
3607 -174138 13907 -938983 -340911 -964935 -639874 -736973 -1005649 -779656 -1440633 -406580
3597 -406580 -184679 129852 -181715 -800453 -392699 -278994 378612 -789420 -432898 -571625
3587 -571625 -1190504 -768093 -387398 -367289 -496444 -738530 74487 -593209 -1213941 -681177
3577 -681177 -774274 136745 -186617 -396432 -698458 -443731 -254654 -243651 -572647 -264381
3567 -264381 -857552 -338631 -432179 -543319 -1096794 -1297068 -685795 -387232 340067 -343530
3557 -343530 -61714 -667320 -578771 -288212 128555 -956225 101135 -881231 -414194 -87911
3547 -87911 -851903 -777473 -288217 14176 633780 -473400 -590400 -991017 -498302 -130928
3537 -130928 -420734 -16450 945687 -644905 -109369 -883658 -542828 199846 -492780 -729282
3527g29282q30821M35920M64669R27569p77246o08463N03354K65199R8498k40575
3517d91178l58576p4011l6996N77013n43488P08828o10365N24907n10046J48074
3507f65838N50335j005305J085546n17878K12803n43964K15599j38056L65136
3498d41622o41776O32568k33368M63159n34592J80320j31931l75250K39026L55646
3488d87820m19672O9370N79217J70448m50940J0392K63159m3449p5179r07572
3478a292046R8440L61186R1831o7293M90431K99806M5591k26595K01742O8858
3468G1951j169337Q49583K5967J24537l93308K25520j245871P96439k47976N23187
3458d39308K2594R23876o94537p2364k61046M91184J96849m76674Q88705j029862
$$ plain form
3527 -729282 -1560103 -1124183 -659514 268055 -509191 -1117654 -614300 -349101 -250603 -491178
3517 -491178 -849754 -923765 -960761 -383748 -927236 -218408 -828773 -303866 -813912 -665838
3507 -665838 -115503 -1120808 -35262 -553140 -340337 -884301 -668702 -806758 -441622
3498 -441622 -1083398 -450830 -684198 -221039 -755631 -575311 -707242 -1082492 -843466 -487820
3488 -487820 -907492 -838122 -258905 -88457 -539397 -529005 -265846 -309295 -384474 -1292046
3478 -1292046 -1193606 -832420 -740589 -807882 -317451 -17645 27946 -198649 3093 71951
3468 71951 -1097386 -247803 -221836 -97299 -490607 -265087 -1510958 -714519 -962495 -439308
3458 -439308 -416714 507162 -187375 -259739 -520785 -29601 167248 -309426 579279 -450583
3448d50583j33285m21074m23162R50681M23272k45624r4896j68718P51814o77819
3438d89394l68217J176891k60348n15537P85n3293K66626j53339K75550j76209
3428b96485k60052L64039j153067J753054q05513q0653K23681j01401M2346k57977
3418e72028N43316l73781L82634o63715J26742o0939P84957l4763p13943N12615
3408f8905m98694M56048k27118O23299Q06798n2641J59531n90698J96750m4662
3398G59708P95798M75828o74183j71861l67636Q29170m63934K36722K13656L6312
3388A669580M43488j126059J05724L33559P85113j110351L26490n2945k35802
3379A138797p61112O54593R61735r45022M83980n65217k77870L12747k47412P42184
$$ plain form
3448 -450583 -583868 -1004942 -1428104 -477423 -54151 -299775 -394671 -563389 188425 -489394
3438 -489394 -857611 319280 58932 -456605 -455820 -509113 -242487 -395826 -120276 -296485
3428 -296485 -556537 -192498 -1345565 407489 -398024 -478677 -254996 -356397 -314051 -572028
3418 -572028 -28712 -402493 -19859 -683574 -556832 -617771 167186 132423 -581520 -68905
3408 -68905 -567599 -111551 -338669 284630 1091428 1038787 1198318 607620 804370 759708
3398 759708 1555506 2031334 1357151 1185290 817654 1646824 1182890 1419612 1633268 1669580
3388 1669580 2113068 987009 1092733 1426292 2211405 1101054 1427544 1374599 1138797
3379 1138797 377685 1032278 1994013 1048991 1532971 967754 689884 1002631 755219 1497403
3369A497403n66560N61040m37518j26900M07980j732456L61113O08803J93523
3360G66428m71069O13384o85086M60622p95784L36049k09206j6123O41226l67504
3350B72937K90705j022178L29500O99118J47803p87735m94423L6073n3460N49310
3340c2350l17455k16283Q67930p63185N8757P5772k74187q4869K50520M06632
3330b8718p48707K43549o35524N61112K53473J276467j385712J1891O55379j99147
3320D063j068708P08606L93811k21184n46170O87127o02704R3770J65277q04223
3310a190335J211642l6153n12159p03142L00942j17590J29491M86921Q43436n47240
3300a34187k36159n42703O68879J95825L39249m33465j038202J041684k37588
$$ plain form
3369 1497403 930843 1491883 1054365 927465 1335445 -397011 -35898 572905 766428
3360 766428 295359 908743 223657 684279 -111505 224544 15338 -785 640441 272937
3350 272937 563642 -458536 -129036 570082 717885 -69850 -564273 -528200 -581660 -32350
3340 -32350 -349805 -566088 301842 -461343 -402586 -326814 -601001 -685870 -435350 -28718
3330 -28718 -777425 -533876 -1169400 -608288 -354815 921652 -464060 -452169 203210 4063
3320 4063 -1064645 -356039 37772 -183412 -729582 -42455 -645159 -551389 -386112 -1190335
3310 -1190335 21307 -14846 -527005 -1230147 -929205 -1046795 -917304 -430383 413053 -134187
3300 -134187 -370346 -913049 -244170 -48345 290904 -142561 -1180763 -139079 -376667
3291c76667M09566j30103J55947J28311n01701j44925p94617L57425J023719m55211
3281c28256k29494m48954Q34990n01152M85360m68162L17883j50032m95943L51696
3271f32064P67706l94475L11922j93937p76630Q13907j073395P46968K66249p05166
3261h68915N13098j96137J67788r33325P07641J88733j36270r0218K63362r04594
3251a288837J59265J116420m0241k01696r16439O37531q08902M07295L93839P16534
3241A74769m12315o84036j15739M04725J01893k19862L83034p7507n53222L78634
3231f19626k34249J046157l53695j08069j52361p4627J26938l40139L05603m84259
3221h88327M07949j12221j69117L36341k29548l86906Q7056j52418R06597n11601
$$ plain form
3291 -376667 32899 -97204 58743 187054 -314647 -459572 -1254189 -896764 126955 -328256
3281 -328256 -557750 -1006704 -171714 -672866 -187506 -655668 -337785 -487817 -983760 -632064
3271 -632064 135642 -258833 53089 -140848 -917478 -103571 -1176966 -429998 -163749 -868915
3261 -868915 -355817 -551954 -384166 -1317491 -609850 -421117 -557387 -647605 -384243 -1288837
3251 -1288837 -1129572 -13152 -53393 -255089 -1171528 -533997 -1342899 -935604 -541765 174769
3241 174769 -237546 -921582 -1037321 -632596 -530703 -750565 -367531 -445038 -998260 -619626
3231 -619626 -853875 192282 -161413 -269482 -421843 -496470 -369532 -709671 -404068 -888327
3221 -888327 -480378 -592599 -761716 -425375 -654923 -1041829 -954773 -1107191 -200594 -712195
3211g12195M1183r8454m62895J67559j50660j31959J55469L45500N17289m02647
3201g31810Q31518j389555J335804K79872j532453R62338l35314J155677n62374
3192A3703j02816l6627j55510O47635j199503L32487k6693M08244l69710O62957
3182A74167j66031n09244P20414j986892P31347P07399o59505P04999n05840K49806
3172e39380j006284N73952J417207m07525k76861M07163n77134k51524M48709
3163b11677n02394n3995M53334p246j215806J656929m44117q52134j78078L51007
3153a004177J7954j74223L14262J025509n75766J6960q02369J039975o46588O11379
3143a77084j78038J068798j192126k51395n01205P61674r0026n40238L86564n02938
$$ plain form
3211 -712195 -671012 -769466 -1232361 -1064802 -1215462 -1347421 -1191952 -846452 -329163 -731810
3201 -731810 99708 -1289847 45957 325829 -1206624 -244286 -579600 576077 13703
3192 13703 -89113 -125740 -281250 366385 -833118 -500631 -527324 -119080 -488790 174167
3182 174167 8136 -501108 219306 -1767586 -1036239 -328840 -988345 -283346 -789186 -539380
3172 -539380 -1545664 -971712 445495 37970 -238891 168272 -408862 -660386 -211677
3163 -211677 -714071 -768066 -314732 -321978 -1537784 119145 -324972 -1177106 -1355184 -1004177
3153 -1004177 -986223 -1160446 -846184 179325 -396441 -379481 -1181850 -141875 -788463 -177084
3143 -177084 -355122 713676 -478450 -729845 -1231050 -469376 -559402 -1099640 -713076 -1216014
3133a216014O67554M96884o43497K55540m47910K07675J76069k24055P82504j123046
3123a068296M07967N28501l67940k24777L62491P2383j6191O16N8648m7419L56284
3112F2267n84691l99560o1015n018P20142j08991m26622L83300m67758K72581
3102f15365N79863L05018l53915p2852m36418j13684L54509l95162k46104O68128
3092c25982n74651M19848r1464K88242n09567l70675J141570l74566j98264l93097
3082i88606N02915m46841J51634J56922J30887j82830l32916R86971M5890k00326
3072a76300o20397J354534n76486o68860M59688p55740N73830J062829j246393
3063e93295O42661q96157Q36230r46436P37775M39338l14071k8740J19129o53495
$$ plain form
3133 -1216014 -548460 -51576 -695073 -439533 -887443 -679768 -503699 -727754 54750 -1068296
3123 -1068296 -660329 -131828 -499768 -724545 -362054 -289671 -305862 -305246 -246598 -294017 62267
3112 62267 -522424 -921984 -982999 -988017 -267875 -376866 -803488 -420188 -887946 -615365
3102 -615365 -35502 269516 -84399 -157251 -593669 -707353 -352844 -748006 -994110 -325982
3092 -325982 -900633 -480785 -572249 -284007 -793574 -1164249 -22679 -397245 -595509 -988606
3082 -988606 -485691 -932532 -780898 -623976 -493089 -675919 -1008835 -21864 24026 -176300
3072 -176300 -796697 557837 -18649 -687509 -227821 -983561 -409731 653098 -593295
3063 -593295 49366 -846791 -10561 -956997 -219222 220116 -93955 -122695 -3566 -657061
3053f57061n55125R56916J98972j32609l02357j36744n47954J772969o26099k86236
3043c15328M17368l42481l95168l17378L93137L63931Q5656j65993N2728k04603
3033d28131M8148k22714m53530Q01591K1341l27135K60899m70400N53400o81428
3023h97959J70216K20601K39522K22244p08968N91645j42932Q5658m06333J90258
3013d36048p1410m57185P71886o21149O41418j84279m38576L00915L94174m2534
3003a42788N1858j079505K83739k06960P15841j59687K75654M87599Q10n13554
2993b86993K97441o88389M89712Q84058m54765p96199L21613k48386l12035O64279
2983a29664j056705J317226q60000N13926j19141L2902N8693N26564l51645K11067
$$ plain form
3053 -657061 -1212186 -255270 -56298 -188907 -491264 -628008 -1175962 597007 -29092 -315328
3043 -315328 102040 -240441 -635609 -952987 -559850 -195919 -110263 -276256 -223528 -428131
3033 -428131 -379983 -602697 -1056227 -254636 -233295 -560430 -299531 -769931 -216531 -897959
3023 -897959 -727743 -507142 -267620 -45376 -754344 -162699 -305631 -219973 -626306 -436048
3013 -436048 -507458 -964643 -192757 -813906 -172488 -356767 -795343 -494428 -100254 -142788
3003 -142788 -90930 -1170435 -886696 -1093656 -377815 -537502 -261848 225751 226561 -286993
2993 -286993 10448 -677941 -188229 695829 241064 -555135 -233522 -481908 -793943 -129664
2983 -129664 -1186369 130857 -729143 -215217 -334358 -301456 -242763 283801 -67844 143223
2973A43223q08934n5962K04755R624m83024Q32804n08956N6100n6077R28591p56983
2962d94839J06646O80105p54424k02944k19405J97146j59156N36095P57036k253561
2952a807301J225580O3813k25403L43859k73443L05257l24271k33926P06687l99487
2942f18635r6951j68420Q25813l6833l87045L81892n71322M23846l64849n35697
2932a148201O67462o57794M99205j12340j81713k12608Q01358J87766J28137m12936
2922d41664r34352N48809N24189R99110j977840J008336o75641M82433J123101
2913F56481j158583P35044O1562N65390r31853m82020M5427J2449j37065J94591
2903d38577l954K62656j123720J192913n92966J150739q82581K14293q2110l91901
$$ plain form
2973 143223 -665711 -721673 -516918 -507294 -990318 -157514 -666470 -610370 -666447 262144 -494839
2962 -494839 -388193 291912 -462512 -665456 -884861 -687715 -846871 -310776 446260 -1807301
2952 -1807301 -581721 -517908 -743311 -399452 -672895 -367638 -691909 -925835 -219148 -618635
2942 -618635 -715586 -884006 -58193 -95026 -482071 -100179 -671501 -247655 -612504 -1148201
2932 -1148201 -480739 -1138533 -639328 -751668 -933381 -1145989 -344631 -156865 -28728 -441664
2922 -441664 -1376016 -827207 -303018 696092 -1281748 -273412 -949053 -466620 656481
2913 656481 -502102 232942 294504 859894 -71959 -553979 -508552 -496103 -633168 -438577
2903 -438577 -442531 -179875 -1303595 -110682 -703648 447091 -435490 -221197 -303307 -695208
2893f95208N26111j16301k68844M76690o32456Q22594K1165o47359J096650j043411
2883d60369K49752q98482O96856J12003N12132n49097r3973L45499j068858Q61194
2873b93343n24937Q02094j355763N18559R9541k58406N24811n88073O94310J77396
2863b03811o07742M28515m10993L39077l47945P85900J07428m42346O46819q35687
2853e40785L46772k10666Q6925j85560J87779m9254q5583m4680N35803k87785
2843b47034j58630M9302l72492p9234K82653P36095k08608n22645o5622n15688
2833a101903N73817K784n5759K04366Q35240j143217J79378m3168r9737N08222
2823a39977n56890l16289K64302O40476j15191j50893K75100r27492J159479k26548
$$ plain form
2893 -695208 -169097 -285398 -554242 -77552 -710008 112586 133751 -513608 583042 -460369
2883 -460369 -210617 -1109099 -412243 -300240 211892 -337205 -431178 -85679 -1154537 -293343
2873 -293343 -818280 -16186 -1371949 -853390 -753849 -1012255 -487444 -1075517 -381207 -203811
2863 -203811 -811553 -383038 -794031 -454954 -802899 -16999 90429 -351917 294902 -540785
2853 -540785 -194013 -404679 -317754 -503314 -315535 -364789 -450372 -495052 40751 -247034
2843 -247034 -405664 -356362 -728854 -808088 -525435 210660 2052 -520593 -586215 -1101903
2833 -1101903 -528086 -525302 -581061 -376695 458545 -684672 -505294 -548462 -648199 -139977
2823 -139977 -696867 -1013156 -748854 -108378 -223569 -374462 -99362 -1026854 132625 -93923
2813i3923k62384M51700j146739M99135L32328j77230m15184K78660K41158L62845
2803G0366k33898j06858L51561l90193m14308m4643m0216N45912Q165L04665j176633
2792a126080Q44759o1857J36929L0978j144001J223858n71376l43590M23283K86261
2782c00836N97493p05355Q65881j598095M95147M78916m29049J523497j518514
2773e90915l24680j57351K05013j45476R84710o43338k1540k16927l11996J120578
2763a01922k90226N6723M6551J94240J49701k97333j23677J77509n21808k59973
2753i70215M48903n28836R2809J026573m31856K84205j849922J563536p45688
2744a110491R61750j65841m69069k25382L94679o3498K64538J0714M23579R7984
$$ plain form
2813 -93923 -356307 95393 -1051346 -552211 -219883 -397113 -812297 -533637 -292479 70366
2803 70366 -163532 -270390 81171 -309022 -723330 -767973 -808189 -262277 -254112 50553 -1126080
2792 -1126080 -281321 -343178 -206249 -175271 -1319272 -95414 -666790 -1010380 -587097 -300836
2782 -300836 296657 -408698 457183 -1140912 -645765 -166849 -595898 927599 -590915
2773 -590915 -915595 -1072946 -867933 -1013409 -28699 -672037 -693577 -910504 -1222500 -101922
2763 -101922 -392148 -335425 -288874 -94634 55067 -242266 -365943 -188434 -710242 -970215
2753 -970215 -521312 -1050148 -957339 69234 -362622 -78417 -1928339 -364803 -1110491
2744 -1110491 -148741 -314582 -783651 -1009033 -614354 -677852 -413314 -402600 20979 118963
2734A18963o46019M481l16461Q51382L37702l82594k51350k54487l35450m76047
2724a349880O03518N66753k18877Q35405J53614j141886o5501j82849K10342O70177
2714H0816p2571j405558N19032K15302N18440n12598L44277M1857m63222K45944
2704d88281J65928l19149m92518L39118K74392k13242N16838J45092o5821L09586
2694A71943r44477J34199J001708p59260l83732N13226l66740j29029M57280m11330
2684g16212O48054o29085J8022J89524k12879R14275l35755m779l30794Q4115
2674c75514k95536j63972N87661j17739k16446L06566q75891L91310K71989K58277
2664b29295j72610K1846n88052M1113N25807k63463L88878k80491O20784j86205
$$ plain form
2734 118963 -527056 -522575 -839036 12346 350048 -32546 -283896 -538383 -873833 -1349880
2724 -1349880 -746362 -179609 -398486 436919 590533 -551353 -616854 -799703 -589361 80816
2714 80816 8245 -1397313 -878281 -662979 -144539 -657137 -312860 -271003 -734225 -488281
2704 -488281 -322353 -641502 -1134020 -794902 -520510 -733752 -216914 -71822 -137643 171943
2694 171943 -772534 -638335 363373 -395887 -779619 -266393 -633133 -762162 -304882 -716212
2684 -716212 -68158 -697243 -679221 -489697 -702576 211699 -124056 -128835 -459629 -375514
2674 -375514 -671050 -835022 -247361 -365100 -581546 -274980 -1150871 -759561 -487572 -229295
2664 -229295 -401905 -380059 -968111 -926998 -401191 -664654 -275776 -556267 64517 -121688
2654a21688l2280r69639J234586k83113k13980N54760r36749P01146j00820o39343
2644h07120M43391M94104l67668L06862j58197o42633k1312J60553O49770k22122
2634a64372O27609l78710m96163M11229m45886o62156M08624J150968j629120
2625a177977O54753j09654N40135n19360o5847N21579n84262P49480m16576o54658
2615a062387O13281o52395R73242m50821L78654r86210R22230q67003O60227j12348
2605e83530l01822J115890q60761O5570Q00175j66755l56328O4349k86538j58806
2595f68556q4461k31113j70784K26197M54511l07480K8854l06864Q90400M83887
2585C14591q38188q8629R2083k8051L82368o84817N79478p57152P67123N41731
$$ plain form
2654 -121688 -153968 -1123607 110979 -172134 -386114 168646 -768103 -66957 -167777 -807120
2644 -807120 -363729 130375 -237293 69569 -88628 -731261 -752573 -592020 57750 -164372
2634 -164372 463237 84527 -411636 -407 -446293 -1108449 -699825 451143 -1177977
2625 -1177977 -523224 -632878 -92743 -612103 -677950 -156371 -740633 8847 -407729 -1062387
2615 -1062387 -449106 -1101501 -128259 -579080 -200426 -1186636 -264406 -1131409 -471182 -583530
2605 -583530 -885352 230538 -630223 -564653 235522 68767 -287561 -223212 -509750 -668556
2595 -668556 -753017 -984130 -1154914 -928717 -474206 -781686 -752832 -1059696 -169296 314591
2585 314591 -523597 -612226 -520143 -548194 -165826 -850643 -271165 -1028317 -261194 280537
2575B80537n93639j044102M71194N72128j61965j40547O85208o47510K47275j079645
2565a411066P79047N90337n44121J21985m99892N41498r19629N67576L41970N13478
2555H1183J41895n59542m08060P59649l40664J41192n51748R57555l49855n89735
2545g18130J001827n22618m69872M28665J27483J04021q21789L93415m01147M8090
2535h30055J52076L31595n37725M67543l00961L90109p71540O62620K92260N94196
2525D50118o12273L12312k64780q57578Q43544p47467O28175p98784N4783L89418
2515f02532O8144M65184l86545J72329L97504l39869n31712J85034N59958K0216
2505G711k90673l32222L06144o12114M43873J10096k90714k53178p2831O20920
$$ plain form
2575 280537 -313102 -1357204 -886010 -313882 -475847 -616394 68814 -578696 -331421 -1411066
2565 -1411066 -632019 -41682 -585803 -463818 -963710 -422212 -1341841 -774265 -432295 81183
2555 81183 223078 -336464 -744524 15125 -325539 -184347 -736095 221460 -128395 -718130
2545 -718130 283697 -238921 -708793 -280128 -152645 -48624 -870413 -476998 -878145 -830055
2535 -830055 -677979 -346384 -884109 -416566 -717527 -327418 -1098958 -436338 -144078 450118
2525 450118 -162155 150157 -114623 -972201 -128657 -876124 -247949 -1046733 -991950 -602532
2515 -602532 -534388 -69204 -455749 -283420 114084 -225785 -757497 -572463 -12505 7711
2505 7711 -282962 -615184 -309040 -921154 -477281 -367185 -657899 -911077 -983908 -362988
2495c62988N0014m59172J25641J54583N17226q55866Q77061l84323K21657l45539
2485d61706m40549m19573J411733r36765O63585o61954N01600Q52387q06666J7601
2475b80307R798k89170R4040O6489J79246k31413P7744m91412J80954o9208j69520
2464i22759J18957O77698l96135M56289m49227K76186m97260K93j59703Q86679
2454h982m32612k59255n87785O50358L6312r9474J64860L06449p79920P23776
2444b86273k92985O5636p28286J97875j67738N95111m32280N74081m63328L8239
2434h99948J38829M26387n27966R91239o89093m5845O31457j401523Q35659q3862
2424f24666m03421J426711j116263P27340k47463j23990n94169L52721p45424
$$ plain form
2495 -362988 -312974 -772146 -646505 -491922 25304 -830562 46499 -337824 -116167 -461706
2485 -461706 -902255 -1321828 89905 -846860 -183275 -845229 -343629 508758 -297908 -280307
2475 -280307 -270509 -559679 -465639 -399150 -219904 -451317 -373573 -864985 -684031 -753239 -922759
2464 -922759 -803802 -126104 -522239 -65950 -515177 -238991 -736251 -735958 -895661 -8982
2454 -8982 -441594 -700849 -1288634 -638276 -601964 -701438 -536578 -230129 -1010049 -286273
2444 -286273 -579258 -513622 -1241908 -1044033 -1211771 -616660 -1048940 -474859 -938187 -899948
2434 -899948 -761119 -334732 -862698 128541 -560552 -606397 25060 -1376463 -540804 -624666
2424 -624666 -1028087 398624 -717639 9701 -237762 -361752 -955921 -603200 -1348624
2415a348624M60426J76984o70828J150989r0021l50181m6140M80924J69378j068278
2405a135371M0103J45246M48837l10315K27829K68872k21340m3674L92643J87473
2395C03q11707J185465l33534M7837j207538L55473M62792L77139P0599j169544
2385a022715k96569N28461P03901N9752j40632j49447L77153j46800l00285P05635
2375C18454k28038n45277M74878q97246J000927q79513L23901l31746k14135n37935
2365a515730J035347K35123j47246j01559J209793q76218n9340j51276l20157
2356f91263K87694L6564r01876J142373j939m59293o99629K02803J033116p85662
2346h37112R5272l99341J368438j451317O20908P8030n64348N65322q87456O75194
$$ plain form
2415 -1348624 -888198 -711214 -1382042 -231053 -321074 -671255 -717395 -236471 -67093 -1135371
2405 -1135371 -1095268 -950022 -501185 -811500 -583671 -314799 -536139 -579813 -187170 303
2395 303 -811404 374061 40527 88364 -1119174 -763701 -300909 76230 146829 -1022715
2385 -1022715 -1319284 -790823 -86922 -27170 -167802 -317249 59904 -86896 -387181 318454
2375 318454 90416 -454861 20017 -877229 123698 -755815 -431914 -763660 -977795 -1515730
2365 -1515730 -480383 -245260 -392506 -494065 715728 -160490 -219830 -371106 -691263
2356 -691263 -403569 -367005 -1268881 -126508 -128447 -587740 -1287369 -1084566 -51450 -837112
2346 -837112 -741840 -1141181 227257 -1224060 -603152 -525122 -1089470 -524148 -1411604 -736410
2336g36410J072053l70452q24055O4011K88744r30196J401335q0350L23412j267590
2326a059498L70175L28520K30638K21765p6990L39940j316626O23932m53481Q86594
2316I4969J27988o95761M22039J059753o84778J5874j207391M64797o97949N95293
2306e05166o5301M6835k91564P64980l59577P72562j280949Q2778J07520m5854
2296g73736j35538O067O39647k0785k35214o493j07564Q13340j10726K03956l14082
2285d1128n41717K96680j84484k74820P30955K30803n24317M03841O22903p11428
2275G288Q3851m8575L05659q39559q95077O65234k1640l26548M23125L14153l22871
2264f54960M74459n38818L88599M34794j088856Q62364k70790M46274n24021O07948
$$ plain form
2336 -736410 335643 -34809 -858864 -794853 -506109 -1436305 -34970 -115320 208092 -1059498
2326 -1059498 -689323 -360803 -130165 91600 14610 354550 -962076 -338144 -791625 94969
2316 94969 222957 -472804 -50765 1008988 324210 340084 -867307 -402510 -1100459 -505166
2306 -505166 -570467 -523632 -815196 -50216 -409793 362769 -918180 -835402 -727882 -773736
2296 -773736 -909274 -903207 -263560 -284345 -519559 -526052 -633616 179724 68998 272954 -41128
2285 -41128 -582845 -286165 -470649 -745469 -14514 216289 -308028 95813 718716 7288
2275 7288 91139 42564 348223 -491336 -1386413 -721179 -742819 -1069367 -646242 -332089 -654960
2264 -654960 -180501 -719319 -330720 104074 -984782 -122418 -393208 53066 -470955 136993
2254A36993k15687m10812j45891L47030k00107n42052N15710O09951n29205n3898
2244d87968q00554Q65248M98827j279991J2026K48317P31529j43171k18749k41210
2234h15696L79209N90710l21892n31000k89938J092701p13975j6672K6456q48319
2224a448416J036465l85145L72192K0772l37219K16525q18079M70231l35627P00755
2214e07546j06528N5715J51719j66209K19014j01115K88466J42897j18673L96867
2204B54607j520908L61785K4046K64967K97350m08950m83712P27176P57251l21877
2194d8265o54487k02207O15500o97821J49488k50951N55961j70819K75784J24545
2184c03272q58038P87510M53268J04219m21982p80522Q10041m05661k80596k62639
$$ plain form
2254 136993 -78694 -489506 -635397 -288367 -488474 -1030526 -514816 95135 -434070 -487968
2244 -487968 -1288522 -423274 75553 -1204438 -1192412 -944095 -212566 -355737 -574486 -815696
2234 -815696 -436487 154223 -167669 -698669 -988607 104094 -609881 -626553 -600097 -1448416
2224 -1448416 -411951 -797096 -424904 -404132 -741351 -524826 -1342905 -872674 -1208301 -507546
2214 -507546 -614074 -558359 -406640 -572849 -353835 -454950 -166484 -23587 -142260 254607
2204 254607 -1266301 -904516 -880470 -615503 -318153 -727103 -1210815 -483639 273612 -48265
2194 -48265 -702752 -904959 -289459 -987280 -837792 -1088743 -532782 -703601 -427817 -303272
2184 -303272 -1161310 -373800 79468 183687 -238295 -1018817 -208776 -614437 -895033 -1157672
2174a157672O22549m1529L32654m94703K71412L53964k76593j16512n52095J53728
2164i04797N75444l19966j74326o89454J353798n67114O91393m76996o8312n52621
2154a132951p4697J58094L29037N01588J5905k20365N8788j36132R09290j198809
2144g90252L19029l49162R15364r64001L43336J38245r1565L5763l18207J67018
2134e94432K58154p3899M54683p78923M18859k38551P27965j096739P96008n11697
2124f38572Q28154l36249m59636p19670J404829N9518Q6434k26474o20568K95700
2114c26534j57658O04039n33674q33280R49916l42924k03288k06591O68814j64781
2104e45961j08445J17225l77511N07315l21743k10493J023664l91861Q1815p07416
$$ plain form
2174 -1157672 -535123 -576652 -243998 -738701 -467289 -113325 -389918 -506430 -1058525 -904797
2164 -904797 -329353 -649319 -823645 -1513099 -159301 -726415 -35022 -512018 -580330 -1132951
2154 -1132951 -1207648 -1049554 -720517 -218929 -203024 -423389 -364601 -500733 408557 -790252
2144 -790252 -471223 -820385 94979 -869022 -525686 -387441 -479006 -443243 -761450 -594432
2134 -594432 -336278 -410177 44506 -734417 -315558 -554109 173856 -922883 -126875 -638572
2124 -638572 189582 -146667 -606303 -1325973 78856 138374 224808 -1666 -622234 -326534
2114 -326534 -484192 119847 -413827 -1247107 -297191 -640115 -843403 -1049994 -381180 -545961
2104 -545961 -654406 -537181 -914692 -407377 -729120 -939613 84051 -307810 -225995 -933411
2094i33411M88436L05102j092407O14137M47706L19847r52225J64203O04195r80238
2084a014655K79719K17855r0935P71098q00361L89199j52371P41652n68805n27246
2074g54850K48635N08482n72966Q34062m9277m06691p5969M5297n55176j23803
2064i02256j14472L37901Q8427Q4331j17431J15345L70187k17204J3677m62947
2054h04442P84623K64436m51433n15769j37694O77760l37568k71394Q4914K16678
2044d89889M0831l92026Q00385K53722k95597o77445R9653N1805M27659p04693
2034h85595K52819k80844K62819N04421m85859N07776r4535K47289n34410k44271
2024g50390R24155j454336O47977O62175p87291M70645p10705O81297n14406K05618
$$ plain form
2094 -933411 -444975 -139873 -1232280 -618143 -170437 149410 -802815 -638612 -34417 -1014655
2084 -1014655 -734936 -517081 -608016 163082 -637279 -248080 -400451 341201 -227604 -754850
2074 -754850 -506215 2267 -570699 263363 214086 -192605 -268574 -223277 -778453 -902256
2064 -902256 -1016728 -678827 -590400 -506069 -623500 -508155 -137968 -355172 -341495 -804442
2054 -804442 -19819 244617 -206816 -722585 -860279 -182519 -520087 -791481 -706567 -489889
2044 -489889 -449058 -841084 -40699 213023 -82574 -760019 -660366 -608561 -180902 -885595
2034 -885595 -632776 -913620 -650801 -146380 -632239 -124463 -218998 28291 -506119 -750390
2024 -750390 173765 -1280571 -632594 29581 -757710 -287065 -997770 -316473 -830879 -625261
2014f25261n45490k481Q10412p25092L182J035249p88083R77053n66297r7929
2004e24737p52461O85171O01311M09482j124261n8805q49n55660J223770j01886
1994a98925J65443K2889J33866n83345k98757O00228k87919Q03208q90354M48164
1984h5502n66225l08356J480187p41704j94005P9754k19522L29664o92825P31780
1974a86754k33996J153535j849303Q32626l90829N47875m44935J23269K25508
1965b23004l21092J10053q305K73732K44247n78633N9407j029091N32423J36078
1955h04185R66426m76403K46852K89300j192909L74591K36717k2681r0769L62938
1945a10123k9315n65095m01957J069355l40421n58752Q60430l70472k5975J41439
$$ plain form
2014 -625261 -1170751 -1173232 -362820 -1087912 -1084730 -49481 -837564 139489 -426808 -524737
2004 -524737 -1277198 -592027 9284 418766 -705495 -764300 -765149 -1320809 -97039 -198925
1994 -198925 -33482 -10593 123273 -460072 -758829 -158601 -446520 356688 -533666 -85502
1984 -85502 -651727 -960083 520104 -221600 -415605 -335851 -555373 -225709 -918534 -186754
1974 -186754 -420750 732785 -1116518 -283892 -674721 -126846 -571781 -448512 -223004
1965 -223004 -544096 -434043 -442348 -168616 75631 -503002 -443595 -1472686 -940263 -804185
1955 -804185 162241 -314162 -67310 221990 -970919 -596328 -359611 -382292 -473061 -110123
1945 -110123 -139438 -704533 -1106490 -37135 -377556 -936308 -75878 -446350 -472325 -330886
1935c30886k77444O26195o08255O56903p30028R70407n37457m72431j76729j30064
1925a009789P81725o82771Q0476O9192N97048l77102k94586J213261n18300K64394
1915A23548p80295k06792J065436p85307R18372o91725J61850k92311K56135k4564
1905b55653k32954l09406p32903J593257p37541K84517p8834Q2913l19359K56601
1895d49362l04693r784P06556j97136k1939j150217J205885m56752k03651M05495
$$ plain form
1935 -330886 -608330 17865 -590390 66513 -663515 306892 -230565 -702996 -879725 -1009789
1925 -1009789 -228064 -910835 -830359 -761167 -164119 -541221 -835807 377454 -140846 123548
1915 123548 -656747 -863539 201897 -583410 334962 -356763 -194913 -487224 -231089 -255653
1905 -255653 -488607 -798013 -1530916 62341 -675200 -390683 -469517 -386604 -705963 -449362
1895 -449362 -754055 -763839 -57283 -254419 -276358 -1426575 -220690 -677442 -881093 -475598
$$ [...]
##END NTUPLES=NMR SPECTRUM
##END=
