##TITLE=abcd
##JCAMPDX= 6.0         $$ Bruker NMR JCAMP-DX V2.0
##DATA TYPE= NMR SPECTRUM
##DATA CLASS= NTUPLES
##ORIGIN= UXNMR, Bruker Analytische Messtechnik GmbH
##OWNER= root
$$ XWIN-NMR		Version 3.5
$$ Mon Aug  3 17:55:34 2026 Russian Standard Time (UT+4h)  servis@DPX200
##.OBSERVE FREQUENCY= 200.131235884673
##.OBSERVE NUCLEUS= ^1H
##.ACQUISITION MODE= SIMULTANEOUS
##.ACQUISITION SCHEME= undefined
##.AVERAGES= 32
##.DIGITISER RES= 18
##SPECTROMETER/DATA SYSTEM= spect
##.PULSE SEQUENCE= zg
##.SOLVENT NAME= CDCl3
##.SHIFT REFERENCE= (INTERNAL, CDCl3, 0, 16.4885)
##AUDIT TRAIL= $$ (NUMBER, WHEN, WHO, WHERE, WHAT)
$$ ##TITLE= Audit trail, XWIN-NMR		Version 3.5
$$ ##JCAMPDX= 5.01
$$ ##ORIGIN= Bruker BioSpin GmbH
$$ ##OWNER= servis
$$ F:\spectra/data/av/nmr/H1/1/pdata/1/auditp.txt
$$ ##AUDIT TRAIL=  $$ (NUMBER, WHEN, WHO, WHERE, WHAT)
(   1,<2026-08-03 17:54:44.15 +0400>,<servis>,<DPX200>,
      <created by zg, POWCHK disabled, PULCHK disabled
       configuration hash MD5:
       00 E9 B6 7A A2 85 ED C7 34 08 36 98 17 FE 4E 26
       data hash MD5: 32K
       74 5A DD CF 00 BB C6 D2 19 E8 7E 43 2B D8 64 35>)
(   2,<2026-08-03 17:54:45.62 +0400>,<servis>,<DPX200>,
      <Start of raw data processing
       efp BC_mod = 2 LB = 0.05 FT_mod = 6 PKNL = 1 PHC0 = -413.9518 PHC1 = 3.101563 SI = 16K 
       data hash MD5: 16K
       E4 1B 72 60 20 58 4E 33 DC 95 2F 9A 6A 40 EB AE>)
(   3,<2026-08-03 17:54:58.51 +0400>,<servis>,<DPX200>,
      <pk PHC0 = 0.6 PHC1 = 0 
       data hash MD5: 16K
       06 AD 8F 0A 9F 79 77 79 38 C8 35 1D AC D3 50 9E>)
$$ ##END=
$$ 
$$ hash MD5
$$ F8 41 71 4E A8 E8 C6 A7 F0 65 7D 3B D6 D8 81 7A
##$RELAX= 
##$RELAX= 
##$RELAX= 
##$RELAX= 
##$RELAX= 
##$RELAX= 
##$RELAX= 
##$RELAX= 
$$ Bruker specific parameters
$$ --------------------------
##$DU= <F:\spectra>
##$EXPNO= 1
##$NAME= <H1>
##$PROCNO= 1
##$TYPE= <nmr>
##$USER= <av>
##$AMP= (0..31)
100 100 100 100 100 100 100 100 100 100 100 100 100 100 100 100 100 100 
100 100 100 100 100 100 100 100 100 100 100 100 100 100 
##$AQSEQ= 0
##$AQ_mod= 1
##$AUNM= <au_zg>
##$AUTOPOS= <>
##$BF1= 200.13
##$BF2= 200.13
##$BF3= 200.13
##$BF4= 200.13
##$BF5= 500.13
##$BF6= 500.13
##$BF7= 500.13
##$BF8= 500.13
##$BYTORDA= 1
##$CFDGTYP= 0
##$CFRGTYP= 5
##$CHEMSTR= <none>
##$CNST= (0..31)
1 1 145 1 1 1 1 1 1 1 1 1 1 1 1 1 1 1 1 1 1 1 1 1 1 1 1 1 1 1 1 1 
##$CPDPRG= <>
##$CPDPRG1= <>
##$CPDPRG2= <>
##$CPDPRG3= <>
##$CPDPRG4= <mlev>
##$CPDPRG5= <mlev>
##$CPDPRG6= <mlev>
##$CPDPRG7= <mlev>
##$CPDPRG8= <mlev>
##$CPDPRGB= <>
##$CPDPRGT= <>
##$D= (0..31)
0 2 0 0 0 0 0 0 0 0.06 0 0 0 0 0 0 0.0002 0 0 0 0 0 0 0 0 0 0 0 0 0 0 
0 
##$DATE= 1785765283
##$DBL= (0..7)
120 120 120 120 120 120 120 120 
##$DBP= (0..7)
150 150 150 150 150 150 150 150 
##$DBP07= 0
##$DBPNAM0= <>
##$DBPNAM1= <>
##$DBPNAM2= <>
##$DBPNAM3= <>
##$DBPNAM4= <>
##$DBPNAM5= <>
##$DBPNAM6= <>
##$DBPNAM7= <>
##$DBPOAL= (0..7)
0.5 0.5 0.5 0.5 0.5 0.5 0.5 0.5 
##$DBPOFFS= (0..7)
0 0 0 0 0 0 0 0 
##$DE= 6
##$DECBNUC= <off>
##$DECIM= 32
$$ [...]
##$SUBNAM4= <"">
##$SUBNAM5= <"">
##$SUBNAM6= <"">
##$SUBNAM7= <"">
##$SUBNAM8= <"">
##$SUBNAM9= <"">
##$SW= 20.6817932712277
##$SWIBOX= (0..15)
0 0 3 0 0 0 0 0 0 0 0 0 0 0 0 0 
##$SW_h= 4139.07284768212
##$TD= 32768
##$TD0= 1
##$TE= 0
##$TE2= 300
##$TE3= 300
##$TEG= 300
##$TL= (0..7)
0 120 120 120 120 120 120 120 
##$TP= (0..7)
150 150 150 150 150 150 150 150 
##$TP07= 0
##$TPNAME0= <>
##$TPNAME1= <>
##$TPNAME2= <>
##$TPNAME3= <>
##$TPNAME4= <>
##$TPNAME5= <>
##$TPNAME6= <>
##$TPNAME7= <>
##$TPOAL= (0..7)
0.5 0.5 0.5 0.5 0.5 0.5 0.5 0.5 
##$TPOFFS= (0..7)
0 0 0 0 0 0 0 0 
##$TUNHIN= 0
##$TUNHOUT= 0
##$TUNXOUT= 0
##$USERA1= <user>
##$USERA2= <user>
##$USERA3= <user>
##$USERA4= <user>
##$USERA5= <user>
##$V9= 5
##$VALIST= <valist>
##$VCLIST= <CCCCCCCCCCCCCCC>
##$VD= 0
##$VDLIST= <DDDDDDDDDDDDDDD>
##$VPLIST= <PPPPPPPPPPPPPPP>
##$VTLIST= <TTTTTTTTTTTTTTT>
##$WBST= 1024
##$WBSW= 30
##$XGAIN= (0..3)
0 0 0 0 
##$XL= 0
##$YL= 0
##$YMAX_a= 1115001
##$YMIN_a= -1243936
##$ZGOPTNS= <>
##$ZL1= 120
##$ZL2= 120
##$ZL3= 120
##$ZL4= 120
##$ABSF1= 0
##$ABSF2= 0
##$ABSG= 0
##$ABSL= 0
##$ALPHA= 0
##$AQORDER= 0
##$ASSFAC= 0
##$ASSFACI= 0
##$ASSFACX= 0
##$ASSWID= 0
##$AUNMP= <proc_1d>
##$AZFE= 0.1
##$AZFW= 0.1
##$BCFW= 0
##$BC_mod= 2
##$BYTORDP= 0
##$COROFFS= 0
##$CY= 18.4799938201904
##$DATMOD= 1
##$DC= 0
##$DFILT= <>
##$DTYPP= 0
##$F1P= 9.9274215381318
##$F2P= -0.165520771350173
##$FCOR= 1
##$FTSIZE= 16384
##$FT_mod= 6
##$GAMMA= 0
##$GB= 0
##$INTBC= 1
##$INTSCL= 4.127829e-11
##$ISEN= 128
##$LB= 0.05
##$LEV0= 0
##$LPBIN= 0
##$MAXI= 10000
##$MC2= 0
##$MEAN= 0
##$ME_mod= 0
##$MI= 50
##$NCOEF= 0
##$NC_proc= -4
##$NLEV= 6
##$NOISF1= 3.799351
##$NOISF2= 2.8
##$NSP= 0
##$NTH_PI= 0
##$NZP= 0
##$OFFSET= 16.48848
##$PC= 4
##$PHC0= -413.3518
##$PHC1= 3.101563
##$PH_mod= 1
##$PKNL= yes
##$PPARMOD= 0
##$PSCAL= 4
##$PSIGN= 0
##$REVERSE= no
##$SF= 200.130005582386
##$SI= 16384
##$SIGF1= 3
##$SIGF2= 2
##$SINO= 400
##$SIOLD= 16384
##$SREGLST= <1H.CDCl3>
##$SSB= 0
##$STSI= 16384
##$STSR= 0
##$SW_p= 4139.07284768211
##$SYMM= 0
##$S_DEV= 0
##$TDeff= 32768
##$TDoff= 0
##$TI= <>
##$TILT= no
##$TM1= 0
##$TM2= 0
##$TOPLEV= 0
##$USERP1= <user>
##$USERP2= <user>
##$USERP3= <user>
##$USERP4= <user>
##$USERP5= <user>
##$WDW= 1
##$XDIM= 16384
##$YMAX_p= 436080580
##$YMIN_p= -509237
$$ End of Bruker specific parameters
$$ ---------------------------------
##NTUPLES= NMR SPECTRUM
##VAR_NAME=  FREQUENCY,     SPECTRUM/REAL,   SPECTRUM/IMAG
##SYMBOL=    X,             R,               I
##VAR_TYPE=  INDEPENDENT,   DEPENDENT,       DEPENDENT
##VAR_FORM=  AFFN,          ASDF,            ASDF
##VAR_DIM=   16384,         16384,           16384
##UNITS=     HZ,            ARBITRARY UNITS, ARBITRARY UNITS
##FACTOR=    0.252644378177508, 1,           1
##FIRST=     3299.83951724647, 0,            0
##LAST=      -839.233330435636, 0,           0
##MIN=       -839.233330435636, -509237,     0
##MAX=       3299.83951724647, 436080580,    0
$$ Real data points
##PAGE= N=1
##DATA TABLE= (X++(R..R)), XYDATA
$$ [...]
9504 -234066 -216773 -171646 -177992 -146721 -130474 -169327 -171784 -120457 -148553 -165487 -155801 -204535
9492 -204535 -231333 -182457 -193194 -266588 -250913 -226296 -218646 -198819 -211071 -232530 -202804 -224798
9480 -224798 -205011 -242996 -200908 -225674 -211611 -168004 -235950 -175879 -164801 -179882 -250920 -216433
9468 -216433 -223992 -172306 -227569 -153250 -237699 -191932 -250050 -215928 -198298 -184174 -188098 -186863
9456 -186863 -213356 -143385 -244762 -130816 -215475 -213163 -219573 -195249 -202844 -232926 -223157 -190115
9444 -190115 -196927 -247135 -257470 -201279 -205221 -227386 -200911 -192667 -200046 -263809 -189854 -212714
9432 -212714 -223752 -197891 -226852 -229938 -212704 -219587 -238646 -180786 -195449 -177106 -196331 -186031
9420 -186031 -204243 -212212 -193201 -165162 -155826 -296035 -168547 -200017 -203859 -241945 -152464 -164911
9408 -164911 -141914 -170903 -199627 -193782 -188693 -165004 -160084 -202015 -158512 -148851 -188865 -129609
9396 -129609 -186778 -99455 -163731 -156005 -111471 -122868 -158507 -137241 -144183 -146304 -141685 -139513 -99293
9383 -99293 -184051 -167544 -133625 -132396 -138005 -132003 -163122 -109325 -96782 -104713 -153074 -125690 -151061
9370 -151061 -99314 -155193 -88127 -131823 -111612 -106033 -152251 -150378 -120417 -130301 -127059 -128739 -154519
9357 -154519 -121358 -111682 -53716 -58110 -23257 -3373 1000 29626 79846 89762 112973 105281 121917
9344 121917 146723 135304 90125 72841 76695 30300 65320 53949 71081 112771 123377 147758
9332 147758 219248 237716 292012 354807 440772 429851 427619 390203 386605 340512 268995 302552
9320 302552 177423 99618 138276 71943 120828 138057 33179 57386 75400 147927 75672
9309 75672 125377 138893 197368 126187 131156 156444 75485 107887 44169 34981 -16548 -67435
9297 -67435 -70561 -29498 -82358 -101457 -112511 -117831 -136997 -145624 -169672 -115588 -144320 -143361 -155136
9284 -155136 -109525 -98379 -162020 -187235 -155462 -161108 -143510 -132173 -193358 -169113 -195080 -134267
9272 -134267 -123422 -166482 -128196 -157817 -137659 -175321 -164386 -162889 -182787 -140252 -201480 -160346
9260 -160346 -190600 -154560 -161289 -169394 -129236 -151349 -206290 -195231 -165084 -181145 -157594 -193571
9248 -193571 -142004 -184873 -225134 -146407 -153922 -142457 -137642 -173267 -165442 -130821 -152908 -125526
9236 -125526 -169596 -152097 -154842 -181951 -130152 -131697 -113820 -158581 -181205 -101621 -132823 -195361
9224 -195361 -152519 -129351 -150517 -129519 -103966 -180703 -168576 -154399 -103764 -98415 -160832 -106868
9212 -106868 -144896 -132859 -106629 -119861 -111312 -144716 -123952 -142150 -136294 -85044 -123235 -102650
9200 -102650 -124744 -124784 -181175 -123246 -136649 -163944 -104005 -167566 -81378 -172862 -131463 -151262
9188 -151262 -86383 -140210 -127723 -151988 -123561 -172940 -216516 -24476 -118801 -82066 -118210
9177 -118210 -161614 -88108 -85016 -99373 -61549 -68415 -83000 -71438 -80276 -55548 -105073 -91526
9165 -91526 -76775 -120605 -91496 -90912 -76060 -115664 -96721 -88448 -84580 -91124 -64179 -72423 -47186
9152 -47186 -62685 -72062 38172 -21474 -15057 67449 93906 68581 68073 81031 16475 59195
9140 59195 30107 24216 27560 79118 29436 61405 1503 21707 18431 18022 32992 28783 58092
9127 58092 6230 58814 48451 61540 65569 83280 108445 72303 104283 136135 79312 116734
9115 116734 138066 91917 126988 116246 79549 142595 140634 162604 131002 195560 222126 210829
9103 210829 235193 269990 301918 328691 371665 449801 510452 622831 654603 822317 990439
9092 990439 1150918 1515891 2464234 4357807 6940236 8617328 9020088 8767611 8555537
9083 8555537 7440189 6207486 5074372 3982767 3128152 2132789 1554843 1314756 1143201
9074 1143201 972059 900802 790115 695781 589432 556287 529093 521134 510584 515466 456345
9063 456345 461879 471854 463989 450490 391922 419221 394958 426473 438288 406485 395656 444336
9051 444336 424923 431593 422062 439525 465355 476417 402881 433786 483775 435303 403629 475235
9039 475235 460233 418236 430260 459952 455718 476555 443815 470807 488464 472593 450948 505342
9027 505342 491553 499652 467893 494476 461481 481729 506764 475680 503351 413609 451601 456463
9015 456463 423184 450905 421807 395726 366697 358911 363167 411676 403627 426846 326808 364858
9003 364858 344073 381633 361458 349146 345015 340973 253654 287875 314557 297945 227747 275395
8991 275395 206795 219905 167904 111787 147901 148934 166129 132399 100597 104889 107957 51859
8979 51859 52473 28422 54389 84925 -22687 17746 -16329 -4949 16778 -12783 17052 -19019
8967 -19019 -27392 -50040 -33658 -59966 -16529 -50972 -120959 -97978 -100078 -81909 -78050 -98095
8955 -98095 -75846 -100090 -42901 -67035 -116734 -88714 -86835 -154278 -145647 -89689 -117782 -156914
8943 -156914 -140597 -109401 -158443 -121875 -137425 -127142 -119910 -128622 -139280 -91536 -94111 -121694
8931 -121694 -127589 -138256 -78622 -100901 -135720 -100168 -70840 -104757 -138016 -121101 -111809 -135201
8919 -135201 -180475 -160676 -141965 -138828 -147985 -137083 -122876 -185803 -199739 -164050 -205582 -164303
8907 -164303 -150086 -204209 -158706 -182613 -148458 -209498 -163588 -178083 -162021 -184508 -163072 -209883
8895 -209883 -188773 -118439 -177634 -132985 -228490 -185108 -173432 -184492 -164593 -175803 -179458 -224337
8883 -224337 -186190 -209610 -160434 -191391 -162845 -177148 -174040 -166728 -248211 -170914 -152118 -283555
8871 -283555 -192484 -204373 -161935 -169785 -171859 -206292 -201439 -183771 -194914 -246511 -222976 -217223
8859 -217223 -217459 -212813 -186375 -168228 -250914 -160904 -206736 -204615 -214222 -186174 -166433 -216753 -200166
8846 -200166 -181000 -185908 -187806 -151219 -195772 -141732 -206907 -172811 -220175 -196955 -200392 -216898
8834 -216898 -245707 -238703 -230017 -212709 -152692 -217503 -222364 -192764 -225371 -198425 -206973 -174345
8822 -174345 -215728 -164059 -213752 -232219 -180448 -151307 -180339 -183547 -182780 -189129 -158580 -208238
8810 -208238 -228977 -203978 -201548 -229283 -193391 -206522 -205223 -235437 -185827 -207127 -181609 -246682
8798 -246682 -208968 -248245 -236580 -192356 -182217 -216328 -192157 -224868 -188749 -170516 -195983 -221173
8786 -221173 -179028 -188247 -209664 -182082 -201771 -215436 -197280 -179770 -207808 -242998 -206762 -226866
8774 -226866 -232593 -270570 -225115 -145750 -227190 -265630 -237423 -213728 -199256 -276044 -253681 -190073
8762 -190073 -162900 -179252 -212277 -191005 -166476 -245335 -206460 -176885 -204604 -191098 -148875 -281268
8750 -281268 -174381 -167805 -210602 -245680 -250995 -234905 -211070 -228049 -172312 -187285 -233741 -212224
8738 -212224 -218061 -218742 -207456 -197667 -222647 -238446 -182285 -197583 -211044 -255980 -185674 -209669
8726 -209669 -208891 -228977 -206336 -254593 -210760 -224247 -197984 -187647 -179377 -174180 -220013 -200142
8714 -200142 -215192 -245971 -212279 -150846 -221247 -178447 -260379 -189295 -227360 -166461 -201374 -179578
8702 -179578 -196181 -201763 -200842 -227641 -198195 -164898 -191773 -208837 -200130 -226942 -230011 -225758 -222140
8689 -222140 -225182 -226101 -194608 -193375 -180818 -206105 -233394 -176011 -225239 -222897 -222534 -201822 -202446
8676 -202446 -169625 -142933 -205852 -137848 -166452 -202293 -174512 -185342 -112441 -175501 -132746 -171126
8664 -171126 -173953 -198046 -175934 -233716 -178044 -209680 -163664 -186965 -217793 -241270 -205572 -225634
8652 -225634 -223877 -179409 -214687 -242081 -207079 -164744 -237732 -186809 -204747 -168084 -204642 -218246
8640 -218246 -193682 -211599 -241644 -109483 -186867 -154413 -206947 -237127 -185561 -179600 -205272 -204415
8628 -204415 -144341 -213566 -234359 -199426 -205496 -196411 -189769 -168912 -214562 -232526 -218982 -277823
8616 -277823 -175010 -195432 -198448 -204670 -185986 -221762 -226428 -221651 -226762 -176580 -230512 -202727
8604 -202727 -222306 -188093 -183937 -210513 -190447 -162575 -171084 -165486 -148973 -200212 -215006 -186656
8592 -186656 -192207 -172453 -179384 -178228 -191477 -154965 -212944 -220277 -193043 -223302 -163864 -170471 -178954
8579 -178954 -180427 -172031 -158063 -141683 -113428 -149389 -92376 -114394 -120342 -151329 -91117 -128978
8567 -128978 -128460 -164940 -217719 -183512 -176903 -140306 -138777 -169240 -154587 -187593 -136343 -159968
8555 -159968 -92243 -54676 -94571 -46556 -80065 -41675 -124131 -74066 -90835 -122108 -112013 -162261
8543 -162261 -164708 -142673 -104118 -222909 -173156 -176290 -160916 -131825 -225954 -157031 -119554 -316036
8531 -316036 -98607 -157987 -155757 -143359 -111032 -156319 -132063 -173614 -142219 -180908 -197708 -182448
8519 -182448 -212655 -199730 -201020 -182391 -142706 -126074 -134240 -175745 -225081 -138117 -205785 -183529
8507 -183529 -175273 -191258 -166129 -204283 -227454 -191325 -153187 -218423 -211720 -199111 -246512 -210913
8495 -210913 -176052 -200403 -170642 -189540 -151507 -187062 -208936 -153041 -195047 -193713 -182785 -195567
8483 -195567 -189915 -172860 -198290 -179715 -196631 -178738 -223774 -166045 -199198 -202645 -205072 -191230
8471 -191230 -192423 -116489 -166161 -180561 -207357 -159575 -172516 -210991 -125436 -187928 -199141 -240111
8459 -240111 -186595 -157380 -114370 -197109 -186779 -172318 -196912 -147755 -227352 -192805 -182716 -148832
8447 -148832 -176659 -178152 -163044 -168749 -186903 -143481 -107120 -158409 -137435 -137360 -201991 -189817 -164303
8434 -164303 -173157 -153273 -148571 -175313 -162236 -97972 -151477 -182847 -138339 -178556 -159322 -143590
8422 -143590 -167073 -175745 -165446 -155077 -189557 -192056 -155423 -138469 -144121 -102506 -136073 -122334
8410 -122334 -136732 -165887 -132875 -155011 -170008 -121172 -101167 -124773 -156070 -159071 -142114 -148602
8398 -148602 -136891 -150323 -142978 -129015 -129952 -128861 -111530 -164528 -80200 -156327 -111485 -163634
8386 -163634 -66250 -76018 -86542 -127394 -86531 -146180 -149511 -132604 -92599 -131115 -80209 -124594
8374 -124594 -120492 -130139 -154821 -96290 -102073 -115727 -112870 -120882 -152424 -95178 -125035 -98657 -120921
8361 -120921 -79388 -129982 -76626 -144855 -117537 -77046 -127187 -77281 -106738 -53392 -72545 -99277
8349 -99277 -93264 -104000 -110631 -60431 -68739 -66014 -92020 -79925 -76195 -44351 -62556 -42479 -30337
8336 -30337 -102980 -118149 -19263 -27293 -70787 -22992 -7585 -6016 -9492 -21496 -22515 -21089 1405
8323 1405 5607 3529 -47695 -2094 22308 35255 -8106 -7545 49373 35483 -19645 74929 91986
8310 91986 35154 -433 43695 54288 70699 81224 92174 125258 134410 122428 114514 66631
8298 66631 88211 115451 59425 74621 105726 139879 123830 113269 195813 124764 167214 149710
8286 149710 198825 166214 152626 195154 196300 195103 222739 180892 184829 250594 263275 235506
8274 235506 218498 236384 223623 206851 238150 240112 262956 247757 289513 275651 195512 206896
8262 206896 222283 299710 267296 269523 239841 262682 238247 267486 274091 258311 224887 266407
8250 266407 238502 273588 247077 260377 281792 268565 241778 185987 254898 207300 269716 219333
8238 219333 218695 205682 184571 178648 188267 220219 201803 146093 106979 163863 212078 151542
8226 151542 168631 159363 115740 135052 83428 147377 122835 112094 131229 149928 70350 100670
8214 100670 93148 65882 110134 76042 81311 73501 80941 65280 48947 51287 85204 -2278 47604
8201 47604 -15703 48009 94096 64884 24632 -28975 -31805 -15494 -70338 -155695 -23347 16473
8189 16473 -16443 -81068 43711 -77258 -65435 -78174 -44721 -80722 -49888 -39301 -21700
8178 -21700 -7542 -61724 -37170 -74676 -71867 -12726 -14204 -16186 -50050 -65014 -76607 -66358
8166 -66358 -27210 -119956 -96171 -70622 -88673 -40938 -78159 -108629 -166444 -90004 -118006 -20653
8154 -20653 -106794 -104020 -90536 -116085 -64911 -75958 -132503 -121397 -112306 -103057 -52775 -73406
8142 -73406 -100342 -100209 -96141 -86754 -143736 -87589 -80126 -75996 -104782 -76562 -111627 -115215 -53401
8129 -53401 -78350 -54186 -90166 -65693 -84957 -166495 -92501 -142080 -66573 -100581 -69060 -52529
8117 -52529 -90444 -55147 -140359 -116857 -126174 -139090 -95232 -89571 -111831 -160606 -119573 -116510
8105 -116510 -75892 -84203 -112841 -59706 -52083 -70138 -114716 -87364 -85132 -65654 -70856 -79048 -109299
8092 -109299 -95697 -132859 -95411 -113981 -103465 -57826 -107134 -98507 -116513 -72227 -53301 -95230
8080 -95230 -8438 -71089 -75317 -53837 -117691 -42961 -49325 -88069 -100327 -95701 -112204 -118447 -47742
8067 -47742 -70096 -45584 -78689 -37570 -43374 -52098 -66528 -46050 -84957 -54627 -62981 -99876
8055 -99876 -83091 -91185 -62777 -82594 -63188 -92574 -81563 -87190 -70221 -110509 -84727 -120804
8043 -120804 -81489 -111238 -70483 -103042 -73089 -129403 -70066 -85674 -101862 -68849 -77691 -132766
8031 -132766 -73657 -51846 -95833 -100624 -101341 -109167 -81144 -110744 -131860 -62419 -121916 -108127
8019 -108127 -87129 -144587 -146709 -131633 -125775 -113300 -56247 -137462 -97758 -164737 -92875 -106925
8007 -106925 -174679 -109291 -112680 -134638 -106538 -188342 -97678 -160020 -143418 -148703 -94028 -116613
7995 -116613 -91756 -169860 -116621 -179362 -162417 -96555 -168428 -134977 -141017 -131952 -135244 -89822
7983 -89822 -124106 -87608 -134362 -89623 -180292 -159679 -146196 -119359 -154063 -123246 -110249 -133147
7971 -133147 -133985 -168755 -167133 -122564 -136275 -159054 -94008 -170386 -193013 -134134 -167582 -123501
7959 -123501 -170706 -179298 -115165 -180365 -86071 -188244 -157195 -165270 -110284 -191383 -171814 -179751
7947 -179751 -115512 -136855 -143840 -163784 -152944 -119345 -186600 -132774 -135004 -146257 -162159 -154483
7935 -154483 -180091 -144067 -137120 -170268 -171990 -179240 -181842 -152141 -186794 -168693 -177583 -172110 -193367
7922 -193367 -89119 -194360 -139625 -146294 -190695 -107198 -168631 -198993 -172190 -198275 -155015
7911 -155015 -191745 -137362 -143098 -182234 -142432 -215548 -171548 -178871 -149728 -163782 -121977 -193261
7899 -193261 -139461 -186172 -228841 -162718 -227294 -142565 -166871 -176796 -166446 -168116 -173014 -195942
7887 -195942 -200564 -160946 -156074 -178311 -143406 -181067 -188136 -172483 -211928 -145476 -140040 -166366
7875 -166366 -184062 -154831 -187394 -189208 -180126 -146866 -162878 -173343 -156879 -180960 -218616 -127787
7863 -127787 -147702 -120169 -202784 -99081 -102282 -175842 -140289 -148483 -124228 -151737 -104113 -486171
7851 -486171 -188734 -177583 -201980 -178086 -185207 -134118 -125889 -202317 -157868 -228220 -180763 -202692
7839 -202692 -171463 -174532 -198307 -114022 -189104 -123604 -144290 -184157 -195433 -213049 -200207 -161683
7827 -161683 -179294 -182676 -127325 -212679 -185561 -201367 -175171 -164380 -182870 -137744 -150972 -119081
7815 -119081 -140658 -104245 -178546 -195613 -156151 -161650 -143412 -196522 -226903 -179273 -191667 -141748
7803 -141748 -179864 -153314 -151312 -197617 -170233 -222307 -207814 -197458 -179383 -204798 -177034 -188845
7791 -188845 -134136 -193308 -132693 -246413 -227807 -229062 -204635 -166585 -175434 -126629 -184950 -207868
7779 -207868 -184988 -161945 -152925 -189396 -215341 -206774 -229793 -142096 -199867 -218535 -234756 -185958
7767 -185958 -138963 -190369 -155212 -135486 -144272 -159269 -163636 -199163 -117004 -172151 -185883 -172693
7755 -172693 -188120 -136542 -219043 -186078 -183636 -151366 -172081 -188294 -168530 -185857 -173137 -200144
7743 -200144 -161462 -200067 -130835 -186913 -132957 -206386 -170333 -208015 -198758 -198731 -197195 -209111 -194057
7730 -194057 -193415 -159018 -170996 -218990 -197657 -157992 -164872 -201589 -221344 -170790 -155432 -205434
7718 -205434 -150513 -151239 -193578 -176253 -157313 -231939 -197597 -195148 -218787 -165725 -229452 -174000
7706 -174000 -180948 -203608 -148513 -186589 -178265 -182611 -193280 -175117 -192775 -206769 -230356 -200819
7694 -200819 -207891 -197909 -212665 -163570 -196072 -162359 -170357 -204814 -161422 -188071 -222944 -178639
7682 -178639 -228431 -213628 -195967 -149133 -226722 -202671 -135028 -186991 -225422 -178359 -185401 -196751
7670 -196751 -198194 -182342 -157641 -170001 -174494 -189281 -163785 -177156 -224446 -140051 -188855 -199999
7658 -199999 -197297 -169537 -214768 -176231 -183307 -180505 -174920 -213507 -229618 -223726 -209729 -174100 -180622
7645 -180622 -144682 -243737 -195442 -171674 -191139 -210467 -175712 -216954 -209861 -182659 -168724 -147345
7633 -147345 -211250 -182662 -181742 -249113 -213651 -257372 -144924 -163187 -206767 -149001 -245032 -174983
7621 -174983 -178446 -139849 -137942 -231228 -183583 -181325 -181569 -190902 -195238 -199740 -167249 -203285 -208159
7608 -208159 -231869 -184852 -177991 -188043 -168314 -158269 -193643 -248541 -224201 -259406 -13176 -86499
7596 -86499 -179743 -213529 -171629 -206463 -211803 -179956 -169402 -186166 -170563 -160882 -180955 -157195
7584 -157195 -162835 -205660 -196982 -170635 -172885 -180568 -137718 -125199 -216392 -188729 -167017 -196193
7572 -196193 -175971 -205898 -206911 -154545 -166075 -186055 -159588 -114560 -190165 -185538 -220291 -162933
7560 -162933 -111420 -166040 -222213 -167070 -184914 -195815 -187646 -170045 -163338 -138691 -153023 -164493
7548 -164493 -137992 -173119 -136093 -150412 -156627 -123198 -131292 -148647 -162746 -196535 -168466 -157182
7536 -157182 -158051 -160614 -127555 -162403 -141236 -145893 -166234 -145180 -158978 -183503 -173677 -116391 -151467
7523 -151467 -146051 -174361 -171713 -160177 -184136 -197384 -173495 -161351 -120282 -109289 -156570 -188640
7511 -188640 -145335 -164844 -172075 -161250 -165815 -161934 -146670 -200544 -173154 -153484 -142433 -147380
7499 -147380 -188192 -213319 -155985 -146933 -131368 -160226 -133602 -135669 -174839 -189615 -187719 -158892
7487 -158892 -160149 -195486 -190135 -176910 -204129 -193666 -199180 -145093 -153386 -170118 -208591 -151876
7475 -151876 -137543 -113478 -116017 -131781 -211106 -173433 -140468 -133596 -151041 -154141 -160854 -165852 -189324
7462 -189324 -160883 -198527 -210698 -173996 -138499 -123997 -154124 -183906 -160112 -167164 -159845 -172969
7450 -172969 -141039 -167321 -154591 -178000 -143339 -189140 -135658 -220939 -185717 -203706 -162957 -158120
7438 -158120 -164907 -156824 -130217 -132147 -161334 -147472 -149190 -165531 -183191 -136498 -164642 -227412
7426 -227412 -177626 -170238 -157601 -223024 -140464 -128136 -202030 -204101 -152575 -241501 -172992 -203105
7414 -203105 -183274 -156830 -176114 -185647 -140825 -141332 -168494 -140750 -129276 -175797 -140096 -173309
7402 -173309 -134886 -140446 -148877 -147591 -181407 -189162 -146709 -170423 -148300 -185495 -133585 -121064
7390 -121064 -179154 -157276 -140741 -101657 -141512 -151667 -177508 -115706 -158499 -169885 -167097 -172500
7378 -172500 -171786 -182942 -187218 -110480 -193873 -165907 -158330 -166068 -166062 -131418 -164069 -80201 -187582
7365 -187582 -152472 -184327 -135131 -183719 -156687 -130823 -145754 -207093 -194248 -85514 -116388
7354 -116388 -171961 -138870 -149551 -140274 -191758 -169991 -164443 -173374 -169328 -163347 -157216 -130536 -109162
7341 -109162 -100956 -124441 -146557 -183253 -224535 -152393 -132315 -161950 -166048 -110149 -73890 -161362
7329 -161362 -181647 -155448 -134593 -135171 -160059 -138215 -162654 -148458 -155917 -127924 -158745 -129047
7317 -129047 -188853 -129990 -153485 -131508 -148638 -152056 -160253 -187340 -155350 -138898 -99471 -142753
7305 -142753 -101522 -120226 -133247 -166383 -118734 -117796 -187103 -137555 -141723 -164185 -136401 -207429
7293 -207429 -130306 -121854 -139794 -148216 -117522 -154871 -115687 -129510 -107565 -142163 -131361 -125434
7281 -125434 -153834 -185704 -110094 -166735 -170952 -130224 -172598 -121135 -145246 -136890 -129373 -99033
7269 -99033 -144815 -131649 -138748 -150253 -145794 -99467 -102541 -115115 -126846 -122316 -143734 -131318 -171611
7256 -171611 -111300 -110538 -136497 -140521 -160129 -97264 -75330 -136213 -105627 -91188 -137756 -121869
7244 -121869 -132162 -111925 -133585 -129395 -141502 -159743 -154594 -108441 -108827 -81020 -77028 -156485 -88591
7231 -88591 -118609 -82874 -115354 -138183 -88164 -87267 -147793 -127300 -99125 -110541 -67660 -112285
7219 -112285 -92185 -114641 -51247 -86261 -88929 -51695 -94454 -68460 -58074 -91338 -117926 -118242
7207 -118242 -93169 -86616 -61068 -102472 -64183 -23580 -58479 -64413 -76272 -52947 -54653 -24424
7195 -24424 -34360 -29905 3381 -7025 -77958 -79749 -25445 4438 3917 24032 35705 7088 18165
7182 18165 9305 44507 20565 22138 27090 83874 10433 83505 108720 145805 163954 225191
7170 225191 201699 228379 238463 288124 279326 394705 417997 432989 434303 475600 432491 422162
7158 422162 348923 356953 300797 268224 194418 143626 133396 139382 105553 79763 113907 101452
7146 101452 83272 38883 73834 72113 80867 119776 114454 116654 172162 171738 171689 194636 268822
7133 268822 423231 531727 595811 663716 652549 613515 597393 486438 476793 381792 315370
7122 315370 291425 261487 142977 213583 251053 213825 195993 219108 152398 136479 166762
7111 166762 190546 200048 201195 197974 226508 221090 211135 248124 272918 280125 232758 274388 286796
7098 286796 272544 287658 290696 315111 334638 303657 379712 371236 371659 393149 399242 436578 426446
7085 426446 447265 468507 475869 503910 534954 562837 533048 530279 556191 620671 686453 707552
7073 707552 686588 723682 725946 796050 855874 834273 895630 844117 949146 1015007 1062045 1060900
7061 1060900 1079887 1163287 1206617 1230028 1268031 1284114 1376059 1455114 1442400 1496709 1550002
7050 1550002 1604135 1711298 1703682 1717252 1745920 1846955 1897077 1898119 1951441 2007581 2005684 2087311
7038 2087311 2109450 2149367 2138187 2206271 2282943 2266908 2376621 2392468 2425248 2420426 2471770
7027 2471770 2489654 2527069 2522865 2501574 2563992 2554523 2546144 2543239 2574409 2552250 2570518 2526707
7015 2526707 2458728 2454304 2470361 2425432 2410752 2424046 2366014 2295757 2306681 2309027 2245977 2229209
7003 2229209 2157734 2128135 2110811 2038805 2028969 1971779 1940419 1874796 1828870 1760183 1760658 1654631
6991 1654631 1679415 1592997 1523224 1542602 1513660 1443637 1418232 1321059 1239854 1261369 1177277
6980 1177277 1126010 1145586 1137399 1068943 1013662 1057116 930191 910649 877361 914057 878282
6969 878282 810630 752002 734135 750661 686389 719692 661757 675045 577586 630898 595653 592741
6957 592741 517795 554529 547978 512391 498264 518568 477899 420640 470840 420899 424336 374024
6945 374024 386992 372203 410428 364300 385021 334555 356562 356678 390536 354054 343165 336505
6933 336505 322637 325455 333259 286554 318324 298490 291264 239744 256729 286633 237806 283388
6921 283388 199776 220852 270560 227620 260638 251464 214504 265016 243271 220884 238016 205662
6909 205662 242488 282535 219355 227620 220314 208297 217040 242414 269942 200933 214679 218278
6897 218278 193055 176562 132953 178095 110658 139744 200283 213811 175090 185612 164157 186743
6885 186743 158643 155475 191588 164359 186299 155750 144182 175986 160745 154064 161181 163353
6873 163353 117813 156480 230486 199207 166711 197867 185469 140198 154770 179526 170944 151727
6861 151727 117477 176884 178194 169034 121736 170485 173809 163703 233907 159612 177670 178857
6849 178857 185503 194308 205946 210383 181562 202728 159154 198615 175055 215132 200944 169888
6837 169888 183966 178764 229964 158064 184076 161013 179231 173714 213842 167092 148165 156123
6825 156123 156144 231558 190983 165541 174597 213552 153952 157234 155006 150910 124738 199001 199140
6812 199140 160299 177383 192082 163981 166401 140850 177450 176336 104927 141763 158026 123185
6800 123185 172821 151193 111538 117583 146446 129307 140021 171430 136046 94529 149927 142028
6788 142028 140704 88842 82153 135078 75871 80796 80538 117014 70363 118920 84961 95434 94831
6775 94831 73507 108036 105891 58401 78251 28522 65195 104402 55891 56081 20165 51453
6763 51453 30483 22921 83877 21163 57081 70697 66096 63542 34490 46714 52724 70891 62038
6750 62038 -10265 19682 33495 12069 53780 50468 78878 22875 49383 37942 -7060 -4288
6738 -4288 42036 -3043 33554 33017 42723 -29859 -20230 23559 17928 -31849 16373 -52433 10876
6725 10876 -14664 -30525 -23580 -2213 26358 -17312 22874 -36567 1864 -15522 12503 -45477
6713 -45477 -7888 32936 -10417 -5913 79432 21828 139796 142446 74186 80954 111138 93762
6701 93762 46384 30185 34520 8115 -910 -3437 8438 10132 12302 6276 32341 -21336 -9760
6688 -9760 -18995 -8492 -47697 -28979 -10883 -25055 -22760 -54603 -5483 -45245 13561 -50336
6676 -50336 -49050 -46868 -53649 -415 17676 5176 -15998 -28236 20046 -66769 7933 17706 -31157
6663 -31157 -2698 -19790 -147 -9743 2625 18371 10110 1295 10239 -37230 -24664 -24008 -1538
6650 -1538 40249 -50623 27139 4819 8722 26521 40229 46323 32109 86645 60635 85370
6638 85370 103714 96244 153059 253384 247103 369489 448221 607152 672259 731307 866340
6627 866340 888786 931585 920068 837244 835384 805115 880740 1000031 1012694 1050782 1061652 970935
6615 970935 979708 954457 796459 705934 627583 566998 503284 452614 432415 347931 373203 384877
6603 384877 411417 417127 510361 571370 712294 788443 914532 998616 1056138 1079669 1091952
6592 1091952 1006508 981609 941435 964417 1045478 1089552 1082985 1126925 1150823 1108405 989490
6581 989490 901791 766273 642658 538955 432986 345358 338224 288872 261858 218061 184928
6570 184928 202476 133868 156653 125312 129530 100733 116077 116053 92383 104072 54442 76119
6558 76119 43248 61841 101858 40373 89669 62452 55918 -28447 37522 10299 40417 28872
6546 28872 54294 48618 38530 57696 -8125 38663 22608 36403 79773 56271 27633 53575
6534 53575 50405 75256 75201 100495 80791 41509 2538 22231 85915 31094 36983 42518 47156
6521 47156 59182 70472 67703 27386 29068 63762 31310 51046 31168 15992 73021 24736
6509 24736 48846 66304 63692 63142 116643 93013 88396 61494 97985 143237 131304 152708 131224
6496 131224 125913 94912 130456 117544 172911 99067 162902 100596 110181 108303 69302 176490
6484 176490 144366 163871 205942 224438 213276 290759 289154 297288 288974 385152 400485 465918
6472 465918 588388 656102 773319 917669 1082806 1427849 1915418 2768665 3759948 4896358
6462 4896358 5841238 6406787 6576962 6413551 5848976 5162540 4423298 3630672 2918615 2338341
6452 2338341 1857175 1491628 1258315 1063061 895204 781589 725013 609213 577224 488204
6442 488204 414359 417466 430961 280485 373278 318728 331821 305654 289436 228637 228984 239397
6430 239397 229779 203612 214874 191609 201846 228537 218086 204597 213494 211704 167499 196004
6418 196004 159807 156399 190192 168911 201665 183001 171729 174900 161290 149275 133076 121936
6406 121936 99117 57387 56274 99840 106281 90433 132380 103286 153911 100297 119736 96903
6394 96903 105766 136170 92416 93264 121888 141701 108367 115517 78444 125389 142018 129276 103379
6381 103379 118612 93390 72980 111935 122029 49484 84561 114196 100952 130682 144639 150492
6369 150492 173980 169722 221619 177189 144393 153463 178335 174829 202492 237716 284075 353803
6357 353803 361422 417493 441044 443200 399606 439832 412029 413236 432278 489258 602387 660170
6345 660170 744788 806996 831778 890234 842894 769890 774715 802175 822345 928205 1069273
6334 1069273 1242138 1391981 1578884 1572207 1559706 1535609 1401337 1381250 1234518 1240807 1196893
6323 1196893 1267745 1372705 1364387 1356742 1339534 1284039 1224272 1061418 1008476 963249 982795
6312 982795 1014251 1012581 1117845 1260614 1204521 1276219 1282509 1262416 1319230 1372809 1466205 1563454
6300 1563454 1702770 1825578 1955596 2029255 2058629 1958528 1968332 1905181 1870961 1958672 2032744
6289 2032744 2207340 2471461 2536473 2608314 2611269 2526328 2393458 2241202 2090927 2075384 2029179
6278 2029179 2048242 2119145 2167057 2228582 2196414 2149733 2142732 2092586 2191007 2322588 2446286
6267 2446286 2520023 2586182 2647554 2722822 2789058 2889013 2892171 2934860 3021414 3136872 3230792
6256 3230792 3213635 3266279 3336272 3404020 3430155 3524104 3636423 3771545 3940506 4108667 4115487
6245 4115487 4264298 4448350 4412343 4359626 4228577 4040057 3884669 3782761 3615157 3579119
6235 3579119 3615243 3739829 4011408 4229789 4435404 4515989 4612167 4569007 4394728 4346449
6225 4346449 4332907 4225015 4226109 4198604 4049823 3913266 3703909 3407547 3141921 2820853
6215 2820853 2593314 2405356 2258914 2096961 1974926 1913856 1834530 1813288 1736227 1665751
6205 1665751 1651829 1633204 1655621 1595427 1651225 1705790 1782721 1853902 2089181 2480177 3218164
6194 3218164 4450810 5561329 6273151 6514875 6727215 6748671 6625925 6514331 6426278 6357314
6184 6357314 6282291 6167699 6172698 6211288 6417435 6690232 7002916 7437702 7714875 7747703
6174 7747703 7641120 7429034 7027335 6454801 5951406 5549824 5074346 4753930 4478291 4294377
6164 4294377 4192907 4029721 3839384 3652223 3422079 3173608 2869783 2627307 2458026 2272433
6154 2272433 2139595 2094032 2019164 2030351 2094380 2082488 2127073 2112822 2092683 1987500 1842174
6143 1842174 1855905 1729102 1613785 1512566 1533023 1564959 1771739 1905460 2004579 2012148 1997338
6132 1997338 1934086 1870200 1724926 1562583 1435782 1427093 1508839 1482093 1633969 1730758 1850225
6121 1850225 1865499 1895045 1831372 1773381 1750351 1608219 1467636 1422217 1277810 1209818 1126039
6110 1126039 1012778 979756 933849 835294 835797 779926 793878 770874 785813 783877 858299 1018701
6098 1018701 1055965 1113484 1225770 1207536 1203897 1219341 1224553 1285161 1300978 1366626 1377699 1498105
6086 1498105 1491828 1460679 1386103 1317672 1199964 1164648 1108601 1082265 1014469 1028558 966099
6075 966099 913943 875538 796353 754706 685031 667196 574835 577988 524535 500361 490078 523679
6063 523679 490846 488619 492935 508297 534034 501719 466623 471925 473407 559627 552802 618057 627789
6050 627789 598449 594115 585179 534423 553485 501789 542246 540092 510191 583702 549625 541874
6038 541874 551087 567105 475404 507761 495301 447852 414835 419396 445806 436797 407661 437129
6026 437129 384347 422038 397499 393648 389216 425152 402549 352848 336806 396568 359696 348536
6014 348536 399040 375019 323522 403067 408835 412337 462363 413324 450909 407394 485650 464292
6002 464292 432952 420854 459626 474219 440006 485232 493203 463107 442020 425719 428588 435766
5990 435766 438970 457197 469378 555770 558646 584807 607035 598688 581023 641612 601711 630844
5978 630844 600010 608545 601896 646974 635197 684993 672653 684452 753981 810354 885603 929533
5966 929533 960093 958946 963742 988309 949490 955939 925245 849639 830260 837354 809893 823605
5954 823605 780526 752413 746664 736070 773228 762630 840075 887580 928604 1020934 1169265 1283508
5942 1283508 1411440 1599115 1764280 1925354 2133792 2280595 2365874 2568638 2634936 2701766
5932 2701766 2702190 2757302 2687572 2655716 2517900 2402582 2265303 2133302 1882534 1823096 1731977
5921 1731977 1707219 1695993 1687437 1749450 1838209 1947389 2167370 2413867 2704291 3033265 3364559
5910 3364559 3702264 4046603 4401514 4688327 4931281 5084315 5133419 5136977 4983467 4763712
5900 4763712 4544630 4184765 3854664 3521167 3252024 2928496 2722668 2558067 2470128 2449098
5890 2449098 2416632 2541769 2654122 2861959 3068955 3301624 3592318 3817053 4152678 4406337
5880 4406337 4610591 4864770 4994675 5002166 4985579 4964360 4955802 4855020 4869490 4731954 4537316
5869 4537316 4259616 3939253 3614514 3278598 2992175 2722266 2532863 2399056 2359660 2317944
5859 2317944 2421268 2376987 2511981 2588806 2723186 2857071 2964575 3090819 3255847 3349943
5849 3349943 3352013 3327658 3365677 3301887 3269518 3218755 3144163 3096287 3121807 3199757 3269279 3281423
5837 3281423 3151103 3089216 2945033 2736794 2605981 2466924 2358752 2326268 2418950 2549051
5827 2549051 2722980 2922227 3076633 3155230 3227447 3234652 3305146 3303705 3351633 3366583 3315755
5816 3315755 3282235 3192394 3134407 2999961 2862354 2715128 2602561 2459142 2337896 2272925
5806 2272925 2184365 2121087 2094329 2006031 2020371 2053138 2132066 2201073 2357353 2517914 2724104
5795 2724104 3096600 3472350 3787759 4099049 4315679 4471239 4646098 4827877 4938158 5015187
5785 5015187 5042274 5045099 4983497 4914292 4802050 4711540 4555479 4401738 4259305 4210142 4101682
5774 4101682 4121780 4163119 4179099 4336564 4528553 4719640 5066423 5467391 5927267 6421564
5764 6421564 6989886 7604007 8169563 8706285 9234055 9564463 9722267 9796810 9733385 9526936
5754 9526936 9194169 8850904 8480089 8100310 7675576 7322823 6961914 6798230 6595177 6574111
5744 6574111 6503795 6535929 6764862 7003550 7327492 7737098 8201607 8680785 9129654 9523025
5734 9523025 9867034 10103304 10292654 10269113 10109247 9848145 9516654 9041582 8550719 7908010
5724 7908010 7441494 6915436 6421556 5986950 5629030 5315816 5090125 4923880 4764023 4648677
5714 4648677 4626162 4629245 4696906 4863332 4974313 5123093 5294411 5388247 5427723 5416733 5391591
5703 5391591 5178236 4978335 4738663 4448483 4189478 3891595 3626927 3402183 3204495 2951775
5693 2951775 2787167 2633185 2513707 2386828 2260869 2172387 2097531 2111582 2035212 1972606
5683 1972606 2007644 1947121 2023360 2014571 2095690 2150775 2230487 2223615 2183534 2209465 2127525 2032005
5671 2032005 1896621 1878408 1775277 1766688 1684916 1673277 1580945 1620921 1565593 1507693 1517573
5660 1517573 1474471 1414463 1396393 1388147 1344266 1355302 1366990 1413952 1472476 1483009 1518859 1609259
5648 1609259 1521893 1543034 1520985 1521924 1436824 1439982 1489092 1476604 1507144 1558281 1541488 1556530
5636 1556530 1598573 1536841 1508636 1503828 1506901 1433813 1314493 1278294 1224936 1152389 1147131 1127834
5624 1127834 1136696 1161551 1181323 1258908 1285697 1312668 1324944 1334850 1262575 1267094 1288170 1295325
5612 1295325 1286992 1382844 1385739 1498188 1440235 1442794 1468042 1392745 1280162 1234063 1247589 1229568
5600 1229568 1160537 1171032 1178879 1224833 1357630 1430582 1482904 1598325 1678506 1728924 1727315
5589 1727315 1785771 1717421 1649596 1620183 1511497 1405942 1365611 1295080 1323483 1259929 1161984
5578 1161984 1190545 1163693 1148388 1167280 1136604 1172247 1191750 1165922 1208777 1163331 1267771
5567 1267771 1311627 1392010 1474827 1608893 1716896 1728028 1725156 1724795 1661275 1599119 1593753 1530869
5555 1530869 1526561 1503422 1498782 1510013 1489154 1486512 1511145 1499695 1521601 1487148 1519722 1535653
5543 1535653 1541629 1617962 1619722 1611245 1637339 1654789 1744662 1771243 1765339 1803724 1821712 1856496
5531 1856496 1897857 1927847 1929657 1955882 1939254 2022384 2024862 2027097 2113960 2096150 2158047 2240896
5519 2240896 2230403 2316173 2397768 2439543 2510095 2479950 2555589 2545316 2578122 2635638 2624157
5508 2624157 2690619 2718510 2690905 2799482 2863577 2906115 2964260 2988545 3068142 3161082 3208164
5497 3208164 3240611 3300689 3379379 3367767 3449029 3577470 3668990 3731226 3823435 3917767 4013306
5486 4013306 4072541 4121748 4240640 4273889 4390413 4487652 4622228 4674740 4833243 5002002
5476 5002002 5130339 5214985 5366237 5497936 5677097 5774232 5929437 6140649 6323724 6464968
5466 6464968 6627643 6942622 7151895 7432373 7740716 8034635 8368257 8776833 9213565 9651806
5456 9651806 10180886 10826399 11707442 12667268 13917199 15407991 17237190 19431031 22085689
5447 22085689 25610994 30557321 38012960 48234220 59980598 70843037 79330481 85157687
5439 85157687 88076645 87819274 84873389 80209753 74362367 68053400 61817318 56364429
5431 56364429 52012460 48739795 46541235 45387176 45169511 45982219 47834520 50812751
5423 50812751 55081177 60928943 68707598 79064157 92708426 110333309 130835164 151232331
5415 151232331 167982598 178556007 182082558 178757664 169306859 155608611 139327642
5408 139327642 122245763 105548899 90435282 77482534 66937153 58635372 52199259
5401 52199259 47262547 43651518 40995761 39512481 38891376 39260223 40623642 43158029
5393 43158029 47355898 54169565 64686974 79368716 95660621 109179535 116605892 118354192
5385 118354192 115370732 107869613 97036179 84989660 72826923 61386349 51151841
5378 51151841 42740070 36368193 31568606 27848644 24822812 22405409 20316098 18708619
5370 18708619 17413669 16287917 15448770 14692732 14106268 13612295 13137530 12844814 12569417
5361 12569417 12275090 12138923 12030818 12011093 11959309 11844994 11634773 11423345 11116017 10702184
5351 10702184 10298706 9864017 9407905 8983264 8653993 8341959 8015214 7776347 7484706
5342 7484706 7204458 7029815 6861542 6656321 6481295 6341088 6193509 6122935 5931376 5842574
5332 5842574 5844847 5815060 5867597 5928076 5982474 5948973 5875220 5764692 5515263 5257998 5067757
5321 5067757 4793334 4628691 4341958 4180286 4035924 3929771 3820062 3781118 3673753 3574006
5311 3574006 3548827 3433768 3372170 3268384 3126103 3021336 2941038 2810059 2694559 2689202
5301 2689202 2628967 2491325 2464673 2370096 2330316 2217063 2154882 2043039 2019056 1956245 1930470
5290 1930470 1792033 1791294 1703662 1717181 1682979 1699388 1635792 1601338 1574036 1478120 1450986 1415311
5278 1415311 1416336 1380171 1318742 1281847 1286147 1256640 1187707 1253234 1201370 1125187 1111361 1065540
5266 1065540 1069346 995490 995994 1002993 927561 885303 874006 830798 842293 837872 805425 851841
5254 851841 785943 778481 808618 742854 750089 742220 732941 654515 725310 645047 634214 615989
5242 615989 612789 617495 606677 607757 584003 585625 567445 563526 620830 577121 561522 577195 587961
5229 587961 566254 536485 524520 491522 489186 513708 511193 524011 492008 503387 471464 563840
5217 563840 608117 684212 711295 719974 720033 680750 626727 599791 536700 505867 545483 465158
5205 465158 417145 417924 430404 458794 410516 421311 419153 373645 400966 402476 374716 433475
5193 433475 383307 314555 301026 342095 318556 354452 436539 419434 401708 443238 411849 478107
5181 478107 533404 544399 640359 684533 780943 834104 932609 898849 860655 841143 777270 734819
5169 734819 695722 637881 602811 568251 550409 480857 458753 477895 475303 505720 497444 536980
5157 536980 583985 608462 707179 788693 891108 1021683 1128931 1271017 1381223 1355851 1310169
5146 1310169 1288596 1206793 1103248 1040849 890877 811916 745305 621476 514209 517221 538789
5135 538789 461301 457092 433392 421814 450032 464138 457396 403924 513774 505911 639284 718914
5123 718914 829444 962114 897664 907373 892296 762819 734259 618526 562688 495158 411859
5112 411859 362097 436205 403223 309385 337349 300305 287712 274022 328484 296152 396771
5101 396771 312975 380139 362959 404238 420694 458850 474813 556301 444177 463505 482285
5090 482285 446048 411072 448596 417472 420305 364561 388966 416456 390159 418721 479237 516590
5078 516590 523043 581742 584822 642683 612757 726038 731302 760031 772113 806319 818669 811300
5066 811300 835198 801181 805631 793527 763441 725288 682847 696607 669991 644017 640768 611441
5054 611441 658634 653062 696085 720817 777831 832955 865186 835768 796648 857378 794743 863396
5042 863396 798651 875968 824472 883593 837768 853586 810081 762580 745454 726822 694947 701314
5030 701314 665436 654959 689023 667932 679843 689228 743957 847873 1065992 1275549 1666625
5019 1666625 1831004 1852057 1808018 1696327 1521467 1377634 1182041 974433 873605 723750
5009 723750 696509 594437 596891 518475 552005 498341 432504 488993 525138 507643 502572 534421
4997 534421 498295 507763 491135 434764 482845 417105 433163 386190 385057 392350 289597 341347
4985 341347 319535 287819 304250 289360 233890 244882 263832 287311 263931 282049 261294 303751
4973 303751 276869 281423 328550 330857 322634 301669 361600 315116 336008 302055 273596 323298
4961 323298 292305 303768 265988 291713 230740 275107 238084 234832 221401 263161 271065 221624
4949 221624 279067 234299 217287 215032 234535 221445 270205 255224 233713 247564 251294 250332
4937 250332 228604 254183 229627 268429 275839 235107 285320 218168 228964 255831 279140 300457
4925 300457 330295 304467 320646 279825 312204 313178 396480 354763 367604 402996 442708 454575
4913 454575 418267 453869 442748 432143 491204 465729 446518 499929 478156 435359 476949 462243
4901 462243 494873 528568 577802 606611 640609 740694 807279 912037 1037540 1313567 1649867
4890 1649867 2045804 2449590 2770756 3111745 3704200 4198321 4576447 4663868 4640474 4640549 4567827
4879 4567827 4316598 3984381 3595657 3181301 2690328 2304662 2003347 1679305 1473331 1304182
4869 1304182 1127270 1012585 934098 824393 806307 769757 728795 667280 699876 687825 654538
4858 654538 675985 693595 730002 889598 914131 937167 963482 1026440 930206 915309 850083
4847 850083 850029 798794 737973 646186 681360 697932 589977 620860 595745 543222 525293 572068
4835 572068 551733 579675 581657 634756 599617 614709 606408 622737 574890 620079 610662 585956
4823 585956 551063 535879 495745 561224 514382 453962 459013 541926 518293 520600 524287 528645
4811 528645 505254 508716 505751 538932 575251 498448 514592 446046 469004 453792 514458 518887
4799 518887 544518 556394 547448 535647 476687 526330 573122 538091 581332 576220 598317 596899
4787 596899 623468 667451 773452 839579 865456 822997 850821 906383 892689 984819 1011688
4776 1011688 977436 992290 940918 930208 910435 851125 801209 864759 853960 793753 855449
4765 855449 813154 812433 819312 818557 889792 785583 818110 869689 935838 916611 937333 944396 1042324
4752 1042324 1069449 1135854 1223971 1275058 1345863 1502901 1754167 1918370 2404916 3055610
4742 3055610 3745626 4614749 5383671 6055472 6372368 6442308 6244895 5736573 5199907 4541590
4732 4541590 3921000 3336702 2908559 2536726 2218547 1962258 1863898 1726620 1630499 1606099
4722 1606099 1483655 1453545 1407407 1380534 1384541 1354806 1299034 1335066 1368866 1375765 1337062 1287513
4710 1287513 1396175 1413464 1382878 1410948 1397376 1408882 1435786 1468172 1419362 1517208 1558268
4699 1558268 1551179 1572048 1618082 1637515 1722945 1690230 1721283 1756005 1859953 1895418 1995916
4688 1995916 2049728 2166750 2238554 2324219 2310589 2325338 2359819 2272269 2235935 2211597 2148435
4677 2148435 2135013 2081348 2093080 2007019 2015510 2034019 1978682 1989030 1983718 1955746 1993217 1958340
4665 1958340 1967879 1960411 1945118 1914896 1879282 1867408 1951020 1911843 1932111 1955290 1966266 1988577
4653 1988577 1938167 2016422 2020751 2098264 2114729 2062952 2106475 2122669 2188090 2184688 2223909 2249943
4641 2249943 2242873 2225138 2362525 2355962 2420195 2446901 2440760 2439906 2447028 2546869 2505633 2558549
4629 2558549 2574557 2629878 2636786 2679439 2696590 2720933 2755685 2792342 2810450 2838738 2847916 2927725
4617 2927725 2959632 3038555 3034239 3120641 3132933 3179694 3251006 3364004 3389351 3498433 3573414
4606 3573414 3674301 3712305 3831898 3886759 3988519 4050619 4105881 4176298 4206380 4301564 4358066
4595 4358066 4382156 4484333 4509882 4589571 4625899 4655019 4745498 4839532 4873963 4934660 4972764
4584 4972764 5112877 5173331 5309662 5355306 5464826 5606391 5672332 5849150 5936988 6095720
4574 6095720 6171557 6299812 6396487 6502779 6572635 6579694 6691596 6804721 6864407 6919543 6993973
4563 6993973 7093788 7131762 7144380 7260765 7287969 7405718 7492406 7574482 7612346 7776832 7885494
4552 7885494 7999429 8101961 8162029 8357415 8513354 8634677 8763443 8881682 9027080 9178159
4542 9178159 9326461 9451891 9571675 9752037 9891509 10057577 10213089 10299460 10389043 10619389
4532 10619389 10787732 10903109 11044339 11233118 11446784 11616788 11810162 11988858 12217195
4523 12217195 12479067 12690827 12916390 13139120 13380203 13584058 13810229 13982190 14264690
4514 14264690 14502586 14769437 15081094 15339569 15620187 16034628 16342583 16761352 17202224
4505 17202224 17683887 18130402 18633423 19192900 19755296 20341655 20974916 21653819 22319545
4496 22319545 23033536 23797602 24497334 25314065 26029212 26843420 27657705 28583363 29544448
4487 29544448 30566100 31715239 32765771 33850618 34821029 35856717 36734228 37618001 38438964
4478 38438964 39302927 40180262 41095182 42053425 43211519 44317519 45602312 47023818 48564854
4469 48564854 50212931 51962382 53889225 55935926 58090302 60271492 62523304 64877432
4461 64877432 67250857 69722148 72204523 74712705 77132128 79459314 81496681 83365545
4453 83365545 85171833 86796042 88568948 90435969 92667951 95249658 98336919 102005004
4445 102005004 106459669 112028721 119029860 128573655 142103996 161264045 186188266 213411428
4437 213411428 236603433 251379821 257052190 254929527 246129146 232748664 217212017
4430 217212017 201366450 186435252 172962744 161588788 152678075 145637976 139843415
4423 139843415 134801642 130334162 126271932 122691127 119618742 116965777 114784329 113023120
4415 113023120 111510237 110431892 109601488 109049551 108779339 108691125 108791913 109011920 109364067
4406 109364067 109718945 110169980 110806344 111558336 112339595 113038624 113626779 114072311 114281739
4397 114281739 114386517 114262351 114087107 113869613 113679313 113502734 113457645 113532179 113906905 114412499
4387 114412499 115256227 116481967 117908120 119669520 121840577 124190740 126828493 129741877
4379 129741877 132862804 136358694 140086529 143949728 148179717 152483573 156952660 161610839
4371 161610839 166477613 171497833 176704729 181988467 187314322 192758723 198103460 203338842
4363 203338842 208270251 212865769 217117225 220917707 224264695 227211022 229740836 231822176
4355 231822176 233483608 235038768 236272934 237331493 238202140 239015613 239781280 240712534 241929586
4346 241929586 243702827 246194427 249428157 253607838 258665278 264762608 271869224 279962089
4338 279962089 288901178 298608999 309062036 320303764 332488718 345712081 360131321
4331 360131321 375853501 392384279 408501575 422125612 431535148 436080580 435739966 430741844
4323 430741844 421523327 408846439 393356091 375820914 356807485 337165955 317404871
4316 317404871 297997689 279292163 261353419 244279533 228259578 213228943 199351527
4309 199351527 186434287 174510769 163507882 153255646 143770064 134967282 126758088
4302 126758088 119142340 112133969 105546869 99443384 93831764 88658771 83875771 79481987
4294 79481987 75451965 71753776 68406372 65311335 62491320 59865697 57463439 55126685
4286 55126685 52943461 50882346 48901519 46852798 44972563 43194112 41387351 39817863
4278 39817863 38243273 36727928 35379633 34136323 32911196 31821299 30767769 29743518
4270 29743518 28793305 27907270 27070646 26295354 25516679 24835248 24184144 23517070 22962318
4261 22962318 22350211 21763685 21259248 20659274 20131133 19678602 19148579 18657696 18193966
4252 18193966 17728586 17299784 16886571 16459017 16099388 15735043 15316328 15011916 14687650
4243 14687650 14278143 13989869 13698948 13387447 13078620 12828348 12537275 12312522 12064525
4234 12064525 11785163 11563039 11316038 11048944 10829009 10603110 10405656 10228842 10068156
4225 10068156 9773125 9602670 9467273 9289960 9045162 8918452 8742082 8534106 8416620
4216 8416620 8225816 8072431 7935883 7752266 7668606 7528784 7418363 7253909 7170057 6978841
4206 6978841 6844163 6722918 6642474 6492852 6353284 6237440 6124577 5971947 5857039 5762223
4196 5762223 5642998 5550431 5448276 5417036 5359103 5286063 5248359 5205596 5237567 5211748 5286445
4185 5286445 5234172 5222671 5178847 5062052 4958686 4910751 4746329 4647131 4485235 4357611
4175 4357611 4173438 4114621 4026949 3897954 3832655 3681394 3573307 3554214 3512728 3425610 3295524
4164 3295524 3292413 3227414 3149582 3066458 3052948 3003203 2974256 2951176 2942634 2891277 2792341 2804506
4152 2804506 2778400 2689003 2683007 2708494 2685688 2617422 2641846 2577117 2493094 2535332 2447668 2427256
4140 2427256 2348559 2366925 2283927 2261792 2227242 2197234 2175925 2131147 2108181 2118316 2077630
4129 2077630 2025566 2007190 2040011 2009010 2039384 1972297 2001025 1957010 1924960 1919652 1838243 1971489
4117 1971489 1898706 1852470 1847196 1911683 1858015 1842810 1910870 1859314 1857451 1878353 1872740 1900964
4105 1900964 1857711 1844157 1867957 1846940 1805711 1777323 1814227 1789999 1776051 1811458 1740378
4094 1740378 1767359 1738666 1687874 1691187 1681270 1726635 1707767 1692797 1678552 1665603 1641450 1603355
4082 1603355 1686011 1644597 1676594 1718496 1704548 1713297 1686162 1634970 1579541 1604942 1576650 1589921
4070 1589921 1505612 1439872 1447841 1379209 1398349 1345547 1320546 1315718 1314903 1295040 1181561 1203896
4058 1203896 1218559 1197429 1195924 1226048 1098550 1122919 1122015 1097864 1104823 1038538 1049290 1036498
4046 1036498 986502 930922 933020 923253 891714 884210 858580 847616 813415 793375 787420 740145
4034 740145 689501 693735 669487 612810 676080 606585 657132 605488 610759 559035 535697 601582
4022 601582 548766 530095 531573 492794 546673 522820 463093 493297 496488 449845 451512 481819
4010 481819 421990 416809 432419 417734 385394 400597 383128 407902 398673 385471 340330 394335
3998 394335 351611 394574 334614 368645 370402 387474 387104 375248 402659 397257 440441 357049
3986 357049 362618 319745 299831 284641 285772 242518 267128 235121 222220 206278 257909 252138
3974 252138 237006 220253 227142 192343 209947 206267 222971 241832 209866 213083 225441 186365
3962 186365 206836 211026 158742 189903 215616 163150 153366 183010 102762 114584 109370 152972
3950 152972 56175 117428 64638 73513 88297 32011 114395 74640 61507 77219 84781 35365
3938 35365 58770 59135 90241 46399 49269 58229 33226 52959 1245 29338 25711 39960 -19540
3925 -19540 -12651 38685 3972 5916 -9188 9246 -13982 8806 -39432 -4792 -30526 4528
3913 4528 26699 -25700 21094 -25032 5748 -18415 28131 -7396 -33288 -26637 -43582 -21543
3901 -21543 -50694 -59924 -73319 -109094 25972 -76952 -23362 -36976 -17760 -98886 -52742 -13493
3889 -13493 -107488 -49693 -47609 -88192 -39781 -79512 -36604 -67767 -105235 -84069 -70981 -85935
3877 -85935 -74404 -69365 -50181 -33916 -27809 -57658 -50042 -9334 -52387 -77173 -70650 -41549 -36253
3864 -36253 -78391 -80695 -118539 -84301 -71143 -64449 -43709 -77584 -77467 -154323 -95105 -109388 -134810
3851 -134810 -105892 -66046 -129184 -93082 -109470 -115536 -106890 -67650 -81374 -75110 -42537 -120546
3839 -120546 -72440 -91113 -146471 -118321 -131871 -84814 -104664 -65880 -75975 -138029 -28772
3828 -28772 -94779 -97559 -63668 -59659 -166397 -115396 -120787 -145806 -73323 -131636 -138103 -92753
3816 -92753 -80655 -140271 -127475 -80356 -116595 -87344 -104247 -98372 -81926 -110738 -126075 -147744
3804 -147744 -97447 -114769 -109414 -112401 -133742 -149989 -117681 -153737 -104157 -127177 -126027 -145420
3792 -145420 -88870 -173877 -139952 -92511 -73830 -114651 -90911 -162848 -104108 -128457 -69582 -101824
3780 -101824 -157349 -76250 -109108 -85184 -138461 -169368 -166911 -111299 -127316 -100445 -130290 -162915
3768 -162915 -129572 -119445 -124466 -103879 -130754 -104854 -104384 -160247 -109454 -177264 -134040 -176130
3756 -176130 -157759 -168904 -148521 -142551 -102693 -125609 -125956 -180803 -127704 -108839 -189764 -156912
3744 -156912 -196456 -150602 -149417 -132279 -150598 -138664 -104889 -102697 -167833 -128077 -143182 -146214
3732 -146214 -155733 -151460 -182769 -155485 -173030 -169845 -156064 -142515 -135234 -146097 -185643 -201918
3720 -201918 -169480 -122481 -128919 -152993 -178806 -143113 -147211 -150264 -161717 -107485 -219753 -169815
3708 -169815 -141954 -203254 -123633 -171897 -176235 -142185 -150298 -169728 -160165 -135811 -176280 -121632
3696 -121632 -192366 -159220 -118099 -166013 -190191 -151223 -205068 -154009 -187760 -114238 -138947 -137488
3684 -137488 -154643 -172087 -161068 -154444 -195763 -162886 -210495 -181782 -146770 -227894 -159726 -186460
3672 -186460 -126347 -166456 -74392 -101751 -146565 -142159 -168274 -135769 -129066 -163755 -125933 -158257
3660 -158257 -166830 -171352 -146804 -209093 -174259 -140158 -180210 -138187 -129643 -164657 -145180 -185777
3648 -185777 -156741 -107383 -157194 -218389 -134002 -184761 -182768 -176263 -146482 -158573 -162497 -215288
3636 -215288 -188857 -183223 -177512 -194252 -178127 -207987 -167415 -159183 -174240 -174850 -70720 -176059
3624 -176059 -141996 -165667 -168776 -175181 -158958 -162965 -188350 -201414 -174752 -158018 -167338 -170239 -235217
3611 -235217 -169000 -177969 -156091 -161436 -177839 -160255 -173068 -216470 -188526 -195458 -141908 -185402
3599 -185402 -166662 -177972 -135235 -143012 -190256 -201510 -126181 -185999 -206662 -193397 -217381 -183905
3587 -183905 -164197 -153263 -108718 -157108 -178314 -164765 -166620 -191112 -145119 -164688 -196355 -190224
3575 -190224 -157832 -166602 -206165 -157076 -191910 -174308 -159952 -179660 -195089 -246727 -191655 -167732
3563 -167732 -144040 -166793 -134549 -149598 -150772 -133009 -215117 -182476 -165864 -217959 -136519 -173908
3551 -173908 -200635 -157825 -127431 -154698 -127632 -165761 -209109 -198578 -182342 -171093 -192490 -170076
3539 -170076 -243275 -218895 -192226 -190899 -170848 -150332 -197566 -175837 -148119 -164878 -108636 -151605
3527 -151605 -192427 -189556 -161218 -141560 -180017 -141039 -201064 -191165 -181239 -171304 -170210 -259618 -233056
3514 -233056 -186587 -177441 -184941 -159280 -138303 -109187 -161098 -126292 -182587 -154532 -162077 -200702
3502 -200702 -142119 -242043 -200528 -214444 -210420 -211744 -215556 -164824 -161358 -196342 -182608 -204665
3490 -204665 -150861 -187109 -192044 -179119 -243619 -200001 -182882 -177254 -174988 -201361 -161064 -154278
3478 -154278 -174519 -159841 -166843 -170206 -215730 -189186 -209573 -211757 -229120 -197769 -205808 -183154
3466 -183154 -156780 -169368 -145820 -183856 -180066 -180575 -191059 -233390 -164231 -164361 -224065 -186320 -186812
3453 -186812 -181125 -184360 -161012 -113825 -186949 -245093 -200275 -191576 -218334 -206176 -185872 -184473
3441 -184473 -210359 -206202 -159706 -221648 -158246 -151672 -181170 -176493 -180445 -210995 -150118 -190917
3429 -190917 -216814 -179734 -189989 -178043 -215843 -172972 -186725 -157984 -210394 -185939 -152737 -184541
3417 -184541 -164740 -253291 -157510 -153940 -177496 -231541 -200584 -183684 -255759 -158460 -218942 -180012
3405 -180012 -239218 -193598 -212078 -163259 -213202 -136802 -204723 -223616 -164903 -221185 -212313 -175775
3393 -175775 -198068 -233821 -235837 -183800 -187125 -197704 -204450 -249531 -150488 -161030 -150577 -158601
3381 -158601 -186803 -172928 -177218 -170977 -196984 -200578 -186322 -174924 -159798 -197311 -116767 -133240
3369 -133240 -174274 -114717 -182311 -172427 -204927 -174103 -160149 -224770 -206486 -252048 -208126 -219635
3357 -219635 -184906 -169208 -165210 -132269 -154854 -140677 -133918 -134052 -127627 -108187 -100079 -89786 -80351
3344 -80351 -118587 -147014 -94398 -135888 -121022 -155324 -214589 -164441 -170659 -175120 -182402 -176468 -197893
3331 -197893 -197218 -179658 -140586 -176619 -180295 -173899 -206503 -147815 -175030 -187478 -191997 -148464 -180154
3318 -180154 -117399 -158475 -184409 -174576 -151333 -176033 -148695 -139186 -152468 -118336 -102779 -116081
3306 -116081 -80593 -79338 -132015 -53402 -83541 -38598 -3461 -25372 -13402 141888 420406
3295 420406 763787 897613 938209 894513 869413 708732 618753 425978 302062 176195
3285 176195 65994 44684 -53431 -77582 -18557 -71837 -92073 -80167 -113920 -10066 -116315
3274 -116315 -65264 -127493 -143359 -89620 -96829 -148831 -100702 -149849 -145395 -85582 -150157 -177670
3262 -177670 -131085 -155235 -181909 -157975 -154047 -177040 -199671 -162273 -202294 -191038 -174659 -196314
3250 -196314 -202337 -121080 -188229 -177744 -206537 -193403 -200302 -138654 -154905 -114218 -113541 -216477
3238 -216477 -156590 -216081 -192128 -180920 -155750 -187527 -116159 -139422 -189429 -173512 -165798 -255696
3226 -255696 -175805 -193031 -131947 -181218 -187595 -180826 -212803 -190166 -191909 -186857 -183568 -215472 -193034
3213 -193034 -134492 -240991 -246213 -254924 -201614 -187102 -214846 -221017 -206122 -220287 -198764 -224312
3201 -224312 -170702 -194230 -155948 -230362 -162700 -214431 -164819 -191193 -250321 -165351 -207054 -171919
3189 -171919 -152031 -212283 -188720 -237421 -194845 -186982 -232720 -211819 -189537 -228885 -186266 -191726
3177 -191726 -215697 -156467 -172285 -173572 -201080 -196103 -152439 -213917 -182614 -202453 -226248 -164233
3165 -164233 -206736 -171061 -160544 -211388 -153578 -132839 -211914 -205802 -186473 -207424 -193491 -224321
3153 -224321 -162799 -175753 -160411 -206007 -176659 -245466 -207339 -204840 -249306 -241789 -148158 -146547
3141 -146547 -223597 -209042 -219708 -177509 -184269 -150621 -205697 -216200 -254575 -200845 -162162 -206298
3129 -206298 -139060 -164338 -218145 -187092 -110287 -177207 -241446 -181040 -169413 -167620 -203665 -261788
3117 -261788 -176144 -188955 -196175 -224417 -172172 -182623 -187282 -161968 -183788 -176135 -224462 -208786
3105 -208786 -166266 -187570 -209177 -190451 -159950 -204426 -204187 -166099 -121594 -169968 -197597 -189903
3093 -189903 -190929 -204646 -215344 -163803 -209687 -229356 -168389 -184864 -159994 -177961 -168048 -205426
3081 -205426 -174886 -213744 -189887 -190447 -176994 -172339 -185067 -232377 -150802 -190203 -209384 -223628
3069 -223628 -214162 -203469 -190407 -170339 -250658 -199078 -225901 -216334 -258058 -154824 -207382 -173997
3057 -173997 -196495 -184662 -176890 -210778 -186932 -176750 -221709 -217443 -239471 -191256 -253991 -216507
3045 -216507 -204496 -189427 -182783 -192177 -220424 -165081 -161843 -199765 -192049 -259412 -200803 -206347 -231065
3032 -231065 -170937 -178196 -158517 -236331 -258501 -219921 -200851 -211328 -209108 -194754 -220871 -199982
3020 -199982 -150574 -176178 -184015 -228133 -203118 -235634 -204693 -234981 -151203 -256858 -205604 -225315
3008 -225315 -180399 -175916 -173702 -184518 -183679 -211413 -213316 -224456 -201303 -224034 -189117 -192106 -204199
2995 -204199 -219561 -176702 -207150 -200195 -187327 -179754 -267981 -228133 -229423 -231049 -195202 -175535
2983 -175535 -184703 -204784 -223517 -236578 -219176 -148141 -235490 -188456 -195448 -228649 -220394 -225661
2971 -225661 -181649 -221883 -220419 -181580 -226987 -218384 -247283 -195351 -149410 -178463 -188964 -134929
2959 -134929 -220688 -247789 -243146 -205476 -227275 -204926 -208687 -185065 -223198 -235923 -222775 -154580
2947 -154580 -174287 -169498 -174978 -184139 -221494 -186224 -178458 -234808 -144535 -170005 -219896 -177490
2935 -177490 -155549 -202389 -158374 -219452 -199320 -191514 -165489 -141199 -192162 -143032 -183546 -180344
2923 -180344 -218939 -167237 -150436 -167601 -211474 -213265 -196396 -210259 -186092 -184362 -222292 -189258
2911 -189258 -151530 -220842 -232640 -210259 -193668 -206244 -172235 -199007 -161263 -167835 -209557 -215597
2899 -215597 -155648 -233182 -235129 -182075 -155102 -175831 -179650 -195559 -176469 -229484 -208629 -223896
2887 -223896 -147017 -153669 -150694 -163177 -169058 -159824 -181590 -180908 -223848 -191469 -162792 -148047 -225321
2874 -225321 -205743 -192518 -207758 -198838 -179331 -230016 -207283 -218281 -161109 -175985 -186464 -266643
2862 -266643 -195414 -163486 -185484 -139018 -198507 -227459 -246430 -194436 -248018 -199687 -168976 -209432
2850 -209432 -221255 -203366 -200104 -225302 -212079 -199693 -209592 -212629 -181626 -245481 -244221 -228637
2838 -228637 -206465 -216172 -213966 -218694 -183734 -175026 -175455 -233237 -192629 -187845 -186420 -243703 -187840
2825 -187840 -196765 -225598 -224183 -205606 -208186 -167979 -202794 -188056 -253500 -201675 -238489 -190326
2813 -190326 -199464 -176744 -184744 -203329 -202203 -233399 -189744 -177868 -194388 -231114 -238104 -204406
2801 -204406 -238050 -228772 -212319 -192578 -177573 -223104 -169591 -217204 -172477 -187354 -197539 -179496
2789 -179496 -239123 -216213 -185603 -250641 -192001 -173647 -204218 -209614 -221057 -212903 -183523 -189430
2777 -189430 -188255 -204240 -159082 -199894 -239814 -200689 -196860 -214774 -216748 -185044 -214429 -186256
2765 -186256 -223815 -218384 -213550 -207493 -193489 -209486 -218194 -210012 -152080 -223064 -215825 -227258 -202404
2752 -202404 -187411 -182376 -128133 -155733 -204099 -166888 -194695 -201325 -194740 -192109 -193577 -166465 -202370
2739 -202370 -194135 -249073 -212633 -206924 -212069 -211874 -197773 -201063 -160729 -182044 -190662 -149582 -207846
2726 -207846 -206212 -189220 -184848 -195678 -192679 -180830 -193559 -161362 -205421 -178680 -229252 -183929
2714 -183929 -187640 -232416 -240677 -167575 -179212 -257408 -196173 -242791 -171873 -219994 -131921 -223535
2702 -223535 -208926 -218732 -235020 -176823 -205100 -198052 -231961 -149974 -206791 -192174 -164194 -207970
2690 -207970 -176427 -228278 -207087 -259237 -128768 -161271 -231967 -207351 -174567 -182440 -185530 -168364
2678 -168364 -212294 -231918 -153341 -198966 -213320 -201027 -233753 -168473 -131353 -151440 -240124 -172003
2666 -172003 -222396 -236927 -222977 -178672 -186176 -174027 -175796 -212062 -164228 -198275 -111702 -223705
2654 -223705 -148675 -180991 -202564 -172764 -180349 -171966 -183160 -220030 -177801 -182170 -231195 -172823
2642 -172823 -153343 -180565 -176380 -194425 -218262 -198862 -275141 -205094 -181367 -161526 -207157 -191024
2630 -191024 -188345 -220850 -233863 -198446 -215706 -216828 -181352 -201733 -198874 -257467 -224070 -182340
2618 -182340 -233077 -240265 -179186 -234139 -172966 -187622 -194672 -232011 -170062 -197250 -215393 -223481
2606 -223481 -205482 -198633 -202341 -217754 -242695 -163896 -227003 -166229 -183968 -218908 -223266 -173779
2594 -173779 -170275 -188390 -220231 -172236 -193917 -208177 -205052 -218879 -196401 -213927 -254691 -173569
2582 -173569 -236573 -169312 -169999 -134142 -182725 -206825 -204284 -217199 -211616 -176799 -171459 -208283 -181118
2569 -181118 -224364 -222860 -164504 -184263 -218303 -176536 -197954 -247885 -169362 -241403 -217226 -215464
2557 -215464 -219884 -174350 -236561 -174758 -190657 -245487 -207833 -187244 -208254 -184934 -194451 -216374
2545 -216374 -178755 -221790 -202832 -226225 -152623 -200607 -218900 -187844 -144536 -190862 -202633 -136914
2533 -136914 -187160 -228816 -241308 -198648 -185191 -249039 -179588 -170190 -186284 -194649 -236757 -200660
2521 -200660 -173404 -174784 -171663 -175451 -168106 -135785 -175841 -138723 -213565 -214985 -176549 -218730 -191942
2508 -191942 -155854 -216910 -204518 -250455 -204868 -231520 -175415 -182956 -229454 -212217 -185942 -206647
2496 -206647 -184185 -242809 -229890 -219164 -202231 -182103 -183214 -197162 -225269 -180449 -223024 -237251
2484 -237251 -210343 -213081 -168984 -150887 -170190 -192111 -202185 -195722 -171711 -137489 -179531 -200448
2472 -200448 -197992 -201374 -220232 -144464 -207172 -152575 -209906 -210309 -216563 -204328 -166733 -210233 -165796
2459 -165796 -202244 -224790 -189627 -175514 -127644 -140309 -148582 -118638 -154095 -176486 -154106 -193256
2447 -193256 -172817 -198506 -180627 -245869 -207626 -171503 -225304 -172335 -190218 -178635 -215876 -163540
2435 -163540 -209927 -171632 -160498 -194019 -195855 -146687 -215853 -251657 -189287 -170157 -198937 -201339
2423 -201339 -184848 -220921 -161677 -156759 -221925 -227276 -200881 -189290 -186442 -191344 -181368 -188657 -201746
2410 -201746 -135262 -163208 -156905 -242572 -191577 -188141 -223797 -201318 -180337 -202812 -230221 -216013
2398 -216013 -210692 -207783 -152690 -206418 -176931 -182426 -231047 -236253 -186802 -193541 -204595 -205647 -206749
2385 -206749 -184345 -216595 -158583 -185276 -202336 -219494 -205234 -202426 -183151 -179849 -211667 -211758 -237666
2372 -237666 -229886 -175929 -231175 -170235 -213319 -192386 -207727 -193436 -206787 -201438 -199952 -202100
2360 -202100 -210125 -203235 -193416 -168520 -195774 -177128 -224569 -175059 -215526 -200566 -194123 -201086 -225787
2347 -225787 -242435 -238283 -213548 -201093 -209657 -156799 -212947 -197134 -221019 -233704 -193571 -220274
2335 -220274 -159967 -172377 -146219 -187573 -194688 -193900 -179812 -143135 -236805 -234069 -205846 -191744
2323 -191744 -239244 -240584 -209810 -208479 -154423 -239556 -206273 -165238 -204068 -204420 -168608 -249414
2311 -249414 -190266 -173941 -215522 -155058 -175492 -178487 -201790 -197307 -166295 -241655 -224875 -180580
2299 -180580 -232742 -217766 -173318 -168152 -179057 -197637 -227799 -204075 -227592 -193743 -201887 -169273
2287 -169273 -174354 -217788 -204768 -225716 -196497 -246250 -251516 -228679 -173664 -199733 -189270 -166699
2275 -166699 -133030 -215784 -232982 -197641 -208850 -181100 -164230 -176225 -184917 -195453 -208185 -192390
2263 -192390 -144743 -196491 -209498 -234916 -178183 -196469 -199550 -197853 -218625 -216584 -199677 -145612
2251 -145612 -222232 -128905 -199506 -190269 -181775 -230104 -149550 -171126 -209539 -137667 -204552 -158661
2239 -158661 -141603 -174644 -179364 -183265 -189326 -218533 -170804 -202753 -178413 -133372 -173860 -222796
2227 -222796 -159487 -202369 -234697 -220308 -193973 -183390 -168728 -167168 -189093 -183592 -173262 -267712
2215 -267712 -232223 -203938 -179125 -134800 -156454 -201359 -233986 -243340 -128444 -229621 -173672
2204 -173672 -205716 -151172 -239133 -177675 -201112 -249043 -205915 -217082 -177337 -221162 -167334 -238549
2192 -238549 -192308 -228367 -218095 -216534 -230250 -262409 -166541 -223641 -178684 -203297 -191955 -232755
2180 -232755 -171119 -195646 -219957 -193487 -167942 -168874 -156628 -204762 -225199 -168584 -216347 -231986
2168 -231986 -224369 -248203 -222365 -209663 -207824 -186733 -198234 -279683 -203660 -242046 -237140 -198579
2156 -198579 -222649 -226795 -200674 -214612 -215373 -250864 -239568 -189301 -191441 -198766 -221264 -220470 -223680
2143 -223680 -229969 -196412 -176586 -144479 -212230 -194245 -131005 -188501 -233210 -244861 -184756 -190351
2131 -190351 -197002 -231095 -227214 -207016 -196679 -182316 -230560 -233092 -194859 -189297 -167593 -205821
2119 -205821 -179108 -199425 -204280 -206294 -196429 -185460 -155475 -218755 -180187 -183090 -203963 -164182
2107 -164182 -192039 -198566 -234005 -192464 -197082 -222957 -232057 -220442 -251274 -176734 -170350 -211279
2095 -211279 -169581 -259330 -216055 -188258 -192969 -241617 -220904 -184758 -180170 -219897 -194245 -251431
2083 -251431 -165296 -178308 -236541 -181981 -144756 -224179 -189445 -167832 -145552 -174010 -193186 -188675
2071 -188675 -207398 -186597 -223838 -210252 -238620 -202336 -178436 -163411 -163690 -167642 -187052 -143720
2059 -143720 -203974 -165227 -194680 -141035 -192321 -216538 -176538 -163172 -245905 -168024 -222961 -162614
2047 -162614 -162887 -223603 -164904 -235115 -209767 -188760 -162948 -196374 -152644 -184870 -207536 -174408
2035 -174408 -176778 -218170 -200230 -190245 -209519 -192154 -230063 -214538 -207187 -197473 -191115 -165287 -193727
2022 -193727 -197241 -216027 -230618 -201811 -212281 -244911 -227912 -230142 -185101 -162962 -210245 -201818
2010 -201818 -205262 -181625 -224246 -233740 -250978 -216022 -181335 -220797 -229226 -199863 -197737 -186099
1998 -186099 -202778 -163109 -191857 -148479 -202743 -165352 -190788 -196675 -194253 -186984 -219823 -182652
1986 -182652 -180439 -181985 -204240 -162858 -173025 -206317 -254908 -203764 -239453 -206842 -212706 -237549
1974 -237549 -172765 -256093 -234268 -213754 -160302 -186339 -132707 -199881 -245876 -210579 -211520 -193958
1962 -193958 -196140 -198490 -211368 -207727 -208420 -232531 -235762 -181077 -189983 -196871 -239621 -214846 -192685
1949 -192685 -158188 -201468 -174150 -238932 -211691 -273038 -194720 -160139 -232331 -219576 -184115 -194962
1937 -194962 -229988 -194722 -172814 -182652 -188239 -192825 -190493 -235372 -210178 -204635 -194006 -186825 -195773
1924 -195773 -199375 -231060 -144032 -164040 -231364 -146232 -226442 -208491 -216353 -180004 -213284 -200534
1912 -200534 -194099 -207603 -211701 -232502 -225221 -159733 -193104 -202816 -219113 -161644 -206738 -162048
1900 -162048 -198211 -226780 -218914 -121425 -231649 -156887 -161707 -234954 -174737 -227602 -177370 -211953
1888 -211953 -179585 -172850 -220100 -173977 -229912 -195810 -209327 -209077 -202178 -194857 -159088 -187884 -185374
1875 -185374 -217326 -157574 -192160 -172465 -183759 -209899 -187301 -206428 -164487 -180322 -199177 -236026
1863 -236026 -163247 -179494 -217508 -185979 -161909 -237238 -215668 -172897 -193323 -187385 -205871 -246676
1851 -246676 -173791 -216788 -184273 -173988 -180975 -190308 -232307 -184030 -239623 -194517 -187333 -177394
1839 -177394 -149051 -177241 -198438 -186111 -200576 -224959 -203189 -223831 -145903 -207542 -195413 -158291
1827 -158291 -235865 -146081 -215422 -190658 -149130 -179713 -167338 -199864 -190055 -176509 -173929 -188049
1815 -188049 -192839 -201023 -190938 -183846 -133493 -165642 -184982 -196838 -159906 -227138 -200330 -209083
1803 -209083 -220224 -215219 -155141 -175233 -265463 -195576 -163390 -141479 -276375 -172317 -195025
1792 -195025 -127830 -222240 -180933 -189594 -181386 -204806 -202558 -205150 -193997 -214699 -222772 -172725 -198847
1779 -198847 -175407 -192070 -230873 -167613 -178327 -211013 -229047 -191289 -203905 -219231 -215462 -210866
1767 -210866 -223535 -168306 -178504 -183277 -156936 -189889 -187048 -158952 -148241 -179337 -205701 -183208
1755 -183208 -190254 -241180 -195794 -172668 -204102 -200639 -212611 -146504 -144755 -201331 -197746 -173818
1743 -173818 -230994 -231813 -211408 -165877 -238427 -215829 -157307 -208630 -230439 -200553 -181774 -187124
1731 -187124 -235264 -169513 -210108 -235584 -207747 -214671 -145117 -182035 -228166 -246705 -156391 -202983
1719 -202983 -225226 -205514 -208836 -204462 -223650 -158793 -216243 -231104 -180255 -215601 -186220 -255602
1707 -255602 -176265 -169882 -230656 -235485 -178740 -213819 -203468 -165720 -237006 -173080 -244941 -202432
1695 -202432 -206316 -170344 -245554 -149171 -186273 -194387 -204344 -241529 -168139 -174352 -203263 -174140
1683 -174140 -185367 -255487 -195003 -192678 -199971 -194269 -192469 -205700 -179832 -210362 -171512 -193583
1671 -193583 -208632 -192308 -279811 -218049 -196132 -236274 -217611 -220391 -165370 -152576 -240365 -221424
1659 -221424 -200110 -236521 -187563 -184300 -214043 -218037 -180676 -201492 -205704 -210823 -230062 -180853
1647 -180853 -225105 -196368 -187326 -196992 -159087 -253303 -240834 -256160 -217227 -223708 -172917 -196744
1635 -196744 -210762 -167613 -189243 -130900 -177738 -211472 -205779 -159960 -193239 -226449 -164353 -188687
1623 -188687 -222407 -147327 -163470 -218395 -221922 -182128 -237132 -199312 -166704 -197198 -172433 -195592
1611 -195592 -224433 -142843 -203466 -222420 -204666 -193186 -235513 -191630 -220871 -194996 -236266 -164047
1599 -164047 -162725 -186832 -189053 -199205 -185012 -174611 -186008 -178296 -169659 -179218 -164062 -175822 -149968
1586 -149968 -208462 -248940 -183527 -227247 -235744 -141667 -189016 -208933 -234704 -196523 -208734 -193969
1574 -193969 -184847 -157172 -200377 -158875 -189472 -212809 -218163 -192594 -160920 -204279 -218450 -166553
1562 -166553 -132266 -181786 -195650 -182911 -205045 -196386 -178406 -210370 -178542 -202474 -198706 -136239
1550 -136239 -167938 -230703 -203382 -196319 -186179 -174680 -180655 -174312 -182137 -248346 -189292 -167374
1538 -167374 -218993 -231770 -215320 -225472 -169707 -190084 -215013 -199177 -188567 -240314 -155598 -215155
1526 -215155 -227655 -222222 -189238 -246189 -222901 -184537 -197563 -243482 -220869 -218403 -181439 -153819
1514 -153819 -170312 -187905 -205260 -171550 -192455 -201718 -202748 -227293 -206659 -182599 -200390 -200806
1502 -200806 -189036 -214063 -166216 -227560 -225412 -124890 -172067 -222520 -159611 -195243 -169003 -208670
1490 -208670 -217048 -224560 -225073 -242192 -234901 -199115 -200853 -272382 -240171 -224082 -174383 -243723 -198073
1477 -198073 -191006 -204381 -182642 -166030 -211276 -191962 -169519 -226852 -155729 -215228 -196430 -270637
1465 -270637 -164935 -205790 -186725 -190065 -203454 -227408 -178379 -230936 -220315 -191299 -224399 -145044
1453 -145044 -186373 -177034 -179706 -195371 -237957 -251804 -122360 -223484 -186528 -222011 -242554 -177169
1441 -177169 -173434 -192134 -198429 -151636 -248076 -221553 -206065 -232635 -174880 -202995 -212355 -180859
1429 -180859 -249668 -241139 -131483 -140124 -225578 -176216 -140533 -194219 -200696 -209035 -169446 -199915
1417 -199915 -217985 -208987 -258083 -235818 -240148 -196248 -219617 -223709 -200709 -178783 -195541 -242787
1405 -242787 -158799 -187372 -216486 -191002 -196303 -187598 -222651 -154187 -199657 -219811 -187893 -144832
1393 -144832 -198544 -195383 -207924 -237235 -208218 -169066 -176633 -161496 -208345 -189500 -204521 -149072
1381 -149072 -178452 -190808 -225647 -203314 -185987 -163528 -222739 -195392 -190332 -167280 -196110 -230480
1369 -230480 -229166 -200923 -195378 -193124 -222928 -137536 -168810 -173796 -200492 -186972 -187622 -163187 -203249
1356 -203249 -197854 -221711 -232645 -217438 -203037 -235658 -236261 -186721 -184093 -149905 -164083 -192254
1344 -192254 -203773 -171442 -197731 -169014 -181092 -231769 -198393 -172323 -195213 -150810 -145583 -214663
1332 -214663 -194114 -177303 -197648 -212164 -188727 -181927 -138481 -198019 -196151 -199515 -196473 -146925
1320 -146925 -152018 -198916 -189356 -201357 -183357 -157818 -191425 -234854 -179805 -224906 -210888 -189826
1308 -189826 -176135 -260419 -185910 -212104 -177436 -153608 -204169 -219235 -200270 -191110 -226918 -225786
1296 -225786 -144783 -187934 -189977 -188043 -193911 -205603 -222633 -230207 -227071 -187304 -216227 -276809 -195190
1283 -195190 -133247 -215651 -199381 -206451 -186878 -196202 -167416 -197022 -198641 -221345 -181566 -197115
1271 -197115 -229611 -231366 -240304 -260751 -221129 -200763 -233579 -186846 -179504 -142435 -188857 -209134
1259 -209134 -173179 -195999 -217406 -180496 -157460 -186002 -230482 -177907 -242427 -223030 -219212 -196348
1247 -196348 -213465 -183562 -174752 -162006 -222954 -191857 -206018 -224612 -256525 -199121 -197339 -161601
1235 -161601 -172212 -214410 -234677 -226155 -206058 -159159 -202986 -209700 -188329 -198061 -136229 -191621
1223 -191621 -195530 -203840 -198558 -242905 -197851 -182681 -227531 -194497 -262182 -210440 -191603 -188055
1211 -188055 -171908 -178668 -184970 -250279 -211704 -153206 -228475 -192407 -123731 -212418 -184248 -182771
1199 -182771 -184173 -154910 -142487 -178926 -160547 -173150 -228026 -189570 -220814 -226993 -187826 -183061
1187 -183061 -186788 -207297 -225412 -224113 -231605 -210283 -192615 -202959 -179646 -193669 -194922 -188065 -171661
1174 -171661 -225702 -187631 -202230 -160923 -168561 -193219 -204224 -200406 -211353 -213593 -155984 -175186
1162 -175186 -229873 -196514 -201954 -167255 -224855 -191166 -245683 -192746 -183331 -116866 -168960 -211144
1150 -211144 -204794 -189112 -242122 -171414 -209108 -143066 -188406 -188545 -169487 -193847 -207966 -171805
1138 -171805 -210489 -223478 -166090 -175659 -212170 -156001 -159228 -223652 -226149 -194891 -193671 -193627 -143941
1125 -143941 -178387 -193210 -137031 -225954 -203537 -198726 -251585 -211672 -207100 -202936 -192699 -220306
1113 -220306 -162492 -225789 -180756 -226376 -195782 -182614 -195137 -190088 -208801 -175202 -231251 -187035
1101 -187035 -168629 -189970 -237181 -236429 -240794 -265167 -223171 -193029 -195727 -196299 -220719 -268757 -177881
1088 -177881 -169405 -249752 -197721 -223809 -209397 -207605 -175727 -215979 -201691 -183922 -198678 -211155
1076 -211155 -188349 -194180 -153096 -232406 -216771 -182352 -201367 -207480 -218924 -197177 -180561 -175078
1064 -175078 -196552 -188889 -189829 -158432 -221888 -203029 -230588 -205738 -186304 -203386 -264992 -204260
1052 -204260 -193158 -189204 -224644 -193492 -218732 -173315 -159026 -214370 -229171 -224634 -171993 -217741
1040 -217741 -214354 -206341 -217006 -195174 -192173 -212988 -189256 -219457 -235244 -227743 -215708 -176579
1028 -176579 -253306 -163791 -246395 -183345 -215202 -248674 -237509 -188294 -214732 -191913 -235476 -239155
1016 -239155 -233468 -158891 -229196 -194369 -157148 -160532 -215312 -215929 -198104 -199476 -211525 -228768 -190313
1003 -190313 -155803 -181938 -139441 -242955 -170539 -214130 -172704 -158539 -246839 -183446 -170289
992 -170289 -180380 -183103 -192380 -206250 -210831 -229424 -166649 -183328 -194589 -193764 -195467 -195839 -187936 -241298
978 -241298 -233983 -183270 -143592 -185729 -201836 -219019 -185987 -225658 -168868 -210379 -167064 -166997 -178815
965 -178815 -176457 -182093 -203307 -241457 -197610 -168045 -244685 -167376 -155993 -221049 -202763 -204566
953 -204566 -171587 -194747 -177599 -221738 -163006 -182740 -200767 -216729 -165998 -208964 -226160 -189085
941 -189085 -152627 -164361 -152174 -145803 -179785 -184459 -203672 -186314 -168954 -211465 -176057 -183922
929 -183922 -167571 -223984 -226506 -206700 -193213 -174072 -189168 -170713 -162943 -201782 -188541 -216939
917 -216939 -215153 -270055 -199015 -223331 -231487 -176647 -213381 -183941 -217901 -190860 -211732 -241069
905 -241069 -178984 -181077 -173153 -166743 -200475 -214700 -213531 -237043 -201465 -164585 -230195 -240184 -136184
892 -136184 -213340 -150505 -192494 -168584 -227905 -208383 -175224 -207340 -173465 -162488 -171969 -185841
880 -185841 -175285 -205032 -203245 -215534 -231308 -137910 -181531 -206985 -207813 -171073 -209756 -164290
868 -164290 -181728 -236506 -190303 -189853 -178485 -168906 -166529 -203861 -200707 -185813 -135489 -198920 -142088
855 -142088 -176107 -225858 -200801 -181313 -223669 -219599 -254887 -230084 -236155 -176356 -192820 -172590
843 -172590 -182698 -187510 -180182 -188239 -224976 -190405 -214321 -201082 -148714 -198216 -200451 -225576 -198629
830 -198629 -206119 -258499 -200148 -206231 -192749 -178367 -221257 -213971 -189098 -239256 -176795 -212866
818 -212866 -207624 -201121 -192225 -212163 -243688 -214238 -209615 -266426 -168134 -202511 -164383 -187806 -190062
805 -190062 -224186 -200061 -242833 -205774 -170901 -168133 -205739 -175928 -244074 -135821 -202137 -215761
793 -215761 -170007 -225776 -151422 -186089 -222602 -222696 -216573 -184173 -251427 -257084 -221713 -228689 -187190
780 -187190 -226612 -166530 -195556 -191401 -225954 -199592 -220838 -168941 -161170 -176932 -174999 -206727
768 -206727 -174688 -213092 -192409 -204677 -213086 -190702 -185358 -179937 -208201 -220642 -192229 -169659
756 -169659 -203355 -193900 -201677 -202607 -180817 -184832 -126143 -220060 -188124 -192198 -202519 -187299 -198616
743 -198616 -239108 -167226 -168028 -211464 -202138 -192249 -248083 -213176 -189375 -162968 -175569 -211398 -170942
730 -170942 -175173 -175577 -188235 -227588 -240243 -266982 -161021 -155282 -245051 -145760 -200218 -261905
718 -261905 -174557 -188348 -212944 -180889 -255719 -170141 -183439 -227274 -152805 -189650 -161856 -198838
706 -198838 -191239 -164487 -201365 -202992 -235473 -187804 -233249 -240886 -146391 -196285 -196562 -190832 -204228
693 -204228 -199817 -163411 -190539 -196608 -174537 -198047 -193944 -181506 -225020 -230836 -220698 -179189 -215897
680 -215897 -183466 -199047 -199708 -227713 -208116 -216180 -193750 -228855 -225084 -216914 -215078 -161302 -175123
667 -175123 -187799 -223529 -161951 -206666 -216993 -215562 -179911 -202956 -190746 -186577 -208208 -191725
655 -191725 -219779 -166984 -208237 -150438 -165450 -193132 -217679 -167802 -192449 -178090 -179104 -232005
643 -232005 -218974 -199629 -152877 -196220 -228721 -215175 -242864 -208985 -222656 -179385 -185902 -205344
631 -205344 -237915 -207515 -197766 -202293 -141458 -165591 -193193 -192303 -163589 -151161 -162722 -224733 -175203
618 -175203 -247417 -225704 -179128 -184701 -236429 -212782 -191414 -242835 -218784 -190527 -198114 -155079
606 -155079 -202818 -207373 -189503 -202751 -197122 -158143 -216068 -192949 -204529 -179741 -212208 -211873 -193511
593 -193511 -197559 -202634 -228533 -210108 -265684 -190480 -152629 -199041 -221701 -203514 -180369 -241137
581 -241137 -221304 -234310 -201743 -205291 -195433 -195409 -175268 -131965 -203043 -211592 -135759 -151516 -162879
568 -162879 -194858 -186529 -188781 -184197 -186014 -122006 -166411 -228759 -230621 -219963 -198671 -174089 -164415
555 -164415 -216932 -168402 -209673 -182707 -233324 -195420 -219377 -187846 -156768 -199505 -217576 -239845
543 -239845 -217762 -195709 -218761 -191789 -213576 -222110 -249506 -216542 -213633 -202924 -242293 -210435
531 -210435 -223688 -198700 -201948 -187072 -187907 -228410 -213433 -171254 -222200 -179287 -221442 -225437 -217652
518 -217652 -239734 -228230 -196995 -214779 -194335 -202005 -160770 -213013 -135438 -160802 -208978 -193126
506 -193126 -207356 -190078 -186520 -170281 -201890 -168442 -151572 -205458 -221658 -191995 -187491 -224680
494 -224680 -206222 -197610 -217988 -191973 -213335 -198698 -252544 -175204 -250678 -196079 -178608 -169815
482 -169815 -204259 -229133 -168975 -209301 -208817 -172414 -183710 -212232 -154757 -228094 -261897 -213972
470 -213972 -197153 -186898 -212843 -210939 -150691 -217998 -170684 -189588 -222726 -224880 -220317 -196383
458 -196383 -191695 -200568 -218062 -157817 -157999 -201069 -156684 -153926 -169935 -201211 -207566 -204980 -172572
445 -172572 -181479 -187846 -167352 -161913 -245030 -196432 -191963 -235101 -193426 -151590 -239083 -207958 -189533
432 -189533 -229439 -191728 -218490 -162647 -205712 -213304 -223894 -205515 -208834 -198177 -232386 -213258
420 -213258 -210456 -217634 -179858 -168411 -133854 -247304 -156228 -189309 -214487 -202934 -199811 -177193
408 -177193 -205600 -190700 -192596 -202877 -226118 -236274 -207671 -167056 -210797 -173717 -131230 -182413
396 -182413 -217618 -203499 -216559 -163874 -202883 -237345 -177043 -242526 -197222 -230178 -215453 -174829
384 -174829 -205678 -217029 -205442 -213158 -147553 -185068 -225432 -196849 -249515 -187165 -255596 -204571
372 -204571 -173372 -174932 -201212 -195994 -214557 -262407 -186987 -264074 -158935 -204997 -239922 -212918
360 -212918 -219231 -195784 -253210 -200406 -187168 -218151 -161549 -204976 -192580 -186576 -172969 -204750
348 -204750 -205334 -160283 -188486 -229300 -211900 -184179 -205658 -172088 -195090 -159483 -253482 -239877
336 -239877 -214973 -210052 -255490 -171965 -191314 -193946 -208009 -196071 -213331 -187564 -235519 -195162
324 -195162 -199249 -198219 -210230 -206230 -254933 -190280 -150709 -164193 -147687 -190414 -193054 -183058 -166933
311 -166933 -177826 -190134 -183391 -196238 -170696 -252889 -232617 -176372 -238234 -175994 -185291 -235331
299 -235331 -196106 -210756 -197547 -179846 -221553 -215513 -191469 -166001 -218979 -206139 -184135 -185777
287 -185777 -203111 -190795 -192973 -204051 -196628 -111728 -238826 -179189 -212474 -226006 -208268 -208829
275 -208829 -183850 -135755 -243838 -164855 -233213 -184102 -175563 -196503 -234685 -193394 -177961 -191541
263 -191541 -195162 -200149 -211203 -177918 -223309 -188747 -199230 -233923 -192389 -212761 -186258 -205223
251 -205223 -179568 -219395 -195443 -210821 -244070 -196277 -210108 -197072 -243345 -191268 -216610 -214745
239 -214745 -157089 -172772 -173279 -204421 -177311 -227314 -201099 -186129 -221246 -172339 -229721 -190080
227 -190080 -179761 -217390 -209216 -195069 -233774 -217307 -169044 -197679 -217092 -176148 -192740 -224553
215 -224553 -242340 -218885 -197426 -199114 -215892 -186617 -217611 -209615 -213787 -200099 -206240 -219086 -203959
202 -203959 -191624 -177623 -209515 -243145 -231099 -216245 -189275 -206641 -183951 -208164 -176937 -249010
190 -249010 -270209 -234770 -223374 -217811 -226286 -192675 -228820 -179332 -232327 -218327 -185168 -211327
178 -211327 -217149 -190570 -209673 -187593 -222126 -214156 -204621 -189707 -244979 -257623 -208293 -196388
166 -196388 -225541 -248852 -220465 -253598 -211774 -189597 -210733 -227551 -206813 -228189 -231007 -206420
154 -206420 -252225 -216570 -228380 -226587 -238117 -240704 -246392 -235568 -261843 -236650 -216683 -261373
142 -261373 -245999 -218169 -223313 -213950 -229299 -271523 -273894 -217182 -269400 -230044 -214842 -225956
130 -225956 -201529 -230942 -218013 -257035 -233311 -240785 -272077 -240418 -214262 -256074 -240528 -225894
118 -225894 -250634 -242896 -267883 -247310 -212245 -230840 -229053 -260096 -224532 -252648 -238682 -291593
106 -291593 -240431 -229687 -243604 -222949 -250753 -234269 -236155 -279283 -243211 -275891 -261967 -251719
94 -251719 -258920 -249363 -252603 -256455 -274698 -270222 -242815 -235116 -257579 -222623 -278017 -249186 -243574
81 -243574 -248766 -251327 -262631 -261813 -283123 -242082 -273989 -273602 -267982 -244660 -293446 -263416 -252457
68 -252457 -264867 -239735 -259157 -264343 -277560 -244235 -282962 -273923 -248960 -292449 -274477 -225083
56 -225083 -260479 -263143 -296128 -247662 -312833 -289309 -292886 -287397 -270044 -268991 -279963 -297600 -250917
43 -250917 -259020 -272431 -257814 -285158 -302240 -283272 -242194 -292209 -244333 -286558 -280412 -303811
31 -303811 -294182 -274521 -301068 -287173 -298037 -289569 -313120 -261972 -310684 -319803 -302072 -331668 -257569
18 -257569 -275495 -306945 -305775 -299162 -293860 -296142 -342455 -300036 -320544 -283445 -326860 -312993 -301289
5 -301289 -338396 -329907 -306858 -319991 -304279
0 -304279
$$ Imaginary data points
##PAGE= N=2
##DATA TABLE= (X++(I..I)), XYDATA
16383 -932054 -915186 -909572 -894185 -898699 -857901 -871674 -832283 -829696 -819950 -788799 -775584 -736353
16371 -736353 -762386 -748373 -717851 -682627 -713500 -681224 -686452 -666173 -617870 -629441 -608461 -622381
16359 -622381 -588666 -562582 -551330 -522475 -557730 -484825 -504214 -481180 -472784 -429652 -423294 -433498
16347 -433498 -419710 -418505 -360993 -371037 -382514 -299609 -330622 -296643 -303026 -299218 -296811 -267599
16335 -267599 -243242 -234593 -229754 -198402 -194606 -210611 -174742 -162059 -109856 -120237 -102034 -137582
16323 -137582 -154236 -95393 -79455 -58107 -64050 -19577 4256 7676 -6806 -15590 -2782 -9274
16311 -9274 63681 59367 73301 99572 107249 110600 71455 132625 119390 181612 132689 177041
16299 177041 173015 202895 210511 241718 222535 242113 238206 269390 291165 268424 302938 302662
16287 302662 305867 315652 332648 367724 391232 400330 378916 365471 449547 456505 457666 431024
16275 431024 466161 450647 444770 522060 504597 462743 485750 491807 505409 500226 524406 527099
16263 527099 569820 561269 573515 585506 592585 587451 585683 634386 643014 621471 645714 669662
16251 669662 639777 655763 692694 681639 704164 675108 708809 720038 730608 761058 693470
16240 693470 732013 791780 758607 743771 733985 766657 809759 773101 837414 828408 820420 844983
16228 844983 816284 839140 847685 898320 863671 873592 886340 944183 875959 896532 888469 886068
16216 886068 917810 959641 892443 983462 943324 940882 987162 922977 950033 1014818 972846 990754
16204 990754 956078 1004349 963244 1021103 948687 1006238 1040729 1058382 999419 989222 972538
16193 972538 1004754 1048480 1064221 1027025 1054843 1058753 1134490 1075006 1091783 1097554 1110102 1126389
16181 1126389 1095120 1081407 1096016 1140166 1128334 1144878 1114101 1088091 1192470 1121212 1114651
16170 1114651 1140628 1080845 1157581 1165587 1149229 1189404 1164717 1176649 1165267 1166008 1192941 1176869
16158 1176869 1167463 1147790 1197505 1198620 1184399 1211549 1148702 1184478 1228152 1188397 1193011 1202947
16146 1202947 1164205 1194605 1227788 1215066 1254080 1231020 1244524 1214788 1236401 1233019 1211581
16135 1211581 1214781 1222015 1227480 1232671 1212765 1231381 1278725 1223770 1265852 1273156 1300139 1253807
16123 1253807 1242065 1283129 1302334 1232890 1275473 1295254 1274899 1273024 1269063 1231355 1307469 1267907
16111 1267907 1252521 1251487 1288461 1237759 1303227 1302405 1292954 1272506 1294477 1269788 1314324 1263183
16099 1263183 1270733 1262102 1258589 1325213 1264291 1270741 1252381 1342744 1268340 1294054 1347165 1301131
16087 1301131 1331666 1292043 1254693 1303209 1331181 1307629 1321308 1296136 1346633 1309989 1315139
16076 1315139 1307840 1336738 1300960 1347709 1285010 1314457 1323434 1343944 1294448 1304694 1295067 1314520
16064 1314520 1307975 1337193 1299679 1289388 1267434 1279497 1275815 1291924 1331802 1349648 1291739 1306848
16052 1306848 1323500 1250184 1326174 1326402 1289683 1306760 1353080 1302793 1317018 1408388 1348594 1315734
16040 1315734 1339377 1299586 1327942 1296977 1373525 1354239 1324183 1291205 1328909 1293990 1279838
16029 1279838 1312219 1319653 1281224 1298234 1303104 1333903 1301625 1321907 1338765 1297568 1296923 1333496
16017 1333496 1312298 1294503 1337818 1340240 1297927 1313079 1308946 1271429 1340247 1331766 1313143 1360445
16005 1360445 1356813 1334674 1377169 1333048 1347133 1321807 1383218 1317158 1324866 1286613 1321087 1377190
15993 1377190 1341625 1332689 1316212 1344557 1325768 1330076 1341855 1378171 1299303 1381758 1292371 1353510
15981 1353510 1342487 1402143 1372126 1349122 1337018 1350330 1323507 1376025 1339501 1356463 1362909
15970 1362909 1356474 1347901 1351038 1327896 1409567 1365527 1322369 1323138 1321704 1349703 1317616 1321019 1382430
15957 1382430 1363987 1392456 1380790 1289232 1343103 1328583 1345389 1387836 1342567 1330846 1328361
15946 1328361 1320985 1366522 1369039 1353706 1323005 1370762 1360996 1309648 1367767 1340906 1346628 1332150
15934 1332150 1340681 1361515 1325789 1359104 1356908 1330192 1390684 1383833 1331893 1337936 1369656 1301468
15922 1301468 1309955 1349229 1319864 1367980 1363699 1353378 1314804 1320478 1332363 1348913 1329308 1355143
15910 1355143 1378244 1317198 1329692 1315241 1401601 1308980 1386296 1352866 1350862 1348683 1395359 1302548
15898 1302548 1349390 1326698 1296190 1343765 1375619 1356957 1363272 1339985 1324828 1351412 1361158 1324121
15886 1324121 1364455 1371477 1360910 1350359 1367589 1363196 1371761 1346756 1367861 1359587 1360670 1335790
15874 1335790 1395837 1336615 1411764 1352814 1334554 1338403 1304163 1353572 1368142 1370188 1285783 1304997
15862 1304997 1371154 1370373 1365492 1321823 1338115 1341030 1354951 1376872 1376527 1389375 1356501 1365106 1351968
15849 1351968 1354689 1292314 1370606 1373574 1359279 1364287 1342307 1350458 1319036 1327626 1307819 1317288
15837 1317288 1358332 1355587 1311444 1387754 1344630 1353326 1333245 1353497 1354841 1370323 1355281 1366765
15825 1366765 1339734 1357745 1337028 1304147 1387094 1343639 1354059 1353191 1404621 1326040 1361820 1373238
15813 1373238 1324886 1342114 1313549 1356982 1359091 1360039 1393356 1335341 1319031 1371972 1394089 1324291
15801 1324291 1374286 1380402 1345183 1369696 1398431 1327855 1355064 1322631 1349709 1397248 1338945
15790 1338945 1362381 1378557 1411360 1346905 1415979 1376647 1364204 1375626 1382507 1394936 1375764
15779 1375764 1335512 1397387 1408509 1370681 1330949 1394908 1332574 1353220 1301997 1335322 1376766
15768 1376766 1369797 1361249 1420963 1374937 1368082 1382734 1331114 1373915 1335234 1383879 1369983 1363782
15756 1363782 1365001 1363292 1386482 1341726 1291276 1387981 1381257 1412441 1399697 1396821 1327427 1354402
15744 1354402 1393591 1350974 1395971 1372822 1427420 1315955 1359064 1365460 1351281 1429824 1330795
15733 1330795 1379580 1387776 1359830 1433024 1377767 1397784 1292445 1390905 1378517 1345475 1353279
15722 1353279 1389937 1420643 1402108 1371235 1382086 1341049 1392803 1393100 1386175 1379422 1362424 1355722
15710 1355722 1386214 1358024 1413256 1359584 1377535 1346315 1353472 1409409 1374581 1350463 1370102
15699 1370102 1363203 1375334 1410584 1390120 1353208 1385112 1413776 1384482 1368567 1345555 1383083
15688 1383083 1367375 1402035 1420637 1368486 1380034 1362259 1379960 1354980 1412707 1403476 1367056
15677 1367056 1414711 1358813 1396403 1422390 1368439 1360844 1366492 1387381 1400689 1360307 1362898 1391070
15665 1391070 1369241 1363578 1381949 1352332 1375713 1359578 1441050 1333533 1353149 1373186 1347072
15654 1347072 1372601 1406983 1336716 1390286 1384557 1397739 1378244 1393090 1394243 1423871 1382509 1354959
15642 1354959 1446288 1354560 1357578 1426189 1331530 1393793 1382976 1383268 1368315 1357140 1380544 1402975
15630 1402975 1398767 1355742 1328566 1331443 1331861 1317945 1408811 1436225 1339686 1366340 1392148 1408512
15618 1408512 1386717 1391777 1391675 1386769 1374106 1386233 1384203 1482178 1382331 1430857 1402076 1381339
15606 1381339 1402447 1435933 1371318 1388766 1438466 1388192 1445017 1368091 1385256 1376562 1379196 1371760
15594 1371760 1425094 1369083 1408083 1357476 1402813 1363233 1418449 1385153 1377743 1366718 1375294 1389710
15582 1389710 1436941 1410731 1395833 1391013 1365988 1403185 1413631 1393230 1409380 1394954 1357269
15571 1357269 1399665 1357476 1385201 1384325 1406507 1387707 1377238 1356105 1414933 1388686 1377460 1411373
15559 1411373 1425186 1421766 1382771 1391455 1359667 1393425 1394668 1399289 1372556 1426187 1413557 1368631
15547 1368631 1355803 1348018 1365180 1372012 1399877 1379227 1424862 1390438 1370744 1400901 1442834 1349978
15535 1349978 1349496 1391005 1349382 1400852 1349615 1359631 1399800 1366982 1429034 1372137 1406422 1403270
15523 1403270 1431686 1364438 1453192 1408981 1451124 1411495 1384531 1427606 1441413 1393961 1423997
15512 1423997 1444199 1384084 1407263 1398899 1422945 1405802 1404946 1415916 1411334 1371887 1417225 1356168
15500 1356168 1404691 1380399 1401319 1396687 1408849 1368715 1429301 1404041 1421689 1386696 1394982 1430135
15488 1430135 1411437 1389602 1422098 1423884 1399626 1389109 1376490 1423196 1391891 1406674 1370347
15477 1370347 1414517 1394342 1441919 1385927 1413429 1425400 1403770 1431412 1374099 1351883 1420972
15466 1420972 1414210 1357945 1377766 1394367 1394152 1399728 1393108 1408170 1408325 1392518 1394665 1428172 1361629
15453 1361629 1464446 1465736 1411594 1442105 1401060 1409157 1408002 1405243 1399412 1393902 1450680 1392060
15441 1392060 1367983 1453726 1414172 1418376 1405786 1375693 1387162 1409980 1398139 1399659 1386329 1379823
15429 1379823 1411687 1433985 1407693 1442472 1452321 1441441 1388727 1456834 1401824 1426155 1428368 1407758
15417 1407758 1439740 1392747 1460984 1432960 1451228 1363892 1377341 1430507 1392934 1429379 1433066
15406 1433066 1410458 1417602 1332144 1400776 1412637 1453775 1448170 1426932 1416734 1449457 1444632 1396112
15394 1396112 1467662 1382985 1419588 1391643 1390001 1450720 1443767 1440328 1408230 1391899 1410963 1430510
15382 1430510 1380161 1402473 1406915 1411450 1418290 1432244 1438612 1368549 1400759 1414270 1436223 1432493
15370 1432493 1449374 1399296 1411805 1398954 1403845 1436871 1429812 1418340 1417520 1412821 1421953 1420242 1441409
15357 1441409 1461446 1412477 1451942 1387429 1422413 1382520 1469685 1420228 1419970 1396726 1388185 1352419
15345 1352419 1399796 1406298 1368280 1464006 1410397 1398475 1447243 1454613 1345215 1442877 1407361
15334 1407361 1383388 1410165 1449559 1427326 1417564 1434014 1455303 1429095 1444788 1443598 1475532 1429828
$$ [...]
##END NTUPLES=NMR SPECTRUM
##END=
