##TITLE=abcd
##JCAMPDX= 6.0         $$ Bruker NMR JCAMP-DX V2.0
##DATA TYPE= NMR SPECTRUM
##DATA CLASS= NTUPLES
##ORIGIN= UXNMR, Bruker Analytische Messtechnik GmbH
##OWNER= root
$$ XWIN-NMR		Version 3.5
$$ Sat Aug  1 16:40:05 2026 Russian Standard Time (UT+4h)  servis@DPX200
##.OBSERVE FREQUENCY= 200.131235884673
##.OBSERVE NUCLEUS= ^1H
##.ACQUISITION MODE= SIMULTANEOUS
##.ACQUISITION SCHEME= undefined
##.AVERAGES= 32
##.DIGITISER RES= 18
##SPECTROMETER/DATA SYSTEM= spect
##.PULSE SEQUENCE= zg
##.SOLVENT NAME= DMSO
##.SHIFT REFERENCE= (INTERNAL, DMSO, 0, 16.4885)
##AUDIT TRAIL= $$ (NUMBER, WHEN, WHO, WHERE, WHAT)
$$ ##TITLE= Audit trail, XWIN-NMR		Version 3.5
$$ ##JCAMPDX= 5.01
$$ ##ORIGIN= Bruker BioSpin GmbH
$$ ##OWNER= servis
$$ F:\spectra/data/av/nmr/H1/1/pdata/1/auditp.txt
$$ ##AUDIT TRAIL=  $$ (NUMBER, WHEN, WHO, WHERE, WHAT)
(   1,<2026-08-01 16:37:28.75 +0400>,<servis>,<DPX200>,
      <created by zg, POWCHK disabled, PULCHK disabled
       configuration hash MD5:
       00 E9 B6 7A A2 85 ED C7 34 08 36 98 17 FE 4E 26
       data hash MD5: 32K
       4D 42 37 4A B7 C6 6E 92 D2 2F 69 49 5E 0C 8C 95>)
(   2,<2026-08-01 16:39:46.17 +0400>,<servis>,<DPX200>,
      <Start of raw data processing
       efp BC_mod = 2 LB = 0.05 FT_mod = 6 PKNL = 1 PHC0 = -413.9518 PHC1 = 3.101563 SI = 16K 
       data hash MD5: 16K
       0D A4 5F 30 03 99 FF B2 08 1C 2A 9B E2 2B 41 A5>)
$$ ##END=
$$ 
$$ hash MD5
$$ BB 68 48 27 4C D3 9E 07 B1 63 CD 47 44 8D 4B 4E
##$RELAX= 
##$RELAX= 
##$RELAX= 
##$RELAX= 
##$RELAX= 
##$RELAX= 
##$RELAX= 
##$RELAX= 
$$ Bruker specific parameters
$$ --------------------------
##$DU= <F:\spectra>
##$EXPNO= 1
##$NAME= <H1>
##$PROCNO= 1
##$TYPE= <nmr>
##$USER= <av>
##$AMP= (0..31)
100 100 100 100 100 100 100 100 100 100 100 100 100 100 100 100 100 100 
100 100 100 100 100 100 100 100 100 100 100 100 100 100 
##$AQSEQ= 0
##$AQ_mod= 1
##$AUNM= <au_zg>
##$AUTOPOS= <>
##$BF1= 200.13
##$BF2= 200.13
##$BF3= 200.13
##$BF4= 200.13
##$BF5= 500.13
##$BF6= 500.13
##$BF7= 500.13
##$BF8= 500.13
##$BYTORDA= 1
##$CFDGTYP= 0
##$CFRGTYP= 5
##$CHEMSTR= <none>
##$CNST= (0..31)
1 1 145 1 1 1 1 1 1 1 1 1 1 1 1 1 1 1 1 1 1 1 1 1 1 1 1 1 1 1 1 1 
##$CPDPRG= <>
##$CPDPRG1= <>
##$CPDPRG2= <>
##$CPDPRG3= <>
##$CPDPRG4= <mlev>
##$CPDPRG5= <mlev>
##$CPDPRG6= <mlev>
##$CPDPRG7= <mlev>
##$CPDPRG8= <mlev>
##$CPDPRGB= <>
##$CPDPRGT= <>
##$D= (0..31)
0 2 0 0 0 0 0 0 0 0.06 0 0 0 0 0 0 0.0002 0 0 0 0 0 0 0 0 0 0 0 0 0 0 
0 
##$DATE= 1785587848
##$DBL= (0..7)
120 120 120 120 120 120 120 120 
##$DBP= (0..7)
150 150 150 150 150 150 150 150 
##$DBP07= 0
##$DBPNAM0= <>
##$DBPNAM1= <>
##$DBPNAM2= <>
##$DBPNAM3= <>
##$DBPNAM4= <>
##$DBPNAM5= <>
##$DBPNAM6= <>
##$DBPNAM7= <>
##$DBPOAL= (0..7)
0.5 0.5 0.5 0.5 0.5 0.5 0.5 0.5 
##$DBPOFFS= (0..7)
0 0 0 0 0 0 0 0 
##$DE= 6
##$DECBNUC= <off>
##$DECIM= 32
##$DECNUC= <off>
##$DECSTAT= 4
##$DIGMOD= 1
##$DIGTYP= 9
##$DL= (0..7)
0 120 120 120 120 120 120 120 
##$DP= (0..7)
150 150 150 150 150 150 150 150 
##$DP07= 0
##$DPNAME0= <>
$$ [...]
##$SUBNAM4= <"">
##$SUBNAM5= <"">
##$SUBNAM6= <"">
##$SUBNAM7= <"">
##$SUBNAM8= <"">
##$SUBNAM9= <"">
##$SW= 20.6817932712277
##$SWIBOX= (0..15)
0 0 3 0 0 0 0 0 0 0 0 0 0 0 0 0 
##$SW_h= 4139.07284768212
##$TD= 32768
##$TD0= 1
##$TE= 0
##$TE2= 300
##$TE3= 300
##$TEG= 300
##$TL= (0..7)
0 120 120 120 120 120 120 120 
##$TP= (0..7)
150 150 150 150 150 150 150 150 
##$TP07= 0
##$TPNAME0= <>
##$TPNAME1= <>
##$TPNAME2= <>
##$TPNAME3= <>
##$TPNAME4= <>
##$TPNAME5= <>
##$TPNAME6= <>
##$TPNAME7= <>
##$TPOAL= (0..7)
0.5 0.5 0.5 0.5 0.5 0.5 0.5 0.5 
##$TPOFFS= (0..7)
0 0 0 0 0 0 0 0 
##$TUNHIN= 0
##$TUNHOUT= 0
##$TUNXOUT= 0
##$USERA1= <user>
##$USERA2= <user>
##$USERA3= <user>
##$USERA4= <user>
##$USERA5= <user>
##$V9= 5
##$VALIST= <valist>
##$VCLIST= <CCCCCCCCCCCCCCC>
##$VD= 0
##$VDLIST= <DDDDDDDDDDDDDDD>
##$VPLIST= <PPPPPPPPPPPPPPP>
##$VTLIST= <TTTTTTTTTTTTTTT>
##$WBST= 1024
##$WBSW= 30
##$XGAIN= (0..3)
0 0 0 0 
##$XL= 0
##$YL= 0
##$YMAX_a= 225431
##$YMIN_a= -321052
##$ZGOPTNS= <>
##$ZL1= 120
##$ZL2= 120
##$ZL3= 120
##$ZL4= 120
##$ABSF1= 0
##$ABSF2= 0
##$ABSG= 0
##$ABSL= 0
##$ALPHA= 0
##$AQORDER= 0
##$ASSFAC= 0
##$ASSFACI= 0
##$ASSFACX= 0
##$ASSWID= 0
##$AUNMP= <proc_1d>
##$AZFE= 0.1
##$AZFW= 0.1
##$BCFW= 0
##$BC_mod= 2
##$BYTORDP= 0
##$COROFFS= 0
##$CY= 18.4799938201904
##$DATMOD= 1
##$DC= 0
##$DFILT= <>
##$DTYPP= 0
##$F1P= 9.9274215381318
##$F2P= -0.165520771350173
##$FCOR= 1
##$FTSIZE= 16384
##$FT_mod= 6
##$GAMMA= 0
##$GB= 0
##$INTBC= 1
##$INTSCL= 4.127829e-11
##$ISEN= 128
##$LB= 0.05
##$LEV0= 0
##$LPBIN= 0
##$MAXI= 10000
##$MC2= 0
##$MEAN= 0
##$ME_mod= 0
##$MI= 50
##$NCOEF= 0
##$NC_proc= -7
##$NLEV= 6
##$NOISF1= 3.799351
##$NOISF2= 2.8
##$NSP= 0
##$NTH_PI= 0
##$NZP= 0
##$OFFSET= 16.48848
##$PC= 4
##$PHC0= -413.9518
##$PHC1= 3.101563
##$PH_mod= 1
##$PKNL= yes
##$PPARMOD= 0
##$PSCAL= 4
##$PSIGN= 0
##$REVERSE= no
##$SF= 200.130005582386
##$SI= 16384
##$SIGF1= 3
##$SIGF2= 2
##$SINO= 400
##$SIOLD= 16384
##$SREGLST= <1H.CDCl3>
##$SSB= 0
##$STSI= 16384
##$STSR= 0
##$SW_p= 4139.07284768211
##$SYMM= 0
##$S_DEV= 0
##$TDeff= 32768
##$TDoff= 0
##$TI= <>
##$TILT= no
##$TM1= 0
##$TM2= 0
##$TOPLEV= 0
##$USERP1= <user>
##$USERP2= <user>
##$USERP3= <user>
##$USERP4= <user>
##$USERP5= <user>
##$WDW= 1
##$XDIM= 16384
##$YMAX_p= 470048805
##$YMIN_p= -1840604
$$ End of Bruker specific parameters
$$ ---------------------------------
##NTUPLES= NMR SPECTRUM
##VAR_NAME=  FREQUENCY,     SPECTRUM/REAL,   SPECTRUM/IMAG
##SYMBOL=    X,             R,               I
##VAR_TYPE=  INDEPENDENT,   DEPENDENT,       DEPENDENT
##VAR_FORM=  AFFN,          ASDF,            ASDF
##VAR_DIM=   16384,         16384,           16384
##UNITS=     HZ,            ARBITRARY UNITS, ARBITRARY UNITS
##FACTOR=    0.252644378177508, 1,           1
##FIRST=     3299.83951724647, 0,            0
##LAST=      -839.233330435636, 0,           0
##MIN=       -839.233330435636, -1840604,    0
##MAX=       3299.83951724647, 470048805,    0
$$ Real data points
##PAGE= N=1
##DATA TABLE= (X++(R..R)), XYDATA
$$ [...]
8868E5715812J05060j946821l032036l637758l965662m315924l989289m010591
8860C0922791k874365k248582k364004j407697j339250l93352j325679l25735
8852A8644127l12376P4245Q6032K86603J119830J117201J723485K407395L365961
8843B8512503L785028M915507M870358L606527L035954J048662j72026j255863
8835D8346650l024173l403042l770682m045139l596804m038184l012373k172319
8827B1283934k597343j626638p33583j122563j003783j292449l24997j140399
8819A1442179n53790k79972j393664L39851o45545j26395m57677n80745n4145
8810G690097o93593l1300p08502k14083j87271Q4334j49800J85157n73629n5586
$$ plain form
8868 55715812 55820872 53874051 50842015 47204257 43238595 38922671 34933382 30922791
8860 30922791 28048426 25799844 23435840 22028143 20688893 20295541 18969862 18644127
8852 18644127 18331751 18405996 18492028 18778631 19898461 21015662 22739147 25146542 28512503
8843 28512503 32297531 37213038 42083396 45689923 48725877 49774539 49602513 48346650
8835 48346650 45322477 41919435 38148753 34103614 30506810 26468626 23456253 21283934
8827 21283934 18686591 17059953 16326370 15203807 14200024 12907575 12582578 11442179
8819 11442179 10888389 10608417 9214753 9554604 8909059 8782664 8324987 7744242 7690097
8810 7690097 6996504 6965204 6256702 6042619 5855348 5939682 5789882 5975039 5401410 5345824
8800E345824Q0801k59357k13962l19107J07430L5238j61557j9832J81746k20920
8790D556304J00662l40738r5647J31500K34888m82995k89537q4689l69128M72000
8780C832620n85412N35855m07747K14836n72473j35539k37106K37122J18477q1027
8770B919606j93095J11308n63582L39779n12297k65571L17942q7229R1941J20260
8760B279062j87049l49331K16726l71695J63946R6396l20526M15970j0750k77449
8750A655300O21k78317M57977j89333J72211m11288K71789p82292J54882J97959
8740A249509O7518N5337k13925J91837m97518K80219j424N4785j92308K6773J3385
8729A034188J76774K1068m41656N43885k51737l86673Q8255K07710m60866M16103
$$ plain form
8800 5345824 5426625 5167268 4953306 4634199 4741629 4776867 4615310 4595478 4777224 4556304
8790 4556304 4656966 4316228 4220581 4352081 4586969 4103974 3814437 3729748 3360620 3832620
8780 3832620 3247208 3783063 3375316 3590152 3017679 2882140 2645034 2882156 3000633 2919606
8770 2919606 2726511 2837819 2274237 2614016 2101719 1836148 2154090 2066861 2158802 2279062
8760 2279062 2092013 1742682 1959408 1587713 1751659 1848055 1527529 1943499 1932749 1655300
8750 1655300 1655921 1377604 1835581 1646248 1818459 1407171 1678960 896668 1051550 1249509
8740 1249509 1317027 1372364 1158439 1350276 852758 1132977 1131553 1186338 994030 1020803 1034188
8729 1034188 1210962 1232030 790374 1334259 1082522 695849 784104 991814 530948 947051
8719I47051j14979J33128K89370n56017N34471o77471M16648m6190j39886j3118
8709G73007M34821j23148K74850p07995L97611j09340m83174P50232j34967l41382
8699G30515K82458k87933l9387k04044J73446K53489K25451N128k68619k04944
8689F65560J84650l68833K02776n0614M51908j58820k58879L29998P076J02124
8679A106946J14009P1438M871J76423L1646L98554j32057j70576M69196r8829
8669A971621J5429k87761K37849P3637l43132k19986K00037j92253k08309l96142
8659H50990L67461j50242r1365j70364j19115K18385J14710n12697J5705M79154
8649A002622o95745M91264j73528j45921k05188L58688n24657K46545K15756k05822
$$ plain form
8719 947051 832072 965200 1254570 698553 1233024 555553 972201 926011 786125 773007
8709 773007 1207828 1084680 1359530 651535 1049146 939806 456632 1206864 1071897 730515
8699 730515 1012973 725040 685653 481609 655055 908544 1133995 1139123 870504 665560
8689 665560 850210 481377 684153 633539 1085447 926627 667748 997746 1004822 1106946
8679 1106946 1220955 1292393 1297264 1473687 1505333 1903887 1771830 1601254 2070450 1971621
8669 1971621 1987050 1699289 1937138 2010775 1667643 1447657 1647694 1455441 1247132 850990
8659 850990 1218451 1068209 976844 806480 687365 905750 1020460 507763 523468 1002622
8649 1002622 306877 798141 624613 478692 273504 632192 107535 354080 569836 364014
8639C64014k86505L75392k07961J24250q0427q3200L52039m39927L43487K60009
8629G21171n02067l58442J89637K51652N0791n4719J5903j27874R4517R9501n10665
8618a30595N69969p48312M53488M31174m19355M61799k22042N2478k49913J55812
8608C54503l87020j23392M17829j98872q6152l79455L15013K72660j74035J91858
8598B02937l04753L75556k27159j46636j09112J80311k11914L20495j81836M09597
8588C07486M1485r1475j90638k87536J22155K69991m7103l17965O27714j64966
8578B69148n7217m41472L04744N6075k67020N93848p7679k54736m26311N33172
8568B32552o0483j93732J86603n4160O5555m31674O24047n91612L47497J03454
$$ plain form
8639 364014 77509 452901 244940 369190 288763 205563 557602 117675 461162 721171
8629 721171 219104 -139338 50299 301951 352742 298023 313926 186052 280569 380070 -130595
8618 -130595 439374 -308938 144550 575724 156369 618168 396126 448604 198691 354503
8608 354503 -32517 -155909 261920 63048 -23104 -402559 -87546 185114 11079 202937
8598 202937 -101816 273740 46581 -100055 -209167 -28856 -240770 79725 -102111 307486
8588 307486 348971 257496 66858 -220678 -98523 171468 124365 -193600 434114 269148
8578 269148 211931 -229541 75203 131278 -135742 458106 380427 125691 -300620 232552
8568 232552 172069 -21663 164940 110780 176335 -255339 368708 -222904 124593 228047
8558B28047K56352p85214K27628K87691j54186m4029K75775o3713l26204N16046
8548D18193j67054k33696r2249K48680k22204L10165K50499m09459n4821j06250
8538e8196J95762j20578Q8429j75389P3265Q9299L7063l84597l73952M15995J406394
8527A193495n48422q14184O40073m228J7432j35253J19641n2718P3464n87413
8517i8113K81622k06667K34520m8895k30343K51943P4311M3997k38318K86844
8507C50901o6091j21103L0275j95946k93693K12769k579j61919L26087k8441l05691
8496b55431K44823n71116L91189L15082l13929M95271k09072K3770l51005M26791
8486A96373o15840M37692o97M5418L08858m18318j86281Q6372k0571k85782K10856
$$ plain form
8558 228047 484399 -300815 -73187 214504 60318 16289 292064 228351 -97853 418193
8548 418193 251139 17443 -74806 173874 -48330 261835 512334 102875 48054 -58196
8538 -58196 137566 16988 105417 -69972 3293 92592 129655 -254942 -628894 -212899 1193495
8527 1193495 645073 -169111 470962 466734 484166 348913 468554 415836 489300 -98113
8517 -98113 183509 -23158 211362 162467 -67876 184067 258378 302375 64057 350901
8507 350901 284810 163707 193982 -1964 -295657 -82888 -85467 -247386 78701 50260 -255431
8496 -255431 -10608 -581724 -190535 124547 -189382 305889 96817 120587 -230418 196373
8486 196373 -419467 18225 17528 62946 371804 -46514 -232795 -146423 -166994 -452776 -241920
8475b41920J97775j96998j07321R5367L16678j95009J72444r1133P2301j63613
8465a41429J10088k04454o8936N94711j26514k61130K71351M5972l7003K47140
8455D29796r3475j80779P9218L39424m5955J05685J45805N0142J28991J56285
8445A115137o36995K94747k36310j96894L11593q62939O42198J65524l8392k41357
8435C16312p7495n85482K28538o7990J01856M1275l3858N203J75125j53767L50617
8424C00334L08421o17334J40638K51081J81101j92405K93392M4095l66786L42533
8414F85070J73735n90900J9210K39021k01783l18766K25648k77339L43045L12816
8404F09757j99339l37929p8655l6126L10080j24697m81513L56976K26186k1469
$$ plain form
8475 -241920 -44145 -241143 -348464 -253097 63581 -131428 41016 -50117 22184 -141429
8465 -141429 -31341 -235795 -304731 289980 163466 -97664 173687 219659 182656 429796
8455 429796 336321 155542 234760 574184 528229 633914 779719 829861 958852 1115137
8445 1115137 478142 772889 536579 339685 651278 -211661 430537 596061 557669 316312
8435 316312 238817 -346665 -118127 -186117 -84261 -42986 -76844 -71641 103484 -50283 300334
8424 300334 608755 -8579 132059 383140 564241 371836 665228 709323 342537 685070
8414 685070 858805 267905 287115 526136 324353 5587 231235 -46104 296941 609757
8404 609757 410418 72489 -6166 -42292 267788 143091 -338422 18554 244740 223271
8394B23271j34811k17574J80943k79959k85805K7380J80072K79267K7460Q6062
8384H6306l96045J77806j03436L1088l5612J91765j10577J9953J87069k90814
8374b42497M92576o43132K72829J80923m53552J76712j98041K2998K61315m2621
8364a72490j11148k10675n156K32931j22693L99353j83310l98757J31663L77206
8354f3076k69785L47069J52535l64663p9317K07326o9569k97483L7830M91926
8344I2793l04335n32550K73232N10975R1918n73279J48855L90374l89181k61175
8334e52373M03294L71347k50530j40601R9308K15902r9349m48733J45967K67499
8324A1731j47530J41956l6487J9742m70420Q8456M26510j40040m06390K62719
$$ plain form
8394 223271 88460 -129114 51829 -228130 -513935 -486555 -306483 -27216 244 86306
8384 86306 -309739 -131933 -235369 -204281 -239893 -48128 -158705 -138752 48317 -242497
8374 -242497 250079 -393053 -120224 60699 -392853 -216141 -414182 -391184 -129869 -172490
8364 -172490 -283638 -494313 -499469 -266538 -389231 10122 -173188 -571945 -440282 -63076
8354 -63076 -332861 14208 166743 -197920 -277237 -69911 -139480 -436963 -399133 92793
8344 92793 -211542 -744092 -470860 40115 132033 -441246 -292391 97983 -291198 -552373
8334 -552373 -149079 222268 -28262 -168863 -69555 146347 46998 -401735 -255768 11731
8324 11731 -135799 6157 -30330 -10588 -481008 -392552 33958 -106082 -512472 -249753
8314b49753m7441P8426j33904j76202M98241J88150o04372k31002J84650J20821
8304c72386K86404j33404J383O62991q14932k82289K91353J8061M7483J44647
8294a50689J84476m43799K19360k72170L97594Q6038k69514O9480j21528K95448
8284e304J21574p07955k8441K43734Q5922p9009J39573n86502N99365k4921m68092
8273g10056N60608l86952M53039j5783j7324Q9924n8157p22751M62478p2594p6730
8262d94298K12100j59798J72375K44839l93014K35930l48344J48618k37352K65454
8252c53490J97990r8980k37703J92300m434j63855J10343N457J30393K29167k12077
8241b04889j36447J83468j37913j86371J91247J10613j50147O236K16261r8750
$$ plain form
8314 -249753 -297194 -218768 -352672 -528874 -30633 157517 -446855 -677857 -493207 -372386
8304 -372386 -85982 -219386 -218003 444988 -369944 -652233 -360880 -342819 -295336 -150689
8294 -150689 33787 -410012 -190652 -462822 -65228 20810 -248704 -179224 -300752 -5304
8284 -5304 116270 -591685 -620126 -376392 -290470 -369479 -229906 -816408 -217043 -241964 -710056
8273 -710056 -149448 -536400 -83361 -99144 -116468 -26544 -84701 -807452 -344974 -417568 -494298
8262 -494298 -282198 -441996 -269621 -24782 -417796 -181866 -530210 -381592 -618944 -353490
8252 -353490 -155500 -254480 -492183 -299883 -304317 -468172 -357829 -352372 -221979 7188 -204889
8241 -204889 -341336 -157868 -295781 -482152 -290905 -180292 -330439 -324203 -107942 -206692
8231b06692K98229k3158k85255R1731j34037j68327k40674p7453L99894o6668
8221d12410J71186l9712J01517l78161j44907J11462J93564j69681K24314N7486
8211b85342R2492p02615J87035J49414l0906P6316M5929N34682l7422m04301l95184
8200g69902K97639N11519l27267J70472m8822m34885k7709j90328n49366K014996
8190F46347m40755L09123r5294p93868K17898j93202N20534l75607j36790K19043
8180a22571n3298j22897m9071M05520j04267k39447r4420J18221l23522L42782
8170b42970n5725M53371r3501K53652o41269k14781K22959k37236N83343l45217
8160c17374N3402K54326j81685M26167l31986j80824R9257j76519q2296P3351
$$ plain form
8231 -206692 91537 68379 -216876 -125145 -259182 -427509 -668183 -745636 -345742 -412410
8221 -412410 -241224 -280936 -179419 -557580 -702487 -591025 -397461 -567142 -342828 -285342
8211 -285342 -192850 -895465 -708430 -559016 -589922 -513606 -467677 67005 29583 -374718 -769902
8200 -769902 -472263 39256 -288011 -117539 -166361 -601246 -628955 -819283 -1368649 646347
8190 646347 205592 514715 419421 -374447 -156549 -349751 170783 -204824 -341614 -122571
8180 -122571 -175869 -298766 -347837 57683 -46584 -286031 -380451 -262230 -585752 -242970
8170 -242970 -298695 154676 61175 314827 -326442 -541223 -318264 -555500 27843 -317374
8160 -317374 -263972 -9646 -191331 234836 -97150 -277974 -178717 -355236 -437532 -364181
8150c64181k4136J15598j99010L92634n8203n38020N46103k66336O4700k18685
8140e49536L99745j56433k09008N11704k60628N299Q9438j14689j68695J7573
8130d35230R5224l28993K59770L90978j02683k42941J26988q1690l63939K46276
8120d36240K22943J6506k35664L2133J28872p0261J47138R2433m77547J97270
8110c82417K65994l01354M6661j75345K9428L74780j89787M3135J49364j13719
8100b53260n19769M56316K28926Q1989m48087M49089n59591Q24668l18090m94349
8090e52158M02140k12206J19541K47792l26223k05104J11526J11771P7947J38544
8080h6430j61351p2055k57237O5201L39649k86911K26242R5694l4700J29118j55283
$$ plain form
8150 -364181 -388317 -272719 -471729 -79095 -137298 -675318 -129215 -395551 -330851 -549536
8140 -549536 -149791 -306224 -515232 -3528 -264156 -258857 -169419 -284108 -452803 -435230
8130 -435230 -340006 -668999 -409229 -18251 -120934 -363875 -236887 -318577 -682516 -436240
8120 -436240 -213297 -196791 -432455 -400322 -271450 -341711 -194573 -102140 -579687 -382417
8110 -382417 -116423 -417777 -371116 -546461 -517033 -142253 -332040 -288905 -139541 -253260
8100 -253260 -773029 -316713 -87787 -5798 -453885 -4796 -564387 260281 -57809 -552158
8090 -552158 -150018 -362224 -242683 5109 -321114 -526218 -414692 -302921 -224974 -86430
8080 -86430 -247781 -319836 -577073 -511872 -172223 -459134 -232892 -137198 -171898 -42780 -198063
8069a98063m21315M38518J11485J83309l70417J24393k21689J94363p8678r9034
8059c37128K1098j47786N21080p78792K48537K16785L50094M3985k91644p3402
8049b27173j23639L75193q0382o1567K66259n22410M84385j72611j03534J644
8039a63835j78046o4783J03213j57578L44749l68031P5645K18655k4470k42524
8029d57005J74465l42085K36241k39050L25081O1085p475m26245M43725J94999
8019c6264j93383k5381j32658J42896r0318K8946J85550k94122j16890K4903J36977
8008c69744J90558k45892k90831K33668L36691q6071k23186K52622l41743r6638
7998f40566M08545l2442J52715j44864j60221K46169p2605j70388m90909Q49286
$$ plain form
8069 -198063 -619378 -180860 -69375 113934 -256483 -132090 -353779 -159416 -238094 -337128
8059 -337128 -316030 -463816 57264 -721528 -472991 -256206 93888 137873 -153771 -227173
8049 -227173 -350812 24381 -56001 -117568 148691 -373719 110666 -61945 -165479 -163835
8039 -163835 -341881 -406664 -303451 -461029 -116280 -484311 -408666 -190011 -214481 -457005
8029 -457005 -282540 -624625 -388384 -627434 -302353 -241268 -248743 -674988 -231263 -36264
8019 -36264 -229647 -255028 -387686 -244790 -335108 -306162 -120612 -414734 -531624 -506721 -369744
8008 -369744 -179186 -425078 -715909 -482241 -145550 -231621 -454807 -202185 -543928 -640566
7998 -640566 -232021 -264463 -111748 -256612 -416833 -170664 -243269 -413657 -904566 -55280
7988e5280n58361L08272L37708q7384k3670P1206n31938j00448k5716L1892M01130
7977b32589l1117l15934L61375j00705j12051j83638K38923o66408K03320L11159
7967e27665j71605K34032K83374j03730O0748k33051N41307p08060J30205l96857
7957h91302P30856m27353J17674m22050K84585J60815L43036o41966n8234O37333
7947a66606j08540j1140l80841p4544M04300n6729L55870k04616P2982j44675
7937c14539O8847n2699k16361L68230J75387o45199M34641j65736M4200P1623
7927b31606k13034l0250J06419J39993k97325k0115j38936L87603j39028k81707
7917g17986K51669k5534l50314K77991L08410m17553L31390R1850j14296L38565
$$ plain form
7988 -55280 -613641 -305369 32339 -55045 -78715 -7509 -539447 -639895 -665611 -633719 -232589
7977 -232589 -263706 -579640 -218265 -318970 -431021 -614659 -375736 -1042144 -838824 -527665
7967 -527665 -699270 -465238 -181864 -285594 -224846 -457897 83410 -624650 -494445 -891302
7957 -891302 -160446 -587799 -470125 -892175 -607590 -446775 -103739 -745705 -803939 -166606
7947 -166606 -275146 -286286 -667127 -741671 -337371 -394100 -38230 -242846 -169864 -314539
7937 -314539 -245692 -298391 -514752 -146522 28865 -616334 -181693 -347429 -303229 -231606
7927 -231606 -444640 -474890 -368471 -228478 -525803 -545918 -684854 -297251 -436279 -717986
7917 -717986 -466317 -491851 -842165 -564174 -255764 -673317 -341927 -250077 -364373 -25808
7907b5808j91262k78071K59471j85396m87420J71556K58663L32065k96867r6561
7897e39630K6012r7764J07183J16814p8082l53638L85338j13682J42843n72033
7887i76639L67776j02838L84068j22066k12079L08008N4046m27901J19924K82699
7877c25002q8246k62558M60415q0035l35372l1254K74504J90461L56048n75733
7867d16772K38187j52907k35884J72164k02098J02599k59119K01584J20648J77449
7857b54149r7139J902867l392183P21905M43589L97323K7356j99130k96733o3529
7847h09823M83067P9690J97105r6509l82190M04551l94205P9320l43881J37777
7837f45098l449J13624R095j83575N31241l8675n61629K60612k1613j87610K07201
$$ plain form
7907 -25808 -217070 -495141 -235670 -421066 -908486 -736930 -478267 -146202 -443069 -539630
7897 -539630 -513618 -611382 -504199 -387385 -465467 -819105 -433767 -547449 -404606 -976639
7887 -976639 -608863 -711701 -327633 -449699 -661778 -353770 -299724 -727625 -607701 -325002
7877 -325002 -413248 -675806 -215391 -295426 -630798 -662052 -387548 -197087 158961 -416772
7867 -416772 -178585 -331492 -567376 -395212 -597310 -494711 -753830 -552246 -431598 -254149
7857 -254149 -351288 1551579 -1840604 -1118699 -675110 -277787 -250431 -449561 -746294 -809823
7847 -809823 -326756 -247066 -49961 -146470 -528660 -124109 -518314 -438994 -782875 -645098
7837 -645098 -648547 -534923 -525828 -709403 -178162 -216837 -778466 -517854 -539467 -727077 -519876
7826e19876J17035L14406l1989m29039K51416l07874J32745l2688K3823j06116
7816e88157J04456j70826L57248N6506m19691k26402L73950k86927P65469q42799
7806h77173O69066m2026j71153K13091o25531p5270O03301l45812L41883n39332
7796h48956N51264k73205J57687l7956n7861M31829p6004m84993K03311m4099
7786d78983k74764O01569p2412K260k31239K8245j15261j31155L599K00958l70496
7775h37679K77117p1963K36283j51836K43039J45006k89401k87140P50735n00471
7765d86310L38163p32489R5209L90756J71390l80026L25153o97692j41582M14972
7755g02456K92564l87836J76774r188K33130q3773J04639J042K77875m08593P4480
$$ plain form
7826 -519876 -402841 -88435 -120424 -549463 -298047 -605921 -473176 -505864 -482041 -588157
7816 -588157 -483701 -654527 -297279 -240773 -660464 -886866 -512916 -799843 -34374 -877173
7806 -877173 -208107 -250133 -421286 -208195 -833726 -908996 -305695 -651507 -309624 -848956
7796 -848956 -297692 -570897 -413210 -451166 -509027 -77198 -153202 -638195 -434884 -478983
7786 -478983 -753747 -152178 -224590 -222330 -453569 -425324 -540585 -671740 -668141 -467183 -837679
7775 -837679 -560562 -632525 -396242 -548078 -305039 -160033 -449434 -736574 14161 -486310
7765 -486310 -148147 -880636 -785427 -394671 -223281 -603307 -278154 -975846 -1117428 -702456
7755 -702456 -409892 -797728 -620954 -630142 -397012 -480785 -376146 -375104 -97229 -505822 -431342
7744d31342m05501O24010m41090Q9100L8892J5614L98700m29123M75021l69939
7734d35658l09845K17043K8798K07191p46138M07693K65673k96898L76202k68885
7724e54824o7539M05123k99234M10057k11621J12478k94264q9998J70021N256
7714d14545m30449O64058J6945q0376k83672N3102j2802P9030l7720j49878P2782
7703e23525K15917r2452q0084r5132r6300J35127j25242j11909N03887k7547J41636
7692a55624M6878m22155j34917K08360l47892J83476J12257O278J27936l14913
7682f90316O1057J72838k10212L457L39439j53170k16283K24411l00499K95760
7672d73518J60390m2985R7294j60049o7958N1906k30860J45209j08276j96325
$$ plain form
7744 -431342 -836843 -212833 -653923 -564823 -525931 -510317 -111617 -540740 -65719 -435658
7734 -435658 -745503 -528460 -499662 -292471 -1038609 -630916 -365243 -662141 -285939 -554824
7724 -554824 -622363 -217240 -516474 -106417 -318038 -205560 -499824 -589822 -419801 -414545
7714 -414545 -844994 -180936 -163991 -244367 -528039 -474937 -487739 -408709 -446429 -596307 -523525
7703 -523525 -307608 -400060 -480144 -575276 -671576 -536449 -661691 -773600 -269713 -297260 -155624
7692 -155624 -108746 -530901 -665818 -457458 -805350 -621874 -509617 -503339 -375403 -690316
7682 -690316 -629259 -456421 -666633 -663176 -323737 -476907 -693190 -468779 -769278 -473518
7672 -473518 -313128 -356113 -258819 -418868 -486826 -434920 -665780 -520571 -628847 -825172
7662h25172M92144j28790P669K78314j57672l60701N10960k57867m9580j00486
7652e91181K86909j73402j06418j33701L44404O9336Q5675m09577M2736N75565
7642i654l99163j82064l71417P4350M20110o2754j76047L22980n84381N54056
7632d13984q317l64718K19146P5965k47821M4504N2378j10348J88242L55332q43287
7621a052908Q30122n45420o0892J08951O8326M87091k82122L69470m70689K40152
7611c07919j00841k07199R7553r7862j00350O37705l51148k60262L89958l91505
7601f91870J4560n14M22522m02223K11636N3757j91310l0828J18053j64560J60861
7590d99916Q3151j31278K56239l27918L12690l73672J34929K3292L08622j82652
$$ plain form
7662 -825172 -333028 -461818 -454149 -175835 -333507 -694208 -183248 -441115 -490695 -591181
7652 -591181 -304272 -477674 -584092 -717793 -373389 -304053 -218378 -627955 -585219 -9654
7642 -9654 -408817 -590881 -962298 -887948 -467838 -530592 -706639 -383659 -968040 -413984
7632 -413984 -422301 -787019 -567873 -491908 -739729 -695225 -642847 -753195 -564953 -209621 -1052908
7621 -1052908 -222786 -768206 -829098 -720147 -651821 -164730 -446852 -77382 -548071 -307919
7611 -307919 -408760 -615959 -518406 -616268 -716618 -78913 -430061 -690323 -300365 -691870
7601 -691870 -677310 -677824 -255302 -657525 -445889 -392132 -583442 -614270 -496217 -660777 -499916
7590 -499916 -416765 -548043 -291804 -619722 -307032 -680704 -545775 -522483 -213861 -396513
7580c96513K90438m4987m7413q3802n43526J59409M27849o87650M54385M5094
7570d26716k48279O22390l73844j5369J04329k30845k08442M08310j2176j11054
7560d91696o1636l1624J21280r3890k74643L00810J93641k69412J31594m6153
7550e21729K30330k90371j66791K92628j205j33452k49691M68353k30980m84980
7540a087888P80999n3356M6377k41277K08497J15330l51781j2497J25772k86372
7530g56196K96128j25659K32596o84250P62335m68187N27997p4369k27940K23288
7520b94257l86922N61318J24357o67989M78379k96433J59066q5515J76525K31
7510b31240j78575j60597L73069m94642J50229L6130K82456l34826L54026l22002
$$ plain form
7580 -396513 -106075 -151062 -198475 -282277 -825803 -666394 -238545 -926195 -471810 -426716
7570 -426716 -674995 -52605 -426449 -441818 -337489 -568334 -776776 -368466 -380642 -491696
7560 -491696 -553332 -584956 -463676 -557566 -832209 -531399 -337758 -607170 -475576 -521729
7550 -521729 -291399 -581770 -748561 -455933 -457138 -590590 -840281 -371928 -602908 -1087888
7540 -1087888 -306889 -360245 -313868 -555145 -346648 -231318 -583099 -595596 -469824 -756196
7530 -756196 -460068 -585727 -353131 -1037381 -275046 -743233 -215236 -289605 -517545 -294257
7520 -294257 -681179 -119861 4496 -663493 -185114 -481547 -322481 -407996 -231471 -231240
7510 -231240 -409815 -570412 -197343 -691985 -541756 -505626 -223170 -557996 -203970 -525972
7500e25972J72503j51619q812J77801p9860M3557m51775L15545j18522j73138
7490h00292L09435j26665j15247N1153P9779n0501o3363j44598k72107L06699
7480h25707L47559J88247J08656R4797k88322m75734K50449l6385K58341n0034
7470d28133j61470j32775J57688j00890k00987M77249j27998J30124k28752J63619
7460d52325n1167M00935l61722L16660o32684K61497j20678K99219L55822m58522
7450d42965n3354j13131P3702K8575J19247L31260m38185j84273K2083K20104
7440d36937N62835n21900J99454l04966j93484L08802L46119l38431l22262M11244
7430b89526m73843N78408k26044J71427N7369k68727k66830N6063J06843l6843
$$ plain form
7500 -525972 -353469 -505088 -513900 -336099 -415959 -372402 -824177 -508632 -627154 -800292
7490 -800292 -490857 -617522 -732769 -681616 -601837 -652338 -715701 -860299 -1132406 -825707
7480 -825707 -478148 -289901 -181245 -86448 -374770 -850504 -600055 -636440 -378099 -428133
7470 -428133 -589603 -722378 -564690 -665580 -866567 -389318 -517316 -387192 -615944 -452325
7460 -452325 -503492 -102557 -464279 -147619 -780303 -518806 -639484 -340265 15557 -442965
7450 -442965 -496319 -609450 -535748 -507173 -387926 -56666 -494851 -679124 -657041 -436937
7440 -436937 125898 -396002 -196548 -501514 -694998 -386196 -40077 -378508 -700770 -289526
7430 -289526 -763369 -184961 -411005 -239578 -182209 -450936 -717766 -661703 -554860 -591703
7420e91703K93275k74258K3711o0347N23870j51895k48118j28924J43430l3682
7410e04641J78357l69845M86552k54677P6465p673P4870O9526l26966l31597L66675
7399e42954M35056o12591M03148K26910k24818k05527m8907K00488R7080m01234
7389f73349J29053r9336L22516l18066J15023L16562q5908p3964J66207m89111
7379f90373N1256L23014j488k30581L39857m82624K28072L50674j3103o19712
7369g45008Q35330l12552j51720j44781j51597L73141p1002l52942N87384j91133
7359c24880J05535R063p0947p4331l6137K75670p5916j31922l10595K75239j34045
7348d93266k1292l4089L45837l11979m3406M53910J2425j61266n585m08548K44895
$$ plain form
7420 -591703 -298428 -572686 -548975 -609322 -85452 -237347 -485465 -614389 -470959 -504641
7410 -504641 -326284 -696129 -209577 -464254 -387789 -395462 -320592 -251066 -578032 -909629 -542954
7399 -542954 -107898 -720489 -317341 -90431 -315249 -520776 -569683 -369195 -272115 -673349
7389 -673349 -544296 -643632 -321116 -639182 -524159 -207597 -293505 -367469 -201262 -690373
7379 -690373 -639117 -316103 -317591 -548172 -208315 -690939 -462867 -112193 -125296 -745008
7369 -745008 90322 -222230 -373950 -518731 -670328 -297187 -368189 -721131 -133747 -324880
7359 -324880 -219345 -210282 -281229 -355560 -391697 -116027 -191943 -323865 -634460 -359221 -493266
7348 -493266 -514558 -548647 -202810 -514789 -558195 -104285 -91860 -253126 -258711 -667259 -422364
7337d22364J98349o47175Q49207k35349R2052j69182N4372Q9341l47088K88021
7327b49816r0385J02274n61930L35662k12281M66326j30152J9442j79694K42502
7317b58052j81228n2473P1178K8032K79607J24462n80555J41891K32883m9459
7307b43714m41895K48119l19817O72056l06944R8792j1019k8453j97874j2668
7297e43417M20258k28589m57213M82450k43968K31484k69868K70766N3076J5419
7287b69602m89430k60763L40676L72102N4745L0848J43564j63328L00207m36191
7277c77172J31265k52411M84582n46470J43570M8389j93510R5137K28533k09730
7267d47817L97145l16009K15917n66498K30854j32719L02254j54586m5854m0155
$$ plain form
7337 -422364 -224015 -871190 -21983 -257332 -165280 -334462 -280090 -190749 -537837 -249816
7327 -249816 -340201 -237927 -799857 -464195 -676476 -210150 -340302 -320860 -500554 -258052
7317 -258052 -439280 -491753 -420575 -392543 -112936 11526 -569029 -427138 -194255 -243714
7307 -243714 -685609 -437490 -757307 -85251 -392195 -293403 -304422 -332875 -530749 -543417
7297 -543417 -123159 -351748 -808961 -326511 -570479 -338995 -608863 -338097 -285021 -269602
7287 -269602 -759032 -1019795 -679119 -307017 -252272 -221424 -77860 -241188 59019 -377172
7277 -377172 -245907 -498318 -13736 -560206 -416636 -368247 -561757 -466620 -238087 -447817
7267 -447817 -50672 -366681 -150764 -717262 -486408 -619127 -316873 -471459 -517313 -557468
7257e57468L88975J46620j84327m6212O8765k04332k5114J92538M7754m07420
7247e80221L34799l13311O79594m25182k10161N51649m74132L18545m26086P09409
7237A64903q59304P69047o85344n9223N0485q364L30561j93246L66126O6019l56058
7226d14398L21121K34374m17401K67254M20848n21500m02049M18728J32482m05797
7216c66338K05121k47264J08761J07986j2887J47378l55230P1304K42562k20908
7206c19515K48677J54867L2151l65218K62961n8442j71077L65236l06131K52381
7196I5890j34411q7875L04428O6110m9264l33169k0285L08239J40045n39744K2604
7185b27432L39523j71182q3029J14326l90460N40738M5116N1771l890L40782l41624
$$ plain form
7257 -557468 -168493 -21873 -206200 -252412 -183647 -387979 -413093 -220555 -172801 -580221
7247 -580221 -245422 -558733 120861 -304321 -514482 37167 -436965 -118420 -544506 164903
7237 164903 -694401 74646 -610698 -669921 -619436 -627800 -297239 -490485 -124359 -58340 -414398
7226 -414398 -93277 141097 -276304 -9050 411798 -109702 -511751 -93023 39459 -366338
7216 -366338 -161217 -408481 -299720 -191734 -204621 -57243 -412473 -341169 -98607 -319515
7206 -319515 -70838 84029 116180 -249038 13923 -44519 -215596 149640 -156491 95890
7196 95890 -38521 -126396 178032 244142 194878 -138291 -158576 149663 289708 -250036 -227432
7185 -227432 112091 -59091 -142120 -27794 -418254 122484 167600 219371 215481 556263 214639
7174B14639k13366k22738o0573K02370N6074M74187j1932m04045m28673J66485
7164b27572m0360J14187N8875R4439j80408M471o9472k2777J32797K0067j35592
7153b51345k36297J89961L91953l80798o3781N44683k16241m4808k87207j39949
7143d93829M24441j02633K72967p80833M54078P5833l89069J96837P8617Q0618
7133a82973l29989L90842k88117L0493p7327R2839K40355o21891M93198J34331
7123a18239p83k97739K4015l39829n8091K04989j35916P05329M6668n50285J30541
7112c89340o0228K35884r7545l8694j38267q6680L21124m58536M00709M14453
7102A02880j95953j67015q20L2497j18313q3776r6768J64719m7576k83432K42132
$$ plain form
7174 214639 1273 -221465 -282038 -79668 -23594 450593 438661 34616 -394057 -227572
7164 -227572 -267932 -153745 -94870 -431 -180839 -176368 -245840 -268617 -135820 -115753 -251345
7153 -251345 -487642 -297681 94272 -286526 -350307 194376 -21865 -66673 -353880 -493829
7143 -493829 -69388 -172021 100946 -679887 -225809 -149976 -539045 -342208 -263591 -182973
7133 -182973 -512962 -122120 -410237 -379744 -457071 -364232 -123877 -745768 -252570 -118239
7123 -118239 -119022 -416761 -392746 -732575 -790666 -585677 -721593 -16264 30404 -519881 -389340
7112 -389340 -449568 -213684 -311229 -349923 -488190 -574870 -253746 -712282 -311573 102880
7102 102880 -93073 -260088 -260908 -228411 -346724 -430500 -527268 -362549 -410125 -693557 -451425
7091d51425k9099O0259k37026L7302K73850M47047q77862K4179M28720k65876
7081e89931M00804n23929L15104j81600l38233M18022K64425m13965p641K9626
7071f27318J97235K45425p48586N61076Q2556l64975L46520k7066k70395L64283
7061b41245k03594J46506R6710j92678K6632k83436L33169K32576l13072j02253
7051e00685L0204J5125m591J67069k299l5824j75045j51618L37091k1231j73561
7040e15365j29923L8139L45015k83437j21145P6172r397N12572m31141k877Q1002
7029d40385n2711k6061J46325L96436n74974P142j69377L24935j96361j11389
7019f96420l2807M03325p4421M85701n09893k06570K19767j35334K71331p4628
$$ plain form
7091 -451425 -480524 -420265 -657291 -619989 -346139 100908 -776954 -752775 -324055 -589931
7081 -589931 -189127 -713056 -397952 -579552 -917785 -499763 -235338 -649303 -656944 -627318
7071 -627318 -430083 -184658 -933244 -372168 -289612 -654587 -308067 -335133 -605528 -241245
7061 -241245 -444839 -298333 -201623 -394301 -367669 -651105 -317936 -85360 -398432 -500685
7051 -500685 -470481 -455356 -459947 -292878 -295177 -331001 -506046 -657664 -320573 -341804 -515365
7040 -515365 -645288 -607149 -262134 -545571 -666716 -590544 -599941 -87369 -518510 -521387 -440385
7029 -440385 -493096 -519157 -372832 23604 -551370 -544228 -713605 -388670 -585031 -696420
7019 -696420 -729227 -325902 -400323 85378 -424515 -631085 -411318 -546652 -275321 -349949
7009c49949J71479m18219L0111N7770P7768L26122o05238R9056R3932K05350j63278
6998d75096K79178l44093L42857r2629m43220R5115L45189L1954J88676n58714
6988f30783m0775J60318k5290k25202P18499j6281n45855L32656j19744K68730
6978a23727O4876K4434k46843j61891J74724J38540l17089K54722R7755r3547
6968a88046k75215m61024L74009P33698j87388K18333o62333J06972q347M5713
6958c03628L91551n97980P60836m02144O2361j23267j61688M86923j23629j34536
6948a45201N0847R2807j73669r6818L8500N0801K13810k61195O478Q24L00691
6937G7875k23608O0015M419j6555J53768l49428M01145N3306J3975M06367n82945
$$ plain form
7009 -349949 -178470 -596689 -566578 -508808 -431040 -104918 -710156 -611100 -517168 -311818 -475096
6998 -475096 -195918 -540011 -197154 -289783 -733003 -637888 -292699 -260745 -72069 -630783
6988 -630783 -671558 -511240 -536530 -761732 -43233 -59514 -605369 -272713 -392457 -123727
6978 -123727 -58851 -34417 -281260 -443151 -268427 -129887 -446976 -192254 -94499 -188046
6968 -188046 -463261 -924285 -550276 183422 -3966 214367 -447966 -340994 -349341 -303628
6958 -303628 87923 -510057 250779 -151365 -89004 -212271 -373959 112964 -10665 -145201
6948 -145201 -94354 -1547 -175216 -272034 -233534 -182733 31077 -230118 -223640 -222816 77875
6937 77875 -145733 -85718 -81299 -97854 55914 -293514 107631 160937 174912 581279 -1666
6926a666l06802J31069J32695j38779L23934q339j84874k18585K89247n77838
6916e59938P20834l81692J43385R0682K39772L3112l42237l0925N4263r9012L12539
6905A80783k50117R6269K5734j7306r9546j98610j57394K01865K90257N16549
6895E88484m26777O1383m82050J21566l4288j88485J60505j81274j58196j03842
6885f42974M40939J05768k17783j42691q9059J49834L2482J64024j30578J63031
6875a67007j05270j04310Q5098M63730k69635j73033R3666K41585k18931K74520
6865A20413m68442K67117O6006m5062l86521J48380J86875K23042n52942M54183
6855A3049j76334j15034L816K75204j18553K76326k05903J89504l88469K31515
$$ plain form
6926 -1666 -308468 -177399 -44704 -183483 140451 132112 -52762 -271347 17900 -559938
6916 -559938 160896 -220796 -77411 13271 253043 286155 -56082 -87007 -32744 -131756 180783
6905 180783 -69334 26935 52669 35363 -64183 -262793 -420187 -218322 71935 588484
6895 588484 161707 223090 -258960 -137394 -171682 -360167 -199662 -380936 -539132 -642974
6885 -642974 -202035 -96267 -314050 -456741 -545800 -395966 -363484 -199460 -330038 -167007
6875 -167007 -272277 -376587 -291489 172241 -97394 -270427 -176761 64824 -154107 120413
6865 120413 -348029 -80912 -14906 -59968 -446489 -298109 -111234 111808 -441134 13049
6855 13049 -163285 -278319 -274503 701 -117852 158474 -47429 142075 -246394 -14879
6845a4879P7631J1576k04058J31904J43891J01410l49601M57463l60166O0443
6835E5614j71470J93985o5196l00076J46571K06891P4265P228k67595L79086k84510
6824b5207j98121J21870L89836p5054j75007M9196k06840K42466p6659k5712J06200
6813A26968Q9128k27217L37766l15639J85546P4900J52195r2958l80113L84430
6803C35006r753l68420k0120L92338L47676k02063J59553j94346j0266L0785n21994
6792f1604M32600j69627K78578O12272l49889l32873n6250J69887k44195J32764
6782D11663J04906N3892J82690m7441l16153M22005k2883J95085N9899n46343
6772D97320L08697j65973L33502m79863k8579L4001L71678m03898L91595k57492
$$ plain form
6845 -14879 62752 74328 -129730 2174 146065 247475 -102126 355337 -4829 55614
6835 55614 -115856 78129 12933 -287143 -140572 66319 140584 147812 -119783 259303 -25207
6824 -25207 -223328 -101458 288378 213324 38317 87513 -119327 123139 46480 20768 126968
6813 126968 216096 -11121 326645 11006 196552 271452 423647 330689 -49424 335006
6803 335006 325253 -43167 -63287 329051 676727 474664 634217 439871 429605 460390 -61604
6792 -61604 370996 201369 479947 1092219 742330 409457 353207 523094 278899 411663
6782 411663 516569 570461 753151 705710 389557 811562 788679 983764 1043663 497320
6772 497320 806017 640044 973546 493683 465104 499105 870783 466885 858480 600988
6762F00988J98018j08099M33227n90882j24334N12553J52849l14706L93325j61212
6752I91727K2691r7823j83960R9701P11343m33700p7053J85532J36365J37618
6742A492441n65881O38251N9213m37364M80478r4310J67997m75507K74625J94064
6732A734007M04065k18145l30424n0861N84923K95791n12985K17030M12238k50141
6722B285498o156L29656m51832Q8545M68868k22819M84640j78224Q2023k09312
6712B670887J53264L32622M3819k7725O3520N87604l86930N32257m34652K27617
6702C762283R5866J3364L25033J49435j53014M1061J04308L06380j58951J92399
6692D678164O76685j52249M5382M1372J37219j34334k3473K15224K46110J82513
$$ plain form
6762 600988 799006 690907 1124134 533252 408918 921471 1074320 759614 1152939 991727
6752 991727 1014418 916595 732635 832336 1543679 1109979 1032926 1218458 1354823 1492441
6742 1492441 926560 1564811 1624024 1186660 1667138 1572828 1740825 1265318 1539943 1734007
6732 1734007 2138072 1919927 1589503 1538642 2123565 2419356 1906371 2123401 2535639 2285498
6722 2285498 2279342 2608998 2157166 2245711 2714579 2491760 2976400 2798176 2880199 2670887
6712 2670887 2824151 3156773 3200592 3172867 3236387 3823991 3437061 3969318 3534666 3762283
6702 3762283 3858149 3871513 4196546 4345981 4192967 4234028 4338336 4644716 4485765 4678164
6692 4678164 5354849 5202600 5247982 5289354 5426573 5292239 5268766 5483990 5730100 5912613
6682E912613O6842J87696K65554j64825K54475L1054O02600K08580j52720N26753
6672G738622l40612J90062L84442L86066O51425n05196L34328M09984J13161Q9518
6662I451800N00704L29570L6395k63129M34749M64321J04372N71252K27892M17365
6652A2275291k55586N27110L41991L16200K70766L94579j23136J76770L50532
6643A4274517N18556L19335L01020K62668R84257M74128P5499K24841M21176K46840
6633A8102837P15234l7028j77682M98382J4308k96703J002479m29307K12265k8984
6623A9575801J41415L52249j0468O3828K33834M69946j21025L53316R9766O23573
6613B1782235k80091K70290j0777j69180O8603K41182J24526r9492m05819O26386
$$ plain form
6682 5912613 5979455 6167151 6432705 6267880 6522355 6553409 7156009 7364589 7211869 7738622
6672 7738622 7398010 7588072 7972514 8358580 9010005 8504809 8839137 9249121 9362282 9451800
6662 9451800 9952504 10282074 10318469 10055340 10490089 10954410 11058782 11630034 11857926 12275291
6652 12275291 12019705 12546815 12888806 13205006 13475772 13870351 13747215 13923985 14274517
6643 14274517 14793073 15112408 15413428 15676096 16660353 17134481 17209980 17434821 17855997 18102837
6633 18102837 18818071 18781043 18603361 19101743 19116051 18819348 19821827 19392520 19604785 19575801
6623 19575801 19717216 20069465 20058997 20122825 20356659 20826605 20705580 21058896 21158662 21782235
6613 21782235 21502144 21772434 21761657 21592477 21661080 21902262 22026788 21927296 21521477 22147863
6603B2147863q7239J3988j09135k51801J73091N5971M85217k01452j96246j97246
6593B1833011J6165J58063k20575n45880k71866M08930l45376K54514Q0060n42423
6583B0824623J8771j4588j037631L68435j76029j93925m57177O71k56705l86601
6573A8689844l0939k11393K1870k0163n35313p90461M30518m04519l37007j1294
6563A6801143j39501m25656M6897n85628j82427M02689n24425k27156m55174r4191
6553A4616571n95778L81633l03530q758o67562J72769l05903q0231j28910o80734
6543A2399567L17816L19409k90534m73982j07270o67742K1796M67536j97228o49524
6533A1139844J84046k31469j39403m71537K86765m41277J20529k73080K76439
$$ plain form
6603 22147863 22060624 22074612 21965477 21713676 21886767 21942738 22427955 22226503 22030257 21833011
6593 21833011 21849176 22007239 21786664 21240784 20968918 21377848 21032472 21286986 21367046 20824623
6583 20824623 20843394 20828806 19791175 20159610 19983581 19789656 19332479 19333150 19076445 18689844
6573 18689844 18658905 18447512 18469382 18449219 17913906 17123445 17553963 17149444 16812437 16801143
6563 16801143 16661642 16235986 16282883 15697255 15514828 15917517 15393092 15165936 14710762 14616571
6553 14616571 14020793 14402426 14098896 14090138 13422576 13595345 13289442 13209211 13080301 12399567
6543 12399567 12717383 13036792 12746258 12272276 12165006 11497264 11519060 11986596 11789368 11139844
6533 11139844 11323890 11092421 10953018 10481481 10768246 10326969 10447498 10174418 10450857
6524A0450857q68552j2864j25904q6963M9423K89249j31605m14456P5195l68761
6514H855619M7702l16732K0144K1699o1761l13355r1664P7706j49599j64502j59484
6503G765773k09636J98894l9882m81457N24895o61674L45079l70758K4919R5170
6493G191323m38938K69768j35368j10503j10310j67970q5919J49923k33427k18635
6483F109944M11977J92078n18416R0164n1179j00808k02567L94742k40848K64809
6473F349896P4242j8252k11975R0514R430K03955l49631m70140M72656O3767m78874
6462E735588M45343k59914O7048K11386j50487n8327K8907j89359L04680l16625
6452E818240j28615L37805l54817L75136K27753q25417Q04370j0925o15352L40515
$$ plain form
6524 10450857 9582305 9569441 9443537 9356574 9405997 9695246 9563641 9149185 9224380 8855619
6514 8855619 8903321 8586589 8606733 8628432 8566671 8253316 8161652 8239358 8089759 7925257 7765773
6503 7765773 7556137 7755031 7715149 7233692 7758587 7096913 7441992 7071234 7096153 7191323
6493 7191323 6752385 7022153 6886785 6776282 6665972 6498002 6412083 6562006 6328579 6109944
6483 6109944 6521921 6713999 6195583 6285747 6234568 6133760 5931193 6325935 6085087 6349896
6473 6349896 6424138 6405886 6193911 6284425 6293855 6497810 6148179 5678039 6150695 6214462 5735588
6462 5735588 6180931 5921017 5988065 6199451 6048964 5990637 6019544 5830185 6134865 5818240
6452 5818240 5689625 6027430 5672613 6047749 6275502 5450085 6254455 6243530 5628178 5968693
6442E968693j1221N60030q04524J6069M24548k22775P8354l2683K59727k30184
6432F006034K21504l6792K27824K6277K44734K60490m67155l68553J65135J93135
6422F472633J17977L42983L36040r93972M76917L36246J38715l51300K34386Q4020
6412G194645N22501m7411J17794k79061L29321K04685k93361J30214M61814L37591
6402H678732j9887l09745L09039N87045J06868K31297J25511R1452O09586j51669
6392A0258229L93483O13040K60403L92682k5421J82576R61679M32794L02403N49224
6382A4321092R12888O08907O41089j34635J284373J008480J072442Q52382J107050
6373B1674068J538330J362852J413864J949704K009136K661588L306409L054746
$$ plain form
6442 5968693 5957472 6517502 5712978 5729047 6153595 5930820 6009174 5976491 6236218 6006034
6432 6006034 6227538 6190746 6418570 6444847 6689581 6950071 6482916 6114363 6279498 6472633
6422 6472633 6590610 6933593 7269633 6275661 6752578 7088824 7227539 6876239 7110625 7194645
6412 7194645 7717146 7669735 7787529 7508468 7837789 8042474 7749113 7879327 8341141 8678732
6402 8678732 8658845 8349100 8658139 9245184 9352052 9583349 9708860 9800312 10409898 10258229
6392 10258229 10651712 11264752 11525155 11917837 11892416 12074992 13036671 13469465 13771868 14321092
6382 14321092 15233980 15842887 16483976 16349341 17633714 18642194 19714636 20567018 21674068
6373 21674068 23212398 24575250 25989114 27938818 29947954 32609542 35915951 38970697
6365C8970697M029096M776317N612088O624576Q702388J0850195J3802170J7757757
6357A11125284K2335795K8146877L4340365L5499562L2360587K4075990J3779336
6350C01663796K308593p687233j4597205k0515012k4576402k5687810k5681070
6343A85227657k3681969k2089021j7938491j4790068j1995790j0559471p854347
6336G6318500p218182n892675n149640m523391l802672l723590k598000k405798
6328D1004552k413637j881022j763698j754040r07980j930549p86484j186618
6320B8380524j357925q57070r97567j035127n45539r69679n35310j028849o83924
6311B0369534j04583q00566k75587n81956k14295n07772j069356k93266J06796
$$ plain form
6365 38970697 42999793 47776110 53388198 60012774 68715162 79565357 93367527 111125284
6357 111125284 133461079 161607956 195948321 231447883 263808470 287884460 301663796
6350 301663796 303972389 296285156 281687951 261172939 236596537 210908727 185227657
6343 185227657 161545688 139456667 121518176 106728108 94732318 84172847 76318500
6336 76318500 69100318 63207643 58058003 53534612 49731940 46008350 43410350 41004552
6328 41004552 38590915 36709893 34946195 33192155 32284175 30353626 29567142 28380524
6320 28380524 27022599 26165529 25167962 24132835 23587296 22617617 22082307 21053458 20369534
6311 20369534 20264951 19464385 19188798 18606842 18392547 17884775 16815419 16522153 16628949
6302A6628949p25500j44381o91602o1072K49131j018744m00993K7701l28037j26098
6292A3409354j13557l75933m48291o7561m34504o9970o1676n67578j33600j2840
6282A1123844o38680L94457o38808k5322k25942O1396Q376m39095k0101q6143
6272I513982m29152J34192l75632q9156q5161k64134l39500L01839k54000l96249
6262G717029K66887J01217j38304k32492J926J55277n45905J44884P0219O1700
6252G602438P1835o16830o8686J53213k41793k35838K71912m05363J94944K55510
6242F981342j25908j11704l52137K80869p5012L75124p60924n9773J95904l35033
6232F012748J5765L08693k25685k26043k0448M09639o52136K63913j44846K47562
$$ plain form
6302 16628949 15903449 15759068 15067466 15006394 15255525 14236781 13835788 13863489 13535452 13409354
6292 13409354 13295797 12919864 12471573 12404012 11969508 11899538 11837862 11270284 11136684 11123844
6282 11123844 10485164 10879621 10240813 10215491 9989549 10050945 10059321 9620226 9600125 9513982
6272 9513982 9084830 9219022 8843390 8754234 8669073 8404939 8065439 8367278 8113278 7717029
6262 7717029 7983916 8085133 7946829 7714337 7716263 7871540 7325635 7470519 7540738 7602438
6252 7602438 7674273 7057443 6988757 7141970 6900177 6664339 6936251 6530888 6725832 6981342
6242 6981342 6855434 6743730 6391593 6672462 6597450 6972574 6211650 6151877 6347781 6012748
6232 6012748 6028513 6337206 6111521 5885478 5865030 6274669 5622533 5886446 5741600 5989162
6222E989162k0120j23926J56522k47326K11018p8611q8995J56063l70850j69855
6212E413082K45659j56506j27242M31074k33572k16782J07448K77539k40467Q2148
6202E582381L2445K02283J89617l88450L88715p6295M80651j82940Q189n67911
6192E668685N03530N44387n05065J16047J30313l06591n04684K58724L07561J6684
6182F229591j14976J6718L9207J10430J27229n00828q2215J54460L73296N4605
6172F407517k69332K38389J88485r7581Q972M55651l41045O5648L85213j22357
6162F919560k8828P2271k14173M79902l0158j44832Q0183L91429J28808J42711
6152G796873m83693O22049l40337K18063j03342P19409k98450M32232n77357L83858
$$ plain form
6222 5989162 5969042 5845116 6001638 5754312 5965330 5886719 5797724 5953787 5582937 5413082
6212 5413082 5658741 5502235 5374993 5806067 5572495 5355713 5463161 5740700 5500233 5582381
6202 5582381 5614826 5817109 6006726 5618276 6006991 5930696 6411347 6228407 6236596 5668685
6192 5668685 6172215 6716602 6211537 6327584 6457897 6151306 5646622 5905346 6212907 6229591
6182 6229591 6114615 6131333 6170540 6280970 6408199 5907371 5825156 5979616 6352912 6407517
6172 6407517 6138185 6376574 6565059 6467478 6476450 6932101 6591056 6656704 7041917 6919560
6162 6919560 6890732 6963003 6748830 7228732 7198574 7053742 7133925 7525354 7654162 7796873
6152 7796873 7313180 7935229 7594892 7812955 7709613 8429022 8130572 8562804 7985447 8369305
6142H369305R7460k59663O29642j75655K54688j83187j00644M18683N63013k03864
6132I409778l394j66580M14657l16893N33887J74957J0011K11342M01530k0530
6122A0648765O21740K08215k82787M35451j30342K09115J7759L97315m7705M63931
6112A2541457N57518j49489q052K67899J45982N24166m47500R43942P1087O2432
6102A4509442J051428O0692J73359K94345N45595O50902N87743N86735M61940
6093A8922181K88799O86923J00056K52625J87134j38413L51101P95669k68197
6084B1177878q3189L99000O7287J059369J87348L40751J61975M08203R37118k11337
6074B4444403K13807N59861R00624N31797P99816M51862R78076O98796P46843
$$ plain form
6142 8369305 8466765 8207102 8836744 8661089 8915777 8732590 8631946 9050629 9613642 9409778
6132 9409778 9406384 9239804 9654461 9337568 9871455 10046412 10056423 10267765 10669295 10648765
6122 10648765 11270505 11478720 11195933 11631384 11501042 11710157 11727916 12125231 12077526 12541457
6112 12541457 13098975 12949486 12941434 13209333 13355315 13879481 13431981 14375923 14447010 14509442
6102 14509442 15560870 15621562 15794921 16089266 16634861 17285763 17873506 18460241 18922181
6093 18922181 19210980 19897903 19997959 20250584 20437718 20299305 20650406 21446075 21177878
6084 21177878 21094689 21493689 21560976 22620345 22807693 23148444 23310419 23718622 24655740 24444403
6074 24444403 24658210 25218071 26118695 26650492 27450308 27902170 28880246 29579042 30325885
6065C0325885J058358P37402O81958R75718Q64503R58948Q05454O98309O09284
6056C7715819Q15568N17608J437256L33855J440821J220055J061496J152038J222827
6047D6917343J361632J222281J813857J210514K283160J269376K277524J698942
6039F0054629K033235K485894K353080K223807K877377K579332L349605K753429
6031H0710388L200188L512179L799092M054896M271035M470483N134516N055343
6023A14208120N956370O470911O473870P067638P760885Q025360R066104R478855
6015A74508113J0295235J1689640J1886967J2613276J4697632J4587033J6193113
6008B66471009J6995487J7594135J8446127J8850791J9435948J8773258J8604667
$$ plain form
6065 30325885 31384243 32121645 32803603 33779321 34643824 35602772 36408226 37106535 37715819
6056 37715819 38531387 39048995 40486251 40820106 42260927 43480982 44542478 45694516 46917343
6047 46917343 48278975 49501256 51315113 52525627 54808787 56078163 58355687 60054629
6039 60054629 62087864 64573758 66926838 69150645 72028022 74607354 77956959 80710388
6031 80710388 83910576 87422755 91221847 95276743 99547778 104018261 109152777 114208120
6023 114208120 120164490 126635401 133109271 140176909 147937794 155963154 165029258 174508113
6015 174508113 184803348 196492988 208379955 220993231 235690863 250277896 266471009
6008 266471009 283466496 301060631 319506758 338357549 357793497 376566755 395171422
6001C95171422J7356837J6316853J3742197J1450034Q793025N272289J946148
5994D70048805j655769m874565p568338j0330029j2965198j4158577j5996498
5987D02499831j6664709j7729005j7441691j7035633j6940164j6644358j5407438
5980B84636833j5018437j3952793j3301127j2761224j1757930j0790933j0144248
5973A96910141r333654r175057p833836p452483p119768p325419o182656n481577
5965A37005691n639869n164870n299895l676017m435997m455568l576209l400180
5957A01357086l782279l119508l313367k388507k937705k440311k742982k350987
5949G8281440k334059k038493j766529k021251k476220j290531k027414j694346
$$ plain form
6001 395171422 412528259 428845112 442587309 454037343 462830368 468102657 470048805
5994 470048805 468393036 463518471 455950133 445620104 432654906 418496329 402499831
5987 402499831 385835122 368106117 350664426 333628793 316688629 300044271 284636833
5980 284636833 269618396 255665603 242364476 229603252 217845322 207054389 196910141
5973 196910141 187576487 178401430 170567594 163115111 155995343 148669924 142487268 137005691
5965 137005691 131365822 126200952 120901057 117225040 112789043 108333475 104757266 101357086
5957 101357086 97574807 94455299 91141932 88753425 85815720 83375409 80632427 78281440
5949 78281440 75947381 73908888 72142359 70121108 67644888 66354357 64326943 62632597
5941F2632597j154651j577849j066756j458406j391403j578695j362093p09741
5933E2333003j384849j292519r15800j359309o65584r88692r13672p26310r05015
5924D3181253p90073p31117o43138j168568q50275k74820j061008m69111o19967
5915C6573176o82614n39147m75331l00245o28319q93485k45930m78579n61705
5906C1767821l58711o51221P8683n86801o47441N0584n56870J19970r10477m69885
5896B7835652P2534k78979q91176L92503k04509j89623l37993J16396k61197j79656
5886B6073952m80633N7895L145j75454k06955j71894L55236n72334J80798j91622
5876B4872134K58214K99948J66549j86361r9386l11880N56239M7987K81224l5795
$$ plain form
5941 62632597 61477946 59900097 58833341 57374935 55983532 54404837 53042744 52333003
5933 52333003 50948154 49655635 48739835 47380526 46714942 45726250 44812578 44086268 43181253
5924 43181253 42391180 41660063 41016925 39848357 38998082 38723262 37662254 37193143 36573176
5915 36573176 35890562 35351415 34876084 34575839 33947520 33054035 32808105 32329526 31767821
5906 31767821 31409110 30757889 30836572 30249771 29602330 29652914 29096044 29216014 28305537 27835652
5896 27835652 27908186 27629207 26738031 27130534 26926025 26736402 26398409 26514805 26253608 26073952
5886 26073952 25593319 25651214 25654359 25478905 25271950 25100056 25455292 24882958 25063756 24872134
5876 24872134 25130348 25430296 25596845 25410484 25311098 24999218 25555457 25603444 25884668 25848873
5866B5848873J10497K98872L18051Q74052K37394N27234K74388K77324Q57710
5857B9624395P70962M15617O73107Q63154N12855R48205J236467Q78441J337412
5848C7260615J162984J419057J840130J637934J891678K675036K424788K771115
5840E3083337L269406L567882M689386M675585N522618O162531P931585R085291
5832I7987621J0128491J3089012J5016249J7779299K2145912K6634406L2222902
5825B35003892L7566883M2372169M4426780M1356267L3528389K3041240J0712922
5818D68008542k458210j3356946k2414656k9084714l3241142l4918241l4501954
5811B98032679l2108865k9486502k5243596k2384105j8668147j5831280j4117804
$$ plain form
5866 25848873 25959370 26258242 26576293 27450345 27687739 28214973 28489361 28766685 29624395
5857 29624395 30395357 30810974 31484081 32347235 32860090 33808295 35044762 35923203 37260615
5848 37260615 38423599 39842656 41682786 43320720 45212398 47887434 50312222 53083337
5840 53083337 56352743 59920625 64610011 69285596 74808214 80970745 88902330 97987621
5832 97987621 108116112 121205124 136221373 154000672 176146584 202780990 235003892
5825 235003892 272570775 314942944 359369724 400725991 434254380 457295620 468008542
5818 468008542 465550332 452193386 429778730 400694016 367452874 332534633 298032679
5811 298032679 265923814 236437312 211193716 188809611 170141464 154310184 140192380
5804A40192380j2316647j0295709r188372p795664p046697o373568n232070m316930
5796G7626723m318812l644891l388922k971100k759865k664655j968065k379628
5788E3530785k376166j548435j465817k002952j502614q31610j635724j238832
5780D0928635j188288r12665j255941p24305r79622j219430j003345m81516m69517
5771C2694006p22304r30646l71902o88773p75119n47397m00298j128967l72482
5762B6756118k25464j57891o27736n12845n83952m22636k19804n71661P5645n20252
5752B2989522m27951n22052K96959p77062j1018k23147o7411P1907q0852Q05204
5742B2054099J60311Q89999J174902l4638J58120l73577o63539k83978r23926
$$ plain form
5804 140192380 127875733 117580024 108391652 100595988 93549291 87175723 81943653 77626723
5796 77626723 73307911 69663020 66274098 63302998 60543133 57878478 55910413 53530785
5788 53530785 51154619 49606184 48140367 46137415 44634801 43803191 42167467 40928635
5780 40928635 39740347 38827682 37571741 36847436 35867814 34648384 33645039 33163523 32694006
5771 32694006 31971702 31041056 30669154 29980381 29205262 28657865 28257567 27128600 26756118
5762 26756118 26530654 26372763 25745027 25232182 24648230 24225594 24005790 23434129 23509774 22989522
5752 22989522 22561571 22039519 22336478 21559416 21548398 21325251 21257840 21329747 21248895 22054099
5742 22054099 22214410 23104409 24279311 24244673 24402793 24029216 23365677 23081699 22157773
5733B2157773j322484n22230k66821j011401p77713k86515j48034k21571k10684
5724A7390320o30676n10087J03004j95217j53682j98531l61090L45972l95621
5715A5394392R6772n55029k62519M30467p7307j20446J19121k0798k73932J9963
5705A4750684N47902j86389K45397j68041r2469O4692O03015l55724O01852K27265
5695A6238184K24872N06858M49995Q3166Q97387K48657M74178N94406P91129K43883
5685B0752715L36857o6094k87498M16100k83313j3911n71967l68884j12008K39123
5675B0041120p03372j26733j86371J61554l00262L65364j99950J24160P23479
5666A9898989N10145P26797P02676J362599N71891P57613J158921Q18439J226029
$$ plain form
5733 22157773 20835289 20313059 20046238 19034837 18257124 17970609 17822575 17601004 17390320
5724 17390320 16759644 16249557 16352561 16157344 16003662 15805131 15444041 15790013 15394392
5715 15394392 15491164 14936135 14673616 15104083 15026776 14906330 15025451 15004653 14730721 14750684
5705 14750684 15298586 15112197 15357594 15189553 15097084 15161776 15764791 15409067 16010919 16238184
5695 16238184 16463056 16969914 17419909 17503075 18400462 18649119 19123297 19717703 20508832 20752715
5685 20752715 21089572 21023478 20735980 21152080 20868767 20854856 20282889 19914005 19801997 20041120
5675 20041120 19337748 19211015 19024644 19186198 18885936 19251300 19051350 19175510 19898989
5666 19898989 20409134 21135931 21838607 23201206 23773097 24530710 25689631 26508070 27734099
5657B7734099Q15744O80747L15795j87910J96286K2723r47401k79664n68088j137477
5647B6644854r26448j113656j149726p38910o45199n14217q60549l95249m68193
5638A9832707L18262o71738r1736M06729L13658R6957K64569M86262r7880M15611
5628B1273401l7705N57849P7557k285L30593m82015l08338J84546p16406j271468
5618A9605729k28420p86972p48040p52949m74461n27850q40966j15014m44082
5609A4686975k31435q99161k76729r8048r3146m06309j87512l89819l09099J40594
5599A1936311j54766K09067j74225m95168M14692l42718j71987q9539O1649j17806
5589A1075510K79634r3896R1694k91759J53016j51074K21560p6196j22311M43007
$$ plain form
5657 27734099 28549843 29230590 29546385 29358475 29554761 29577484 28630083 28350419 27782331 26644854
5647 26644854 25718406 24604750 23455024 22716114 22070915 21556698 20696149 20300900 19832707
5638 19832707 20150969 19479231 19387495 19794224 20107882 20204839 20469408 20955670 20857790 21273401
5628 21273401 21235696 21793545 21871102 21868817 22199410 21717395 21409057 21593603 20877197 19605729
5618 19605729 19377309 18590337 17842297 17089348 16614887 16087037 15246071 15131057 14686975
5609 14686975 14455540 13556379 13279650 13181602 13088456 12682147 12494635 12104816 11795717 11936311
5599 11936311 11781545 11990612 11816387 11321219 11735911 11393193 11221206 11131667 11193316 11075510
5589 11075510 11355144 11261248 11352942 11061183 11214199 11063125 11284685 11208489 11086178 11529185
5579A1529185r1566L21325m6354p6443q9072N96146j42270R7734J70439m06654
5569A1862470L49110l5868m4110j49056J06184J94455J0206J58801l34478P55387
5559A2873101l62438J5455L49361K48742K39442J70722M9925J62165K23423j29251
5549A3840647L45203K10610O46395L19199k66419N71387J70047k8752L5250L55048
5539A6198615n22726M31274J91226l74626N82447j82862j40491N67949l4340N94568
5529A7311034L50778Q5968K18265L58255J51982L76928N25275M38862N40858O24885
5519B0983090N90599M38619K38286N05281M05106Q32760N98797J151932N93166
5510B6337636R62551L91638O60932P86160J080563N32947Q36796J055435J240387
$$ plain form
5579 11529185 11437619 11758944 11712590 11636147 11547075 12143221 12000951 12098685 12269124 11862470
5569 11862470 12211580 12175712 12131602 11982546 12088730 12283185 12293391 12452192 12117714 12873101
5559 12873101 12510663 12526118 12875479 13124221 13363663 13534385 13584310 13746475 13969898 13840647
5549 13840647 14185850 14396460 15042855 15362054 15095635 15667022 15837069 15808317 15843567 16198615
5539 16198615 15675889 16107163 16298389 15923763 16506210 16323348 16182857 16750806 16716466 17311034
5529 17311034 17661812 17747780 17966045 18324300 18476282 18853210 19378485 19817347 20358205 20983090
5519 20983090 21573689 22012308 22250594 22755875 23160981 23993741 24592538 25744470 26337636
5510 26337636 27300187 27691825 28352757 29138917 30219480 30752427 31589223 32644658 33885045
5501C3885045P61220R75442J491769J194345R29250J239788J501352Q12849J192235
5492D3983295P06532Q94188M43892K55796J77916Q4823O1396j524n61906K50369
5482D6294777r61400j3486n25208M974l16117l70084K26295K05564l92482k31757
5472D3921076K29166N39874N01478K28624M19143K53844Q837j46152o47577Q4296
5462D5392609j117319k04267r70266j022031j607273j012038j501941j117510
5454C6839964j462376j137896j276115j073968q74334p33526p62296m24811k08702
5445B8885940j063255j05988o25275l32270L38956k30723J29177j12841o2195
5436B6821526m06988n0876m47691k74340n38270n29093n69214r70096n44395o93473
$$ plain form
5501 33885045 34646265 35621707 37113476 38307821 39237071 40476859 41978211 42791060 43983295
5492 43983295 44689827 45584015 46027907 46283703 46461619 46546442 46607838 46606314 46044408 46294777
5482 46294777 45333377 45319891 44794683 44799657 44483540 44113456 44339751 44545315 44152833 43921076
5472 43921076 44150242 44690116 45191594 45420218 45839361 46093205 46102042 45955890 45308313 45392609
5462 45392609 44275290 44071023 43100757 42078726 40471453 39459415 37957474 36839964
5454 36839964 35377588 34239692 32963577 31889609 31015275 30281749 29519453 29094642 28885940
5445 28885940 27822685 27716697 27091422 26759152 27098108 26867385 26996562 26883721 26821526
5436 26821526 26414538 26363662 25915971 25641631 25103361 24574268 24005054 23034958 22490563 21797090
5426B1797090r30397j204891l99043p80028m88938j041130k18889n29019o18247
5417A5586508p46564k07415k74616k8459o12353j03193q19426J55057j23957l68634
5407A2456948N6904m38374L7712M1523n73567j29619M16433o90387L76601o6286
5397A1487888M8085n07552P70Q9805j05284k38747q892j37976k26387K33552N4055
5386A0689317N8745o52779N1938j8148L183l09995L46336k64620J79970j35949
5376I947998j16300r2335k1691J9358K72473n19382J94942n4271J67777p2926
5366I725643J52270p0144J17298k23721N79520j93827l61544L05269M7541Q6700
5356A0165005l08933N49813j32907N05271j46103j88624M80278j6770J80910J16497
$$ plain form
5426 21797090 20866693 19661802 19262759 18482731 17993793 16952663 16733774 16204755 15586508
5417 15586508 14839944 14632529 14357913 14329454 13717101 13613908 12794482 12949539 12825582 12456948
5407 12456948 12513852 12075478 12113190 12154713 11581146 11451527 11867960 11177573 11554174 11487888
5397 11487888 11535973 11028421 11029191 11118996 11013712 10774965 10766073 10628097 10401710 10635262 10689317
5386 10689317 10748062 10095283 10147221 10129073 10132256 9822261 10168597 9903977 10083947 9947998
5376 9947998 9831698 9739363 9717672 9737030 10009503 9490121 9685063 9630792 9798569 9725643
5366 9725643 9877913 9807769 9925067 9701346 10280866 10087039 9725495 10030764 10078305 10165005
5356 10165005 9856072 10405885 10272978 10778249 10632146 10443522 10923800 10907030 11087940 11204437
5346A1204437j11765O34785O14002l3404L33099P8306L63038R2802O82007J00683
5336A3957990O76986N14571Q67027N23691J02302J253713J49667J124045R97461
5327B0167453J034548J349801J699519J877518J863457K811422K899588L619232
5319C7322538M523655N097825N724463O942398O891719P237995P523691Q022280
5311H9286564Q593398R025736R043603R456727R260193Q124108P976126P429261
5303A58195716P542923P888903O379524N054500L882101J136807J93333n98343
5295A89675464j573878k604931l979319m958827o135347p149615p354803q083795
5287A47834949p879825p730748q256561q307899q198572p971064p961051p398738
$$ plain form
5346 11204437 11092672 11727457 12341459 12308055 12641154 12719460 13082498 13175300 13857307 13957990
5336 13957990 14634976 15149547 16016574 16540265 16642567 17896280 18045947 19169992 20167453
5327 20167453 21202001 22551802 24251321 26128839 27992296 30803718 33703306 37322538
5319 37322538 41846193 46944018 52668481 59610879 66502598 73740593 81264284 89286564
5311 89286564 97879962 106905698 115949301 125406028 134666221 142790329 150766455 158195716
5303 158195716 165738639 173627542 180007066 185061566 188943667 190080474 190273807 189675464
5295 189675464 188101586 185496655 181517336 176558509 170423162 163273547 155918744 147834949
5287 147834949 139955124 132224376 123967815 115659916 107461344 99490280 91529229 84130491
5279H4130491p016187o773823o236131n234077m170172m318591l693415k705137
5271D3982958k803145k642500j790652j822314j978802j135047j614352q32919
5263B9363227j001638r59824j236967j65963r15465q25561o25753l16447n08553
5254B2807056o77072l15096m59803l69799n18855j67674k30774q25778M31584
5245A9673789k41255k63176q38377K561q59904N45733k02287J34911k22406m20730
5235A7308859K79661l03455J51759j33921L2721k19628O33779j07436R2498J07156
5225A7841993P65126j13458r2756M62365J89341M32688N5885O51287N45823K44634
5215B0982928L49727K77111K08967M81576N62091P27643J58605K94791j21035
$$ plain form
5279 84130491 77114304 70340481 64104350 58870273 54700101 50381510 46688095 43982958
5271 43982958 41179813 38537313 36746661 34924347 32945545 31810498 30196146 29363227
5263 29363227 28361589 27401765 26164798 25998835 25083370 24257809 23632056 23315609 22807056
5254 22807056 22129984 21814888 21355085 20985286 20466431 20298757 20067983 19242205 19673789
5245 19673789 19432534 19169358 18330981 18333542 17473638 18019371 17817084 17951995 17729589 17308859
5235 17308859 17588520 17285065 17436824 17302903 17335624 17115996 17749775 17642339 17734837 17841993
5225 17841993 18607119 18493661 18400905 18863270 19052611 19485299 19541184 20192471 20738294 20982928
5215 20982928 21332655 21609766 21818733 22300309 22862400 23590043 23748648 24043439 23922404
5206B3922404N50207L60486L88281Q64259J01929L06045Q87876R2832N53901K56676
5196B8284896R8789N95611O7944M2894O1707k29555q9139q34098k98206m82571
5186B7218272l77203q49926n71936k83461n50709k59100r91120n22491k41979
5177B2570347p16658m59065p29382J1940n90355k91980l35240n35247o38094k62175
5167A8024091l79326q11121m54666m01103p13453o63070N243l00266p58384l53752
5157A3194193k92220m01917p97199J92907o22854k40604l99137o2785m11153k20532
5147I938699L5274p26971J14124k11666J17747n19993j92120K92788p05864J58791
5137H300809m15514j42735o5613J14582l61861K23274l62867k71422j68866L21568
$$ plain form
5206 23922404 24472611 24833097 25221378 26085637 26187566 26493611 27381487 27474319 28028220 28284896
5196 28284896 28383685 28979296 29047240 29090134 29151841 28922286 28833147 27999049 27700843 27218272
5186 27218272 26841069 25991143 25419207 25135746 24585037 24325937 23334817 22812326 22570347
5177 22570347 21853689 21394624 20665242 20677182 20086827 19794847 19459607 18924360 18286266 18024091
5167 18024091 17644765 16833644 16378978 15977875 15264422 14601352 14606595 14306329 13547945 13194193
5157 13194193 12901973 12500056 11702857 11895764 11272910 11032306 10633169 10570384 10159231 9938699
5147 9938699 9973973 9247002 9361126 9149460 9267207 8747214 8555094 8847882 8142018 8300809
5137 8300809 7885295 7742560 7676947 7791529 7429668 7652942 7290075 7018653 6849787 7171355
5127G171355M7196n39301K37043j70470r7100K89681j76854l18612K41447j61018
5117F523367k62799j17713J11494K23637o02084L01940k29192K75593p19082L28456
5107E833617M2261n80539P20844n17335L02783l29596J59027k11736l3070K3822
5097E410078r3448M36271n33014J07448M3256K83178n10956r6765L02674j09401
5087E239321j66918L9649J44430l38519K82922l33085M30443m32680K36376m3669
5077E058270J20626O4800l20372J60865k0331l0736J99801M007j29156L05691
5067E413465o68339N21094K83366M6356N7005J06984k25815l9741M00646j45107
5057E749914K3474R606Q1812j05649Q33380r4547L51751M0537K71574L15433M4755
$$ plain form
5127 7171355 7218551 6679250 6916293 6745823 6648723 6938404 6761550 6442938 6684385 6523367
5117 6523367 6260568 6142855 6254349 6477986 5875902 6177842 5948650 6224243 5505161 5833617
5107 5833617 5875878 5295339 6016183 5498848 5801631 5472035 5631062 5419326 5386256 5410078
5097 5410078 5316630 5752901 5219887 5327335 5370591 5653769 5142813 5046048 5348722 5239321
5087 5239321 5072403 5112052 5256482 4917963 5200885 4867800 5298243 4865563 5101939 5058270
5077 5058270 5178896 5243696 4923324 5084189 5063858 5033122 5232923 5236930 5107774 5413465
5067 5413465 4745126 5266220 5549586 5595942 5652947 5759931 5534116 5494375 5895021 5749914
5057 5749914 5773388 5782994 5864806 5759157 6592537 6497990 6849741 6890278 7161852 7477285 7522040
5046G522040L47349M63138k88511M43797J59819K24828j71945M96775k87534N95390
5036I505146k3131p9003K28156n0384J44292M75221j45819J86475L65631m5177
5026A0561407L13972Q45731j43059M24545O54252O87541M54487J82350Q58645
5017A4839871J20000L96282N03800p3293O48546j50342K80867K33173k60242m48736
5007A6089926K65397o89577K2506j80838j17979l47581k03708q0206P5024Q4301
4997A4917265J86954K61431O9510K17684O49197J47350Q69738L68918L92228N66574
4987A8646849N74349K96911L05862O46081p53099M43650j54706p15914k68287
4978A9021696l86770o8783n81708o53853j95207q07722n31705l9476l18199o11384
$$ plain form
5046 7522040 7869389 8332527 8044016 8487813 8647632 8872460 8700515 9197290 8909756 9505146
5036 9505146 9482015 9403012 9631168 9580784 9725076 10200297 10054478 10240953 10606584 10561407
5026 10561407 10875379 11721110 11578051 12002596 12656848 13344389 13798876 13981226 14839871
5017 14839871 14959871 15356153 15859953 15786660 16435206 16284864 16565731 16798904 16538662 16089926
5007 16089926 16355323 15665746 15688252 15507414 15389435 15041854 14838146 14757940 14832964 14917265
4997 14917265 15104219 15365650 15435160 15652844 16302041 16449391 17319129 17688047 18080275 18646849
4987 18646849 19221198 19518109 19823971 20470052 19716953 20160603 20005897 19289983 19021696
4978 19021696 18634926 18566143 17984435 17330582 17135375 16327653 15795948 15756472 15438273 14826889
4968A4826889k51814M25442n16520q7719j79512M39471L38729j72229N2956N26792
4958A5402485m7091M5682M68680k8247m09142K05804o95916l26912k91241j46734
4948A4177368o36972k67716n34196P5273o85598m24258o01800l56139l41932j85542
4938A0218488j33184j11753l33871j49601j45713o96775L44057M2216j75841n36028
4928H321995N43492j38890k374m51930J13341k52258J68711o68643L98051p08634
4918G322861L96031m88908q8720j084063K19659N3359q1913l06561J54118n58645
4908E537218P1585J20801L8374m05938M6649j82549j52439L72323l85353J41988
4898E202659k87621J98350k21413l69879N34207k81165k09027O46662m12432k66685
$$ plain form
4968 14826889 14575075 15000517 14483997 14396278 14216766 14656237 14994966 14822737 14875693 15402485
4958 15402485 15355394 15401076 15869756 15841509 15432367 15638171 14942255 14615343 14324102 14177368
4948 14177368 13540396 13272680 12738484 12813757 12128159 11703901 11102101 10745962 10404030 10218488
4938 10218488 10085304 9973551 9639680 9490079 9344366 8647591 8991648 9033864 8858023 8321995
4928 8321995 8865487 8726597 8724223 8272293 8385634 8133376 8302087 7633444 8031495 7322861
4918 7322861 7718892 7229984 7141264 6057201 6276860 6330219 6248306 5941745 6095863 5537218
4908 5537218 5608803 5729604 5767978 5362040 5408689 5226140 5073701 5446024 5060671 5202659
4898 5202659 4915038 5113388 4891975 4522096 5056303 4775138 4566111 5212773 4800341 4533656
4888D533656L9831k02761J62455M36305l83854J60182k89049n2984j54225k7015
4878D222541K9224Q4648o8630J36277O3179j66528j18467J13983K58690K1712
4868D576629l59599l18348J05694k228j36346J11784K452l86717M79476K0223
4858D093020p7189j27871j7729j60960K4138m56106R84021j73293K2108q0456
4848D029683J30487J721P3886k97054k76015K80136l18884L47698n3717L66521
4838D284462n87969O8773O8818Q8111M9478k97642L35469L30083p50293M43971
4828D033261k28649L4685J50773O8511J39815K6532o18900L80917k01776M65020
4818D250189N216j00689k7558l67229O35940l04967J0914k10056L35721R0681
$$ plain form
4888 4533656 4573487 4370726 4533181 4969486 4585632 4745814 4456765 4403781 4249556 4222541
4878 4222541 4251765 4336413 4267783 4404060 4467239 4300711 4182244 4296227 4554917 4576629
4868 4576629 4217030 3898682 4004376 4002148 3865802 3977586 3980038 3593321 4072797 4093020
4858 4093020 4015831 3887960 3870231 3709271 3733409 3277303 4261324 4088031 4110139 4029683
4848 4029683 4160170 4161891 4235777 3938723 3662708 3942844 3623960 3971658 3917941 4284462
4838 4284462 3696493 3765266 3834084 3922195 3971673 3674031 4009500 4339583 3589290 4033261
4828 4033261 3804612 3839297 3990070 4058581 4198396 4224928 3606028 3986945 3785169 4250189
4818 4250189 4255405 4154716 4127158 3759929 4395869 4090902 4101816 3891760 4227481 4318162
4808D318162M53186r76966K89816M98902k31305N2462J99882k88115K53198R1793
4798D661015K69098o59538j54644N04032J79476J51492P6958n1312L6236N2065
4788E064878K72053K50308k50960m6624n5429L6933k24441O20166p8268P2132
4778E660748K27491O6280q3329k09783K56209L19312M8296N0105M00262p564l55257
4767F372770L98571L06316J31370P0064K93427M87383J0368j76751N91964J60038
4757H645520K23833L30012J92683J00653L25777M07824k22482O80327L86831J19290
4747A1190268M34448L42712L257L12354N08036K40189L48021Q67367O33746N43095
4737A5423493L17203M83432R34565J031888N48579J193484N09520J356533J413438
$$ plain form
4808 4318162 4771348 3794382 4084198 4583100 4351795 4404257 4604139 4316024 4569222 4661015
4798 4661015 4930113 4270575 4115931 4619963 4799439 4950931 5027889 4976577 5012813 5064878
4788 5064878 5336931 5587239 5336279 5289655 5234226 5271159 5046718 5666884 5588616 5660748
4778 5660748 5888239 5954519 5871190 5661407 5917616 6236928 6285224 6335329 6735591 6728027 6372770
4767 6372770 6771341 7077657 7209027 7279091 7572518 8059901 8070269 7893518 8485482 8645520
4757 8645520 8869353 9199365 9392048 9492701 9818478 10226302 10003820 10684147 11070978 11190268
4747 11190268 11624716 11967428 11970685 12283039 12791075 13031264 13379285 14246652 14880398 15423493
4737 15423493 15740696 16224128 17158693 18190581 18739160 19932644 20442164 21798697 23212135
4728B3212135J084923J245660J108897P73767P16648J372706P27300J143305M50931
4719C1836272J431852J145226Q89986N84952J241592P08897J200351P05264J023993
4710D0768385J229389Q32713R25024O10979J584923N82091Q88768Q69140N41007
4701D8832419N42077Q2804q958o13189l21973m9715p22088j119142p28644j211037
4691D4682554o74552r61267r09114o28971j042350j378032o04256p60387j467094
4682C6256531j022501q77806j087915p79187j542332p16964q33171j001739j017422
4673B7377494q09627j072635j308895r70517q07453j315494m26008r44162m68533
4664A9254170r65447p22627o46267k78490o47067J7531l69888n24542l59820l50664
$$ plain form
4728 23212135 24297058 25542718 26651615 27425382 28142030 29514736 30242036 31385341 31836272
4719 31836272 33268124 34413350 35303336 35888288 37129880 37838777 39039128 39744392 40768385
4710 40768385 41997774 42830487 43755511 44366490 45951413 46533504 47422272 48291412 48832419
4701 48832419 49374496 49457300 49448342 48835153 48513180 48463465 47741377 46622235 45893591 44682554
4691 44682554 44008002 43046735 42137621 41508650 40466300 39088268 38484012 37723625 36256531
4682 36256531 35234030 34356224 33268309 32489122 30946790 30229826 29396655 28394916 27377494
4673 27377494 26567867 25495232 24186337 23215820 22408367 21092873 20666865 19722703 19254170
4664 19254170 18288723 17566096 16919829 16641339 15994272 16011803 15641915 15117373 14757553 14406889
4654A4406889l13700l76650l67823m40602o16164J1720K6763n63831l03074j38879
4644A1324649M377K6201o92127j21443j21921m71260K7444j91041l49364J33806
4634I569321m90362O1791j62395l13371K744J21708n33309L91498n05240k41243
4624G901142J35115K49533p9085l5432m13101Q1402l4987l40488k4057M86305
4614G926347o9044l53230J97637j05853N4203j94949N17589m31975k1926L35695
4604G854494p7120M95439l84989k44000K61564J91258n0843k38746K39950K14992
4594H261999o503j94741O7062M18613p7432L01279n35452N12060j26434J96788
4584H817239J50111R9023M1507J54020J10222K7346K07967l7981L41034O28886
$$ plain form
4654 14406889 14093189 13716539 13348716 12908114 12291950 12303670 12330433 11766602 11463528 11324649
4644 11324649 11329026 11355227 10663100 10541657 10419736 9948476 9975920 9784879 9435515 9569321
4634 9569321 9078959 9140750 8978355 8664984 8667728 8789436 8256127 8647625 8142385 7901142
4624 7901142 8036257 8285790 8206705 8171273 7758172 7839574 7804587 7464099 7440042 7926347
4614 7926347 7857303 7504073 7701710 7595857 7650060 7455111 7972700 7540725 7518799 7854494
4604 7854494 7777374 8272813 7887824 7643824 7905388 8096646 8045803 7807057 8047007 8261999
4594 8261999 8255496 8060755 8127817 8546430 8468998 8770277 8234825 8746885 8620451 8817239
4584 8817239 8967350 9066373 9107880 9261900 9372122 9399468 9607435 9569454 9910488 10539374
4574A0539374n74275M64451k83550N0526R1356J9750N9479M66076L82211o77822
4564A0537576K68257j1619L29562K07363L0053n22847M16463k78293K03930M58621
4554A1639066J50705l39401K11930M44324m06588L01726k25498K58168K49903
4545A2284335j61277J9018J1706L71485J49379l93018L41247l2004n16056L57711
4535A2432526m40756j23604j64588j02441J95636j14910J75968l02171j52819
4526A1402841J16981j77568n79374N48449k64070K80127m41182n4219N9954k18497
4516A0673442K4334m56869L81773n5832J3909m29334L5287r1935j08918o09971
4506I375886O04435n06327l16514j78383K8372j95489M4478l72157q9720k96579
$$ plain form
4574 10539374 9965099 10429550 10146000 10196526 10287882 10307632 10367111 10833187 11215398 10537576
4564 10537576 10805833 10794214 11123776 11331139 11361192 10838345 11254808 10976515 11180445 11639066
4554 11639066 11789771 11450370 11662300 12106624 11700036 12001762 11776264 12034432 12284335
4545 12284335 12123058 12142076 12153782 12525267 12674646 12281628 12622875 12590871 12074815 12432526
4535 12432526 11991770 11868166 11703578 11601137 11796773 11681863 11857831 11555660 11402841
4526 11402841 11519822 11342254 10762880 11311329 11047259 11327386 10886204 10831985 10891939 10673442
4516 10673442 10697776 10240907 10622680 10566848 10580757 10151423 10186710 10094775 9985857 9375886
4506 9375886 9980321 9473994 9157480 8979097 9007469 8811980 8856458 8484301 8394581 8098002
4496H098002K05783p5975k02575Q7254J1961m98708K3292L12531P6691n65453
4486G472803K09643k05618j22885m17682P7936P9251L3650k74562m72594L45562
4476F725504L62518j27571J66045p33732K74241q34091J000020j82068j81171
4467F469695o5670k91750M46290j20561K12579k30789J37059k73321q2532J16694
4457F317694k56262l03287J40601N31922j98226l2455J84582n71513J28865K58048
4447F199969R5199o0100K13371Q1095k69338K19686j91439L00315K05870k60227
4437F534401j55061j60595K20382k88995N72309r0259L49610N15359l71267k18713
4427F907171K54774k07428N8501L09238n5220M34457m97958P14975j67775J35160
$$ plain form
4496 8098002 8303785 8227810 8025235 8112489 8124450 7625742 7649034 7961565 8038256 7472803
4486 7472803 7682446 7476828 7353943 6936261 7014197 7093448 7127098 6852536 6379942 6725504
4476 6725504 7088022 6960451 7126496 6392764 6667005 5832914 6832934 6650866 6469695
4467 6469695 6404025 6112275 6558565 6438004 6650583 6419794 6556853 6283532 6201000 6317694
4457 6317694 6061432 5758145 5898746 6430668 6232442 6199987 6384569 5813056 5941921 6199969
4447 6199969 6295168 6235068 6448439 6529534 6260196 6479882 6288443 6588758 6794628 6534401
4437 6534401 6379340 6218745 6439127 6150132 6722441 6632182 6981792 7497151 7125884 6907171
4427 6907171 7161945 6954517 7013018 7322256 7267036 7701493 7203535 7918510 7750735 7885895
4417G885895l00867N35594r7335l13668M23182o9311L00595p4028P8021L7611
4407H405689L8115K95438j055k71290J89933J09408j97799O46610k69749O6946
4397I012246n4684J53824J7763N85839J36362j42813K1873K15192L57119K13226
4387A0515947J75907K44826N42915j41567M78597k62560L50590J68434K78569
4378A2351658P04811J96075j54962J36832J42230J16889J79098K1165M53756j41784
4368A4005768J15195J37436M83025J0792j45582L39843M92403n29708N83363L95898
4358A5888433k56895L43093R26166k57814q2938K84463J85436J33421K09928J75632
4348A7548925j17582N2264R3564m80723K9516N10493l22306k95205J12950J86031
$$ plain form
4417 7885895 7585028 8120622 8023287 7709619 8132801 8063490 8364085 8290057 8368078 8405689
4407 8405689 8443804 8739242 8738187 8466897 8656830 8766238 8568439 9215049 8945300 9012246
4397 9012246 8957562 9111386 9129149 9714988 9851350 9708537 9730410 9945602 10302721 10515947
4387 10515947 10691854 10936680 11479595 11338028 11816625 11554065 11904655 12073089 12351658
4378 12351658 13056469 13252544 13097582 13234414 13376644 13493533 13672631 13693796 14147552 14005768
4368 14005768 14120963 14258399 14741424 14752216 14606634 14946477 15438880 14909172 15492535 15888433
4358 15888433 15631538 15974631 16900797 16642983 16560045 16844508 17029944 17163365 17373293 17548925
4348 17548925 17431343 17483607 17577171 17096448 17125964 17636457 17314151 17018946 17131896 17317927
4338A7317927k21165K1697R6707P66805o9157J03009K01295O68035O399L70171
4328A9261723M74029o17628j86070n79094O86399q27618n65954k75474p04780
4319A6665533j03962o58868m19831L21343l13901J72592k62769K68810m66322
4310A5202625N42409j09647J87473Q02032P7584K69350K48621m54213J15150n5519
4300A6825865l2685j66533n78733n76836l83765L3792n97069O49820m6687K20118
4290A5347287N1514l2672m52682M33957p04090L17131k16644j84647n31526k13349
4280A3814279j48791m35315r87726k57792k10468k44284r07148j07836n6015l58649
4270A0100255m16719j30176k4378K26791j60423k86583n51042K95157k73123M056
$$ plain form
4338 17317927 17096762 17118459 17215166 17981971 17912814 18015823 18217118 18885153 18891552 19261723
4328 19261723 19735752 19118124 18932054 18352960 19039359 18211741 17645787 17370313 16665533
4319 16665533 16561571 15902703 15482872 15804215 15490314 15662906 15400137 15668947 15202625
4310 15202625 15745034 15635387 15822860 16624892 16702476 16971826 17220447 16766234 16881384 16825865
4300 16825865 16793180 16626647 16047914 15471078 15087313 15121105 14524036 15173856 15127169 15347287
4290 15347287 15398801 15366129 14913447 15347404 14643314 14960445 14743801 14559154 14027628 13814279
4280 13814279 13665488 13230173 12242447 11984655 11774187 11529903 10622755 10514919 10458904 10100255
4270 10100255 9683536 9553360 9528982 9755773 9595350 9308767 8757725 9052882 8779759 8783815
4260H783815M32417k19379r4303o0080J5143r5773J39962n88655j3344k75495
4250H024308N98807j63907K80369o40900K17480o3145q06646J94824j33830M20797
4240G928157n45187Q34n0361K85558l62790L53980K35717k98406K7951j87283
4230G388170j84783K57993q5979O1678M3686j91087p9260p2623n31088L43719
4220F950426j40027m95394j65547l25913M05683m24510O4747r3665K80283k94538
4210E761545m4071J64305n5902j01979J66418k87300R5988l06497l59214L35024
4200E368317q8930l37286J2987k00303O2632k95904J21340J71773l13098o1924
4190D439604J64297j68926k72757L68648k60530M59863l78045j3930j77789j44770
$$ plain form
4260 8783815 9216232 8996853 8902550 8842470 8857613 8761840 8901802 8313147 8299803 8024308
4250 8024308 8623115 8459208 8739577 8098677 8316157 8253012 7446366 7641190 7507360 7928157
4240 7928157 7382970 7383804 7333443 7619001 7256211 7610191 7845908 7547502 7575453 7388170
4230 7388170 7203387 7461380 7375401 7437079 7480765 7289678 7210418 7137795 6606707 6950426
4220 6950426 6810399 6315005 6149458 5823545 6229228 5804718 5869465 5775800 6056083 5761545
4210 5761545 5717474 5881779 5825877 5723898 5890316 5603016 5699004 5392507 5033293 5368317
4200 5368317 5279387 4942101 4955088 4754785 4817417 4521513 4642853 4814626 4501528 4439604
4190 4439604 4603901 4434975 4162218 4530866 4270336 4730199 4352154 4338224 4160435 4015665
4180D015665M25134p0614m31109p9368j63467L21808j14435K25780k18150j8714
4170C892530l46887L89019l8627N3003m64626j16167r6650L59433M58605n42925
4160C546708j27854L595k43310J3093K38717j90242l09547L41875j9562M48106
4150C701579j27937K21094L36605q2796j91770J41626j83938R1182j05711K820
4140C802754k08006N5549l8351j01319j61562M61294m26192j94905j93045N63761
4130C559978k78413J42547l54603K97531k60734L94700J56350J19979k08759j99716
4120C368860K98818q5386k11013K27689l31269L27535p54672J76628K92134j50530
4110C158794n69844J56981L78840j53663j21995m0414J51720n16265m55574M65901
$$ plain form
4180 4015665 4440799 4370185 3939076 3859708 3696241 4018049 3903614 4129394 3911244 3892530
4170 3892530 3545643 3934662 3896035 3949038 3484412 3368245 3271595 3631028 4089633 3546708
4160 3546708 3418854 3422449 3179139 3192232 3430949 3240707 2931160 3273035 3253473 3701579
4150 3701579 3573642 3794736 4131341 4048545 3856775 3998401 3814463 3905645 3799934 3802754
4140 3802754 3594748 3650297 3611946 3510627 3349065 3810359 3384167 3189262 2996217 3559978
4130 3559978 3281565 3424112 3069509 3367040 3106306 3501006 3657356 3777335 3568576 3368860
4120 3368860 3667678 3582292 3371279 3598968 3267699 3595234 2840562 3017190 3309324 3158794
4110 3158794 2588950 2745931 3124771 2971108 2849113 2808699 2960419 2444154 1988580 2454481
4100B454481L7253M02176n28447L41653J9252K28583q2842n19610k8876K74498
4090B598121J3717k30201M21464n62448N0590L03647J42280l31706k71972N06072
4080B639564R8259M8856n10684P3238k17089K91510N4869j44282l670r9208J59095
4069B390458J83070k90041j41139J04913J8766j73466J99131k78081J11208n664
4059B119155K61131l26989k4473L13310L16836k20487j9406m20386J04680r5094
4049B008277K27770j8335K8614l32213O16766q75481L43912M79113m53364m621
4039B020438J65650N9994Q5227l2070l11428m3844N9142j69047J80329K15453
4029B229844j39822J09364m2064j65696N5957J56197j89871M131K43014l39296
$$ plain form
4100 2454481 2491734 2893910 2365463 2707116 2726368 2954951 2872109 2352499 2323623 2598121
4090 2598121 2611838 2381637 2803101 2240653 2291243 2594890 2737170 2405464 2133492 2639564
4080 2639564 2737823 2786679 2275995 2349233 2132144 2423654 2478523 2334241 2330571 2231363 2390458
4069 2390458 2573528 2283487 2142348 2247261 2266027 2092561 2291692 2013611 2124819 2119155
4059 2119155 2380286 2053297 2028824 2342134 2658970 2438483 2419077 1998691 2103371 2008277
4049 2008277 2236047 2217712 2246326 1914113 2530879 1655398 1999310 2478423 2025059 2020438
4039 2020438 2186088 2246082 2331309 2299239 1987811 1943967 2003109 1834062 2014391 2229844
4029 2229844 2090022 2199386 2157322 1991626 2047583 2203780 2013909 2018040 2261054 1921758
4019A921758R1900K77084j53693r021r2863K66382k13197M30424k78624L9394
4009B279544o56119N41768p4481L55207j29691j82103L31517m3354k96497L9871
3999B165662n9992L15100l41268M83520k04545M49901m17929M48914k6287j48387
3989B664689j86928J41652K17002J15932m93543M36512m21755j03232n57590M66818
3979B279557N5893R3458M66055m35384k18021J35456j5065j82311j29778J93916
3969B243776n6576k34449K45485J70059L3032l88779N45960m12834l6000j10135
3959A999539K87332j80189o8120l20730L84987n6769Q6914K94007n62683M76476
3949B340764j35180k48749l49948Q1697j81301J17722J33358K14594j83200K60977
$$ plain form
4019 1921758 2013658 2290742 2137049 2128028 2035165 2301547 2088350 2518774 2240150 2279544
4009 2279544 1623425 2165193 2090712 2445919 2316228 2134125 2465642 2422288 2125791 2165662
3999 2165662 2105670 2420770 2079502 2563022 2358477 2808378 2390449 2839363 2813076 2664689
3989 2664689 2477761 2619413 2836415 2952347 2458804 2895316 2473561 2370329 1812739 2279557
3979 2279557 2335450 2428908 2894963 2459579 2241558 2377014 2361949 2179638 2049860 2243776
3969 2243776 2187200 1952751 2198236 2368295 2401327 2012548 2558508 2145674 2109674 1999539
3959 1999539 2286871 2106682 2038562 1717832 2102819 2046050 2132964 2426971 1864288 2340764
3949 2340764 2205584 1956835 1606887 1688584 1507283 1625005 1758363 1972957 1789757 2050734
3939B050734m51647O3113M5420M40455n73045K54334K02262J3636n40338L11075
3929A815999p8401j03130k37922R1598k4563P27243n95071j88854M45623P6775
3919A929297l0220q03051L58565j30077J23460p6997J92853L03454l60219K31274
3909A738339j5419n68719R4325M0606L14001l05921J07486l0383L16639l49915
3899A341039K3640j30799K11639L5118k6043J89711n01110j79559L14788l87170
3889H91254L18966j64517J91197J03992j00020k13823K42016p8193K41275R1312
3879A523459k76937j80345N43340l90504j31671P2530J99400j45855J93272j87576
3869A219113J9314j87224R6615J25733j02404K2027L27427k64074J88171l15479
$$ plain form
3939 2050734 1599087 1662200 1707620 2148075 1575030 1829364 2031626 2045262 1504924 1815999
3929 1815999 1737598 1634468 1396546 1488144 1463581 2190824 1595753 1406899 1852522 1929297
3919 1929297 1899077 1096026 1454591 1324514 1447974 1370977 1563830 1867284 1507065 1738339
3909 1738339 1722920 1154201 1248526 1289132 1603133 1297212 1404698 1374315 1690954 1341039
3899 1341039 1364679 1233880 1445519 1480637 1454594 1644305 1143195 963636 1278424 891254
3889 891254 1210220 1045703 1236900 1340892 1240872 1027049 1269065 1190872 1432147 1523459
3879 1523459 1246522 1066177 1609517 1219013 1087342 1159872 1359272 1213417 1406689 1219113
3869 1219113 1238427 1051203 1147818 1273551 1171147 1193174 1520601 1256527 1444698 1129219
3859A129219K8075L40551m45121p5748J80306r9902K89715k04232J23365J19400
3849A385628r5482n3636l16681K10439m04045M10822K28022k29263l69305L46172
3839A112671k89118L76391j62451Q3227J75662m09951P2749J33901M26004k41234
3829A277851L10893j61740j48719j25090l73290p4425J08499K85816J2781N41255
3819A653831m48007R8167k15657j21260l0434j05767q3778L80678m0220J02100
3809A189653M09010k13100k43573m75110M20889J02231Q91j82280L95930j72189
3799A232352J58578l56932l26882L96125j560k17868K13045l37916J66856P24500
3789A650298o28967J33829Q2740j50476O4864k50719l98224P21564m02384J20219
$$ plain form
3859 1129219 1157294 1497845 1052724 976976 1157282 1057380 1347095 1142863 1266228 1385628
3849 1385628 1290146 1236510 919829 1130268 726223 1137045 1365067 1135804 766499 1112671
3839 1112671 823553 1199944 1037493 1120720 1296382 886431 959180 1093081 1519085 1277851
3829 1277851 1588744 1427004 1278285 1153195 779905 705480 813979 1099795 1112576 1653831
3819 1653831 1205824 1303991 1088334 967074 936640 830873 747095 1127773 1087553 1189653
3809 1189653 1598663 1385563 1141990 666880 1087769 1190000 1190891 1008611 1404541 1232352
3799 1232352 1390930 1033998 707116 1103241 1101681 883813 1096858 758942 925798 1650298
3789 1650298 1021331 1155160 1237900 1087424 1152288 901569 503345 1224909 822525 942744
3779I42744J54499N626j95510L68943j22039J10188J07574l85017m17115N41251
3769A111144k30407J30745k72716L46775k09152k37951K05003L6327J15901l15775
3759F79894K09167Q4940R9521l24275K03863K62883l13825l90917N94289j17343
3749I88197l2745m12442M31830q351k8465R5765j6412K25301n70986L5850k53677
3738D53865K70077j7236K23776J06447M3811J49115o31738J4602N01157P4977
3728A188853j25489k61782k40432K90662J85313k33879j23069L99677l90465J97608
3718H86997K63355l29898J13815L48647o9707m70773L98879n80201J7546j28774
3708D49886M96848l16106M45687j38716Q4862j86113j14224L38056o4726L46940
$$ plain form
3779 942744 1097243 1102869 907359 1276302 1154263 1264451 1372025 987008 569893 1111144
3769 1111144 880737 1011482 738766 1085541 876389 638438 843441 879768 995669 679894
3759 679894 889061 974001 1073522 749247 953110 1215993 902168 511251 1105540 988197
3749 988197 955452 543010 974840 966489 938024 1033789 1017377 1242678 671692 707542 453865
3738 453865 723942 706706 930482 1036929 1080740 1229855 598117 612719 1113876 1188853
3728 1188853 1063364 801582 561150 851812 1037125 803246 680177 1079854 689389 886997
3718 886997 1150352 820454 934269 1282916 1213209 742436 1141315 561114 578660 449886
3708 449886 946734 630628 1076315 937599 1022461 836348 722124 1060180 995454 1342394
3698A342394m60052L14840j04620k77346K60334K7795J60645p03763K72951n411
3688H27767J36281k27434j72695j36267J53057M28098L3059J57013k32224j97108
3678G69547L79560k69416k4964j6540m98276N71989j99817k916Q4859P4105o1349
3667H06782j07928j17236K42943K29390j21445P5868j55043p2959n1125K84327
3657A013574j53160j22355N413J34694J28741L43272l44594m45723K64398l64441
3647D59819J15049Q6809M75955j93237M27644q99477R0326r9742L19659K45464
3637A028269j48849Q6987j22099J59568l69195m6678j87591N39634k09633n2896
3627F77517q7529J1979K58659j24436k45107O29711l46896L66310l70185k82478
$$ plain form
3698 1342394 882342 1197182 1092562 815216 1075550 1103345 1263990 560227 833178 827767
3688 827767 964048 736614 563919 427652 580709 1008807 1041866 1198879 966655 769547
3678 769547 1149107 879691 854727 838187 339911 911900 712083 709167 794026 868131 806782
3667 806782 698854 581618 824561 1053951 932506 1008374 853331 780372 729247 1013574
3657 1013574 860414 738059 743472 878166 1006907 1350179 1005585 559862 824260 459819
3647 459819 574868 661677 1137632 944395 1372039 472562 562888 463146 782805 1028269
3637 1028269 879420 966407 844308 1003876 634681 588003 400412 940046 730413 677517
3627 677517 589988 601967 860626 736190 491083 1120794 773898 1140208 770023 487545
3617D87545Q19616o74324J10849j79031j50931J57832K09087k22623K05261L20398
3607A083679n20905m3852q1992L8471R5251l03666M74336q3639k50479L8338K84102
3596G29644K6873j97625L23844P9241J35862m58017J72728m42545K57641J71697
3586G99343M27247r1117j45141L05686n20353K04107j14187j45556N8087K28370
3576A006486k07562J91972k52363J36154m41703J32223j21889M85926L89684l15556
3566A003372P4343q7052j18561L26792m79247l73705R49535k91874Q7849j73091
3556I18361r9975l83787K32894p983j7909M7421L44879m96972J97590j72547J02330
3545F64302l60885P39067k97880J84088l03793J39698m41565K96967K36595p19634
$$ plain form
3617 487545 1307161 632837 743686 564655 413724 571556 780643 558020 763281 1083679
3607 1083679 562774 518922 436930 475401 570652 266986 741322 657683 407204 445542 729644
3596 729644 756517 558892 882736 961977 1097839 639822 812550 370005 627646 799343
3586 799343 1226590 1135473 990332 1296018 775665 979772 865585 720029 778116 1006486
3576 1006486 798924 990896 738533 874687 432984 565207 443318 929244 1318928 1003372
3566 1003372 1077715 990663 872102 1198894 719647 345942 1295477 1003603 1091452 918361
3556 918361 818386 434599 667493 659510 641601 689022 1033901 536929 734519 561972 664302
3545 664302 303417 1042484 744604 928692 624899 764597 323032 619999 856594 136960
3535A36960K86362r560L10857N53584n22405j16750J6410m56668K33569M32335
3525H64694j40482L44972j09993r602k34006L8219j85051j38158K17800j91419
3515D56974j2381K91809L65466k22307j53167j44946o1686R9485P2734K93024
3505I85005l12761K16193J506j06148O8355k40716l34798J96309O06592j22561
3495I56976k27433N19149n38705L20287j11855l74566M11931j90286j90610L12177
3485H87065j31773k3829m48293M05270Q1495P28j70665L80362j93580k58631n40145
3474a1996M82521J68696k16376r2635O10839K6944l88890k1786K7174L2418l07688
3463C09221K55487j9416M55197l60039R2919L57m63672N53232l618j48581o8854
$$ plain form
3535 136960 423322 413762 724619 1278203 755798 639048 655458 198790 432359 864694
3525 864694 724212 1069184 959191 949589 715583 753802 568751 430593 648393 456974
3515 456974 444593 736402 1101868 879561 726394 581448 519762 619247 691981 985005
3505 985005 672244 888437 889943 783795 852150 611434 276636 472945 1079537 956976
3495 956976 729543 1248692 709987 1030274 918419 543853 955784 765498 574888 887065
3485 887065 755292 731463 283170 688440 769935 770663 599998 980360 786780 528149 -11996
3474 -11996 470525 639221 422845 330210 941049 967993 579103 557317 584491 616909 309221
3463 309221 564708 545292 1000489 640450 733369 733726 270054 823286 819668 671087 602233
3452F02233L08292J37888k68682K6136K29171m60844k71771J77223N52090k72076
3442G59660k8925j72192j96279L92736j68680j85531K98955K54657J2491R163
3432I76055o14006L61229j5970K06021k09504j93496L74413o9609P4216l43813
3422E45536J10799j18956K8251K84624l17559J60654o859j34911J45637j37437
3412E59779L4199l28958M77750K80567l51187K02131k80641J19675l95326P8547
3402C96536m63746O36933l29996J77406L38042l51467j11254J89343k76751N8869
3392B63915o3503J93641o2988J91880k72386j5380M45530j18926m19817M07155
3382E49121k78287Q0844J28736Q7352k48851K61293J29290P8117q794l4829n1352
$$ plain form
3452 602233 910525 1048413 779731 805867 1035038 574194 302423 479646 1031736 759660
3442 759660 730735 558543 362264 755000 586320 400789 699744 954401 966892 976055
3432 976055 362049 723278 707308 913329 703825 510329 884742 815133 889349 545536
3422 545536 656335 537379 565630 850254 532695 693349 686490 551579 697216 559779
3412 559779 593978 265020 742770 1023337 672150 874281 593640 713315 317989 396536
3402 396536 -67210 569723 239727 417133 755175 403708 292454 481797 205046 263915
3392 263915 200412 394053 331065 522945 250559 235179 680709 561783 141966 549121
3382 549121 270834 351678 480414 567766 318915 580208 709498 787615 778821 743992 692640
3371F92640L52531m09965k43488J03521l1726J61487R8867J72203l85712j8948
3361D91410L03844k70016Q5580n37291P07636l00694m59688P75622m58658L11792
3351F49537k8590J0714P0625j92207M45887l4899n27653k33823J40944N7093k48502
3340A09126M33107n2172K66793L1932P9455m9778r1930n34891K60582j83768K20822
3329D89278j88678L49177J28751j09058m37107M48449N1868J3808q7487L0031
3319F89032l21173M33732J4998J46059n04753K04903O8441L0451m57390M27755
3309G32055m45981N83737l21714J9544K41764L9887n6591m20818J69683J95834
3299G37400k3085k64552J16546k49042J61704K24064o9571K31244k33420m3640
$$ plain form
3371 692640 1045171 635206 391718 495239 463513 625000 723867 896070 510358 491410
3361 491410 795254 525238 610818 73527 781163 480469 20781 796403 337745 649537
3351 649537 620947 631661 702286 510079 955966 921067 393414 159591 300535 357628 109126
3340 109126 542233 490061 756854 788786 868241 818463 726533 191642 452224 268456 489278
3329 489278 300600 649777 778528 669470 232363 680812 732680 746488 659001 689032
3319 689032 367859 801591 816589 962648 457895 662798 731239 761690 304300 732055
3309 732055 286074 869811 548097 567641 809405 849292 792701 371883 541566 737400
3299 737400 714315 449763 566309 317267 478971 703035 633464 864708 631288 587648
3289E87648l19180J98256p79J11397J28226j877J09554j38813j41972j1861k61864
3278B58735j3636L80788r3834K44892n48581L45345l79097J26192m8877k11892
3268F0035K65768M5670j02386L15638n6039k78424K44501o2389L66601J14615
3258I13590k94618l61255K56184l37557L74474J73798k09108n8290k44011j80924
3248C2283M86506j47462J84601j30741K82396n24106M69917K93934m92819N99213
3238A053722p58058K54102j51693K29213M0233N0677m2067p8642k01548N53219
3228I49158l90298k71006j85870N60761l66813L18528Q2503m33418P44851n45404
3218D62992J49906O3771j26198J14283J09631m53288O5839J73510j79073L15254
$$ plain form
3289 587648 268468 466724 465945 577342 705568 703691 813245 674432 532460 520599 258735
3278 258735 245099 625887 532053 776945 228364 573709 194612 320804 271927 60035
3268 60035 325803 371473 269087 584725 528686 250262 494763 432374 798975 913590
3258 913590 618972 257717 513901 176344 550818 724616 515508 457218 213207 32283
3248 32283 518789 371327 555928 425187 707583 183477 653394 947328 454509 1053722
3238 1053722 295664 549766 398073 627286 667519 718196 676129 597487 395939 949158
3228 949158 558860 287854 101984 662745 295932 614460 696963 263545 1008396 462992
3218 462992 612898 676669 550471 664754 774385 321097 386936 560446 381373 696627
3208F96627j55045J95248k56727j43403N0343K83802J26348j01003J21165l47319
3198D70036J44112k55126j79424M78926o8469M017L36304j31801K58721o67735
3188C89561j86803o9147K75635J41107k77734K00088j4907J11534J05102k12771
3178D61665l83658N72920n61436K49015j0085M27673P5823j02434q0256j01730
$$ plain form
3208 696627 541582 736830 480103 336700 387043 670845 797193 696190 817355 470036
3198 470036 614148 359022 179598 658524 590055 594072 930376 798575 1057296 389561
3188 389561 202758 133611 409246 550353 272619 472707 457800 569334 674436 461665
3178 461665 78007 650927 89491 338506 328421 756094 831917 729483 649227 547497
$$ [...]
##END NTUPLES=NMR SPECTRUM
##END=
