##TITLE=abcd
##JCAMPDX= 6.0         $$ Bruker NMR JCAMP-DX V2.0
##DATA TYPE= NMR SPECTRUM
##DATA CLASS= NTUPLES
##ORIGIN= UXNMR, Bruker Analytische Messtechnik GmbH
##OWNER= root
$$ XWIN-NMR		Version 3.5
$$ Wed Jul 29 16:29:48 2026 Russian Standard Time (UT+4h)  servis@DPX200
##.OBSERVE FREQUENCY= 200.131235884673
##.OBSERVE NUCLEUS= ^1H
##.ACQUISITION MODE= SIMULTANEOUS
##.ACQUISITION SCHEME= undefined
##.AVERAGES= 32
##.DIGITISER RES= 18
##SPECTROMETER/DATA SYSTEM= spect
##.PULSE SEQUENCE= zg
##.SOLVENT NAME= D2O
##.SHIFT REFERENCE= (INTERNAL, D2O, 0, 16.4885)
##AUDIT TRAIL= $$ (NUMBER, WHEN, WHO, WHERE, WHAT)
$$ ##TITLE= Audit trail, XWIN-NMR		Version 3.5
$$ ##JCAMPDX= 5.01
$$ ##ORIGIN= Bruker BioSpin GmbH
$$ ##OWNER= servis
$$ F:\spectra/data/av/nmr/H1/1/pdata/1/auditp.txt
$$ ##AUDIT TRAIL=  $$ (NUMBER, WHEN, WHO, WHERE, WHAT)
(   1,<2026-07-29 16:28:32.32 +0400>,<servis>,<DPX200>,
      <created by zg, POWCHK disabled, PULCHK disabled
       configuration hash MD5:
       00 E9 B6 7A A2 85 ED C7 34 08 36 98 17 FE 4E 26
       data hash MD5: 32K
       F8 CE CF 6E A0 2F 17 C5 08 C5 9E 7E 48 92 0A 7F>)
(   2,<2026-07-29 16:29:13.04 +0400>,<servis>,<DPX200>,
      <Start of raw data processing
       efp BC_mod = 2 LB = 0.05 FT_mod = 6 PKNL = 1 PHC0 = -415.5518 PHC1 = 3.101563 SI = 16K 
       data hash MD5: 16K
       0E 85 17 1A 24 70 EF DF 5B 94 A3 6A 7B 0B 08 06>)
(   3,<2026-07-29 16:29:26.06 +0400>,<servis>,<DPX200>,
      <pk PHC0 = -3.8 PHC1 = 0 
       data hash MD5: 16K
       4C 18 32 91 8A BE 12 C6 B3 A6 9B 4B 6E 55 E6 81>)
$$ ##END=
$$ 
$$ hash MD5
$$ A9 79 F7 23 67 83 5C DA 80 97 D8 EC 0B BA 25 1D
##$RELAX= 
##$RELAX= 
##$RELAX= 
##$RELAX= 
##$RELAX= 
##$RELAX= 
##$RELAX= 
##$RELAX= 
$$ Bruker specific parameters
$$ --------------------------
##$DU= <F:\spectra>
##$EXPNO= 1
##$NAME= <H1>
##$PROCNO= 1
##$TYPE= <nmr>
##$USER= <av>
##$AMP= (0..31)
100 100 100 100 100 100 100 100 100 100 100 100 100 100 100 100 100 100 
100 100 100 100 100 100 100 100 100 100 100 100 100 100 
##$AQSEQ= 0
##$AQ_mod= 1
##$AUNM= <au_zg>
##$AUTOPOS= <>
##$BF1= 200.13
##$BF2= 200.13
##$BF3= 200.13
##$BF4= 200.13
##$BF5= 500.13
##$BF6= 500.13
##$BF7= 500.13
##$BF8= 500.13
##$BYTORDA= 1
##$CFDGTYP= 0
##$CFRGTYP= 5
##$CHEMSTR= <none>
##$CNST= (0..31)
1 1 145 1 1 1 1 1 1 1 1 1 1 1 1 1 1 1 1 1 1 1 1 1 1 1 1 1 1 1 1 1 
##$CPDPRG= <>
##$CPDPRG1= <>
##$CPDPRG2= <>
##$CPDPRG3= <>
##$CPDPRG4= <mlev>
##$CPDPRG5= <mlev>
##$CPDPRG6= <mlev>
##$CPDPRG7= <mlev>
##$CPDPRG8= <mlev>
##$CPDPRGB= <>
##$CPDPRGT= <>
##$D= (0..31)
0 2 0 0 0 0 0 0 0 0.06 0 0 0 0 0 0 0.0002 0 0 0 0 0 0 0 0 0 0 0 0 0 0 
0 
##$DATE= 1785328111
##$DBL= (0..7)
120 120 120 120 120 120 120 120 
##$DBP= (0..7)
150 150 150 150 150 150 150 150 
##$DBP07= 0
##$DBPNAM0= <>
##$DBPNAM1= <>
##$DBPNAM2= <>
##$DBPNAM3= <>
##$DBPNAM4= <>
##$DBPNAM5= <>
##$DBPNAM6= <>
##$DBPNAM7= <>
##$DBPOAL= (0..7)
0.5 0.5 0.5 0.5 0.5 0.5 0.5 0.5 
##$DBPOFFS= (0..7)
0 0 0 0 0 0 0 0 
##$DE= 6
##$DECBNUC= <off>
##$DECIM= 32
$$ [...]
##$SUBNAM4= <"">
##$SUBNAM5= <"">
##$SUBNAM6= <"">
##$SUBNAM7= <"">
##$SUBNAM8= <"">
##$SUBNAM9= <"">
##$SW= 20.6817932712277
##$SWIBOX= (0..15)
0 0 3 0 0 0 0 0 0 0 0 0 0 0 0 0 
##$SW_h= 4139.07284768212
##$TD= 32768
##$TD0= 1
##$TE= 0
##$TE2= 300
##$TE3= 300
##$TEG= 300
##$TL= (0..7)
0 120 120 120 120 120 120 120 
##$TP= (0..7)
150 150 150 150 150 150 150 150 
##$TP07= 0
##$TPNAME0= <>
##$TPNAME1= <>
##$TPNAME2= <>
##$TPNAME3= <>
##$TPNAME4= <>
##$TPNAME5= <>
##$TPNAME6= <>
##$TPNAME7= <>
##$TPOAL= (0..7)
0.5 0.5 0.5 0.5 0.5 0.5 0.5 0.5 
##$TPOFFS= (0..7)
0 0 0 0 0 0 0 0 
##$TUNHIN= 0
##$TUNHOUT= 0
##$TUNXOUT= 0
##$USERA1= <user>
##$USERA2= <user>
##$USERA3= <user>
##$USERA4= <user>
##$USERA5= <user>
##$V9= 5
##$VALIST= <valist>
##$VCLIST= <CCCCCCCCCCCCCCC>
##$VD= 0
##$VDLIST= <DDDDDDDDDDDDDDD>
##$VPLIST= <PPPPPPPPPPPPPPP>
##$VTLIST= <TTTTTTTTTTTTTTT>
##$WBST= 1024
##$WBSW= 30
##$XGAIN= (0..3)
0 0 0 0 
##$XL= 0
##$YL= 0
##$YMAX_a= 1413165
##$YMIN_a= -2038525
##$ZGOPTNS= <>
##$ZL1= 120
##$ZL2= 120
##$ZL3= 120
##$ZL4= 120
##$ABSF1= 0
##$ABSF2= 0
##$ABSG= 0
##$ABSL= 0
##$ALPHA= 0
##$AQORDER= 0
##$ASSFAC= 0
##$ASSFACI= 0
##$ASSFACX= 0
##$ASSWID= 0
##$AUNMP= <proc_1d>
##$AZFE= 0.1
##$AZFW= 0.1
##$BCFW= 0
##$BC_mod= 2
##$BYTORDP= 0
##$COROFFS= 0
##$CY= 18.4799938201904
##$DATMOD= 1
##$DC= 0
##$DFILT= <>
##$DTYPP= 0
##$F1P= 9.9274215381318
##$F2P= -0.165520771350173
##$FCOR= 1
##$FTSIZE= 16384
##$FT_mod= 6
##$GAMMA= 0
##$GB= 0
##$INTBC= 1
##$INTSCL= 4.127829e-11
##$ISEN= 128
##$LB= 0.05
##$LEV0= 0
##$LPBIN= 0
##$MAXI= 10000
##$MC2= 0
##$MEAN= 0
##$ME_mod= 0
##$MI= 50
##$NCOEF= 0
##$NC_proc= -3
##$NLEV= 6
##$NOISF1= 3.799351
##$NOISF2= 2.8
##$NSP= 0
##$NTH_PI= 0
##$NZP= 0
##$OFFSET= 16.48848
##$PC= 4
##$PHC0= -419.3518
##$PHC1= 3.101563
##$PH_mod= 1
##$PKNL= yes
##$PPARMOD= 0
##$PSCAL= 4
##$PSIGN= 0
##$REVERSE= no
##$SF= 200.130005582386
##$SI= 16384
##$SIGF1= 3
##$SIGF2= 2
##$SINO= 400
##$SIOLD= 16384
##$SREGLST= <1H.CDCl3>
##$SSB= 0
##$STSI= 16384
##$STSR= 0
##$SW_p= 4139.07284768211
##$SYMM= 0
##$S_DEV= 0
##$TDeff= 32768
##$TDoff= 0
##$TI= <>
##$TILT= no
##$TM1= 0
##$TM2= 0
##$TOPLEV= 0
##$USERP1= <user>
##$USERP2= <user>
##$USERP3= <user>
##$USERP4= <user>
##$USERP5= <user>
##$WDW= 1
##$XDIM= 16384
##$YMAX_p= 365771274
##$YMIN_p= -310200
$$ End of Bruker specific parameters
$$ ---------------------------------
##NTUPLES= NMR SPECTRUM
##VAR_NAME=  FREQUENCY,     SPECTRUM/REAL,   SPECTRUM/IMAG
##SYMBOL=    X,             R,               I
##VAR_TYPE=  INDEPENDENT,   DEPENDENT,       DEPENDENT
##VAR_FORM=  AFFN,          ASDF,            ASDF
##VAR_DIM=   16384,         16384,           16384
##UNITS=     HZ,            ARBITRARY UNITS, ARBITRARY UNITS
##FACTOR=    0.252644378177508, 1,           1
##FIRST=     3299.83951724647, 0,            0
##LAST=      -839.233330435636, 0,           0
##MIN=       -839.233330435636, -310200,     0
##MAX=       3299.83951724647, 365771274,    0
$$ Real data points
##PAGE= N=1
##DATA TABLE= (X++(R..R)), XYDATA
$$ [...]
10516h0883J0854Q58k1269k4385J8090k1190L4371M511l2336P826j3061J7405
10504i9209n880N864j1376K2518k8843J9510o475L939o068n374M636j020j5268
10491a23046K3304p22j1455N603O174R094k0064k0224J6558j205K2117m3053M2508
10478i4411k9922M2262m0973L0311j0103J0686k0308J4531j9987K556J5294m719
10466a04783M339l2808K4786P093k7124M1042k2228J411J388l853O875o993J9941
10453i0914q595r865M961k423j0018K1476j4345J531O594k1596O224P849P50k0876
10439a29247L9546j3568j1293O03K030K6314k3912M5610n3935q419J4292m190
10427a16169j299J9303j783k4199R52Q423J4585q056N56o721j4276K1154j0999
$$ y = [-80883, -70029, -69171, -90440, -114825, -96735, -117925, -83554, -79043, -111379, -103553, -116614, -99209, -105089, -99225, -110601, -88083, -116926, -97416, -103891, -99952, -106020, -111394, -106758, -107778, -123046, -99742, -100464, -111919, -106316, -100142, -91048, -111112, -131336, -114778, -115983, -93866, -136919, -94411, -124333, -82071, -123044, -92733, -102836, -92150, -112458, -97927, -117914, -115358, -100064, -104783, -100444, -133252, -108466, -101373, -128497, -87455, -109683, -108272, -106884, -110737, -103862, -110855, -90914, -99509, -109374, -104413, -106836, -116854, -95378, -109723, -108192, -101598, -123194, -116970, -109121, -108371, -129247, -89701, -103269, -114562, -113959, -111929, -85615, -109527, -63917, -117852, -126271, -111979, -116169, -117468, -98165, -99948, -124147, -123195, -114772, -100187, -108243, -107687, -114408, -128684, -107530, -118529]
10414a18529L4481j7779L361J2576j6401j2602p929Q198J1968O964j1226L787
10402a03131r87n386o724J4195K3599l8684L4923l5140n202O363J6229n466P620
10389i7791l2159k0304J7973L6918j4320J5626j2155p591j4829K7947N364P164
10377h8157l6574L8111k8646P147p383K1435l380K9562l3644k5333j650M0139
10365h8373j4364J4686Q112m6051K2912P146p245m035L4396j2384j4285J795l479
10352a01169l2619L9427q340m70K048l929j8171L0041l432k9176K6049k8263K2865
10339a05139k4663L0851J486J9396l3677J6914j6317Q014J3271j9235K3461J6448
10327f9190m1827K650j159K4502J3612k8924J6945l597k3116Q400m435P927j5157
$$ y = [-118529, -84048, -101827, -98466, -85890, -102291, -114893, -122822, -114624, -102656, -95692, -106918, -103131, -104118, -109504, -116228, -102033, -78434, -117118, -82195, -117335, -122537, -116174, -99945, -105411, -97791, -129950, -150254, -132281, -95363, -109683, -94057, -106212, -113803, -128632, -100685, -95321, -88157, -124731, -86620, -115266, -108119, -115502, -94067, -97447, -67885, -101529, -126862, -128512, -88373, -102737, -88051, -79939, -125990, -103078, -95932, -103177, -107212, -72816, -85200, -99485, -97690, -101169, -133788, -94361, -102701, -103171, -101123, -105052, -123223, -93182, -96614, -125790, -99741, -128004, -105139, -129802, -98951, -97465, -78069, -111746, -94832, -111149, -103135, -89864, -109099, -85638, -69190, -111017, -108367, -109526, -85024, -71412, -100336, -83391, -86988, -110104, -101704, -106139, -98212, -113369]
10314a13369M0459k5724j8685J5510L4032k6401M628j2711k985K5016k5333O050
10302i9513r894L5701j8368l123j3407J7873k2604J8744l468p443K0597J0208
10290g4697k1202J897N729r703j2107J1486P401j8910Q171O122k644K3146k3132
10277i8443K7237j0223k6862J0804Q984k2139J7763J0851p671l106O944L198j406
10264h4069K31J5133l3239J1053M001K338k6959l23Q693K2265j3617N534K704
10251h6255n73j1749q968k1110L7738K264L2850k6214l458n578j5684J112K8074
10238g7551j484j6324j0663J6297L224M343j4935J2480j990m489r743J0277M387
10225h6171N423j0706J493Q50j2029M326M079K3348n857l6238J8316J8061k3263
$$ y = [-113369, -72910, -98634, -117319, -101809, -67777, -94178, -89550, -102261, -105246, -80230, -105563, -99513, -109407, -73706, -92074, -95197, -108604, -90731, -113335, -94591, -98059, -105502, -84905, -74697, -95899, -94002, -88273, -97976, -110083, -98597, -91196, -110106, -101935, -95813, -98457, -75311, -98443, -71206, -81429, -108291, -97487, -88503, -110642, -92879, -82028, -89699, -92805, -85861, -82663, -84069, -83838, -68705, -101944, -90891, -86890, -84552, -111511, -111834, -103141, -80876, -94493, -88959, -86255, -86828, -98577, -107545, -128655, -90917, -88653, -55803, -82017, -85475, -91053, -106737, -105625, -77551, -79035, -95359, -106022, -89725, -86501, -82158, -97093, -84613, -86603, -91092, -100835, -90558, -86171, -80748, -91454, -89961, -89111, -101140, -96814, -92735, -69387, -75244, -111482, -93166, -75105, -98368]
10212i8368K3212P761j4134q441j883l462L1513k9146L8162j4879j289m667K3623
10199e1998m392j2442J0816l517q345Q925K917K9133n692j180k5811P852K2933
10186c0801r007r107j3539K550L2640l5953r254L1707k124j0794j6947J6686L266
10173e0677n159J479J6738j9045k807J0278O768Q938Q865j855l0463R452l0065
10160g7553L7074j1431q548J5951J079n142k3545K0655K0529j0743K133k2525
10148f2066m066K2256k4928J2034J4106k1390K1862m027j5895k058N637R927J2021
10135c6587o617j948J1961j2846j6235M9365k6512j274k201J7248j4740j079r180
10122e0645K3640j5435J8100M590J4263l7225j7555M1045l0229J1905J3210j719
$$ y = [-98368, -75156, -67395, -81529, -89970, -91853, -95315, -63802, -92948, -54786, -69665, -70954, -75621, -51998, -56390, -68832, -58016, -61533, -69878, -60953, -58036, -28903, -34595, -35775, -61586, -53734, -30801, -39808, -48915, -62454, -59904, -27264, -63217, -72471, -40764, -42888, -53682, -70629, -53943, -50677, -55836, -54357, -37619, -56664, -59471, -49193, -42425, -33487, -24622, -26477, -56940, -47488, -77553, -40479, -51910, -60458, -44507, -43428, -48570, -72115, -51460, -30931, -41674, -39541, -62066, -66132, -43876, -68804, -56770, -42664, -64054, -42192, -46219, -62114, -64172, -58535, -48608, -36587, -43204, -45152, -33191, -46037, -62272, -12907, -39419, -40693, -42894, -25646, -40386, -41465, -50645, -27005, -42440, -24340, -19750, -5487, -42712, -60267, -19222, -49451, -37546, -24336, -26055]
10110b6055j1171m138Q586j5676l95P314Q816J4985l550J1966J108k5271j1865
10097d5346j6632L0352p96j1935K2742J2128J3883l475K926J2993K2782M643r827
10084C4438J8423R268k6462M8436k021J7583k4481p126L8188k2621M4371k9915
10072I8081P802J1959r493J9155j3010N4066j570l064j6987J1748m1326J9668
10060A37029J5207l476k8251K392l4806O040k1662M742K721k2262k7215j6394
10048A4065k0146Q665p295R286j4986j3162j8151J6808j5690k173L441o837o566
10035e2741L765J4329o156k5362J3836j7732J1068M761j9869j61K4363j8905K0360
10022d8444j5410O465j1806p38J4108J4750j5533j8117J3583k616o464R843L4896
$$ y = [-26055, -37226, -41364, -32778, -48454, -48849, -41535, -32719, -17734, -21284, -9318, -8210, -33481, -45346, -61978, -31626, -32422, -44357, -21615, -9487, 4396, 921, 3847, 16840, 39622, 44265, 34438, 52861, 62129, 35667, 84103, 82082, 99665, 75184, 68058, 106246, 83625, 127996, 98081, 105883, 117842, 108349, 127504, 114494, 168560, 166990, 163926, 146939, 158687, 117361, 137029, 152236, 148760, 120509, 122901, 88095, 94135, 72473, 77215, 79936, 57674, 30459, 14065, -6081, 2584, -4711, 4575, -10411, -23573, -41724, -24916, -40606, -42779, -39338, -46175, -52741, -48976, -34647, -40803, -66165, -52329, -70061, -58993, -54232, -74101, -74262, -49899, -68804, -48444, -63854, -57389, -69195, -69933, -55825, -41075, -56608, -74725, -61142, -63758, -70222, -60379, -25483]
10009b5483l4703P913J5315k5673P979J5814j7905q255L898J9468l1178J941K3497
9996d7372k2434k3925O7090l762l5455P228N282P010j2245r478K492r224P427
9983f7366p863R72K0151k9154J5821J3556l0304L0726j8421n486J8171J1772k0851
9970f8276o9J9633Q71l9524J795K8257R365j2811K7610j0404M73k5968R178J2441
9956d7429M686n424J1316N474j0737J9652k3445p425K2164j6172j7052N079J6795
9943d2518m57J3156k7834m802k0940J4897K6430l1042M3789j7575l087k9825J0866
9930f8942K5044r137L7100k5943J8254l0742k1704K6779J1590n552J9210m5381
9918f9424J8938O324L2510j5178l1695j5054K3361J56p35K1569o771m350l677
$$ y = [-25483, -60186, -52273, -36958, -62631, -54652, -38838, -56743, -64998, -61100, -41632, -72810, -70869, -47372, -69806, -93731, -26641, -30403, -65858, -58630, -53348, -46338, -58583, -68061, -65569, -74793, -67366, -75229, -74257, -54106, -83260, -67439, -53883, -84187, -53461, -71882, -77368, -59197, -47425, -68276, -68345, -48712, -47841, -87365, -85570, -57313, -47948, -60759, -33149, -43553, -43080, -69048, -59870, -47429, -42743, -48167, -36851, -31377, -42114, -22462, -45907, -53332, -31168, -47340, -64392, -59313, -42518, -42975, -29819, -57653, -62455, -83395, -68498, -42068, -73110, -29321, -46896, -49983, -79808, -68942, -43898, -53035, -15935, -41878, -23624, -54366, -76070, -49291, -37701, -43253, -24043, -69424, -50486, -44162, -11652, -26830, -58525, -73579, -50218, -50062, -50797, -29228, -35999, -40349, -44026]
9905d4026O932r463M80K9180J674l4636K9385K334j2846n177K4125K3249J0359
9892B1570J1477k2204n112K7141p378L625j9961K8935k8952R949l3989J3904J61
9879h34o497j3919k6899K3242J776l2357L4662k3289n82j8060K1270k9612L6117
9866c4982l368kj0864k713M720J0104k2179K1255j0196l411K611k1954R797j4314
9852g5496L0846n184j3130J9286j5897q776M20k34L887L3894k5031J9252j6017
9839e2180J0099o28K632j0657L145J6490j6579J6708k1652J0313J1062n956j213
9826c8416r156K6292n126k0238n492K1207k0173J3251j168P993J0442n0030Q329
9813f2285M7521j119r003K8031j407k1150r547R779L108M718J936J8339l7127
$$ y = [-44026, -37094, -46557, -46077, -16897, -15223, -49859, -20474, -18140, -30986, -36163, -12038, 11211, 21570, 33047, 10843, 5731, 32872, 25494, 29119, 9158, 38093, 9141, 19090, -14899, -995, -834, -7331, -21250, -48149, -24907, -23131, -55488, -20826, -44115, -44697, -62757, -41487, -71099, -34982, -38350, -38352, -49216, -51929, -47209, -37105, -59284, -38029, -48225, -51636, -49025, -70979, -61182, -75496, -44650, -49834, -62964, -43678, -59575, -68351, -67931, -68165, -64278, -30384, -55415, -36163, -52180, -42081, -42709, -40077, -50734, -47589, -31099, -47678, -30970, -52622, -42309, -31247, -37203, -38416, -47572, -21280, -26406, -46644, -52136, -30929, -51102, -37851, -39019, -31026, -20584, -70614, -62285, -14764, -15883, -24886, 3145, 1738, -19412, -28959, -19180, -16072, -11354, -9418, 8921, -28206]
9800b8206p363K9155Q752K4354j1588K1250k0259p817J9771p261O434K0010J110
9787D8342k6057L8343K1278j3482m1813M5991j7141M11r288R444K895J3293l2483
9774C9733J9271K0308n601j4977p508j4044L0756k6581j2281K205Q31Q307J8564
9761E8983k8588J3164l0184M4106j4630R872P075j0887o671j2966L3805j5369
9749D7710k8886M1729k5533K1608q815j9355J1204m1565M2798j3154k3597p220
9737c076K1832l2669K4779k7151k815J8186j0274m590q739J5702j205l0923J4564
9724b6379k8513J6560m061L340M01j4940J3990k070K1827k197P231m0443R283
9711d5971Q134j288K1545k6550J5836j203k645l0599L0827j176k333J5425k93
$$ y = [-28206, -35569, -6414, 2338, 26692, 15104, 36354, 16095, 8278, 28049, 20788, 27222, 47232, 48342, 22285, 60628, 81906, 68424, 26611, 72602, 55461, 55872, 46584, 56028, 58923, 72216, 39733, 59004, 79312, 73711, 58734, 51226, 37182, 67938, 41357, 29076, 31281, 32112, 40419, 58983, 30395, 43559, 13375, 57481, 42851, 52723, 59798, 48911, 42240, 29274, 63079, 47710, 18824, 60553, 35020, 56628, 47813, 28458, 39662, -1903, 40895, 27741, 4144, -3076, 18756, -13913, 10866, -16285, -19100, -914, -11188, -15778, -24517, -8815, -10020, -40943, -26379, -54892, -38332, -42393, -39053, -38652, -53592, -39602, -41672, -19845, -22042, -14811, -55254, -45971, -37837, -39125, -17580, -44130, -28294, -29497, -32142, -62741, -31914, -33090, -35423, -19998, -20291]
9698b0291L938j4202M218j0885p818K2075O971N860p395p736K8999J2694k0051
9685c623j8939O3575n557R35J4544L512n995J6258J5802J8623j8172J3391R476
9672A03830l5554K6137J1004k8609l731j6045L3497l4342o519j6951j463n968
9660B5286k4265M281j9760p455K9935r85m2778j9326K8233P790P990j6404O943
9647b0515k4992p009K094J2038j3567m072o401Q885Q403j6627J2654p471k0627
9634g7207K8715r379k676n109m916J0522k4385J9748k7652L9979k1601J1289M367
9621e8305j1429j913O593j5512O557J8003j0177n771r413n6M9483k4776l4941
9608i1657k99P884j4113L1081q013R277p361J4213l082L51p087r267J5817j5841
$$ y = [-20291, -16353, -30555, -26337, -37222, -45040, -22965, -15994, -10134, -17529, -25265, 3734, 16428, -3623, -22562, 41013, 35456, 36391, 50935, 54447, 48452, 64710, 80512, 99135, 80963, 94354, 103830, 68276, 94413, 105417, 76808, 73077, 57032, 90529, 56187, 49668, 32717, 31254, 25286, 1021, 5302, -14458, -21913, 8022, 7037, -35741, -55067, -26834, -19044, -11054, -27458, -20515, -45507, -52516, -50422, -38384, -51951, -56023, -62424, -53539, -45136, -61763, -49109, -56580, -77207, -48492, -57871, -60547, -65656, -70572, -60050, -84435, -64687, -92339, -52360, -73961, -62672, -58305, -69734, -71647, -65054, -80566, -74009, -56006, -66183, -71954, -81367, -81423, -31940, -56716, -91657, -91956, -84072, -98185, -67104, -75117, -65840, -73201, -58988, -62070, -61719, -68806, -78073, -62256, -78097]
9594g8097R120J440k0157J7588N420P515j4998r307m373J7210j6118k87K682L9827
9580d2535l2202J2318q108K0114k2085J6242J3650r226q689J6150J481k2620K7376
9567c8134k8200J635J775K0998J7608j7697k4283O121j766p527K6022j6178K1872
9554c7754j9010Q773j4156J6452J017L88K91J8424j1148K423q916J2899p913q438
9540d6668J1415p391K5937l3562M385K2356j1192Q629n084o347J7814l7682K0623
9527c6767R125j7376K2394j3866K5923J243j3698J4908N73j2355L203r985J0918
9514a5760j0021j3525o030L578j0376K4070P301M514J3171j0323j2642j1547J6866
9501b0724J5443j2527M925j8064j4700J2198M388K0586j9487K172J9196m911j1007
$$ y = [-78097, -68977, -67537, -87694, -70106, -64686, -57171, -72169, -81476, -85849, -68639, -84757, -85044, -82362, -42535, -74737, -62419, -70527, -50413, -72498, -56256, -42606, -51832, -60521, -44371, -42890, -65510, -38134, -66334, -64699, -62924, -41926, -24318, -42015, -66298, -60177, -61943, -69470, -43448, -59626, -37754, -56764, -47991, -62147, -45695, -44678, -44290, -43999, -25575, -36723, -34300, -43216, -30317, -38230, -46668, -35253, -42644, -16707, -50269, -45884, -23528, -34720, -26091, -31175, -37522, -19708, -57390, -36767, -27642, -45018, -22624, -36490, -10567, -9324, -23022, -8114, -7541, -19896, -16693, -26678, -15760, -25781, -39306, -45336, -41758, -52134, -28064, -20763, -16249, -3078, -13401, -26043, -37590, -20724, -5281, -17808, -12883, -30947, -45647, -33449, -29061, -8475, -27962, -25790, -6594, -11505, -22512]
9488b2512j3950r933J0274Q618K5698j7437j2836O829P377r206O290l292R5q72
9474b4857o019O958J4144j4930j3795l37J4260N607k0749J4609M234P292j4848
9461b8431K0362J1197j7673k0332k305J5278q293O037L22K4659j075k4373K2747
9448a880j9771Q640R366J1713r363J7163j4188K6633J2640n664j1640J4747J2665
9435E1061L042K1097k6093N5813k6250j2899P967J1618l0338K8595Q937j20q327
9422H4103P357k202L7522k2222P632P158q786J113p495K2649l0867J1158l140
9409A03980J7871q199j218j048J6686M390j4648J439R092L463J1550j9398K0623
9396A44583j4763K696j1632j8737P713J0019n168K3533P216l027k2221J4571l3306
$$ y = [-22512, -36462, -46395, -36121, -27503, -1805, -19242, -32078, -25249, -17872, -27078, -20788, -24080, -23985, -24857, -30876, -23918, -9774, -24704, -38499, -38836, -24576, -18969, -39718, -25109, -20875, -13583, -28431, -8069, 3128, -14545, -34877, -37182, -21904, -30197, -24160, -23838, 821, -254, -24627, -1880, -21651, -13011, -3645, 8068, -1295, 15868, 1680, 28313, 40953, 35289, 23649, 38396, 51061, 54103, 75200, 49107, 104920, 78670, 65771, 73738, 85356, 55018, 83613, 92550, 92430, 84103, 91460, 89258, 126780, 104558, 112190, 119348, 110562, 111675, 104180, 126829, 95962, 107120, 103980, 121851, 113652, 112434, 111386, 128072, 132462, 117814, 119253, 128345, 131808, 143358, 123960, 144583, 129820, 132516, 120884, 102147, 109860, 119879, 114711, 138244, 145460, 142433, 120212, 134783, 101477]
9383A01477J3932J5550L3800j0177m3161R535K1791r089k8214L729J5337j9893
9371A04617K1731l4039k1967Q731J7232j1906J8191j0220j8559q497j5469Q042
9359E7887Q548p793j2231o914K7767m9892K8136k4162q470L6232J507j8887P058
9346C8786q470L106P908k6462K3940J1779n811J0607l5340q176N44p194K6683
9333C1900O477k130k8266L449L116q334M239r921k215J1561k800j1730J612L801
9319G59K3251J310k8294L573M95j4268J8424k2860M094K9771J593j5359K724j3076
9305g863j8542J6890Q919j6275n022J3313l601J9485q890J9613l3909M4974j9763
9292I329k351J0439j0832k7690J3340P978j2833J9778k2429j0257J342j993O668
$$ y = [101477, 115409, 130959, 164759, 154582, 111421, 120956, 142747, 133658, 105444, 109173, 124510, 104617, 126348, 92309, 70342, 79073, 96305, 84399, 102590, 92370, 73811, 65314, 49845, 57887, 66435, 58642, 46411, 39497, 67264, 17372, 45508, 21346, 12876, 49108, 50615, 31728, 38786, 30316, 33422, 41330, 14868, 38808, 50587, 44776, 55383, 20043, 11867, 12411, 5217, 31900, 38377, 36247, 7981, 11430, 14546, 6212, 10451, 530, -1685, 9876, 7076, -4654, -3042, 759, 24010, 25320, -2974, 599, 1094, -13174, 5250, -17610, -13516, 16255, 17848, 2489, 5213, -7863, -26405, -9515, -596, -16871, -21893, -8580, -12181, 7304, -1586, 18027, -15882, 29092, 9329, 6978, 17417, 6585, -21105, -7765, 213, -12620, 7158, -15271, -25528, -24186, -26179, -19511]
9279a9511j5935L4270m6430K4791R983j0685L884J4129O247n861p590m218K2431
9266E505M624k2135J1833j9842K4337l9202J7000p429P882j2975k950q371J2845
9253b8878J2021J7719j1962j9484P656J4348N277p751P036l5713L1001J3056k7095
9240b2769P192p448K3495Q552k0811K452o352L534J1120m531k1863L0163p678
9227d944L766j650M433J3457j5912J0741J4197k1906J2513j6423J6837p949p203
9214d3j1883L0917k489j5518j581L5852P304k3628q218J8759R246J4368k0147
9201C2939m140M636L0935k141L3M137J3233Q710j6591n171M231M5725l9094K8550
9187A05992l0055M813R34J4719R869P580K367j1469K1052k8906L2677j8734R919
$$ y = [-19511, -35446, -1176, -47606, -22815, -12832, -23517, -19633, -5504, 743, -5118, -12708, -16926, 5505, 10129, -12006, -173, -20015, 4322, -34880, -17880, -25309, -17427, -30402, -33352, -41723, -28878, -16857, 862, -11100, -30584, -22928, -8580, -3303, -11054, -4018, -39731, -8730, 4326, -22769, -15577, -23025, 470, 9022, -11789, -9337, -15689, -12155, -1035, -5566, -27429, 2734, -4944, -1178, -2828, 1605, 15062, -850, 9891, 24088, 2182, 14695, -1728, 15109, 7160, -43, -11926, 18991, 16502, 984, -597, 35255, 42559, 18931, 10713, 29472, 38718, 53086, 32939, 28799, 33435, 64370, 62229, 62262, 66399, 79632, 88342, 71751, 66580, 70811, 116536, 77442, 105992, 75937, 80750, 81684, 96403, 106272, 113852, 116219, 104750, 125802, 96896, 129573, 110839, 120758]
9174A20758R652r154J2579p619J5048j7566N804L8488k2757N093N874N83n766
9161A51017K7240J064P694k3075l0837K8666j2157k462K9226l4196M830m502J323
9148A43831j1471J9364j6915L856o257N0867K311m1781J9516j8929J0439q834
9136A45997j0648N5794j3359n743j2022k0316l878K5929m912j3101J4460r32j9393
9123A37876R34J9358k427l232o680K2515j2476N518j429k97j0476J9781m528n662
9109A58775J3802j5624o265P511j6331M795K8957q004K0396j1389m4065J5338
9097A47896K3555m7569O15L5896k683J7448l2817K300J4128l6101K8563j0394
9085A40837J2845K0534l6455p494K4756L849j1206q17q405N089j1100K8209j2618
$$ y = [120758, 130410, 121256, 133835, 126216, 141264, 123698, 129502, 167990, 145233, 150326, 156200, 156783, 151017, 178257, 179321, 187015, 163940, 133103, 161769, 149612, 147150, 176376, 142180, 147010, 142508, 143831, 132360, 151724, 134809, 138665, 132408, 183275, 185586, 143805, 163321, 144392, 154831, 145997, 135349, 191143, 177784, 172041, 160019, 139703, 135825, 161754, 156842, 143741, 158201, 157269, 137876, 138810, 158168, 155741, 152509, 145829, 168344, 155868, 161386, 159957, 159660, 149184, 168965, 164437, 158775, 172577, 156953, 150688, 158199, 141868, 146663, 175620, 167616, 188012, 176623, 132558, 147896, 171451, 123882, 124497, 160393, 157710, 175158, 142341, 144641, 158769, 122668, 151231, 140837, 153682, 174216, 137761, 130267, 155023, 158872, 147666, 146849, 138444, 143533, 132433, 160642, 148024]
9072A48024k3584K0066J4816k1325p316j1111K986J8324J624j8906O821k6352
9060A04067K1432K8625m6096K021j5149K0981j5696j3172j0480M975K0727j7176
9048H5059q439k5502J5348M523n762J2657R089l1431K869Q388l536K4528m4437
9035D3354q13J5416K04k3031n876j6016J5300q74l1651K1874p638L044L320J2155
9021B8768j0711M32k799M924L55o631J3955l3658J8607r151J3229p712j5563p113
9007a3068J980J1985J3057j7298l461P009j8475R898l207L284N186j2549r943
8994b5602L8523l0200J3268l77J0476q927K771p120j3114L367j3072J0965N327
8981a3715M6181n7310J4490J965j6397O560R172j1147p601L436L1888j0217j7124
$$ y = [148024, 124440, 144506, 159322, 137997, 130681, 119570, 122556, 140880, 142504, 123598, 130419, 104067, 125499, 154124, 108028, 110049, 94900, 115881, 100185, 87013, 76533, 81508, 102235, 85059, 76620, 51118, 66466, 70989, 65227, 77884, 86973, 55542, 58411, 66799, 63263, 87791, 43354, 42541, 57957, 58161, 35130, 29254, 13238, 28538, 27664, -3987, 17887, 10249, 13293, 16613, 28768, 18057, 18489, 15690, 20614, 20969, 14338, 28293, -5365, 13242, 4091, 17320, 9608, -5955, -13068, -11088, 897, 13954, -3344, -6805, 204, -18271, -8373, -11580, -8296, -3110, -15659, -25602, 12921, -17279, -4011, -4388, 6088, -2839, -68, -7188, -20302, -16935, -30007, -19042, -13715, 32466, -24844, -10354, -8389, -24786, -18226, -9054, -20201, -27802, -24366, 7522, -2695, -19819]
8968a9819Q523J3803n3457K9939J041j434J2728j0235J7786M820k7884o869K1688
8955i370j1356n749K1643l2245p760J657K1780k0365O365q767J2002j6195J8826
8942b9534J2309j0632r730j1746K3569j2956K299J1372k4413K7715l419p68J175
8929b4759j8008J0311J5162j2851M879j3974J5368k1854K4850k2123L3440n1293
8917f0852K1967j0403P890K9318k4392J6377k4539j365J3670J3714p345j0272
8905c6232j5501L0388j7682K564p654p808K4554k5413K0107j0753l227J28J509
8892d5020K5089j7648L47l0593J6039K0153l688J0308j7918j8401L1859o333K7926
8879g880j675k7252M364q831M393K4887j0077k079j0682P519j7737K6464K239
$$ y = [-19819, -11296, 2507, -50950, -21011, -19970, -21404, -8676, -18911, -1125, 3695, -24189, -31058, -9370, -20726, -26475, -4832, -37077, -44837, -43180, -21400, -41765, -35400, -44167, -32165, -48360, -29534, -17225, -27857, -37587, -49333, -25764, -38720, -36421, -25049, -49462, -21747, -25166, -25934, -24759, -42767, -32456, -17294, -30145, -25266, -39240, -23872, -45726, -20876, -42999, -9559, -60852, -38885, -49288, -41398, -12080, -36472, -20095, -44634, -45999, -32329, -18615, -25960, -36232, -51733, -21345, -39027, -36463, -44117, -51925, -27371, -52784, -32677, -43430, -46657, -46529, -45020, -19931, -37579, -37232, -67825, -51786, -31633, -35321, -25013, -42931, -61332, -29473, -35806, -7880, -9555, -36807, -32443, -41274, -36881, -11994, -22071, -24150, -34832, -27313, -45050, -18586, -16347]
8866a6347K740q027L1332k4976p779N538q190K3208l5382L2704j5278N073J4033
8853a351j511J755P56K4J3330p490j7327J2233J0819k7224j6401M192K1758L363
8839c074l8456L7347j1007K478j6082N121M2239k8961L4j3393k0891K5661j3384
8826c2368J1833k7620K1108J0040O620j5623J3908k0280J7877p463J0501k4018
8814c5485q804m302L1134k2012J3526P065j5539j0383J4301R49m053J2290o752
8801b8065P391L979J2334k803J0202m8277J3839M5573l2424N969J1997j6295J3993
8788b587r89j7437l9931M8474J421J5341k073p146l4799K9895j4825K3711k7042
8775b7987M0695k098k6390K8654o52k5825L2961k3766p269J5962M463k2986O976
$$ y = [-16347, -13607, -21634, 9698, -15278, -23057, -17519, -25709, -2501, -37883, -5179, -20457, -15384, -1351, -2862, -1107, -351, -327, 13003, 5513, -11814, 419, 11238, -15986, -32387, -28195, -6437, -3074, -41530, -4183, -15190, -12712, -28794, -23673, 18566, -10395, -10361, -23754, -44645, -18984, -32368, -20535, -48155, -27047, -17007, -10387, -26010, -12102, -32382, -14505, -21968, -11467, -35485, -44289, -48591, -17457, -39469, -25943, -18878, -34417, -44800, -30499, -29550, -33603, -21313, -28065, -20674, -16695, -4361, -7164, 3038, -45239, -31400, 14173, -18251, -12282, -285, -16580, -2587, -3576, -21013, -60944, -12470, -11049, 4292, 2219, -4927, -39726, -9831, -24656, -945, -27987, 12708, 10610, -15780, 12874, 12222, -13603, 19358, -4408, -11677, 4285, 8748, -14238, -7262]
8762g262r867j18N659r224J4879K970l0758m254J0171J15J478J74k715k710j2440
8747d3902k585J8658q825J5376m313J943p41k1462p107J6652r045K3741k3432
8734d5042p77j547J5621k0212n981M4464j7543N627k1137O488J2303j8981j674
8721d8391K9972j9982k9960M7565p489j5842n166K6677M234k7590m530J7348p625
8708d0779l1821N2047j813l1385N762L0449Q28j4209N753K030J2755k4285o089
8695d0757j4230K2240o326J4054r000J278j805k46j5636l323Q339L01J225m679
8681d8565K5920l968M652k4197J4918M3J2302j1132m148K8482q286k0600j4290
8668d8869R542K6552k380k0480j4095J5622J0871j4285m259j705J243L2013j5741
$$ y = [-7262, -17129, -17247, -11588, -20812, -5933, -2963, -33721, -37975, -27804, -27689, -26211, -26037, -28752, -31462, -43902, -46487, -27829, -36654, -21278, -25591, -23648, -24389, -45851, -52958, -36306, -45351, -21610, -45042, -45819, -47366, -31745, -51957, -57938, -13474, -31017, -25390, -46527, -40039, -27736, -46717, -48391, -18419, -38401, -68361, -20796, -28285, -44127, -49293, -22616, -18382, -45972, -50502, -33154, -40779, -72600, -20553, -22366, -53751, -47989, -17540, -16712, -30921, -25168, -23138, -10383, -34668, -40757, -54987, -32747, -39073, -25019, -34019, -32741, -34546, -34792, -50428, -53751, -45412, -45111, -43886, -48565, -22645, -26613, -21961, -46158, -31240, -31197, -18895, -30027, -34175, -5693, -13979, -34579, -48869, -39327, -12775, -15155, -35635, -49730, -34108, -23237, -37522, -41781, -43486, -42243, -10230, -25971]
8655b5971K7895m781l0070R357p202J0127j80m723m870q326J5839K0553j0748
8642a3100R077J585J3846k1893J4232p999R02p487j3037K1165k7076J3102k690
8629a9373r27J4296j3616J7601k0247j8755J0221j005J2154J0020j2501K2369
8617B37l652k2214J568j2412K1024j0947j9119M767J5548j4187L3926l5245j9672
8604f0378L1827J6965r965o651K0594l538j9776J0885k5884K1464N753J9017q587
8591h274j7277l361K4126r183N686j4565M045p110J2052q411M028J4469r423j3001
8577b6199J6582k7168Q430J4673j3120K9564q242O047k8855J8336q100M350k0593
8564c4295J2732M938O615r79n800R584l292J0006l0629K0794J1149l0914L0963
$$ y = [-25971, 1924, -2857, -32927, -23570, -30772, -20645, -20825, -25548, -30418, -38744, -22905, -2352, -13100, -4023, -2438, 11408, -10485, 3747, -4252, -3350, -10837, -23874, -2709, -29785, -16683, -19373, -20300, -6004, -19620, -2019, -22266, -41021, -30800, -31805, -19651, -9631, -22132, 237, -3415, -25629, -24061, -36473, -15449, -26396, -45515, -40748, -25200, -39387, -5461, -40706, -60378, -28551, -11586, -21551, -28202, -7608, -11146, -30922, -20037, -45921, -24457, -18704, 313, -8274, -25551, -28912, -4786, -13969, -8283, -22848, -18803, -25913, -13861, -22272, -18244, -3775, -13198, -26199, -9617, -36785, -28355, -13682, -26802, 2762, -5480, 567, -28288, -9952, -18052, -13702, -34295, -21563, -16625, -10010, -10989, -16789, -7205, -10497, -491, -31120, -10326, 823, -30091, 872]
8551H72M147p795j2296L3151l9960J522R380L8657j7112l510M4388l5452j8412
8538b420J4249J2037k228J3895k1053Q196l6016j34582J48393M631K1998j4198
8526A2902o578K0944m3818J1546L8693k1092O535j9022K9127j0433K2111n345
8514C5570k7k3529m895L933R34m834j6345K7589l2340K0226J2771k1371j791J5936
8500A1827l4838J3148J3295k2327M1145j5471j1581Q921j3908L6523m3807J4607
8488b466K292j2180K980J3781n299j1804K7776j6712m939J1961l0885L5656j8623
8475h462P600m234L379l3409K7651j8472J6644O092J5105p950L916j8223j3283
8462b3646j902L3400j9933k3148j044N0779j2508J2662j1444j3181O409j9003
$$ y = [872, 5019, -2776, -15072, 18079, -21881, -20359, -10979, 27678, 10566, 7056, 51444, 15992, -2420, 11829, 23866, 21638, 35533, 14480, 22676, -13340, -147922, 471, 5102, 27100, 12902, 6324, 27268, -16550, -5004, 33689, 12597, 19132, 110, 29237, 18804, 40915, 35570, 35543, 12014, 7119, 11052, 11986, 7152, -9193, 18396, -13944, 6282, 19053, -2318, -4109, 11827, -23011, -9863, 3432, -18895, 22250, 6779, -4802, 4119, -9789, 26734, -17073, -2466, -174, -12354, -9374, 4407, -892, -12696, 15080, -1632, -6571, 5390, -25495, 10161, -8462, -862, -5096, -1717, -35126, -7475, -25947, -9303, -3211, 11894, 3944, 7860, -10363, -23646, -25548, 7852, -12081, -35229, -36273, 14506, 1998, 14660, 3216, -9965, -3556, -22559]
8450b2559K9401K89j0280k2779K3922M935l912j6076J1962J390L0831l2203J126
8437c953N011n988J0953Q596l7733L5378q090r897J0279L1433j7592K4256m0764
8424A889J5572q106n302N392K8828J1540l2291J238q645J5086k960P395J3378
8411D3014l8415P069m925J8163m244j3644m42j2570J6650J321O437k6115K7174
8398A9473j2924J7336j6691R413j507m4649M1321o088j1893K5813j4178Q315k7839
8385a4098L6684k7967K5962j4481l654P637j799J9344l1041K255L350P426l129
8372F489r908j4164L6172j2701J2671l2836J9853O625m922j749N73o037Q535J715
8358A0316r22k4242L1203j6840J9868k3334N799O881J19J3091m200K3017l1096
$$ y = [-22559, 6842, 7131, -3149, -25928, -2006, 2929, -983, -17059, -5097, -3707, 27124, -5079, -3953, 1058, -4930, 6023, 14619, -23114, 12264, 4174, -5723, 4556, 35989, 18397, 42653, 1889, 17461, 9355, 4053, 9445, 38273, 49813, 17522, 18760, 10115, 25201, 22241, 29636, 43014, 4599, 11668, 6743, 24906, 20662, 7018, 6576, -5994, 10656, 11977, 18414, -7701, 19473, 6549, 23885, 7194, 16607, 15100, -29549, 11772, 5684, -6209, 19604, 5426, 13741, -14098, 22586, -5381, 20581, 6100, 2446, 10083, 8284, 27628, -3413, -1158, 2192, 9618, 6489, -3419, -17583, 18589, 5888, 18559, -14277, 5576, 12201, 7279, 5530, 6103, 66, 8601, 10316, 9394, -14848, 16355, -485, 19383, -3951, 1848, 8729, 8848, 21939, 17739, 40756, 9660]
8345I660O132o195J446k036m323l952L425n000J9666q430J3557k1984J3619r976
8331E609J404J9602k685j7506N293O665r414N054n749p341K1458j8910L102k814
8317C768L0496l1840j190r195O716J3865O183R36n069K0758p492j4849O474m925
8303A4636P874O975k6413K9282P04k6675M215J4902L651k0359K1299j5728Q706
8290B3069J3002j6926J3065n456j529q351K308J1480o124m320J2961k7927J8004
8277B3256K7162l9996L6936j0428M818m3753L9303m4982N8180k996j1560l818
8265C2122j8486J1432l680K209J5234J3840j6242j0464M088r368K3087j3378K346
8252C2740o967Pj0185K317n759J02O293J9984k0900k156J9120j0049k852M456
$$ y = [9660, 15792, 9597, 11043, 9007, 4684, 732, 4157, -843, 18823, 10393, 23950, 1966, 15585, 5609, 7013, 26615, 23930, 6424, 11717, 18382, 8968, 14022, 8273, 932, 22390, 3480, 6582, 3768, 34264, 2424, 1234, -7961, -1245, 12620, 18803, 19739, 14670, 35428, 27936, 13087, 19561, 14636, 22510, 29485, 3072, 32354, 33058, 6383, 10598, 25500, 29151, 8792, 30091, 14363, 23069, 36071, 19145, 32210, 26754, 25225, 16874, 19182, 30662, 24538, 20218, 33179, 5252, 23256, 50418, 10422, 47358, 36930, 41748, -2005, 37298, -7684, 50496, 47500, 35940, 32122, 13636, 25068, 21388, 23597, 38831, 52671, 36429, 25965, 30053, 20685, 43772, 30394, 32740, 25773, 25780, 15595, 17912, 12153, 12255, 18548, 38532, 17632, 15476, 34596, 24547, 21695, 26151]
8238B6151K603Q231q493q250L784M748R818l919j6775J213k853J7688K3571l8263
8224A9254p577O782n855K0486j8474K3354m401P397o011K3234l7777K9502n463
8211D4451l883k3035k5903L1933o56J9133j336j7285K7808l4178P53J3364J9993
8198E1159o7379P1026k4518l2440L1877j23961k15964L86685P204j6152j9359
8187D8178l8810N0409k9600Q564q972j2384M3315n0003R834J2085q900N035o018
8174B2733K2173j6954K7401k8428K5096j1372K0256k0038l8943M9033j8974M940
8162C6923N046K85q905L303j1931R898K5763k3727k5253J4773J9363j4276O667
8149C7929J1228m13J0821N73k6017O139n875Q995k8628j8877L5362n679O476R453
$$ y = [26151, 28754, 36985, 28492, 20242, 24026, 28774, 38592, 34673, 17898, 19111, 16258, 33946, 57517, 19254, 11677, 18459, 12604, 33090, 14616, 37970, 33569, 40966, 34955, 58189, 20412, 49914, 44451, 40568, 17533, -8370, 23563, 22907, 42040, 40704, 23419, 51227, 17049, 17802, 31166, 51159, -16220, 54806, 30288, -2152, 29725, -94236, -310200, 76485, 83689, 67537, 48178, 9368, 59777, 30177, 38741, 29769, 17385, 60700, 10697, 20531, 32616, 23716, 28751, 22733, 44906, 27952, 55353, 26925, 52021, 40649, 60905, 40867, 1924, 50957, 31983, 36923, 41969, 42254, 33349, 36652, 24721, 34619, 60382, 36655, 11402, 26175, 45538, 31262, 37929, 49157, 48744, 59565, 60138, 34121, 40260, 34385, 43380, 14752, -4125, 31237, 25558, 32034, 41487]
8135D1487j4478R532l731L700k8213K2845J1080k201K621r397Q688j9091K0222
8122D3064j6973j9242L0155k3002K1765k0943j413Q757R946j0047J4449j4920
8110B1596L119O920Q004j7430q361L6947J3184r028k1813j0744K9948j0554k3431
8097A8357J0423m339O636j634K1350k2253Q697j0195K444n037O657M1100k8441
8084D3765M005j206k0409J8090r069P532K901q615K904N05L865j6365K706K7848
8070E8457k7838J5051l609M07n125J077N673R019r546K2661k7972K7912l3175
8057C2992J7012O636k42j6357J5291j1854j7825L0543j4748j3959J5980j5815
8045B7654M4944l7653p168n616M494J3425K6556j8151j161r171J7158k3358J6648
$$ y = [41487, 27009, 36541, 32810, 36510, 8297, 31142, 42222, 40021, 42642, 33245, 41933, 22842, 43064, 26091, 6849, 37004, 14002, 35767, 14824, 13411, 22168, 32114, 22067, 36516, 21596, 24715, 31635, 39639, 22209, 13848, 50795, 63979, 54951, 33138, 22394, 52342, 41788, 18357, 28780, 24441, 31077, 29443, 50793, 28540, 37237, 27042, 29486, 24449, 31106, 72206, 43765, 47770, 46564, 26155, 44245, 35176, 42708, 45609, 36994, 39898, 40403, 44268, 27903, 30609, 58457, 30619, 45670, 42061, 42468, 37343, 38420, 44093, 53112, 43566, 66227, 38255, 66167, 32992, 50004, 56640, 56398, 40041, 55332, 43478, 25653, 56196, 41448, 27489, 43469, 27654, 72598, 34945, 27777, 22161, 26655, 40080, 66636, 48485, 47324, 38153, 55311, 31953, 48601]
8032D8601j0345K5711J6395m8249j2693M2539j049o139l143j4953J1910p699J9544
8019F0430k0679K8191K696j0069k5814R065K402J7449k8291M4536P170o154k4649
8006E6283N180q881J4913j2715O437R13j7110K7094j1121j3382K9133j1399K9470
7993I4815m1481j1803K0816K1787k9968K2199n976J0080k0640J4817j7279J7247
7981G4614k2527J3832J0417j6943K6978p861L392k030j4322K874j9416K8465k0873
7968E6600K8572j5685M969J317j3380K4017j5992K2864j0325k7353L2978K9906
7956A18488k6569r610o97O154l1722O0172m1050P337l340j821J4735l3256K3440
7943H2261Q608r559n269M863k2269J5128m350L0829k5069J0734k793o416j5379
$$ y = [48601, 38256, 63967, 80362, 32113, 19420, 61959, 60910, 54771, 51628, 36675, 48585, 40886, 60430, 39751, 67942, 70638, 60569, 34755, 43820, 46222, 63671, 35380, 79916, 87086, 80932, 56283, 61463, 52582, 67495, 54780, 61217, 62130, 45020, 72114, 60993, 47611, 76744, 65345, 94815, 53334, 41531, 62347, 84134, 54166, 76365, 70389, 80469, 59829, 74646, 57367, 74614, 52087, 65919, 76336, 59393, 86371, 78510, 81902, 79872, 65550, 68424, 49008, 77473, 56600, 85172, 69487, 74456, 75773, 62393, 86410, 70418, 93282, 82957, 55604, 88582, 118488, 91919, 82309, 81612, 87766, 56044, 116216, 75166, 82503, 79163, 77342, 92077, 58821, 82261, 90869, 81310, 76041, 80904, 58635, 73763, 69413, 100242, 75173, 85907, 83114, 76698, 61319]
7930F1319M842j2213L7188m257m274j397K15l029k198K9210q186j997J2161l078
7916A04306k9711M7387m0704R73J6432j3722J0934j5232J2246k3461L9273k1982
7904H6739J509J8500k032q160q444K2753j0808M683K305n45Q616p848Q183M082
7890A19533l6074m188J5472L5521k2473k699m925K6228k6331j919K5525p551j8261
7877I7858P538L3124l1126K2597j4556j0460j932K121J2661P238k1526J3647m37
7864A16747l690j7535O256J2696j7613K7603o81k2635r410n469l4529l1290J67317
7851A87767k2587j3792l0180J5876j4125J0280J1019m4231K8647J4510j6415K2374
7839A49143j1455k4529O670J2109o268K6197k3682k3957L6979p172j51N82j2355
$$ y = [61319, 66161, 53948, 91136, 86879, 82605, 81208, 81423, 78394, 76196, 105406, 97220, 95223, 107384, 104306, 74595, 121982, 81278, 82251, 98683, 84961, 95895, 80663, 92909, 69448, 108721, 86739, 88248, 106748, 104716, 96556, 88112, 110865, 100057, 104740, 107045, 106500, 115116, 107268, 115451, 119533, 83459, 79271, 94743, 130264, 107791, 105092, 100167, 126395, 100064, 98145, 123670, 116119, 97858, 105396, 138520, 107394, 129991, 115435, 104975, 103043, 105164, 117825, 125063, 103537, 117184, 116747, 113057, 95522, 101778, 114474, 96861, 124464, 123783, 101148, 91738, 86269, 51740, 20450, 187767, 165180, 151388, 121208, 137084, 122959, 133239, 144258, 100027, 128674, 143184, 126769, 149143, 137688, 113159, 119829, 131938, 125670, 151867, 128185, 104228, 141207, 134035, 133884, 134466, 122111]
7826A22111L954P732J3576j6386J5624K1459j1006l1815Q964P631R061k4463P906
7813A34348K5m1637M0958J2001o504L44l803N386N752k5555j079K5920J312j7946
7799A29522J3193J4155k4267j4072L9800l0413K3309J112K426j4761J3931j566
7787A52369L172j3169J776J0827p144J8845k0296J1247j2239L0237k8911J3181
7775A59895K1529j848l6048K7786k6085K2317k7956L758K4906J8129m4199O348
7763A48532l683M616Q245K4018l0842M245J0422m911J2766k8440L7458j6592K957
7750A68791q578k1495K5653N0416m0037J1901R312j3673k9170L5793k6564j1011
7738A51338O758J3562J6089p528R296J1931j4994K749J5997N050j9333K0186j2545
$$ y = [122111, 126065, 133797, 147373, 130987, 146611, 168070, 157064, 125249, 134213, 141844, 150905, 126442, 134348, 134373, 92736, 133694, 145695, 139191, 139535, 135732, 141118, 146870, 121315, 120236, 146156, 147468, 129522, 142715, 156870, 132603, 118531, 158331, 127918, 151227, 152339, 154765, 140004, 153935, 152369, 155541, 142372, 144148, 154975, 147831, 166676, 146380, 157627, 145388, 175625, 146714, 159895, 181424, 179576, 143528, 171314, 145229, 167546, 139590, 143348, 168254, 186383, 142184, 148532, 144849, 149465, 157710, 181728, 150886, 155131, 165553, 160642, 173408, 144968, 182426, 165834, 168791, 160213, 138718, 164371, 214787, 174750, 186651, 195963, 182290, 153120, 188913, 162349, 151338, 158096, 171658, 187747, 180219, 189515, 201446, 186452, 189201, 205198, 210248, 190915, 211101, 198556]
7725A98556k7727J830K1891q392J1659j5662J887J1058k0464L1477j2276J1262
7713B05099k0680N929J0212j0156l585J7692N620m4888L3704M915L97N313k6150
7700A83422M4562k7844J1958j2226M820J3009j0333K6747l6296J6571M452M983
7688B23825L513L127L357l137j6600J9753j6037k5485M5593j8430J9920j7672
7676B21727r278j2063K8085O741j4378J7245J2224k5571j4131J5820j9516O382
7664B13287O615J7959k267P265K3682j6386o506j1404M5107m4329K5174P205k6849
7651B38553l246K605P130R802K7062k2421j6810J8710k358K6007k8151N051L9908
7638C01842l7616P392l101l553j1327K6221j4571M7j1077J2347J4817j2028m332
$$ y = [198556, 170829, 172659, 194550, 186158, 197817, 182155, 184042, 195100, 174636, 206113, 193837, 205099, 184419, 190348, 200560, 190404, 186819, 204511, 210131, 165243, 198947, 203862, 204259, 209572, 183422, 227984, 200140, 212098, 199872, 204692, 217701, 207368, 234115, 197819, 214390, 218842, 223825, 227338, 230465, 233822, 230685, 214085, 233838, 217801, 192316, 237909, 219479, 239399, 221727, 212449, 200386, 228471, 235212, 220834, 238079, 250303, 224732, 210601, 226421, 206905, 213287, 219902, 237861, 235594, 242859, 266541, 250155, 243649, 232245, 277352, 233023, 258197, 265402, 238553, 235307, 237912, 245042, 254844, 281906, 259485, 242675, 261385, 259027, 285034, 256883, 261934, 301842, 264226, 271618, 268517, 264964, 253637, 279858, 265287, 265334, 254257, 266604, 281421, 269393, 265061]
7625B65061n951j6437N2131j0560p995J4030Q71J494O026j6497J8318j1044n446
7612B84001j8542K8050J9724k240J2711k1547k493m763J9306J0081j668K4842
7600C47462l0059J0712M7152l5507K5869k5932L9176m8088K5744k6716O1593j9922
7588C71484m730P07J3157m670L113J6922K8004L239p587k742J758j4292M5163
7575D49526j2274j354r173M2046m7003J6735j1645J5115m830k3778M3005m4208
7563D12162L2130J4107l094J7389J3446o1991L4365L107O24j962J3559r695j5664
7550D48483J354J8792o141k3250r048O0404l7111r043L2802l2583J9461Q84K2498
7537D87502j9920R769J502R373P222l6819K7147P368j6365K846J1171p121l5990
$$ y = [265061, 259110, 242673, 294804, 284244, 276249, 290279, 291150, 292644, 298670, 282173, 300491, 289447, 284001, 265459, 293509, 313233, 310993, 323704, 302157, 299664, 294901, 314207, 324288, 322620, 347462, 317403, 328115, 375267, 339760, 365629, 339697, 378873, 330785, 356529, 329813, 391406, 371484, 366754, 367461, 380618, 375948, 379061, 395983, 423987, 427226, 419639, 416897, 418655, 404363, 449526, 437252, 435898, 426725, 468771, 421768, 438503, 426858, 441973, 437143, 413365, 456370, 412162, 444292, 458399, 455305, 472694, 486140, 424149, 458514, 461621, 462245, 460283, 473842, 464147, 448483, 449837, 468629, 462488, 439238, 430190, 490594, 453483, 444440, 477242, 444659, 464120, 465004, 487502, 467582, 477351, 478853, 488226, 495448, 458629, 485776, 493144, 476779, 479625, 490796, 483675, 447685]
7524D47685L4155R92J446J9569J650J2209r91j6733L5344l6793J1771J6545J0191
7511E37040K460j4188J3186j4870L831L3270L1478q449o644n774l75p568J3299
7498E76696K8604J7632k6470R067o664n805K4228j1202K9240j3000q586K3129
7486F36869J4115L677k0210Q873j0388J4846r967M919J1695k8352M0242o735p537
7473F52047N019J3774j2599J3116k6188K6648l334N175j350J5870k2278J5234
7461F81134k0321L751j6842J5132K1455k3192J4256J537K4762Q634n016L4451
7449G39741O526l1083K2571J1462K472L584N700J1154p181J644J2663k3477j398
7436G54378J2099K1605P606O0K440L1735p321M9497M5341R323M4128O924J1497
$$ y = [447685, 481840, 482832, 484278, 503847, 505497, 517706, 516715, 499982, 535326, 498533, 510304, 526849, 537040, 539500, 525312, 538498, 523628, 527459, 560729, 592207, 583758, 577114, 571340, 570965, 563397, 576696, 605300, 622932, 596462, 605529, 598865, 593060, 617288, 606086, 635326, 622326, 613740, 636869, 650984, 654661, 634451, 643324, 632936, 647782, 637815, 642734, 654429, 626077, 666319, 659584, 652047, 657066, 670840, 658241, 671357, 645169, 671817, 668483, 673658, 672308, 688178, 665900, 681134, 660813, 664564, 647722, 662854, 684309, 661117, 675373, 676910, 701672, 710306, 705290, 739741, 746267, 715184, 737755, 749217, 751689, 755273, 760973, 772127, 764946, 766590, 779253, 755776, 754378, 766477, 788082, 795688, 795748, 798188, 829923, 822602, 872099, 917440, 926763, 970891, 977815, 989312]
7423I89312L6863j9374j2286L2171J7775l1959k632j0774k9259p011K8355k2133
7411I69048q732L368J8924r373J4729M0280L3131p50O6374K0921O494j7793J5128
7398A151749J4814j9645k680R000m0783p503M890k3140m634o09J8674j1995k522
7385A085616q858L6511M8033n6961J7841K0969o167j0358J8161P753j2893J1499
7373A151146O196K6921k0996k0364M1736j8805J50J13K2361J0803K978P418j1829
7360A197828R607Q20N8660j9907J4943r476J7290K2011p197J0606j095M3523M384
7347A341997J3260J3744K9031j2171J6185j695j9191Q388N3272j680j9311M7582
7335A469411n108j2080K5278R236J841r29N0816J7534r91O325K9600R618M2250
$$ y = [989312, 1026175, 1006801, 994515, 1026686, 1044461, 1012502, 1009870, 999096, 969837, 962826, 991181, 969048, 960316, 963684, 982608, 973235, 987964, 1028244, 1061375, 1060625, 1126999, 1147920, 1154414, 1136621, 1151749, 1166563, 1146918, 1144238, 1153238, 1112455, 1104952, 1109842, 1086702, 1082068, 1081459, 1100133, 1088138, 1085616, 1076758, 1113269, 1161302, 1104341, 1122182, 1143151, 1136984, 1126626, 1144787, 1152540, 1139647, 1151146, 1157342, 1184263, 1163267, 1142903, 1184639, 1165834, 1165984, 1166097, 1188458, 1199261, 1202239, 1209657, 1197828, 1207435, 1208255, 1266915, 1247008, 1261951, 1252475, 1269765, 1291776, 1284579, 1295185, 1294090, 1337613, 1341997, 1355257, 1369001, 1398032, 1385861, 1402046, 1400351, 1381160, 1389548, 1442820, 1441140, 1421829, 1469411, 1464303, 1452223, 1477501, 1486737, 1488578, 1487649, 1538465, 1555999, 1555008, 1561333, 1590933, 1600551, 1642801]
7322A642801K130K6507K3977l729K9571M124j0992K1881M974K6435l0663K4752
7310A761768j7015j693L0851q1K1004K1566J8523q617K1833l7894N9841l3072
7298A837014L5095M650j6012M4688l8132K9390L179k6928P535Q558j3029M0427
7286A916435J040M320L415L937N84K7745L2882l257J5736J0710r380M2606K1976
7273B068749p40L4526l530J9923K8426O977J5110M0802j395R882K5901o4L1007
7260B275574j611L9883J4179J7915J9558J6456K2818O739N0211K4875Q978L4168
7248B529743L3755K0441K2589M9714J9183N1674K2174L5746J3002M6801k5274
7237B819548N5729J1352J9935k791O8558j3605K3157j3570N6081K730L3775M7494
$$ y = [1642801, 1644931, 1671438, 1695415, 1691686, 1721257, 1725381, 1714389, 1736270, 1741244, 1767679, 1737016, 1761768, 1744753, 1743060, 1773911, 1773830, 1794834, 1816400, 1834923, 1826306, 1848139, 1810245, 1870086, 1837014, 1872109, 1876759, 1860747, 1905435, 1867303, 1896693, 1899872, 1872944, 1880479, 1889037, 1876008, 1916435, 1917475, 1921795, 1925210, 1929147, 1929731, 1957476, 1990358, 1987101, 2002837, 2013547, 2004167, 2046773, 2068749, 2068009, 2102535, 2099005, 2118928, 2147354, 2154331, 2169441, 2210243, 2208848, 2218730, 2244631, 2244567, 2275574, 2273963, 2313846, 2328025, 2345940, 2365498, 2381954, 2404772, 2411511, 2461722, 2486597, 2495575, 2529743, 2563498, 2583939, 2606528, 2656242, 2675425, 2727099, 2749273, 2785019, 2798021, 2844822, 2819548, 2875277, 2886629, 2906564, 2903773, 2972331, 2958726, 2981883, 2968313, 3024394, 3027124, 3060899, 3108393]
7225C108393K9219J3742L5353K0154O9649O185M7834M1363K4849L0874N5999M7727
7213C531341L9545K9283N2075L8357J4770N4530O1804M00N4953O0874Q3432J636
7201D023000J9662O9670K2293M3332Q2674M0958M1398O7340K4368L6298N4316
7190D525309M9502N0770P2399L6827O9101L7500N8852K6722N9002N5306L6114
7179E077404O2993L4463O0573N4045M5946N7300L7388M8364O5832N6001O1593
7168E661902J3846Q6415Q1062N9628L5862J02069O9583M7835J10345R9994P4097
7157F442638Q0704J03734R0621R6526J19505Q6561J32609J23334J22322R0121
7147G488675J33010J16313J25235J15973J24554J51222J07305J59874R7907J52931
$$ y = [3108393, 3137612, 3151354, 3186707, 3206861, 3276510, 3282695, 3330529, 3371892, 3396741, 3427615, 3483614, 3531341, 3570886, 3600169, 3652244, 3690601, 3705371, 3759901, 3821705, 3822105, 3877058, 3937932, 4021364, 4023000, 4042662, 4112332, 4134625, 4177957, 4260631, 4301589, 4342987, 4410327, 4434695, 4470993, 4525309, 4574811, 4625581, 4697980, 4734807, 4803908, 4841408, 4900260, 4926982, 4985984, 5041290, 5077404, 5140397, 5174860, 5235433, 5289478, 5335424, 5392724, 5430112, 5478476, 5544308, 5600309, 5661902, 5675748, 5762163, 5843225, 5902853, 5938715, 6040784, 6110367, 6158202, 6268547, 6368541, 6442638, 6523342, 6627076, 6717697, 6814223, 6933728, 7020289, 7152898, 7276232, 7398554, 7488675, 7621685, 7737998, 7863233, 7979206, 8103760, 8254982, 8362287, 8522161, 8620068, 8772999]
7137H772999J66500J23901J37254J59972J10929J44779J48174J66382J75063J68350
7127A0274303J81333J72329J69051K11147J67889K05536K06613J99178K34596
7118A2021975K03979J97330K58529K21446K32551K09346K82918K42099K58292
7109A4128465K30185K87528K79808K99607K94566K91884L24039L15985L29520
7100A6781587L87141L46663L83200L78717M02853M05639L97312M17622M35409
7091B0336143M22672M48415M52571M87752M77764M87047N15257N25891N97991
7082B4751503N42482N89411O38685O52266P25366O85502P43080P73442Q21229
7073C0922966Q20654Q87860R18076R26399R71369J026967J053535J125521J158641
$$ y = [8772999, 8939499, 9063400, 9200654, 9360626, 9471555, 9616334, 9764508, 9930890, 10105953, 10274303, 10455636, 10627965, 10797016, 11008163, 11176052, 11381588, 11588201, 11787379, 12021975, 12225954, 12423284, 12681813, 12903259, 13135810, 13345156, 13628074, 13870173, 14128465, 14358650, 14646178, 14925986, 15225593, 15520159, 15812043, 16136082, 16452067, 16781587, 17168728, 17515391, 17898591, 18277308, 18680161, 19085800, 19483112, 19900734, 20336143, 20758815, 21207230, 21659801, 22147553, 22625317, 23112364, 23627621, 24153512, 24751503, 25293985, 25883396, 26522081, 27174347, 27899713, 28585215, 29328295, 30101737, 30922966, 31743620, 32631480, 33549556, 34475955, 35447324, 36474291, 37527826, 38653347, 39811988]
7064C9811988J224484J271442J320129J389858J479981J570629J651845J735471
7056E1455827J887707J936548K084785K235895K336535K481576K678972K815083
7048F9912928L024975L210845L450824L676056L903445M190601M525582M808072
7040A00703328N171314N564378N991172O435509O939826P427372Q017517Q587443
7032A54837859R207480R843680J0528174J1144041J1818149J2393754J2959169
7025B32732306J3361806J3712170J3851073J3751638J3463113J2858128J2029455
7018C25759689J0874323R448243P763863N956204M010135J958817j37407k116692
7010C63517175m043175n822187p488232q859391j0009545j0990364j1728734j2192063
$$ y = [39811988, 41036472, 42307914, 43628043, 45017901, 46497882, 48068511, 49720356, 51455827, 53343534, 55280082, 57364867, 59600762, 61937297, 64418873, 67097845, 69912928, 72937903, 76148748, 79599572, 83275628, 87179073, 91369674, 95895256, 100703328, 105874642, 111439020, 117430192, 123865701, 130805527, 138232899, 146250416, 154837859, 164045339, 173889019, 184417193, 195561234, 207379383, 219773137, 232732306, 246094112, 259806282, 273657355, 287408993, 300872106, 313730234, 325759689, 336634012, 346082255, 353846118, 359802322, 363812457, 365771274, 365633867, 363517175, 359474000, 353651813, 346163581, 337304190, 327294645, 316304281, 304575547, 292383484]
7002B92383484j2524760j2622885j2578588j2428548j2113287j1742020j1287230
6995B07086166j0849369j0286013r756587r203080q698801q129362p635272p178706
6987A35348976o686978o256735n838128n465964n074955m769809m473772m150198
6979I2632437l890214l675681l442191l200593l027968k861092k725696k545473
6971F7263529k407437k287579k172672k051097j938594j883692j771341j696078
6963E1055039j630822j549423j485622j405193j405325j258187j243783j168462
6955C9908222j161379j093851j067818r71961r69861r08995q65860q73890q30483
6946C1164124p79333p60186p50983p05951o67026o43238o44384o17032n91372
$$ y = [292383484, 279858724, 267235839, 254657251, 242228703, 230115416, 218373396, 207086166, 196236797, 185950784, 176194197, 166991117, 158292316, 150162954, 142527682, 135348976, 128661998, 122405263, 116567135, 111101171, 106026216, 101256407, 96782635, 92632437, 88742223, 85066542, 81624351, 78423758, 75395790, 72534698, 69809002, 67263529, 64856092, 62568513, 60395841, 58344744, 56406150, 54522458, 52751117, 51055039, 49424217, 47874794, 46389172, 44983979, 43578654, 42320467, 41076684, 39908222, 38746843, 37652992, 36585174, 35613213, 34643352, 33734357, 32868497, 31994607, 31164124, 30384791, 29624605, 28873622, 28167671, 27500645, 26857407, 26213023, 25595991, 25004619]
6937B5004619n83116n71235n42153n24640n07672n26307m80333m54103m65038
6928B0350022m56308m14491l99492m09808m18570l58862l61957l47667l51097
6919A6831770l39575l24047l36319k88897l04439k75517l03037k99371l10778
6910A4049790k43269k52402k62604k80803k39644k41579k48542k42727j74740
6901A1863480k37261k04851k26771j89017k24236j89815j88477j75711j82351
6892A0044990j72286j71945j64964j58007j65744j44397j56640j26763j55938
6883H628306j41176j31595j34594j21760j35412j03136j32623r5954j18292j23533
6873G390231j15799j08304r1303j32852p9622j07192j02624r7068r3122q2682
$$ y = [25004619, 24421503, 23850268, 23308115, 22783475, 22275803, 21749496, 21269163, 20815060, 20350022, 19893714, 19479223, 19079731, 18669923, 18251353, 17892491, 17530534, 17182867, 16831770, 16492195, 16168148, 15831829, 15542932, 15238493, 14962976, 14659939, 14360568, 14049790, 13806521, 13554119, 13291515, 13010712, 12771068, 12529489, 12280947, 12038220, 11863480, 11626219, 11421368, 11194597, 11005580, 10781344, 10591529, 10403052, 10227341, 10044990, 9872704, 9700759, 9535795, 9377788, 9212044, 9067647, 8911007, 8784244, 8628306, 8487130, 8355535, 8220941, 8099181, 7963769, 7860633, 7728010, 7632056, 7513764, 7390231, 7274432, 7166128, 7074825, 6941973, 6862351, 6755159, 6652535, 6555467, 6462345, 6379663]
6863F379663j11776r6972j07294o3807j20408j16225o1850j03600j01376r2224
6853E404131p8562q4790r9118q1397q0060o7896j31961k4055j00056q5391p2210
6842D498635l3084n8493j15974k1972q0666o2794p6245j0721p4080o9198k0576
6831C874832o0234l7189o1232k3276m3903l8692o6352n0926l7729k3692m3236
6820C388371m9976l8289l8835k3200m3046k9281r179o0294l0258k3952k5758k7044
6808B989259m0031k1580j4624q058l0054r918k8919q440m7484R574l2066l3857
6796B723802l3786n520l0733j4347o7227r83j0071k8900q7757p316m3044q17k7688
6783B365613k9991R940m2835j4933j1182o964n2111L6267j2545m4826K7865l9163
$$ y = [6379663, 6267887, 6170915, 6063621, 5999814, 5879406, 5763181, 5701331, 5597731, 5496355, 5404131, 5325569, 5240779, 5141661, 5060264, 4980204, 4912308, 4780347, 4756292, 4656236, 4570845, 4498635, 4465551, 4407058, 4291084, 4269112, 4188446, 4125652, 4049407, 4038686, 3964606, 3895408, 3874832, 3814598, 3777409, 3716177, 3692901, 3648998, 3610306, 3543954, 3493028, 3455299, 3431607, 3388371, 3338395, 3300106, 3261271, 3238071, 3195025, 3165744, 3156565, 3096271, 3066013, 3042061, 3016303, 2989259, 2949228, 2927648, 2913024, 2904966, 2874912, 2864994, 2836075, 2827635, 2780151, 2789725, 2757659, 2723802, 2690016, 2684496, 2653763, 2639416, 2572189, 2571206, 2561135, 2532235, 2444478, 2437162, 2394118, 2393301, 2365613, 2335622, 2345562, 2302727, 2287794, 2276612, 2269648, 2217537, 2253804, 2241259, 2196433, 2224298, 2185135]
6771B185135p998n002l795j8354k2942l1101o695j3252j9596J267p0615k8242
6759A958810J4314m2267j5321l2706m3890k0983J8218p1347J3663j9787m7269
6748A711435j5581j5685R344m0428J391j1602K8140k6924p719K973l0134p465
6736A597745l4725k6924l36j7463k3069m2696k8409k633j9048j9350m4162j9429
6724A319501l3618j2180l3835j822j9465k1252L814m3998j4466l1341n825J7767
6712A123280k9522j0325k568k1879L159q905j8810N723l6152L9196j3831p830
6700A021536L37k3401K314j9935j3212P396K1932m1096j0786K3592j5496l7786
6688I15395P722q400K6463l8926K0622k7726P609J3116j9238N944k9285K4004
$$ y = [2185135, 2177137, 2172135, 2168340, 2149986, 2127044, 2095943, 2089248, 2075996, 2056400, 2057667, 1987052, 1958810, 1973124, 1930857, 1915536, 1882830, 1838940, 1817957, 1836175, 1764828, 1778491, 1758704, 1711435, 1695854, 1680169, 1689513, 1649085, 1650476, 1638874, 1667014, 1640090, 1632371, 1635344, 1605210, 1597745, 1563020, 1536096, 1535760, 1518297, 1495228, 1452532, 1424123, 1421490, 1402442, 1383092, 1338930, 1319501, 1285883, 1273703, 1239868, 1238046, 1218581, 1197329, 1201143, 1157145, 1142679, 1111338, 1105513, 1123280, 1093758, 1083433, 1080865, 1058986, 1062145, 1053240, 1034430, 1040153, 1004001, 1043197, 1029366, 1021536, 1021873, 998472, 1000786, 980851, 967639, 975035, 996967, 955871, 945085, 968677, 953181, 915395, 923117, 914717, 941180, 902254, 922876, 895150, 902759, 915875, 896637, 902581, 873296, 897300]
6676H97300j0298j202j9263n589L561l0704M8309k2031l4533J114L2338l1056
6664H27946l2256L4142l8294K0088l5795L7661K1358j376m9949M766R242j1765
6652G85768l050l461P588k2596J1964j056l3499K3281k1508J8207j3650j4377
6640G33611J53o402j1472J63O864l5017L4099m445J278O571j7711J2680j5093
6627G05279m724l1694K2566q503O778k1551M497K46j5426J298k5652j5438J2058
6614F29734K69K4574j7229K7953j2834r024J2120j8531j2661J2735Q448r305p603
6601F28646j7302j1618K2871j0463J443n160K4610l0185N451J29j9046j3428K9048
6588F04996J1442p868r800P590k0532K5221R533L17j6510j661j3512K5591j8749
$$ y = [897300, 887002, 885800, 866537, 860948, 864509, 833805, 882114, 860083, 825550, 826664, 859002, 827946, 795690, 829832, 791538, 811626, 775831, 813492, 834850, 833474, 783525, 788291, 797533, 785768, 782718, 779257, 786845, 764249, 776213, 775157, 741658, 764939, 743431, 761638, 747988, 733611, 733764, 727362, 715890, 716053, 722917, 687900, 721999, 717554, 718832, 725403, 707692, 720372, 705279, 700555, 668861, 691427, 682924, 689702, 668151, 672648, 672894, 657468, 658766, 633114, 617676, 629734, 630003, 654577, 637348, 665301, 652467, 643443, 655563, 637032, 624371, 637106, 645554, 636249, 628646, 611344, 599726, 622597, 612134, 613577, 608417, 633027, 602842, 608293, 608422, 589376, 575948, 604996, 616438, 608570, 598770, 606360, 585828, 611049, 620582, 620899, 604389, 602728, 589216, 614807, 596058]
6575E96058P958l0298M139R138m325j834J1602K18J0117l3638L2920k0802K908
6562E84161k0293K1385q244K0328L207R758j7886k6989J4944k2684J2946j2251
6550E58382n686j8706Q705Q924L914j2705o037K2609j4481J8531j9407J3573J2786
6537E70402J6060j3061m830L1812K3068Q768j2902l098J3475k2348o877J7028
6525F17497K4787n1437n284P399j1706m765P019o740j0213M396R720N707k4715
6512E61665L1496K333K1004k6859J4343L6542n210J649J1105r535q217j1759K587
6499F21144k1076K1962j674j0404l3265j55M667j9856k6687n664R315N423q116
6486E35614k7259K8805m1660K5203j1474N2J2646l6134K7307l5297L8463j6647
$$ y = [596058, 604016, 573718, 577857, 586995, 582670, 580836, 592438, 592656, 602773, 569135, 602055, 581253, 584161, 563868, 585253, 577009, 597337, 600544, 610302, 592416, 565427, 580371, 557687, 570633, 558382, 552696, 533990, 542695, 551619, 555533, 542828, 536791, 559400, 544919, 563450, 544043, 557616, 570402, 586462, 573401, 568571, 600383, 623451, 632219, 619317, 616219, 629694, 607346, 600469, 617497, 642284, 590847, 585563, 592962, 581256, 576491, 583510, 576770, 566557, 570953, 580673, 586380, 561665, 593161, 595494, 616498, 589639, 603982, 640524, 635314, 636963, 648068, 638533, 630316, 618557, 621144, 600068, 622030, 620356, 609952, 576687, 576532, 581199, 561343, 534656, 528992, 538307, 543730, 535614, 508355, 537160, 495500, 520703, 509229, 509281, 521927, 485793, 513100, 477803, 516266, 499619]
6474D99619l4172J5865r335L0790n8819K3178k9164L347m622q84j0316l795Q509
6461D30201j4666R888l4736m829K3362J4376p700l5178O431j3581K358L121n750
6448C73297p092R946n559Q278r634q843R553n621K592q211J5763K174O492j7359
6434C65776L5869k3422K6532j2387J1746j777J3393k9440M06j0816K5718k3400
6422C78198N226k4374J4351K0979k8719J8787k9432R667J3813k0985L55J6285
6410C74151M629k0065K9591l3091Q437j274K1252K2225k6271J0987j0211J4071
6398C94431j6225L1778k9749J4409r02l2597J6770j2587J6455p388r677j2850
6386C51868m324R766j2170M160Q207o313P131J2875j8420L73K0504n836J667j0361
$$ y = [499619, 465447, 481312, 471977, 502767, 443948, 467126, 437962, 441309, 436687, 435803, 425487, 421692, 430201, 415535, 425423, 390687, 385858, 409220, 423596, 415896, 380718, 387149, 373568, 375926, 379047, 373297, 366205, 376151, 370592, 378870, 369236, 360393, 369946, 364325, 366917, 358706, 374469, 376643, 383135, 365776, 401645, 378223, 404755, 392368, 404114, 402337, 415730, 386290, 386696, 375880, 401598, 378198, 383424, 359050, 373401, 394380, 365661, 384448, 355016, 364683, 378496, 357511, 357866, 374151, 378780, 358715, 388306, 355215, 363652, 362378, 383630, 405855, 379584, 390571, 380360, 394431, 378206, 409984, 380235, 394644, 393742, 361145, 377915, 365328, 381783, 374395, 364718, 351868, 347544, 357310, 345140, 349300, 357507, 351194, 358325, 371200, 352780, 353153, 373657, 367821, 369488, 359127]
6372C59127K6392j7026K1452l5089K7399Q449l0667q32P382j9522j4939R271K1733
6359C63130n722k770J3708J7533J2630m003K1149M423J1396j1363N531m45J7188
6346D42385j4649J687k2595J2633J6333m1394k909j8047J0029J4280m2790K3059
6334C78022j9444M3199J351m00J5840L7346K0179l20K6188j9419k5037K9526j2943
6321D74088K348l4214J6329m2970K9311l3385j056l5689M2279n448k4750K356
6309C89199l077Q260L3116J8037j4100J9341k505J0696O710j5075j5226p408k622
6296D25346n663l5918O2461p6304L231j605K192j8837l1182J1017L128R305l9932
6283C07239K1847m055L017j803l286K6733o590l08k5461k322n895j0425O273M123
$$ y = [359127, 385519, 368493, 389945, 354856, 382255, 390704, 360037, 359205, 366587, 347065, 332126, 341397, 363130, 357408, 354638, 368346, 385879, 398509, 394506, 415655, 420078, 431474, 420111, 425642, 425197, 442385, 427736, 429423, 406828, 419461, 435794, 394400, 391491, 373444, 383473, 397753, 354963, 378022, 358578, 401777, 403128, 402728, 418568, 455914, 476093, 475773, 501961, 482542, 457505, 487031, 474088, 476436, 442222, 458551, 415581, 444892, 411507, 410451, 374762, 417041, 411593, 386843, 389199, 386122, 394382, 427498, 445535, 431435, 450776, 448271, 458967, 465677, 450602, 435376, 427968, 425346, 419683, 383765, 446226, 369922, 373153, 371548, 373740, 354903, 323721, 334738, 337866, 347171, 307239, 329086, 325031, 328048, 326245, 322959, 349692, 343102, 342794, 317333, 315011, 309116, 298691, 304964, 309087]
6269C09087N563j8994R35k5394M554k516j1777O178j3188k9971L2730j0077j7496
6256B29634J2673n003j2985J201j3389J8475P600J3145m4399J6176L285o467J3664
6243B33610p777n000J9359m144o883J0436j0716J3120O464r330R853j004j03l4761
6229B13124J3004L1691j4446L164j9277l92J6883J261j294j6931l710K3021j3456
6216B32642j121j0002M579pJ1999L648N766J4210Q098L1579p227j113k65o168
6202B86618j2762J061K296o8q385j7214j3527K1048j977k9822j4985j3414K6790
6189B25659J5570m978O811J11m9500J6270n268j055j0691L3867j4974L945N493
6176B21260j7506o682Q046m767q278J4195L640M940K7319j3360l2780j213p948
$$ y = [309087, 314650, 295656, 296591, 271197, 275751, 273235, 261458, 267636, 254448, 224477, 257207, 247130, 229634, 242307, 237304, 224319, 225520, 212131, 230606, 238206, 251351, 206952, 223128, 226413, 219946, 233610, 225833, 220833, 240192, 236048, 229165, 239601, 228885, 242005, 248469, 239139, 248992, 247988, 247885, 213124, 226128, 257819, 243373, 246537, 227260, 226868, 243751, 245012, 243718, 226787, 223077, 246098, 232642, 231521, 221519, 226098, 226091, 238090, 241738, 247504, 261714, 269812, 301391, 294164, 293051, 292786, 286618, 273856, 274917, 277213, 277145, 268760, 251546, 238019, 259067, 257090, 227268, 212283, 198869, 225659, 241229, 236251, 243062, 243173, 193673, 209943, 204675, 203620, 192929, 226796, 211822, 215767, 221260, 203754, 197072, 205118, 200351, 192073, 206268, 209908, 214848, 242167, 228807, 196027, 194814, 186866]
6163A86866L1983L144J5527j9343l199J1138M642j8724M323J6524Q16l4612J4624
6150B13709J2235j773k1984K6922Q081r535N382N727l6681J8943K475J5314j1941
6137B26874J0573n713J3602M471o535n53K4241j3733O8o60j1012K8136R560k1393
6123B57926K4182k6191J8112j2719N4841l7366K1152O012q592p163L8526j8496
6111C10224J4521M537M499k5589N2344p483j1983J4786q136j1897J3968j2890
6099C36901J6702J438M431j1244l009L2243k995L1032r241M439m71j197K3305
6086D22334K4582N232J6899l262L7405o848L246J6584l5495J1168j5575R299k2060
6073D63509l835J6172q528p430J665L720j2439L179L2283J5791N625L2223L0972
$$ y = [186866, 218849, 221993, 237520, 218177, 214978, 226116, 230758, 212034, 216357, 232881, 233697, 199085, 213709, 225944, 224171, 202187, 229109, 237190, 227655, 233037, 238764, 202083, 221026, 223501, 238815, 226874, 237447, 231734, 245336, 249807, 243272, 242719, 266960, 253227, 253295, 252635, 241623, 269759, 279319, 257926, 282108, 255917, 274029, 261310, 316151, 278785, 299937, 305949, 297357, 290194, 328720, 310224, 324745, 329282, 333781, 308192, 360536, 353053, 341070, 355856, 347720, 335823, 349791, 336901, 353603, 355041, 359472, 348228, 345219, 377462, 374467, 405499, 396258, 400697, 400226, 399029, 422334, 446916, 452148, 469047, 465785, 503190, 496342, 499588, 516172, 480677, 491845, 476270, 485569, 463509, 459674, 475846, 467318, 459888, 461553, 465273, 452834, 456013, 488296, 504087, 509712, 541935, 572907]
6060E72907L0175M6153O4123P5818M9035J1149j6979K0459K095k6177k6119M350
6048H06989k5697k5430l9218j4723l2903J624m5093j2800l9312j6051K9020j6530
6036E69876K3498j2478L7426M0903J2277N7306L5347L0312M9100m972k9799K0607
6024H29403q665k0253j1841j8619j6850m3053j9308o0571J0480n2863J1771m6360
6012E53271p030J3940l9427P451K505N746j2985J0428k4072M6151K2413O0m481
5999E73970J2807j6678J1501N37K835l4522N50j9133R61m3270M973j0226J1935
5986D96240m2531R19k5230K3780J5670p772J8077l6827K4306j4710j8899J7369
5974D50392Q745j0690K0724l6500K3227k4093K912r409m761p339J081k4250M124
$$ y = [572907, 603082, 649235, 713358, 789176, 838211, 849360, 832381, 852840, 854935, 828758, 802639, 806989, 781292, 755862, 716644, 701921, 669018, 670642, 625549, 612749, 573437, 557386, 586406, 569876, 593374, 580896, 618322, 659225, 671502, 728808, 764155, 794467, 843567, 838595, 808796, 829403, 820738, 800485, 788644, 770025, 753175, 710122, 690814, 630243, 640723, 587860, 599631, 553271, 546241, 560181, 520754, 528205, 530710, 536456, 523471, 533899, 509827, 555978, 578391, 578451, 573970, 586777, 570099, 581600, 582137, 584972, 550450, 551000, 531867, 532828, 489558, 494531, 484305, 496240, 453709, 454628, 429398, 453178, 468848, 461076, 479153, 442326, 466632, 451922, 433023, 450392, 459137, 448447, 469171, 432671, 455898, 431805, 434717, 425308, 420547, 413208, 414289, 390039, 394163]
5961C94163P246J1397n818m148O647J1490M277K3600r70k7732J0875l181J8427
5948D46273J09K980m446j4231J0233l462j1339k0250R191M688J261m115k2749
5935C94143K2698j8201K8559p194k0439K2217r691L0329l1005l4996N9373j6753
5923D19040j0334J947o630K2580q128k1706J8523J9083m2459J1134L9879k3582
5911D19347J5327k1940J9270j8157l495N141m561K5949k6420J0112j4719K519
5899D08373M118J3482j6372K1620j2820n22k0256L1079j6540M367l942J2567J601
5886D26755Q05j314m4015L9758o841k209J8490P225k2455O854q026q527J7654
5873D24154j1184j3130l106K0201M710m1183M7119L63j0586O761p673k1862M9094
$$ y = [394163, 401409, 412806, 406988, 402840, 409487, 420977, 425254, 448854, 447884, 420152, 431027, 427846, 446273, 446382, 449362, 444916, 430685, 440918, 437456, 426117, 405867, 415058, 419746, 421007, 416892, 394143, 416841, 398640, 427199, 420005, 399566, 421783, 412092, 442421, 411416, 376420, 435793, 419040, 408706, 410653, 404023, 426603, 418475, 396769, 415292, 434375, 391916, 403050, 442929, 419347, 434674, 412734, 432004, 413847, 410352, 415493, 410932, 436881, 410461, 420573, 405854, 408373, 412491, 425973, 409601, 431221, 418401, 417879, 397623, 428702, 412162, 416529, 412587, 425154, 426755, 427560, 426246, 382231, 421989, 415148, 412939, 431429, 438654, 416199, 423053, 415027, 406500, 424154, 412970, 399840, 396734, 416935, 421645, 380462, 427581, 427944, 417358, 424119, 416446, 394584, 443678]
5860D43678r507L081K3598r361j7555K1065N749j6935K7981j8374L4310l238L987
5847D88479L504L552M9823k2937K3750K6461p722L531j0247J8168l594J8604l6580
5834E54792K9493J6107k4956j2393P892N061l0672K7747p746k590Q374m599K3748
5821E90258j6654O299L826J3816j8897J2189K4955O201k388K734K3193j761K8627
5808F72398L1014o645K1070l625M408k0394K1085J1120j2454L727l669j8630J242
5795G00647r502j2848R525L115J7714n546J6551j8113o818K024K2758n731j736
5782G12040L5392k0691j5242J9707P600j0917P213M82M8924M805J4936k7602Q213
5769G84860L918K1746J0040K3325j3539J4359j7208M1663L635m480J9421K2650
$$ y = [443678, 434171, 437252, 460850, 451489, 433934, 454999, 460748, 443813, 471794, 453420, 487730, 484492, 488479, 491983, 495535, 545358, 522421, 546171, 572632, 564910, 568441, 558194, 576362, 572768, 591372, 554792, 584285, 600392, 575436, 563043, 570935, 575996, 545324, 573071, 565325, 562735, 571109, 566510, 590258, 573604, 579903, 583729, 597545, 578648, 590837, 615792, 621993, 619605, 622339, 645532, 643771, 672398, 703412, 696767, 717837, 714212, 718620, 698226, 719311, 730431, 717977, 721704, 718035, 699405, 700647, 691145, 678297, 687822, 690937, 708651, 703105, 719656, 701543, 694725, 696749, 719507, 713776, 712040, 747432, 726741, 711499, 731206, 738806, 727889, 735102, 735584, 784508, 789313, 804249, 776647, 784860, 788778, 810524, 820564, 843889, 830350, 844709, 827501, 869164, 872799, 868319, 887740, 910390]
5757I10390J1932j2949P398J2979J766K3092J7724M1023j5511o48L8606K6700
5745A062502L9629j7187L3281M0217J1876M38N4447K9153L6152O221L2169K3664
5733A352562P1322J1999M3332K4590P0098J4337K5949N9964M0990L6675N1671
5722A803489J2155L5104M4069K0808M8769M1577L1124M0872L3182O4226L2915
5711B208290J8861N8768O7471M5100L3905Q5454M6833P4703L2670P3489N6275
5700B801819M9415O0447J6791K1202P6067K3751K5404J9226J6947j4762J2005
5689C108312J1946r163j384k4296k052n651j604Q61J1771j9692N6299M259L7220
5676C166826L1947L5354P5025K3651P9034O6175J0510P0264J7867M334K5127O266
$$ y = [910390, 922322, 909373, 916771, 929750, 931516, 954608, 972332, 1013355, 997844, 997196, 1035802, 1062502, 1102131, 1084944, 1118225, 1158442, 1170318, 1170756, 1225203, 1254356, 1290508, 1296729, 1328898, 1352562, 1423884, 1435883, 1479215, 1503805, 1573903, 1588240, 1614189, 1674153, 1715143, 1751818, 1803489, 1815644, 1850748, 1894817, 1915625, 1964394, 2005971, 2037095, 2077967, 2111149, 2175375, 2208290, 2227151, 2285919, 2353390, 2398490, 2432395, 2517849, 2564682, 2639385, 2672055, 2745544, 2801819, 2851234, 2911681, 2928472, 2949674, 3025741, 3049492, 3074896, 3094122, 3111069, 3096307, 3108312, 3120258, 3111095, 3109711, 3085415, 3083363, 3077712, 3076108, 3076969, 3088740, 3069048, 3125347, 3129606, 3166826, 3198773, 3234127, 3309152, 3332803, 3411837, 3478012, 3488522, 3558786, 3576653, 3580987, 3606114, 3612380]
5664C612380o091J44n9306n6145l3647l3183n2879o5084m4643q3201k7214o2660
5652C088471k4757m3756l1290j1603J107J7226j6860M1842l318K7988N8340N5728
5640C159118K6043J3134K7859m692J5744n6297J4503l2501m0373n3372o3735o8906
5628B936525l5293q1630o5327l4645l9252n1763m3721n1399Q630m3123J662L3090
5616B533754l0826K5014M3569M8303L7833K4011J8236O162M2809J6455j6692N714
5604B754342p155n779M414l207k5979J8642k1835m008q08J5662q623K3556O3778
5591B803000K0552N7632N3657M7804Q1714P1839N8569P3638O1753J03975Q9320
5580C523453P5388J12228J01136J18282J45724J58516K10325J18881K58277J92130
$$ y = [3612380, 3606289, 3606433, 3547127, 3490982, 3457335, 3424152, 3371273, 3306189, 3261546, 3178345, 3151131, 3088471, 3063714, 3019958, 2988668, 2977065, 2978172, 2995398, 2978538, 3020380, 3017062, 3045050, 3103390, 3159118, 3185161, 3198295, 3226154, 3221462, 3237206, 3180909, 3195412, 3162911, 3122538, 3069166, 3005431, 2936525, 2901232, 2819602, 2754275, 2719630, 2680378, 2628615, 2584894, 2533495, 2542125, 2499002, 2500664, 2533754, 2502928, 2527942, 2571511, 2619814, 2657647, 2681658, 2699894, 2706056, 2748865, 2765320, 2748628, 2754342, 2747187, 2741408, 2745822, 2742615, 2716636, 2735278, 2713443, 2709435, 2708627, 2724289, 2715666, 2739222, 2803000, 2823552, 2881184, 2934841, 2982645, 3064359, 3136198, 3194767, 3268405, 3330158, 3434133, 3523453, 3598841, 3711069, 3812205, 3930487, 4076211, 4234727, 4445052, 4563933, 4822210, 5014340]
5570E014340K42306K16995J64295K26737J86123J90219J42940J32201J00857J14049
5560F731062O6059O4353Q4397K7362L2647P1035M8525L7520J18316J11822R9497
5549G492595J69757J28163K20724K24337K63075K46715L19345K77875K92658L24208
5539I959452K49561L02752K39473K40131K21143J47234J18460R8996N7295N4747
5529A1689244j4123j5362n0710m9230o1003p3241n6287m6406j0008K94K5635P5753
5517A1414556P8837J59543J96749K50285K48466L28404L20359L12287L62116L26312
5507A3997914K69854J97369J53961J15661N0727m9848o8897j51264j71811k47368
5497A4096298k07266k04529k70742j94928k05944j84404j29901j10820j1493p981
$$ y = [5014340, 5256646, 5473641, 5637936, 5864673, 6050796, 6241015, 6383955, 6516156, 6617013, 6731062, 6797121, 6861474, 6945871, 6973233, 7005880, 7076915, 7125440, 7162960, 7281276, 7393098, 7492595, 7662352, 7790515, 8011239, 8235576, 8498651, 8745366, 9064711, 9342586, 9635244, 9959452, 10209013, 10511765, 10751238, 10991369, 11212512, 11359746, 11478206, 11577202, 11634497, 11689244, 11675121, 11659759, 11609049, 11559819, 11498816, 11425575, 11369288, 11322882, 11312874, 11313168, 11338803, 11414556, 11493393, 11652936, 11849685, 12099970, 12348436, 12676840, 12997199, 13309486, 13671602, 13997914, 14267768, 14465137, 14619098, 14734759, 14785486, 14735638, 14666741, 14515477, 14343666, 14096298, 13889032, 13684503, 13413761, 13218833, 13012889, 12828485, 12698584, 12587764, 12576271, 12568290]
5487A2568290P1303P7522J96455J92617K05264K71309K96845L10890K44160K83236
5477A4717891K22985K00837J19430K7222l386p3483j52804k34694k55364l27919
5467A4240715l29857l83867l79189l85462l83263k94998l45677k76346k20689
5458A1241367j84975j62012j15406o4525q6284l120l138J3782K0465M9455N9439
5447A0765048J0087R178l3359n1045j74465j20490k25183k33776k52997l06009
5437I386989l13697l28569l16444l78282k87225k95967l11850l01519k64325k24399
5427F364712k38572j63029j88293j76194j18501j21928p3226p0224m1133p6974
5417E096638n7335p9307r8532q2034j15659m3298o5481p5467j19209o2941n7474
$$ y = [12568290, 12639593, 12717115, 12913570, 13106187, 13311451, 13582760, 13879605, 14190495, 14434655, 14717891, 14940876, 15141713, 15261143, 15288365, 15284979, 15211496, 15058692, 14823998, 14568634, 14240715, 13910858, 13526991, 13147802, 12762340, 12379077, 12084079, 11738402, 11462056, 11241367, 11056392, 10894380, 10778974, 10714449, 10628165, 10625045, 10621907, 10635689, 10656154, 10705609, 10765048, 10775135, 10784313, 10750954, 10699909, 10525444, 10404954, 10179771, 9945995, 9692998, 9386989, 9073292, 8744723, 8428279, 8049997, 7762772, 7466805, 7154955, 6853436, 6589111, 6364712, 6126140, 5963111, 5774818, 5598624, 5480123, 5358195, 5284969, 5214745, 5173612, 5096638, 5039303, 4959996, 4861464, 4779430, 4663771, 4620473, 4554992, 4479525, 4360316, 4297375, 4239901]
5406D239901o2719m1429m0906o6052l3062n5383n8358o5449o1432m7632q7295
5395C620184o1573l5801p1940l7149m3962p4252k8344k4093m8719l6971l2887
5384C124493k6414m180j8715k6392j5466k4171k327j2750k069l5458q46o329J1977
5371B961353N524k960K9403o155K984J2592j2918N2892k9386K0635O365l971L1501
5358C067859J8394J0507L0981J0630K1531L1768L6386J5186J9571L5356M5390
5347C343559L7024M0697L2035N9047M4904K3923N0008O7090L0230P5832L2585
5336C836934M9707N3823L7474Q1020L3192N7373L4772N3281O0327N1018R751M2392
5324D401064J06527N3061Q308P3194O6103P0387M6200R6916O3405Q1910P2791
$$ y = [4239901, 4177182, 4135753, 4094847, 4028795, 3995733, 3940350, 3881992, 3816543, 3755111, 3707479, 3620184, 3558611, 3522810, 3450870, 3413721, 3369759, 3295507, 3267163, 3243070, 3194351, 3157380, 3124493, 3098079, 3093899, 3075184, 3048792, 3033326, 3009155, 3006828, 2994078, 2992009, 2956551, 2955705, 2949376, 2961353, 2966877, 2963917, 2993320, 2987165, 2990149, 3002741, 2989823, 3042715, 3013329, 3033964, 3040329, 3036358, 3067859, 3086253, 3096760, 3127741, 3138371, 3159902, 3191670, 3228056, 3243242, 3262813, 3298169, 3343559, 3380583, 3421280, 3453315, 3512362, 3557266, 3581189, 3631197, 3698287, 3728517, 3804349, 3836934, 3886641, 3940464, 3977938, 4058958, 4092150, 4149523, 4184295, 4237576, 4297903, 4348921, 4358672, 4401064, 4507591, 4560652, 4568960, 4642154, 4708257, 4778644, 4824844, 4921760, 4985165, 5067075, 5139866]
5313E139866R7643J07289R2801J30311J48608J38616J50142J79007J86455K25985
5303F596723K17472K78492K67972L17003L62525L47150M01183M37215M59007M64759
5293A0149501M97629M84675N38559N50304N07893M79482N10196M57723M25664
5284A4601626L93735M12448L60423L67733L32669L10458L40378L11647L40021
5275A7771138L61744L50220L69621L71242L68507L72795M19216L26933L86442
5266B1097858L60057L35556L12087K91088K41949K18972J37665R3371o476m7101
5256B3035026j42102j80392l08669l26600l90428m31456n04880n14933n23483
5247A9712083o01374n88083n88398n59869n26999n03126n38795m36373m42691
$$ y = [5139866, 5237509, 5344798, 5437599, 5567910, 5716518, 5855134, 6005276, 6184283, 6370738, 6596723, 6814195, 7092687, 7360659, 7677662, 8040187, 8387337, 8788520, 9225735, 9684742, 10149501, 10647130, 11131805, 11670364, 12220668, 12728561, 13208043, 13718239, 14175962, 14601626, 14995361, 15407809, 15768232, 16135965, 16468634, 16779092, 17119470, 17431117, 17771138, 18132882, 18483102, 18852723, 19223965, 19592472, 19965267, 20384483, 20711416, 21097858, 21457915, 21793471, 22105558, 22396646, 22638595, 22857567, 22995232, 23088603, 23082127, 23035026, 22892924, 22712532, 22403863, 22077263, 21686835, 21255379, 20750499, 20235566, 19712083, 19110709, 18522626, 17934228, 17374359, 16847360, 16344234, 15805439, 15369066, 14926375]
5238A4926375l90076l53239k91462k74386k64539k10618j82506j68021k04183
5229A2587345j92564j96839k28337k73138k88823k71923l94486l74050l65902
5220A0001283m01505l93431m27773l92740m10176l85943l60341l84246l31275
5211F513853l13831k76073l20714k26750k66134k43617k03694j95749j68939j94352
5201D104000j46850j41857j58389j40160q8982j47823q2342j21074q7415q2595
5191B906513q6135p3809o5815o2847q2802m7911o8023j3551o9318o5292m1586
5180B229424l0069m8659l3959m3081m4343l3607l0681m6611j984n4728L812n7426
5168A808088J6223m7354k8794l1119j7847j6702n7134M444j8532l6197J422K359
$$ y = [14926375, 14536299, 14183060, 13891598, 13617212, 13352673, 13142055, 12959549, 12791528, 12587345, 12394781, 12197942, 11969605, 11696467, 11407644, 11135721, 10741235, 10367185, 10001283, 9599778, 9206347, 8778574, 8385834, 7975658, 7589715, 7229374, 6845128, 6513853, 6200022, 5923949, 5603235, 5376485, 5110351, 4866734, 4663040, 4467291, 4298352, 4104000, 3957150, 3815293, 3656904, 3516744, 3427762, 3279939, 3197597, 3076523, 2989108, 2906513, 2820378, 2746569, 2680754, 2617907, 2535105, 2487194, 2419171, 2405620, 2336302, 2271010, 2229424, 2199355, 2150696, 2116737, 2073656, 2029313, 1995706, 1965025, 1918414, 1916430, 1861702, 1865514, 1808088, 1824311, 1776957, 1748163, 1717044, 1699197, 1682495, 1625361, 1629805, 1611273, 1575076, 1576498, 1578857]
5156A578857k5854l1485k8355m1539J2132J2425j5840j0995m0216K552N386m6906
5144A370162L563K5388n3695K4713j6841k5110L768r480K4820l3348l0475J7156
5132A300621k5985q182j1881J8385k3485k6910J3583k1627R144j7563q984L700
5120A200816J2508J7326j2935j5929j5491J8198m942k4052N428J464l0560K4058
5108A175889K2020k2398J2892j5958J6370m9470j661M2692j8012j2724K4701J4017
5096A188358k0700K7314k1158N427p419L1370l1107J899p110M4739J3389l9273
5084A185729M1186J1153O168J5130m102m243K247J3598k1649K0111o006K975K7454
5071A289751r152m629m713Q790J9730Q872k3083M2047Q433j2270L3285P100L0133
$$ y = [1578857, 1553003, 1521518, 1493163, 1451624, 1463756, 1476181, 1460341, 1449346, 1409130, 1411682, 1417068, 1370162, 1373725, 1399113, 1345418, 1370131, 1353290, 1328180, 1331948, 1322468, 1347288, 1313940, 1283465, 1300621, 1274636, 1266454, 1254573, 1272958, 1249473, 1222563, 1236146, 1214519, 1223663, 1206100, 1197116, 1200816, 1213324, 1230650, 1217715, 1201786, 1186295, 1204493, 1199551, 1175499, 1180927, 1182391, 1151831, 1175889, 1197909, 1175511, 1188403, 1172445, 1188815, 1139345, 1137684, 1180376, 1162364, 1149640, 1174341, 1188358, 1167658, 1194972, 1173814, 1179241, 1171822, 1203192, 1172085, 1173984, 1166874, 1211613, 1225002, 1185729, 1226915, 1238068, 1244236, 1259366, 1255264, 1251021, 1253268, 1266866, 1245217, 1265328, 1259322, 1262297, 1289751, 1280599, 1275970, 1271257, 1280047, 1299777, 1308649, 1285566, 1327613, 1336046, 1323776, 1357061, 1364161, 1394294]
5058A394294q135L3599K0448L2576Q438L6938N9267P030K1251J5209K1096m676
5046A637335L4588J3377l0705M5216J4990J2529J8105L829L5208J733o886L1728
5034A811047k4732M7483J6600M1987J1570l59O7746M8090K6376K8733N3751L7964
5022B166256L5545N4924K5158P7143J0689M6960K7551L1194O6123K6725L4065
5011B602333N0707L8959M3767O7292K8859K9954Q5444M3659O2574P1062O1863
5000C186473O2524P5757Q3983R2152J22679R2294J17690J14254J19827J30518
4990D198151J33314J78145J36065J95256K28446J84642K20241K38938K63282K31275
4980F207755K59885K90317K96411K71292L07958L10088K86560L16619L39909K79259
$$ y = [1394294, 1386159, 1419758, 1440206, 1472782, 1481220, 1518158, 1577425, 1584455, 1605706, 1620915, 1642011, 1637335, 1671923, 1685300, 1654595, 1699811, 1714801, 1727330, 1745435, 1749264, 1784472, 1786205, 1779319, 1811047, 1786315, 1833798, 1850398, 1892385, 1903955, 1903596, 1971342, 2019432, 2045808, 2074541, 2128292, 2166256, 2201801, 2256725, 2281883, 2359026, 2369715, 2416675, 2444226, 2475420, 2541543, 2568268, 2602333, 2653040, 2691999, 2735766, 2803058, 2831917, 2861871, 2947315, 2990974, 3053548, 3124610, 3186473, 3248997, 3324754, 3408737, 3500889, 3623568, 3715862, 3833552, 3947806, 4067633, 4198151, 4331465, 4509610, 4645675, 4840931, 5069377, 5254019, 5474260, 5713198, 5976480, 6207755, 6467640, 6757957, 7054368, 7325660, 7633618, 7943706, 8230266, 8546885, 8886794, 9166053]
4970I166053L41928L07394L14253L07883L34547L22898K92519L54017K97931L39901
4960A2379324K91372L05352K74944K53452K52837J91679J57330J31944Q0077M9207
4950A4367518N0641r703l8652n4846q8579j24665j43282j07468j59262j32444
4940A3559258j38356j23005j37072j49235r1144j10425j48210j16050j33902j40380
4930A2271479j87478j44973j12346j71435j69403j76915j51156j87383j75509
4921A0794881j22190j56643j34622j02142j01969n5719m1812n355k2948j1j7697
4910A0033773l0954j995J1536N5765J6697L7122M6354k0226K9527M0508K710Q30
4898A0221647J3467q198q2188R61o7139m8046j00469p4397p6126p1374r2875l7256
$$ y = [9166053, 9507981, 9815375, 10129628, 10437511, 10772058, 11094956, 11387475, 11741492, 12039423, 12379324, 12670696, 12976048, 13250992, 13504444, 13757281, 13948960, 14106290, 14238234, 14318311, 14367518, 14418159, 14408456, 14369804, 14314958, 14226379, 14101714, 13958432, 13850964, 13691702, 13559258, 13420902, 13297897, 13160825, 13011590, 12920446, 12810021, 12661811, 12545761, 12411859, 12271479, 12084001, 11939028, 11826682, 11655247, 11485844, 11308929, 11157773, 10970390, 10794881, 10672691, 10516048, 10381426, 10279284, 10177315, 10121596, 10079784, 10074429, 10051481, 10051470, 10033773, 10002819, 10000824, 10012360, 10068125, 10084822, 10121944, 10168298, 10148072, 10177599, 10218107, 10220817, 10221647, 10235114, 10226916, 10144728, 10145689, 10078550, 10030504, 9930035, 9855638, 9779512, 9708138, 9615263, 9578007]
4886I578007m8415o5759k917k1022R925k107N4168O3326O1870J00326O4836P2944
4874I865182R7623N4143P6934N1388L5845J4011n2108m2237q3978j11573j25473
4863I779757j61777j69652k02681j62246k18299j78113j68988j93675j68454j68056
4853G987816j39385j03311j01487o8962p0134p1608l3844o822l7756n4151j9484
4842G280872l3098m7364p0701o2438j27293q1786j48970j02376j41907j86692
4832F278247j51976j67260j80072j73069j51121j43045j43740j61011j28934j23501
4822D754518j01846m9205r7860n7737n8494j7707j6060r253K8438L0584P7856
4811D483234O9482Q4480J23241J95293K04714L39505M73692O61533R23447J167154
$$ y = [9578007, 9529592, 9463833, 9460916, 9439894, 9449819, 9447712, 9501880, 9565206, 9627076, 9727402, 9792238, 9865182, 9962805, 10016948, 10093882, 10145270, 10181115, 10195126, 10143018, 10100781, 10016803, 9905230, 9779757, 9617980, 9448328, 9245647, 9083401, 8865102, 8686989, 8518001, 8324326, 8155872, 7987816, 7848431, 7745120, 7643633, 7574671, 7504537, 7432929, 7399085, 7392263, 7354507, 7300356, 7280872, 7247774, 7200410, 7129709, 7067271, 6939978, 6858192, 6709222, 6606846, 6464939, 6278247, 6126271, 5959011, 5778939, 5605870, 5454749, 5311704, 5167964, 5006953, 4878019, 4754518, 4652672, 4603467, 4505607, 4447870, 4389376, 4371669, 4355609, 4346356, 4374794, 4405378, 4483234, 4552716, 4637196, 4760437, 4955730, 5160444, 5499949, 5973641, 6635174, 7558621, 8725775]
4801H725775J252427J197057R22554L38981k20591l14542k77877p3250j57761
4792A1392773m01881p32536r20358r64968p94999p04287n92365n17245n00257
4783E263877m16550m29396k86470l07117k46794k23967j71700j70839j30893j51735
4773B728416o1821p2522o2183o6330n2291n0860m5268p957m7516j4640n0075j5483
4761B181470l5950q258J4519m2661o554r682J3684l0997k5933K4263l5286M270
4749B042885r309q488P487J3424j4483k8300r123Q764L3797k6798m701K7687n892
4736B026950k8812L6050Q988l07L1343k2109L3809K4421L8160J964L5683K3295
4724B209435J5841P3437L1557L1493P8797N1707J18985J01099J45599J77333J68370
$$ y = [8725775, 9978202, 11175259, 12097813, 12436794, 12216203, 11901661, 11623784, 11550534, 11392773, 10990892, 10258356, 9337998, 8373030, 7578031, 6873744, 6281379, 5764134, 5263877, 4847327, 4417931, 4131461, 3824344, 3577550, 3353583, 3181883, 3011044, 2880151, 2728416, 2666595, 2594073, 2531890, 2465560, 2413269, 2362409, 2317141, 2309184, 2261668, 2247028, 2196953, 2181470, 2145520, 2137262, 2151781, 2109120, 2102566, 2092884, 2106568, 2075571, 2049638, 2073901, 2038615, 2042885, 2033576, 2025088, 2032575, 2045999, 2031516, 2003216, 1994093, 2002857, 2036654, 2009856, 2005155, 2032842, 2026950, 1998138, 2034188, 2043176, 2042869, 2074212, 2052103, 2085912, 2110333, 2148493, 2150457, 2186140, 2209435, 2225276, 2298713, 2330270, 2361763, 2440560, 2492267, 2611252, 2712351, 2857950, 3035283, 3203653]
4713C203653K10862J75683J45279R0591k986L4888L154l0234n2163m3912j00747
4702C634068j15136r2974j18710p7638r2164n6768q1897m5638p0394l1232k8979
4691B822538j0012j3724Q387M376N75j8368K8492M6909j25L9768L9251N3333Q224
4678C009624N5025K6960O3495k97P1256N4662N9357L4649O9279P1232L3826N5036
4666C604104Q7807N4758P1492M6961J02073O8506J07289N1728R9006R9568Q4739
4655D478031J24941P9942J25465N8360J14195R3075R4379P7105J04245P3312P9671
4644E502721O6323N3415O6329J01354P7913N7134K4098Q8610M4001P1603M3587
4633F197088Q1359O3514O5768P0086R0627M4405J16828M7342J00155P6258N2894
$$ y = [3203653, 3414515, 3590198, 3735477, 3826068, 3823082, 3857970, 3861124, 3830890, 3778727, 3734815, 3634068, 3518932, 3425958, 3307248, 3229610, 3137446, 3080678, 2998781, 2953143, 2882749, 2851517, 2822538, 2812526, 2798802, 2807189, 2811565, 2812140, 2793772, 2822264, 2869173, 2869048, 2908816, 2948067, 3001400, 3009624, 3064649, 3091609, 3155104, 3154807, 3226063, 3280725, 3340082, 3374731, 3444010, 3515242, 3549068, 3604104, 3691911, 3746669, 3818161, 3865122, 3967195, 4035701, 4142990, 4194718, 4293724, 4393292, 4478031, 4602972, 4682914, 4808379, 4866739, 4980934, 5074009, 5168388, 5245493, 5349738, 5423050, 5502721, 5569044, 5622459, 5688788, 5790142, 5868055, 5925189, 5949287, 6037897, 6081898, 6153501, 6197088, 6278447, 6341961, 6407729, 6477815, 6568442, 6612847, 6729675, 6777017, 6877172, 6953430, 7006324]
4622G006324Q6624O5626N7842N3523P9838O7500Q3304O4427O2133P2898N6307
4611G756346P8869Q8299P7717P6504R9114Q3247P3266J11147R7028J25086R5686
4600H762309P7054J38116J14392J16901J38950J18318J66536J50323K19628K07968
4590A0210495K43122K57765L16847L27572L74645L88484M22052M48243M43248
4581A3432473M94833N23069N16612N29396N45758N73709N34121N93799N59974
4572A8303744O17598N45046N72340N64037N29228N55431N52235N14800N22461
4563B3276920N74694N54550M92153N05888M24303M15468L14305K19147J33509
4554B6910937N4487J306p9752j80759k17840k75715l51352l85718m46754m66283
$$ y = [7006324, 7092948, 7158574, 7216416, 7269939, 7349777, 7417277, 7500581, 7565008, 7627141, 7700039, 7756346, 7835215, 7923514, 8001231, 8077735, 8176849, 8260096, 8333362, 8444509, 8541537, 8666623, 8762309, 8839363, 8977479, 9091871, 9208772, 9347722, 9466040, 9632576, 9782899, 10002527, 10210495, 10453617, 10711382, 11028229, 11355801, 11730446, 12118930, 12540982, 12989225, 13432473, 13927306, 14450375, 14966987, 15496383, 16042141, 16615850, 17149971, 17743770, 18303744, 18921342, 19466388, 20038728, 20602765, 21131993, 21687424, 22239659, 22754459, 23276920, 23851614, 24406164, 24898317, 25404205, 25828508, 26243976, 26558281, 26777428, 26910937, 26965424, 26966730, 26886978, 26706219, 26488379, 26212664, 25861312, 25475594, 25028840, 24562557]
4544B4562557n04227n10430n52131n19077n80461n52123n76840n78861n58628
4535A9629779n42357n65900n35784m96680n75496n17129m93850m71579m42714
4526A4988290m50177m17886m23246l78115m05051l40282l45828k96229k99663
4517A1631813k78251k73591k33908k34864j83045j90781j93194j79530j35893
4508I728756j60848j16892j08150q4366q6898n6559m0092n7548k8080j7336l7060
4497H934927J685N085l9727k1152l2940k8720k7632k4584q9453l5351o5150l9058
4485H537930j27992m8633j10455r5734p2632p6814j07878o1212j01861p5738p0818
4474G588163o1105l6492r0983n1071k4698p9355j9837m0591l9932m6139o8252
$$ y = [24562557, 24058330, 23547900, 22995769, 22476692, 21896231, 21344108, 20767268, 20188407, 19629779, 19087422, 18521522, 17985738, 17489058, 16913562, 16396433, 15902583, 15431004, 14988290, 14538113, 14120227, 13696981, 13318866, 12913815, 12573533, 12227705, 11931476, 11631813, 11353562, 11079971, 10846063, 10611199, 10428154, 10237373, 10044179, 9864649, 9728756, 9567908, 9451016, 9342866, 9258500, 9171602, 9115043, 9074951, 9017403, 8989323, 8971987, 8934927, 8936612, 8941697, 8901970, 8880818, 8847878, 8819158, 8791526, 8766942, 8677489, 8642138, 8576988, 8537930, 8409938, 8361305, 8250850, 8155116, 8082484, 8005670, 7897792, 7836580, 7734719, 7658981, 7588163, 7527058, 7490566, 7399583, 7348512, 7323814, 7244459, 7224622, 7184031, 7144099, 7097960, 7029708]
4463G029708o0864o7078p6719r2148p9930p8888j05273j11684j06859j04851j14557
4452F030857j00800j31266j15315p2854j30216j16996q0936q0077j01886p4865
4442E025646r4335l1993p6544p3415q5139p2186o1799o8502p0093n2410j02860
4431D236370p5991o6664q1414o8289p1357o9976p3910n3035r4103k1544o6404
4420C493683o0879l6891l6365n6934j4317l8278o2728j5484k8370l3796l5609
4409C074032k0978m9060k5170j2297l8432j7050m5589P504m3340J4828k2371N288
4397B827365K9993m6254J9893q944J1942l3426J0695j2969P707J8531J9678q059
4385B836152L407n536J4269L3865l908J7749L4102M0476P551N982J5902K6103
$$ y = [7029708, 6968844, 6901766, 6825047, 6732899, 6652969, 6574081, 6468808, 6357124, 6250265, 6145414, 6030857, 5930057, 5798791, 5683476, 5610622, 5480406, 5363410, 5282474, 5202397, 5100511, 5025646, 4931311, 4899318, 4822774, 4749359, 4664220, 4592034, 4530235, 4461733, 4391640, 4339230, 4236370, 4160379, 4093715, 4012301, 3944012, 3872655, 3802679, 3728769, 3675734, 3581631, 3560087, 3493683, 3432804, 3395913, 3359548, 3302614, 3288297, 3250019, 3187291, 3171807, 3143437, 3109641, 3074032, 3053054, 3003994, 2978824, 2966527, 2928095, 2911045, 2865456, 2872960, 2829620, 2844448, 2822077, 2827365, 2857358, 2811104, 2830997, 2822053, 2833995, 2800569, 2811264, 2798295, 2806002, 2824533, 2844211, 2836152, 2839559, 2834023, 2848292, 2882157, 2878249, 2895998, 2930100, 2970576, 2978127, 2984109, 3000011, 3026114]
4373C026114P380J6036K9980J198j4940Q319M062J3330j0257M2734L864J7529
4361C145349K2436M6561l87L0480M3557M2808N5526M5446P3257N1950L0096L0372
4349C617451P1367M3449M386M8163O4579L8639P0634K2121M6841N2573N0555K9588
4337D160346L7551M0720L6998O2952M8095M1175O3117L6658O6304M1003P6843
4326D711762P2511Q8914O9859J12018J08600R0443J64009J03429J69304J74088
4316E864937J63925J77311J47159J49438J77619R8878Q9168J20705Q7319Q7567
4306G164026R4688J23379N8018R8751R6773P9905J11202P0456J11526P8525P4256
4295H161505Q5142O4444O2348M9069N6335N6141Q8023N6474J35627R0108J03601
$$ y = [3026114, 3033494, 3049530, 3079510, 3080708, 3065768, 3074087, 3078149, 3091479, 3081222, 3123956, 3127820, 3145349, 3167785, 3214346, 3213959, 3244439, 3287996, 3330804, 3386330, 3431776, 3505033, 3556983, 3587079, 3617451, 3688818, 3732267, 3736653, 3784816, 3849395, 3888034, 3958668, 3980789, 4027630, 4080203, 4130758, 4160346, 4197897, 4238617, 4275615, 4338567, 4386662, 4427837, 4490954, 4527612, 4593916, 4634919, 4711762, 4784273, 4873187, 4943046, 5055064, 5163664, 5254107, 5418116, 5521545, 5690849, 5864937, 6028862, 6206173, 6353332, 6502770, 6680389, 6779267, 6868435, 6989140, 7076459, 7164026, 7258714, 7382093, 7440111, 7538862, 7635635, 7715540, 7826742, 7897198, 8008724, 8087249, 8161505, 8246647, 8311091, 8373439, 8422508, 8478843, 8534984, 8623007, 8679481, 8815108, 8905216, 9008817]
4284I008817O6479N0983K5857l4412j7467o8464J371j09590o7033p1996j00402
4273H684143m6650j21831q5512m9202o3083m2756o4012n4247q4060p3776q7549
4262G911465p6485n0884r4583o5476o7316m0003p2200o0887m6959m1914q1727
4251G213031q3421p7495p1236p3546p2662l5647o1424n8277o3469O613k5777J1610
4239F608300K6924O1266O9515N4986J70190J68627J52273J67554R2856O0251N423
4228G638165k9540N63j9823m1486p4913p2497j18791q1773o6131j8533l5386J0602
4216G090457O3655P1898J59873J74421K77481L04443L73081M19091L79908L81571
4206I695879L72394L38825J77965R1283o1810j40754j60091j84859k08963k55749
$$ y = [9008817, 9075296, 9126279, 9152136, 9117724, 9100257, 9031793, 9033164, 8923574, 8856541, 8784545, 8684143, 8637493, 8515662, 8430150, 8380948, 8317865, 8275109, 8211097, 8156850, 8072790, 7999014, 7911465, 7834980, 7784096, 7689513, 7624037, 7556721, 7516718, 7444518, 7383631, 7336672, 7294758, 7213031, 7129610, 7052115, 6980879, 6907333, 6834671, 6799024, 6737600, 6679323, 6615854, 6622467, 6596690, 6608300, 6635224, 6696490, 6766005, 6820991, 6991181, 7159808, 7312081, 7479635, 7572491, 7632742, 7638165, 7608625, 7609188, 7589365, 7547879, 7472966, 7400469, 7281678, 7199905, 7133774, 7115241, 7079855, 7090457, 7154112, 7226010, 7385883, 7560304, 7837785, 8142228, 8515309, 8934400, 9314308, 9695879, 10068273, 10407098, 10585063, 10676346, 10614536, 10473782, 10313691, 10128832, 9919869, 9664120]
4196I664120l05858l07184k98360k46574k20942j34714j62879j18938r6579n9597
4186G712495L2248Q9402J62595K08886K16885J80681J57892K9813m9328j09583
4176H631986j04856j22318j48983j62299k35831k65903l07642k63202k31473k15262
4166F574217k70358k41366k28005k34689k10262j86217j88186j91386j42887j50316
4156D530545j70118j01093j29595o7430q2412j01343l3267n2321o5889q691n968
4145C712418k8769K624m52k2367p1869m2946o2514m1246o5636l1691m8474o1772
4133C237306n0326p6713k8735k5951k3146J3547K1598N5998Q0496R3012J07192
4122C404278J24801J28867L3383J2559L2375O346K1063M468o020k3385m8213o2098
$$ y = [9664120, 9358262, 9051078, 8752718, 8506144, 8285202, 8150488, 7987609, 7868671, 7772092, 7712495, 7744743, 7834145, 7996740, 8205626, 8422511, 8603192, 8761084, 8790897, 8741569, 8631986, 8527130, 8404812, 8255829, 8093530, 7857699, 7591796, 7284154, 7020952, 6789479, 6574217, 6303859, 6062493, 5834488, 5599799, 5389537, 5203320, 5015134, 4823748, 4680861, 4530545, 4360427, 4259334, 4129739, 4062309, 3979897, 3878554, 3845287, 3792966, 3727077, 3718386, 3712418, 3683649, 3686273, 3685821, 3663454, 3591585, 3548639, 3486125, 3444879, 3379243, 3347552, 3299078, 3237306, 3186980, 3110267, 3081532, 3055581, 3032435, 3045982, 3067580, 3123578, 3204074, 3297086, 3404278, 3529079, 3657946, 3691329, 3703888, 3736263, 3742609, 3763672, 3768140, 3762120, 3738735, 3690522, 3628424]
4110C628424p8443p7727r9615l9601j5754p9532n545k3116J0177J3009O2711Q6607
4098C381595J07864R6723N8837K7944M2568q408N7420L4772R6298R9056J99750
4087D194419K11132K25879K08355J25110K8875r9067r5566r4838p2252j40695
4077D491352j63403k25403k66961k44238k47173j82629j72474j35748j25411n0870
4067B677042m6663l3221Q2454R8063J42276K03637J97547J41455R7161J6202m2729
4056C533224m9761m3351m6163j00861j76856k03165j83453k03509j66672j75535
4046B183898j76253j27307j41024j44408r7161j01893p9831n0754p2231n2588
4036A140448m3263p5447M737l9377k2980k6389k6377k5249j9473n965l0477K529
$$ y = [3628424, 3549981, 3472254, 3372639, 3333038, 3317284, 3237752, 3232207, 3209091, 3219268, 3232277, 3294988, 3381595, 3489459, 3586182, 3645019, 3672963, 3715531, 3707123, 3764543, 3799315, 3895613, 3994669, 4194419, 4405551, 4631430, 4839785, 4964895, 4993770, 4894703, 4799137, 4704299, 4632047, 4491352, 4327949, 4102546, 3835585, 3591347, 3344174, 3161545, 2989071, 2853323, 2727912, 2677042, 2630379, 2597158, 2679612, 2777675, 2919951, 3123588, 3321135, 3462590, 3559751, 3575953, 3533224, 3483463, 3440112, 3393949, 3293088, 3116232, 2913067, 2729614, 2526105, 2359433, 2183898, 2007645, 1880338, 1739314, 1594906, 1497745, 1395852, 1316021, 1265267, 1193036, 1140448, 1097185, 1021738, 1026475, 987098, 964118, 937729, 911352, 886103, 866630, 860665, 830188, 832717]
4024H32717k1273l3159l0410j2645j2348m5219J1399m4450l8966J4841n340j9539
4012E95608j8773k9799O631J7902k1050o630l808j9163j9852O5485l6700M0615
4000E70466J6850m4649M1853P572k2253j6960J3353q922j6414o165m2805M530
3988D96456k2785l6742R260o0473n792O746j7151j4201R397k2578M346j1857J0255
3975C44881j7152j2949K1374j1177K123L817Q947J1486j0105j2452l7368K9461
3963C20886j2721M543k9709j7917P347j4098N495l828K3337l6386k85j9651J3938
3950B40951j1988k5793L3660k8859j8121J6738k0704j5418O032K14L656m642j3800
3937A61926K3409k5362M515j9911J5343j9864J9216j2987j6796R757K0846k1573
$$ y = [832717, 811444, 778285, 747875, 735230, 722882, 677663, 689062, 644612, 605646, 620487, 615147, 595608, 576835, 547036, 553667, 571569, 550519, 543889, 540081, 520918, 501066, 566551, 529851, 570466, 587316, 542667, 584520, 592092, 569839, 552879, 566232, 557310, 540896, 534731, 491926, 496456, 473671, 436929, 446189, 385716, 379924, 386670, 369519, 355318, 364715, 342137, 346483, 334626, 344881, 327729, 314780, 336154, 324977, 327100, 330917, 339864, 351350, 341245, 328793, 291425, 320886, 308165, 312708, 282999, 265082, 272429, 258331, 263826, 259998, 283335, 246949, 246664, 227013, 240951, 228963, 203170, 236830, 207971, 189850, 206588, 185884, 170466, 176498, 176712, 180368, 175726, 161926, 185335, 159973, 164488, 144577, 159920, 140056, 159272, 146285, 129489, 139246, 160092, 138519]
3925A38519o743J631j5071J9876J9764j6495p134r351J9127l4849K6367j8522
3913A17119k653k1926j2515L0207N190J062J0622k4275J252j1580k889J9491j9974
3900H9131k2009K8594p348j6509J5185k9365K2601r579K2046k9336m814M895J6451
3887G9943k6836J2921J3820k8413p873K0977o28q956M757p739J9125k5649K972
3874D8421L864P131k960j9732O065m51P92r20o097J9835J9890j4568k4765N699
3860D2204r413j160K1362k0881j1459J8762j8454J4577j1978N889k2795p4L3206
3847C9786l2638M3270l1932J5674j7598L4455j6849J8448l9288M2399J0555k1502
$$ y = [138519, 131776, 133407, 118336, 138212, 157976, 141481, 134347, 124996, 144123, 109274, 135641, 117119, 114466, 92540, 80025, 110232, 115422, 116484, 127106, 102831, 104083, 92503, 89614, 109105, 89131, 67122, 95716, 88368, 71859, 87044, 57679, 80280, 70701, 92747, 63411, 58597, 63492, 79943, 53107, 66028, 79848, 51435, 43562, 64539, 63911, 54955, 59712, 51973, 71098, 45449, 48421, 52285, 59416, 56456, 36724, 42789, 42338, 43130, 42210, 36113, 55948, 75838, 61270, 36505, 42204, 32791, 31631, 52993, 32112, 20653, 39415, 20961, 35538, 23560, 29449, 6654, 6580, 39786, 7148, 50418, 18486, 34160, 16562, 51017, 34168, 52616, 13328, 55727, 66282, 44780]
$$ [...]
##END NTUPLES=NMR SPECTRUM
##END=
