##TITLE=abcd
##JCAMPDX= 6.0         $$ Bruker NMR JCAMP-DX V2.0
##DATA TYPE= NMR SPECTRUM
##DATA CLASS= NTUPLES
##ORIGIN= UXNMR, Bruker Analytische Messtechnik GmbH
##OWNER= root
$$ XWIN-NMR		Version 3.5
$$ Mon Jul 27 17:19:44 2026 Russian Standard Time (UT+4h)  servis@DPX200
##.OBSERVE FREQUENCY= 200.131235884673
##.OBSERVE NUCLEUS= ^1H
##.ACQUISITION MODE= SIMULTANEOUS
##.ACQUISITION SCHEME= undefined
##.AVERAGES= 32
##.DIGITISER RES= 18
##SPECTROMETER/DATA SYSTEM= spect
##.PULSE SEQUENCE= zg
##.SOLVENT NAME= CDCl3
##.SHIFT REFERENCE= (INTERNAL, CDCl3, 0, 16.4885)
##AUDIT TRAIL= $$ (NUMBER, WHEN, WHO, WHERE, WHAT)
$$ ##TITLE= Audit trail, XWIN-NMR		Version 3.5
$$ ##JCAMPDX= 5.01
$$ ##ORIGIN= Bruker BioSpin GmbH
$$ ##OWNER= servis
$$ F:\spectra/data/av/nmr/H1/1/pdata/1/auditp.txt
$$ ##AUDIT TRAIL=  $$ (NUMBER, WHEN, WHO, WHERE, WHAT)
(   1,<2026-07-27 17:18:32.90 +0400>,<servis>,<DPX200>,
      <created by zg, POWCHK disabled, PULCHK disabled
       configuration hash MD5:
       00 E9 B6 7A A2 85 ED C7 34 08 36 98 17 FE 4E 26
       data hash MD5: 32K
       60 23 C3 39 EC D6 87 20 16 23 A2 09 85 5F 81 08>)
(   2,<2026-07-27 17:19:14.12 +0400>,<servis>,<DPX200>,
      <Start of raw data processing
       efp BC_mod = 2 LB = 0.05 FT_mod = 6 PKNL = 1 PHC0 = -417.9321 PHC1 = 3.101563 SI = 16K 
       data hash MD5: 16K
       55 BF E8 4B 72 02 44 99 7A 6A 72 0A ED 87 24 65>)
(   3,<2026-07-27 17:19:26.28 +0400>,<servis>,<DPX200>,
      <pk PHC0 = 4.2 PHC1 = 0 
       data hash MD5: 16K
       A6 AC CD 7F 21 98 67 E7 60 82 C2 C1 34 91 0B C5>)
$$ ##END=
$$ 
$$ hash MD5
$$ FF AC 84 98 D3 21 B3 C9 B8 F8 9A 02 A4 05 C4 E1
##$RELAX= 
##$RELAX= 
##$RELAX= 
##$RELAX= 
##$RELAX= 
##$RELAX= 
##$RELAX= 
##$RELAX= 
$$ Bruker specific parameters
$$ --------------------------
##$DU= <F:\spectra>
##$EXPNO= 1
##$NAME= <H1>
##$PROCNO= 1
##$TYPE= <nmr>
##$USER= <av>
##$AMP= (0..31)
100 100 100 100 100 100 100 100 100 100 100 100 100 100 100 100 100 100 
100 100 100 100 100 100 100 100 100 100 100 100 100 100 
##$AQSEQ= 0
##$AQ_mod= 1
##$AUNM= <au_zg>
##$AUTOPOS= <>
##$BF1= 200.13
##$BF2= 200.13
##$BF3= 200.13
##$BF4= 200.13
##$BF5= 500.13
##$BF6= 500.13
##$BF7= 500.13
##$BF8= 500.13
##$BYTORDA= 1
##$CFDGTYP= 0
##$CFRGTYP= 5
##$CHEMSTR= <none>
##$CNST= (0..31)
1 1 145 1 1 1 1 1 1 1 1 1 1 1 1 1 1 1 1 1 1 1 1 1 1 1 1 1 1 1 1 1 
##$CPDPRG= <>
##$CPDPRG1= <>
##$CPDPRG2= <>
##$CPDPRG3= <>
##$CPDPRG4= <mlev>
##$CPDPRG5= <mlev>
##$CPDPRG6= <mlev>
##$CPDPRG7= <mlev>
##$CPDPRG8= <mlev>
##$CPDPRGB= <>
##$CPDPRGT= <>
##$D= (0..31)
0 2 0 0 0 0 0 0 0 0.06 0 0 0 0 0 0 0.0002 0 0 0 0 0 0 0 0 0 0 0 0 0 0 
0 
##$DATE= 1785158312
##$DBL= (0..7)
120 120 120 120 120 120 120 120 
##$DBP= (0..7)
150 150 150 150 150 150 150 150 
##$DBP07= 0
##$DBPNAM0= <>
##$DBPNAM1= <>
##$DBPNAM2= <>
##$DBPNAM3= <>
##$DBPNAM4= <>
##$DBPNAM5= <>
##$DBPNAM6= <>
##$DBPNAM7= <>
##$DBPOAL= (0..7)
0.5 0.5 0.5 0.5 0.5 0.5 0.5 0.5 
##$DBPOFFS= (0..7)
0 0 0 0 0 0 0 0 
##$DE= 6
##$DECBNUC= <off>
##$DECIM= 32
$$ [...]
##$SUBNAM4= <"">
##$SUBNAM5= <"">
##$SUBNAM6= <"">
##$SUBNAM7= <"">
##$SUBNAM8= <"">
##$SUBNAM9= <"">
##$SW= 20.6817932712277
##$SWIBOX= (0..15)
0 0 3 0 0 0 0 0 0 0 0 0 0 0 0 0 
##$SW_h= 4139.07284768212
##$TD= 32768
##$TD0= 1
##$TE= 0
##$TE2= 300
##$TE3= 300
##$TEG= 300
##$TL= (0..7)
0 120 120 120 120 120 120 120 
##$TP= (0..7)
150 150 150 150 150 150 150 150 
##$TP07= 0
##$TPNAME0= <>
##$TPNAME1= <>
##$TPNAME2= <>
##$TPNAME3= <>
##$TPNAME4= <>
##$TPNAME5= <>
##$TPNAME6= <>
##$TPNAME7= <>
##$TPOAL= (0..7)
0.5 0.5 0.5 0.5 0.5 0.5 0.5 0.5 
##$TPOFFS= (0..7)
0 0 0 0 0 0 0 0 
##$TUNHIN= 0
##$TUNHOUT= 0
##$TUNXOUT= 0
##$USERA1= <user>
##$USERA2= <user>
##$USERA3= <user>
##$USERA4= <user>
##$USERA5= <user>
##$V9= 5
##$VALIST= <valist>
##$VCLIST= <CCCCCCCCCCCCCCC>
##$VD= 0
##$VDLIST= <DDDDDDDDDDDDDDD>
##$VPLIST= <PPPPPPPPPPPPPPP>
##$VTLIST= <TTTTTTTTTTTTTTT>
##$WBST= 1024
##$WBSW= 30
##$XGAIN= (0..3)
0 0 0 0 
##$XL= 0
##$YL= 0
##$YMAX_a= 548467
##$YMIN_a= -828675
##$ZGOPTNS= <>
##$ZL1= 120
##$ZL2= 120
##$ZL3= 120
##$ZL4= 120
##$ABSF1= 0
##$ABSF2= 0
##$ABSG= 0
##$ABSL= 0
##$ALPHA= 0
##$AQORDER= 0
##$ASSFAC= 0
##$ASSFACI= 0
##$ASSFACX= 0
##$ASSWID= 0
##$AUNMP= <proc_1d>
##$AZFE= 0.1
##$AZFW= 0.1
##$BCFW= 0
##$BC_mod= 2
##$BYTORDP= 0
##$COROFFS= 0
##$CY= 18.4799938201904
##$DATMOD= 1
##$DC= 0
##$DFILT= <>
##$DTYPP= 0
##$F1P= 9.9274215381318
##$F2P= -0.165520771350173
##$FCOR= 1
##$FTSIZE= 16384
##$FT_mod= 6
##$GAMMA= 0
##$GB= 0
##$INTBC= 1
##$INTSCL= 4.127829e-11
##$ISEN= 128
##$LB= 0.05
##$LEV0= 0
##$LPBIN= 0
##$MAXI= 10000
##$MC2= 0
##$MEAN= 0
##$ME_mod= 0
##$MI= 50
##$NCOEF= 0
##$NC_proc= -5
##$NLEV= 6
##$NOISF1= 3.799351
##$NOISF2= 2.8
##$NSP= 0
##$NTH_PI= 0
##$NZP= 0
##$OFFSET= 16.48848
##$PC= 4
##$PHC0= -413.7321
##$PHC1= 3.101563
##$PH_mod= 1
##$PKNL= yes
##$PPARMOD= 0
##$PSCAL= 4
##$PSIGN= 0
##$REVERSE= no
##$SF= 200.130005582386
##$SI= 16384
##$SIGF1= 3
##$SIGF2= 2
##$SINO= 400
##$SIOLD= 16384
##$SREGLST= <1H.CDCl3>
##$SSB= 0
##$STSI= 16384
##$STSR= 0
##$SW_p= 4139.07284768211
##$SYMM= 0
##$S_DEV= 0
##$TDeff= 32768
##$TDoff= 0
##$TI= <>
##$TILT= no
##$TM1= 0
##$TM2= 0
##$TOPLEV= 0
##$USERP1= <user>
##$USERP2= <user>
##$USERP3= <user>
##$USERP4= <user>
##$USERP5= <user>
##$WDW= 1
##$XDIM= 16384
##$YMAX_p= 338932985
##$YMIN_p= -600700
$$ End of Bruker specific parameters
$$ ---------------------------------
##NTUPLES= NMR SPECTRUM
##VAR_NAME=  FREQUENCY,     SPECTRUM/REAL,   SPECTRUM/IMAG
##SYMBOL=    X,             R,               I
##VAR_TYPE=  INDEPENDENT,   DEPENDENT,       DEPENDENT
##VAR_FORM=  AFFN,          ASDF,            ASDF
##VAR_DIM=   16384,         16384,           16384
##UNITS=     HZ,            ARBITRARY UNITS, ARBITRARY UNITS
##FACTOR=    0.252644378177508, 1,           1
##FIRST=     3299.83951724647, 0,            0
##LAST=      -839.233330435636, 0,           0
##MIN=       -839.233330435636, -600700,     0
##MAX=       3299.83951724647, 338932985,    0
$$ Real data points
##PAGE= N=1
##DATA TABLE= (X++(R..R)), XYDATA
$$ [...]
9435 26861 102079 120604 204809 147365 75100 20426 106828 747 161182 79044 74415 138818
9423 138818 144996 161715 3929 -7442 148597 100949 77214 108579 145266 20400 174951
9412 174951 107028 41193 139720 173180 47312 154545 79934 48215 164571 28896 163890
9401 163890 155003 72201 121569 106663 68637 78633 76505 41637 70071 73138 130722 164520
9389 164520 86044 74840 187714 163692 85289 42241 87799 22705 149296 156701 22594
9378 22594 130532 4258 142822 9229 66414 107204 139822 66777 137393 25864 13749
9367 13749 23594 49577 -9221 113860 55398 13624 19318 65957 72630 58302 40300 -24098
9355 -24098 -37431 11723 -39693 -37946 -10125 -17749 -62513 -29772 -3530 -1398 17807 960
9343 960 26870 33991 9199 60623 22868 -18524 79025 12919 87464 -83153 37149 -81298
9331 -81298 102689 208164 136285 13163 33811 53308 29979 88217 32929 69571 86011
9320 86011 143935 40993 54478 37277 39117 -5730 47703 35241 36760 56355 130765 72177
9308 72177 56339 9405 89580 118354 88702 79561 45330 204295 150328 25406 64305 130123
9296 130123 82138 47185 88924 106537 102868 111856 73308 18428 83704 142282 152159 30900
9284 30900 68939 107791 92037 108450 121680 19716 105130 107001 12609 15706 163066 76579
9272 76579 89272 141201 243114 103165 65652 195216 183257 89415 95044 178739 118655
9261 118655 73232 157539 81023 232533 275890 133247 129754 75327 216268 205995 193306
9250 193306 188267 111665 198554 145445 211688 147782 186130 140266 112686 274947 171472
9239 171472 140923 82833 109511 188933 104892 96848 157947 147990 200542 214138 200773 206116
9227 206116 215714 123892 89934 177926 190779 81694 181752 184362 149802 247521 202228 165039
9215 165039 358054 246787 158449 208846 266336 268442 139964 147246 284584 192332 183632
9204 183632 134975 270027 221974 252549 261001 243346 365824 276394 116560 238197 256087
9193 256087 222702 259814 291331 176380 172289 202994 267759 202105 187293 284417 173990
9182 173990 333589 264106 255110 230007 352100 223328 336724 261147 325797 239467 254042
9171 254042 262431 277357 298048 322872 322425 317668 373036 307834 280968 462443 394257 409726
9159 409726 408956 445981 362896 381624 352485 301907 314654 320346 424713 388487 365774 494750
9147 494750 466109 559190 490899 499242 495075 511970 465135 525491 476563 489620 548136 598068
9135 598068 655059 529342 584435 561481 590821 642536 672830 576008 521536 606138 596045
9124 596045 611759 586790 668235 630158 694713 775533 670425 757780 760327 831571 789564 897057
9112 897057 879390 882418 821157 908077 930056 948924 924603 1094750 1231235 1149443 1220742
9101 1220742 1251334 1340917 1326354 1492157 1786203 1900370 2036786 2339039 2694673 3222636
9091 3222636 3894352 5127383 7658767 12837685 19362012 22934370 23215418 22283054 21057526
9082 21057526 17851931 14211722 11374286 9159044 6525544 4997851 4141110 3547084
9074 3547084 2974714 2595170 2401989 2156485 2037230 1858998 1752373 1611616 1451607 1548671
9064 1548671 1518574 1400999 1458799 1404329 1260888 1289401 1326575 1181638 1118654 1170926 1057594
9053 1057594 1118241 1071290 1155764 1024533 1041000 980408 1038611 986078 1019120 917630 966966
9042 966966 846501 824449 827724 781652 807149 813401 787080 855897 817272 791527 819600 844661
9030 844661 798538 772760 746736 736818 797248 691343 734886 793666 665118 712073 762104
9019 762104 721413 675676 625749 722963 630274 724151 638726 691436 642773 610585 670773 761971
9007 761971 688826 653108 673593 680657 686099 645388 675523 683629 646412 726444 646238 722185
8995 722185 642872 669813 632893 695875 705701 735769 727080 703024 733691 672576 669626 694746
8983 694746 746051 673408 667810 673642 668695 720640 817605 790973 676459 709266 749385 696753
8971 696753 662533 678320 693966 705229 679197 748170 700024 702729 819832 757892 818251 676506
8959 676506 628961 735912 737028 779975 679774 664101 805404 694457 771233 701853 646596
8948 646596 775862 707161 698168 819921 914428 888359 837742 785332 802200 829571 781187
8937 781187 809132 669802 730734 838045 684575 842218 820460 785308 766687 821053 841424
8926 841424 815724 853827 915626 846908 794594 774017 777280 940743 803580 784100 865688
8915 865688 836714 919516 870398 911978 1025509 875745 807179 889655 905398 898742 840985
8904 840985 973669 845382 982096 879054 905875 932073 1034346 969521 900887 1029639
8894 1029639 1000401 1101992 966621 1062955 1009751 960299 1084441 975000 1125517 1027958
8884 1027958 1097311 1095077 972591 1091716 1132510 1163495 1107074 1091781 1121190 1181145 1188120
8873 1188120 1114035 1109815 1236677 1230535 1142413 1179193 1322633 1159724 1222270 1232625 1273502
8862 1273502 1245617 1261370 1337927 1410240 1328467 1218353 1374097 1366081 1370375 1337425 1312490
8851 1312490 1418695 1421479 1451777 1451754 1424708 1453254 1426819 1384516 1483416 1562693 1515355 1463362
8839 1463362 1482403 1608896 1506888 1482276 1544697 1609724 1533336 1636136 1525081 1567777 1655569
8828 1655569 1673115 1669081 1614386 1731540 1703247 1590724 1628958 1810520 1675360 1667373 1773894
8817 1773894 1828683 1849142 1868714 1744553 1875921 1812133 1898546 1837615 1918952 1962270 1952733
8806 1952733 2020640 2059030 2026933 2044745 2125724 2072292 2057299 2121066 2129769 2198919 2155129 2168640
8794 2168640 2140693 2242996 2192145 2307331 2278923 2230185 2329693 2402798 2305906 2472278 2378899
8783 2378899 2504840 2405118 2467574 2596096 2563465 2582652 2514017 2522419 2548330 2654999 2622983
8772 2622983 2699343 2697667 2732506 2851322 2763287 2824801 2826424 3009005 2871736 2967455 2966086
8761 2966086 3064655 3016219 3045787 3079085 3121220 3107335 3225368 3309546 3180799 3231243 3303993
8750 3303993 3339531 3268997 3461517 3466058 3416568 3490197 3539227 3597836 3550382 3574567 3632500
8739 3632500 3751532 3772432 3836552 3782183 3762930 3855741 3920812 4077494 3965068 4116749 4107244
8728 4107244 4212733 4314931 4290835 4374197 4263857 4431003 4475161 4490076 4635865 4557672
8718 4557672 4694284 4730391 4795495 4787101 4791188 4882345 4930828 4952776 5071677 5127485 5161972
8707 5161972 5336346 5314953 5240750 5426918 5546359 5566178 5615145 5558837 5806649 5840330 5899413
8696 5899413 5891856 6018810 6072151 6151405 6243570 6324626 6332973 6378956 6584685 6658685 6719209
8685 6719209 6802368 6899512 6960215 7078719 7145292 7145527 7353008 7474700 7591677 7614907 7737602
8674 7737602 7830553 7962151 8029875 8074304 8244452 8371901 8577291 8574271 8742631 8736645 9008420
8663 9008420 8953457 8995085 9275564 9426075 9480695 9450161 9757626 9900414 9993786 10134708
8653 10134708 10187332 10475957 10547032 10647830 10925482 11066770 11048965 11232418 11410540 11615330
8643 11615330 11692977 11751090 11893054 12277291 12386881 12504035 12727989 12941503 13167741 13463716
8633 13463716 13482919 13589199 13776066 14053882 14114163 14428792 14543806 14706110 14971461 15191665
8623 15191665 15464224 15642584 15762236 16020006 16242428 16530615 16592833 16878978 17120854 17359531
8613 17359531 17516333 17840236 18053525 18277556 18580196 18734976 18976760 19168351 19448891
8604 19448891 19649993 19977349 20160237 20292743 20515453 20827100 21124896 21295039 21450273
8595 21450273 21785048 21940626 22179152 22424427 22655906 22794515 23219488 23237818 23457259 23600407
8585 23600407 23869693 24037120 24198444 24388907 24669217 24686732 24906417 24998018 25184927 25199001
8575 25199001 25345475 25525624 25592981 25732081 25814806 25861224 25917904 26063396 26194336 26134001
8565 26134001 26166473 26240177 26195764 26280002 26234100 26188581 26064793 26080139 25973322 25976848 25883621
8554 25883621 25809880 25784433 25629396 25486344 25384579 25167669 25154934 25016886 24919646 24619188
8544 24619188 24561192 24387458 24287387 24112947 23842690 23783384 23605766 23430309 23282981 22934110
8534 22934110 22803476 22534692 22298972 21860168 22521045 21830111 21571515 21358373 21130163
8525 21130163 20880381 20665681 20537650 20219194 20087143 19846110 19617650 19476141 19189317
8516 19189317 18995817 18734738 18581519 18365996 18099159 17923846 17852084 17547227 17317834 17156544
8506 17156544 16947578 16666450 16338261 16245942 16092754 15807407 15609119 15522486 15270954 15088069
8496 15088069 14808272 14721413 14403900 14296185 13971213 13903323 13646559 13563934 13289406 13182539
8486 13182539 12968417 12702163 12698132 12493831 12215774 12130685 11952525 11778494 11587092 11482820
8476 11482820 11190475 11131054 10982861 10869511 10600538 10496433 10308768 10292915 10107788 10058048
8466 10058048 9901129 9670304 9571958 9438939 9292542 9220717 9092643 9093939 8847407 8756521
8456 8756521 8679216 8463810 8469057 8330016 8197621 8141855 8036783 7944121 7744556 7823921 7640737
8445 7640737 7630729 7544348 7471607 7266765 7195361 7212542 7147929 7093723 6969418 6943611 6803102
8434 6803102 6867583 6792538 6723929 6614829 6451879 6527575 6420938 6315843 6220603 6366679
8424 6366679 6180934 6099523 6135119 6066044 6047282 5985305 6031472 6016801 5843765 5807373 5912687
8413 5912687 5801187 5789118 5702546 5788875 5605323 5563904 5546988 5370034 5402783 5439857 5353621
8402 5353621 5277929 5365773 5343388 5293184 5311200 5255246 5249244 5128389 5052281 5078713 5106936
8391 5106936 4968470 4833199 4876629 4849275 4700366 4644173 4677241 4622280 4508598 4443627 4430176
8380 4430176 4411537 4316776 4217655 4287281 4239870 4177584 4006903 3975284 4070759 3911067 3864401
8369 3864401 3809507 3878817 3730317 3692365 3621430 3573895 3563477 3451521 3429852 3342337 3404583
8358 3404583 3213925 3211157 3264224 3116479 3081558 3065010 3123215 3049512 2984164 2985192 2969042
8347 2969042 2863927 2769784 2797203 2731942 2683902 2722372 2695887 2747004 2663052 2599419 2548498
8336 2548498 2645150 2522767 2519746 2528151 2446106 2440685 2444355 2399959 2326864 2257493 2271954 2249542
8324 2249542 2231889 2249898 2281558 2181165 2261947 2201020 2216807 2101784 2123441 2177787 2082929
8313 2082929 2068884 2003861 2001198 2016353 1993951 2066946 2007477 2030077 2004856 1912817 1855376 2071897
8301 2071897 2025497 1839941 1883072 1916511 1892244 1901823 1822661 1846986 1924100 1820116 1711622
8290 1711622 1788287 1835641 1790447 1749129 1817054 1772447 1718697 1784585 1803389 1759866 1719711
8279 1719711 1795468 1718057 1735846 1697395 1729194 1595212 1701894 1688539 1648207 1600794 1606277
8268 1606277 1652817 1732335 1681252 1530711 1561368 1486873 1552048 1592959 1489026 1491429 1451409
8257 1451409 1526457 1404825 1430019 1418317 1478745 1501056 1386799 1371237 1376821 1417077 1313836
8246 1313836 1333899 1347137 1312995 1279145 1361544 1251424 1358317 1145563 1207498 1212054 1262857
8235 1262857 1176238 1243426 1142317 1156810 1148575 1254857 1112988 1074599 1156242 1155690 1060241
8224 1060241 1073415 1032190 1059753 1033858 1206770 1012081 1073763 981956 1047016 1032826 1031351
8213 1031351 1016920 950867 935763 1074932 1082031 961558 988010 924745 999557 937793 926339
8202 926339 892303 938068 1011908 869015 932679 981456 902114 827713 1119143 824332 708927
8191 708927 708339 801660 724115 985145 803034 780569 787137 845051 777956 820106 742809 776126
8179 776126 756341 828073 780904 738016 820493 802065 756158 718471 846967 917624 757472
8168 757472 742059 860461 672294 843713 708218 743722 705850 816138 717404 648668 700642
8157 700642 799864 703040 729256 770174 745714 694022 653682 750616 703553 684793 685333 621762
8145 621762 619092 675406 716919 687729 646321 648690 721169 657110 707263 696273 574853 629232
8133 629232 674098 673627 548161 649687 658971 613130 691422 736917 662861 637930 542274 524331
8121 524331 630289 659806 630147 603623 560050 602132 647114 586588 634922 711613 627503
8110 627503 596343 648715 631009 675715 538786 538429 558021 703261 603900 558489 703022
8099 703022 667189 611051 652299 694526 626586 635823 548262 598335 497830 578113 513746 624766
8087 624766 611570 563967 567361 594167 639529 631968 529720 541256 665707 678601 617527 672706
8075 672706 682084 599815 631877 621434 630272 723132 600176 570231 627728 676236 590038 625767
8063 625767 744346 582256 663108 599930 591040 567181 697984 624897 575955 650417 674662
8052 674662 633444 680913 704813 731065 712944 736858 722991 702271 811211 687223 779184
8041 779184 769751 871378 793551 868817 866923 884356 817107 960960 821517 769414 832875
8030 832875 997779 873050 985770 862546 994831 1009241 999708 983026 1050426 967323 1080564
8019 1080564 1042185 1049292 1059886 1036008 990055 1164437 1099780 1058723 1133834 1031258 1096157
8008 1096157 1001733 1112772 1074484 1146280 1082505 1069006 1147940 1136168 1026778 1060226 1057884
7997 1057884 1148233 1064728 1066663 1041675 1049967 1049595 956363 957438 1003794 923335 952327 966089
7985 966089 967960 837933 887186 886453 931825 943923 901752 883731 801921 892351 769627 830550
7973 830550 800415 815697 623955 760625 649735 793478 606910 617365 668636 728588 629178
7962 629178 570743 601492 635978 690373 610238 683158 594465 577811 602578 569031 603312 589938
7950 589938 529129 424113 520640 564308 464433 485041 488839 447829 501062 476820 440194 449942
7938 449942 474984 470934 482018 473719 410010 410300 447856 524390 430899 505536 407138 505690
7926 505690 435591 309469 462001 374829 460186 500940 419846 381578 356377 298917 396248
7915 396248 410968 409680 283446 408378 392078 441658 411352 345780 382945 436087 355655
7904 355655 370481 357694 362070 390288 343390 365713 407319 311570 324297 310533 391288 268599
7892 268599 266251 289521 391007 275956 294779 338481 407836 476069 371265 447559 372571
7881 372571 390644 380620 359134 312915 361855 284539 384417 344836 314865 369879 297480 272550
7869 272550 304306 335864 394606 242727 243903 248615 279895 292827 270214 281303 319888 323342
7857 323342 202871 158361 151549 459256 581106 498537 376146 351279 370481 346665 301186
7846 301186 174881 266271 218084 227848 207002 355195 287482 227414 255779 335234 317786
7835 317786 154482 244819 397741 295252 254688 207761 287277 326658 220834 302910 318007
7824 318007 186308 277304 253485 168847 277608 215079 170066 245340 342449 175774 216399
7813 216399 203568 291605 330887 150137 258565 307504 269201 377731 309967 300773 351263
7802 351263 254229 212635 246198 244951 175029 210423 256641 303813 198626 179365 158173 257886
7790 257886 253489 270384 257914 300317 287863 168062 295672 314669 193398 291373 272674
7779 272674 362572 332632 375463 309525 372901 389219 291308 344750 388408 351504 384198 358521
7767 358521 265083 354231 332715 388523 400370 513808 311356 420001 418577 328781 367728
7756 367728 412976 465989 509961 383212 472548 538673 515552 536688 579923 493673 567205
7745 567205 559507 692654 661963 746215 640379 534814 805450 847965 798750 830424 869952
7734 869952 908898 831560 882159 918403 959192 1012715 1089860 1047193 1184190 1040212 1151466
7723 1151466 1194205 1247640 1225108 1432228 1409183 1443595 1432894 1389686 1559849 1561993 1517655
7712 1517655 1492793 1467041 1524736 1527196 1407942 1481306 1479275 1343304 1259891 1250288 1352527
7701 1352527 1215312 1155410 1211405 1200929 1252388 1237150 1248376 1229262 1179800 1215978 1311542
7690 1311542 1250952 1379769 1393013 1307908 1163910 1305021 1268936 1113675 1055567 1049255 916651
7679 916651 946052 968269 928304 916983 885162 846447 967922 944994 986721 848363 1087875
7668 1087875 1250505 1222664 1100952 1310511 1328487 1300827 1288197 1279259 1207579 1239687 1202654
7657 1202654 1141325 1092554 1147473 1157056 1211506 1154462 1267792 1238775 1204922 1384341 1390521
7646 1390521 1525859 1454724 1687031 1723788 1781629 1967420 1936743 1949791 1985586 2109395 2083435
7635 2083435 2161036 2144391 2116628 2221448 2070265 2038367 2042814 2154847 2220688 2128830 2220040
7624 2220040 2165209 2143759 2265438 2205184 2228194 2458237 2614725 2618548 2702219 2699899 2692911
7613 2692911 2625339 2527615 2486616 2376059 2326638 2249142 2171243 2227799 2265529 2164152 2033258
7602 2033258 2020971 2004323 1805853 1762045 1835243 1920928 2030456 2011316 2130874 1865662 1811050
7591 1811050 1797038 1566956 1605154 1530768 1355094 1279639 1309941 1395661 1230741 1235024 1132747
7580 1132747 1226482 1127276 973754 1095812 999223 1056520 1086434 1004248 1016372 994605 981440
7569 981440 1047586 858719 855459 810719 908720 693212 677635 872554 819583 843408 768678
7558 768678 743354 747372 796955 863981 833604 810308 804264 832188 773910 810225 831933 692595
7546 692595 791522 856592 809738 790366 760998 846597 814515 929841 880603 896796 825353
7535 825353 900347 1038696 933812 1033976 1013149 1091441 1056944 1158652 1064701 1113628 1169232
7524 1169232 1302088 1326785 1298006 1374511 1464386 1496172 1497656 1565224 1525357 1429449 1421074 1328466
7512 1328466 1309223 1160370 1002118 1059128 1116389 1061472 1168529 1148400 1184572 1212542 1239183
7501 1239183 1343145 1208113 1301244 1282834 1174095 1189252 1082155 1035196 1007430 1007287 944496
7490 944496 975749 984953 948032 976737 931199 998930 1045828 968316 1072090 1041021 1041659 1043008
7478 1043008 1087680 1059194 1062054 1064809 936583 1112354 1079061 1014840 1129952 1144140 1109431
7467 1109431 1088381 1235688 1179004 1191226 1314750 1234650 1284909 1388558 1287941 1355796 1352611
7456 1352611 1439068 1464172 1486788 1413572 1424693 1429840 1495691 1397835 1553654 1534243 1500085
7445 1500085 1551572 1643479 1583622 1653594 1750646 1691683 1816132 1899540 1992461 1915943 1908973
7434 1908973 2138128 2069845 1922446 1995809 2107644 2023132 1998114 2141284 2282236 2207989
7424 2207989 2342092 2289539 2473377 2470282 2631260 2641319 2773358 2876645 3070436 3196807
7414 3196807 3436287 3732327 4177507 4692316 5325219 5624495 5817573 5816176 5668477 5329940
7404 5329940 5182232 4891629 4764322 4686328 4643609 4672326 4644037 4651310 4788976 5038079 5365643
7393 5365643 5501392 6147310 6938054 8126658 9759057 11441775 12712241 13172798 12947660
7384 12947660 12364350 11509796 10465980 9391848 8562371 7872852 7341071 6901402 6641832
7375 6641832 6619830 6696178 6793271 6945675 7392780 7945608 8543491 9589033 11201931 13053770
7365 13053770 14410600 15269290 15406572 15140751 14772093 13890693 12955397 11986100 10960802
7356 10960802 9991289 9183394 8669205 8272369 7969236 7964158 7899213 8058307 8209618 8625729
7346 8625729 9067144 9701194 10502290 11472882 12793354 14178810 15803603 17253419 18289453
7337 18289453 19157981 20281833 22225783 25008976 27368104 28122608 27566926 26348017 24416504
7328 24416504 21929771 19545149 17460748 15767363 14540679 13828103 13590276 14074332 15134600
7319 15134600 16807282 18941575 21370757 24014741 27230299 32591272 41530992 53081266
7311 53081266 62166861 64970855 63522172 59983426 53954507 46094790 38877132 32829817
7303 32829817 27259440 22941363 20128756 18531515 17776182 17620011 17929989 18711028 19861026
7294 19861026 21761520 25162416 31512747 41807023 53916903 61935128 63810849 61924566
7286 61924566 58021710 51142423 43167141 35992515 29818594 24222611 20024794 17104342
7278 17104342 15194824 13992210 13053702 12468450 12070058 12004882 12322098 13424611 15651433
7269 15651433 19095927 22655030 24612159 24727034 23884383 22277849 19714164 17094827
7261 17094827 14685390 12406753 10630538 9226954 8164747 7488664 6949900 6417800 6081232
7252 6081232 5733308 5452131 5356989 5126151 4901142 4716543 4551738 4416644 4312598 4197880
7242 4197880 4123542 3952803 3799852 3889700 3792650 3658447 3595494 3509046 3473747 3353717 3324291
7231 3324291 3330109 3180758 3170510 3156580 3214036 3072310 3043558 3023046 2925976 2896055 2927629
7220 2927629 2817980 2735464 2616317 2645320 2484743 2454837 2469682 2570481 2475870 2429815 2451880
7209 2451880 2347731 2307935 2290793 2238438 2200722 2218815 2342959 2390528 2317668 2283916 2345069
7198 2345069 2356278 2266265 2269176 2222551 2114996 2048043 1969241 2008166 1986109 2068302 1993470
7187 1993470 2051174 2052952 2136973 2043155 2016586 1852785 1967714 1923467 1716997 1846073 1848890
7176 1848890 1859187 1849508 1856684 1959001 1905943 1866039 2015991 1928716 1718380 1721596 1792951
7165 1792951 1725795 1785678 1775990 1798386 1899925 1879155 1870591 1840607 1810919 1710972 1641710 1660412
7153 1660412 1561546 1547867 1562756 1632900 1631015 1577876 1571322 1669546 1677707 1541876 1546711 1596438
7141 1596438 1482899 1619991 1592331 1638976 1603523 1696964 1537120 1711844 1571546 1490045
7131 1490045 1434933 1523070 1545206 1492862 1513930 1559532 1616469 1508433 1538328 1531325 1496362
7120 1496362 1508397 1506956 1525600 1604933 1582454 1672961 1719952 1739535 1743244 1828631 1706935 1758086
7108 1758086 1724594 1730101 1578385 1650818 1687413 1704125 1787809 1840631 1735302 1620206 1748737
7097 1748737 1836109 1768225 1821962 1841427 1976750 1988550 1996261 2114559 2232099 2363794 2257105
7086 2257105 2274519 2360047 2403995 2259703 2293108 2262588 2258578 2259079 2203550 2282627 2211965 2153374
7074 2153374 2304383 2293856 2301168 2298358 2427610 2357972 2434784 2406214 2539092 2625338 2804492
7063 2804492 2714026 2809730 2877742 2902515 2827802 2924179 2782831 2775795 2729216 2617680 2668432
7052 2668432 2583256 2634118 2586291 2621537 2671955 2659648 2525513 2615175 2700712 2694601 2742472
7041 2742472 2742139 2828932 2766897 2878035 2961643 2919831 2904712 2844631 2975931 2968809 2870373 2881673
7029 2881673 2902886 2902156 2996606 2862935 2981053 2982154 2956865 2994717 2986323 2977897 3102053 3069598
7017 3069598 3062138 3194275 3205880 3209636 3228462 3361621 3328768 3221680 3378272 3407903 3398296
7006 3398296 3460111 3565626 3465061 3389685 3441640 3460221 3470298 3394284 3489317 3500410 3557637
6995 3557637 3635740 3570386 3528855 3594979 3674204 3646043 3536001 3662147 3706109 3572601 3846133
6984 3846133 3818264 3647411 3523418 3524617 3494713 3332108 3281386 3313542 3229217 3189411 3202785
6973 3202785 3156805 3149928 3129891 3133060 3042628 2958411 2911510 2932549 2954917 2988641 2997192 2837202
6961 2837202 2857323 2775365 2723351 2464405 2449375 2405600 2404114 2271070 2177092 2143112 2202049
6950 2202049 1928548 1960957 1937607 1928406 1833255 1846720 1796215 1781370 1736448 1783910 1660951
6939 1660951 1723588 1525313 1451376 1456488 1392485 1410583 1245146 1180740 1279540 1108271 1143615
6928 1143615 1225193 1174478 1071950 985826 1078074 1069420 885952 891015 921210 977053 855319
6917 855319 843430 889750 765567 795460 825564 744248 727335 770088 722244 685807 816514
6906 816514 760106 673960 597917 715139 698195 598172 594154 601386 611942 670008 588635 633953
6894 633953 517524 619112 533696 614800 519821 574491 595413 623313 519752 515636 479398
6883 479398 559593 518893 507268 370002 438707 510132 481783 419825 478166 389484 394304 342545
6871 342545 381987 425313 503978 397884 369589 332006 478351 239186 350147 363257 436845
6860 436845 405157 313578 349100 302737 434716 372576 315853 345995 381260 401586 342237
6849 342237 293193 400098 417209 340072 282343 295962 272443 314498 322699 380565 334093 359701
6837 359701 312874 308920 348025 266518 228475 390481 328916 236697 188520 276613 254804 357764
6825 357764 328986 286106 273321 322170 213531 357146 242134 293023 373755 310519 300918
6814 300918 298510 320367 215754 352324 288624 325568 229570 284779 160745 350535 285417
6803 285417 241488 209821 269627 176580 278617 283109 205414 276780 243965 278836 353701 274372
6791 274372 326257 216856 254469 155694 231046 365037 260511 243892 351865 239622 323775
6780 323775 273573 286197 313643 324203 216445 342888 377664 309418 354948 318502 268391
6769 268391 253443 282024 410389 353381 434687 243220 335231 444681 374888 380401 345761
6758 345761 400891 356165 235728 340613 368041 255384 354050 380291 440934 395362 391798
6747 391798 310503 345783 232245 361146 323980 360023 260577 339951 353662 460016 426280
6736 426280 429223 463350 440206 459772 498878 485359 530619 456879 395546 535120 528054 415142
6724 415142 462013 457216 441927 555439 464718 584397 478708 613525 559531 615717 672427
6713 672427 700039 672210 728290 828952 931725 1157887 1258503 1359060 1371779 1392328 1425443
6702 1425443 1284638 1154130 1126597 922521 836351 887775 876454 879937 904271 889436 903538
6691 903538 905376 1080223 972581 856515 894535 992118 1060288 1167682 1285621 1540738 2026732
6680 2026732 2456562 3093583 3277821 3272569 3195435 2877016 2647899 2371142 2063035 1738133
6670 1738133 1491066 1438078 1435108 1289079 1176719 1285618 1272644 1344690 1172633 1126283 1259682
6659 1259682 1243961 1292398 1370172 1455182 1493298 1766587 2064034 2693091 3221312 3435488
6649 3435488 3405586 3467371 3270077 2806656 2411197 2198817 1913461 1671435 1530634 1515049
6639 1515049 1506787 1312073 1353514 1387210 1307365 1289799 1234914 1317848 1311910 1311302 1395667 1328312
6627 1328312 1355053 1425432 1470402 1672274 1885518 1778288 1874080 1930087 1752287 1754349 1544985
6616 1544985 1408335 1318199 1271025 1267047 1129099 1221166 1104436 1014633 1114650 1154403 1091314
6605 1091314 1098146 1172420 1174929 1220144 1359193 1385371 1423671 1385936 1352483 1394084 1272138
6594 1272138 1291403 1063305 1096625 1098445 1051848 977384 1060892 955994 1014570 904780 978344
6583 978344 1071864 1041957 952140 941661 1074651 1069956 1037141 1087847 1131224 1330151 1334413 1431490
6571 1431490 1506773 1563144 1596505 1541725 1478645 1441794 1292239 1251037 1368762 1258264 1291384
6560 1291384 1141708 1119846 1265968 1225174 1219024 1197954 1334575 1308320 1176793 1412217 1410193
6549 1410193 1547372 1619224 1698723 1789260 1998562 2016986 2056015 2001478 2057079 1868038 1838029
6538 1838029 1733704 1634178 1477158 1614243 1570253 1526292 1564276 1589601 1529510 1470766 1446956
6527 1446956 1408428 1463940 1403490 1436219 1424215 1371297 1481193 1357537 1343882 1469123 1422551
6516 1422551 1518508 1563434 1631622 1546813 1680275 1721864 1789283 1890478 2019011 2270248 2744966
6505 2744966 2913291 3081162 3048293 2895075 2910669 2841663 2589591 2444822 2492944 2326848
6495 2326848 2321571 2363259 2249235 2247000 2423850 2377995 2459410 2542742 2545306 2754390 2856919
6484 2856919 3047355 3232973 3498330 3938517 4588960 5640052 6635326 7506010 7692420
6475 7692420 7577641 7273405 6843458 6315693 5991655 5833588 5584078 5785679 5768054 5778290
6465 5778290 5776495 5649933 5574183 5444528 5416634 5471163 5599819 5786376 5975698 6465498
6455 6465498 7179450 8012958 9589590 12341411 15490673 18089239 19217185 19327878 18827278
6446 18827278 17593404 16001571 14745058 13647408 13171517 13333148 13904038 14147440 13974637
6437 13974637 13588439 12990403 12370449 11714462 11174766 10763608 10522366 10378220 10819051
6428 10819051 11493020 12565138 14421286 17798477 23216748 29529619 34063155 35491424
6420 35491424 35306898 34066672 31777970 28893865 26768136 26005001 26800785 29204191 31367277
6411 31367277 31681006 31113516 29636455 27361884 24648327 21873189 19643238 17695706
6403 17695706 16024286 15123403 14768949 15041323 15659905 17027382 19916945 24680363 30438396
6394 30438396 34255420 35603700 35549468 34718429 32993579 31120020 30656858 32308948 36948622
6385 36948622 43843168 49348807 50876809 49523490 46753893 42303962 36559477 31253391
6377 31253391 26643261 22472365 19290711 16867030 15397226 14412846 14010946 13851386 14376559
6368 14376559 15544245 17178895 18401943 18867801 19032813 19177250 19172473 19275615 20444868
6359 20444868 23275934 28650736 35720850 41327719 43055140 42277349 40025857 36192576
6351 36192576 31188346 26544965 22442343 18705103 15625109 13416369 11870837 10726129
6343 10726129 10019690 9217371 8710986 8233396 7968560 7686760 7672149 7604016 7786869 7947073
6333 7947073 8391332 8967103 10176375 12078412 14450712 16276116 16856518 16581988 15920830
6324 15920830 14653318 13075693 11528131 9956935 8814801 7756629 7033298 6559296
6316 6559296 6141992 6046710 5863937 5597964 5367920 5185783 5028116 4896226 4710735 4578870
6306 4578870 4596716 4367883 4419876 4399297 4457803 4346082 4407295 4411110 4416402 4370116 4218795
6295 4218795 4201939 4132827 4108002 4028757 3981626 4076081 4131315 4371116 4638682 4724374 4814243
6284 4814243 4739615 4706587 4572571 4432407 4207603 4231412 4166335 4215424 4324696 4316590 4324508
6273 4324508 4341198 4372775 4265115 4366399 4329386 4429681 4574881 4708155 4758961 4904914
6263 4904914 5253794 5603009 6125210 6799142 7747871 8936713 10594063 13099941 15590115
6254 15590115 17192427 17472866 17098920 16255883 14826521 13198566 11766948 10430115 9409661
6245 9409661 8548074 8016384 7728456 7628372 7683098 7617764 7812916 8252747 8760027 9443450
6235 9443450 10394947 11359627 12434437 13849456 15800409 18819179 23967372 31407337 39446499
6226 39446499 44504545 45789926 44557718 41977651 37775625 33029659 29006757 25947546
6218 25947546 23945592 22987660 22640029 21784788 20911276 19980151 18663406 17538459 16868428
6209 16868428 16738505 17162704 18076764 18843695 19514973 20481763 22084771 24710571 29703899
6200 29703899 37245452 45301290 50274609 51475046 50354782 47756169 43725701 39365023
6192 39365023 36351949 35055701 36021346 38629366 40524449 40435539 38673697 36347693 32987675
6183 32987675 29153075 25888553 23434695 21935463 20991228 20198728 19547858 19281685 19047408
6174 19047408 19231718 20640097 22852573 25473669 27417165 28207019 28187227 27480053 26239060
6165 26239060 25353939 25253777 26604718 29792543 33897250 36831051 37251661 35753381 33334051
6156 33334051 30081511 26138201 22628468 19625282 17180917 15255518 13835641 12702983
6148 12702983 11953856 11285484 10671571 10091926 10000863 10095759 10649422 11191322 11427607 11457104
6138 11457104 11482060 11503050 11665943 12245702 13619510 14898627 15693763 15620268 15073476 14079622
6128 14079622 12765340 11480975 10114400 8944049 8033201 7213189 6559852 6070752 5846674
6119 5846674 5603553 5481865 5362170 5219485 5305442 5349319 5520975 5583281 5517244 5147944
6109 5147944 5141601 4991896 4664989 4438192 4333810 4226642 3934175 3928429 3907203 3815295 3702098
6098 3702098 3768715 3845416 3694135 3636217 3768485 3599124 3623070 3579043 3402432 3307116 3150104
6087 3150104 3110966 3011066 3044188 2965040 2919822 3042875 2939438 2956192 2930513 2879443 2842110
6076 2842110 2775547 2725800 2743504 2661933 2633877 2680851 2732755 2682085 2604449 2586139 2569015
6065 2569015 2554490 2470610 2250175 2337623 2307085 2208247 2264236 2153068 2185416 2032105 2001210
6054 2001210 1997192 2087474 2070752 2012606 2028681 2090954 2025633 2005264 1864183 2090102 1994277
6043 1994277 1926767 1907284 2090708 2100653 1925330 1992640 1980271 1975315 1892059 1961949 1956470 1948271
6031 1948271 1821568 1823088 1779704 1857254 1823433 1861323 1763219 1877754 1849182 1687179 1729183
6020 1729183 1812896 1807352 1754102 1857487 1723693 1769265 1777362 1747972 1887134 1848677 1803081
6009 1803081 1633665 1742121 1821290 1732083 1713158 1689073 1761339 1750240 1588642 1646092 1631561
5998 1631561 1643022 1622538 1616671 1642214 1612674 1637349 1514649 1626757 1662280 1531719 1657349
5987 1657349 1535130 1660603 1570469 1726941 1508489 1616979 1638257 1734690 1656793 1670832
5977 1670832 1682968 1754004 1661685 1704003 1796847 1881590 1832404 1859128 1885118 1879247 1880077 1905107
5965 1905107 1907911 1996261 1895019 1938154 1997666 1998378 1981830 1999016 2103664 2055489 2067098 2109813
5953 2109813 2066539 2034795 2071039 2285407 2250220 2264057 2249113 2445968 2480200 2610434 2620170
5942 2620170 2636019 2696491 2607808 2728162 2657487 2812634 2761465 2754503 2782232 2855718 2744139
5931 2744139 2694781 2673515 2692872 2722920 2800121 2778121 2778171 2978216 2945105 3249698 3246687 3470639
5919 3470639 3593808 3816175 4147037 4417205 4627070 4887816 5164006 5340893 5336225 5391395
5909 5391395 5425865 5344700 5309242 5204262 5188250 5243033 5082099 5037340 5113867 5008639 5166215
5898 5166215 5320836 5363429 5632494 5835850 6182714 6501953 6924837 7504550 7878435 8447125
5888 8447125 8777111 9157545 9310048 9366678 9284311 9237073 9077023 8754371 8636188 8441173
5878 8441173 8265531 8045061 7998414 7835770 7766817 7802780 7877565 7930627 7959467 8162517 8387126
5867 8387126 8698942 9224440 9618183 9870660 10096988 10259220 10399847 10276926 10130932 9802928
5857 9802928 9468757 9118650 8758161 8469495 8125556 7795957 7488234 7285543 7097657 6971235
5847 6971235 6769434 6575150 6575394 6567874 6555452 6646555 6667595 6735027 6933762 7062623 7249781
5836 7249781 7359562 7289401 7420448 7344364 7255802 7134275 7143149 7110365 7155908 7202929 7373058
5825 7373058 7354633 7479743 7733142 7888449 8085678 8259634 8338081 8694145 8875639 9106427
5815 9106427 9221067 9506545 9686341 9896058 10034857 10231295 10376038 10590445 10845103 10997046
5805 10997046 11249557 11558410 11767308 12253455 12601570 12989466 13429970 13865182 14333132
5796 14333132 14897943 15393221 15822487 16247866 16618922 16939883 17142298 17384110 17586503
5787 17586503 17650290 17781944 17948630 18108612 18178493 18157460 18193911 18228827 18456866 18475629
5777 18475629 18777078 18875170 19128768 19384472 19819309 20128176 20450286 20623799 20871256 21050707
5767 21050707 21221034 21233622 21246591 21238102 21154050 21015340 20814659 20606937 20432669 20085927
5757 20085927 19921702 19732698 19540719 19140672 19079819 18848854 18621928 18652027 18504737 18567084
5747 18567084 18491329 18431504 18509200 18516484 18475284 18400255 18364363 18147836 17938290 17691839 17273501
5736 17273501 16907623 16549513 16216633 15707825 15241297 14729225 14362651 13994219 13700309
5727 13700309 13389235 13132584 12913093 12748978 12552922 12343390 12200303 12085387 11951690
5718 11951690 11984206 11921769 11864499 11846389 11980490 11981763 11924397 11919654 11792118 11660975 11510688
5707 11510688 11342121 11067939 10671406 10420595 10054158 9723051 9349395 9037569 8798762
5698 8798762 8636437 8474991 8309066 8251940 8113998 7932243 7698607 7721397 7802590 7783163
5688 7783163 7826731 7827724 7899454 8059632 8101517 8169161 8221708 8163918 8122474 8204255 8054706
5677 8054706 8153380 7937214 7750007 7719534 7572039 7442580 7300387 7226774 7273288 7246102
5667 7246102 7343073 7280236 7372409 7441156 7452141 7409163 7409131 7535273 7558113 7479279 7613625 7706929
5655 7706929 7639208 7668910 7721570 7711539 7821331 7918929 7999539 8043989 8194982 8199018 8318288
5644 8318288 8374859 8552730 8543755 8612464 8700367 8759602 8791589 8783838 8805727 8811219 8845425 8827281
5632 8827281 8997381 8863309 8992356 9035467 9148906 9364712 9409061 9553830 9701300 9859317
5622 9859317 10041015 10097618 10390981 10464629 10579814 10724231 10694736 10841933 10820918 10551545
5612 10551545 10467030 10397144 10180787 10075105 9939560 9587523 9676100 9508526 9444316 9414118
5602 9414118 9392236 9507087 9402133 9310103 9391938 9399174 9410074 9437264 9623023 9655956 9722299
5591 9722299 9783734 9790115 9889096 9989899 10021953 9926596 9804255 9727144 9525169 9182884 8861482
5580 8861482 8533185 8238456 8103874 7740928 7359318 7165207 7008065 6826634 6619125 6565608
5570 6565608 6679541 6559840 6505950 6643073 6624895 6802971 6867626 6933645 6936874 7067354 7142686
5559 7142686 7008733 7055743 6986278 6846718 6709479 6699167 6462893 6240337 5867947 5806892
5549 5806892 5568360 5318938 5052845 4806342 4845979 4588574 4365101 4282868 4161456 4006801
5539 4006801 3886805 3703203 3733502 3539463 3502984 3431893 3410343 3262846 3290585 3229296 3242485
5528 3242485 3139048 3267501 3060636 3109059 3184187 2943311 2961351 2962387 2919564 2904126 2952625
5517 2952625 2923441 2848833 2929711 2795024 2919017 2832749 2951428 2899824 2842349 2805671 2885303
5506 2885303 2791185 2712911 2749319 2825722 2698464 2740326 2708497 2695226 2868491 2716260 2768994
5495 2768994 2755680 2678541 2778616 2827762 2833109 2784179 2892163 2933264 2948183 2978607 3009914
5484 3009914 3081867 3104536 3164679 3116985 3094114 3172243 3021579 3092094 3107031 3090887 3028588
5473 3028588 2997638 3000000 3095543 3082424 3041245 3066877 3006316 2982590 2968847 3045398 3093081 3004969
5461 3004969 3064668 3052150 3155847 3239124 3097240 3122965 3182376 3262256 3078312 3052927 3248825
5450 3248825 3075293 2912824 2949601 3058950 2911595 2770027 2881261 2763106 2677080 2557540
5440 2557540 2631728 2602513 2646315 2565780 2519657 2588997 2587202 2542455 2476320 2527417 2604957 2614942
5428 2614942 2641230 2696597 2682124 2733144 2626339 2720369 2687469 2651712 2596283 2756302 2750975
5417 2750975 2751345 2643217 2767057 2821959 2870012 2878059 2896757 2892993 2936783 2948481 3032189 2953447
5405 2953447 2903121 2976971 3040502 3103930 3188023 3075000 3234345 3380981 3378300 3385289 3493393
5394 3493393 3581784 3654302 3809610 3927493 4118954 4292543 4350311 4450366 4627578 4745235
5384 4745235 4903420 4941287 5052486 5097797 5126691 4918299 5031221 5134869 5023691 4953371
5374 4953371 4989504 5017995 4981872 5186541 5205879 5152363 5224747 5277101 5282662 5338627 5493985
5363 5493985 5479062 5425192 5487830 5417210 5319112 5302807 5245903 5156966 5092900 5013515 4752152
5352 4752152 4709700 4573533 4526378 4343581 4320622 4315286 4188512 4149211 4083719 3979921 3793135
5341 3793135 3706403 3692565 3501243 3427623 3448887 3358774 3285225 3240670 3172214 3109715 3055792
5330 3055792 2927966 2840248 2797337 2645104 2410765 2527536 2406265 2344796 2215809 2239794
5320 2239794 2196662 2130806 2089835 2009105 2057643 1977468 1981903 1992136 1951873 1972178 1915799 1921057
5308 1921057 1954000 1863061 1811428 1869361 1906097 1819131 1700323 1777088 1804028 1766600 1644759
5297 1644759 1589926 1536658 1576947 1594578 1525372 1591039 1609141 1595217 1382527 1507146 1413698
5286 1413698 1524241 1403661 1476520 1616964 1483299 1427797 1447036 1436281 1411720 1346803 1373250
5275 1373250 1312724 1322567 1274140 1314834 1301842 1353517 1227535 1245286 1354337 1366526 1301603
5264 1301603 1251913 1346898 1388944 1329305 1276831 1414020 1496380 1434544 1332527 1550163 1570827
5253 1570827 1511028 1358271 1506281 1509810 1441348 1395814 1424680 1409952 1458207 1540936 1501416
5242 1501416 1562883 1565484 1466237 1629516 1609197 1646364 1650965 1622465 1698790 1682551 1682862 1694922
5230 1694922 1759062 1831477 1923781 1774881 1894951 1960652 1889702 1970660 1788557 2041168 2010395
5219 2010395 1880048 1881339 1993130 1983463 2112729 2233301 2368076 2453352 2539921 2715989 2840379
5208 2840379 2748430 2685391 2703466 2554228 2320564 2443084 2335496 2219849 2125981 2014204
5198 2014204 1985331 1923801 1864857 1816206 1844309 1806424 1768106 1788222 1684490 1758340 1783994
5187 1783994 1699553 1580420 1701816 1676175 1666990 1655081 1668117 1647499 1588164 1641265 1610577
5176 1610577 1728750 1637668 1561903 1579486 1602074 1563592 1479698 1473050 1527950 1495438 1407870
5165 1407870 1355116 1470279 1449304 1350280 1351958 1473641 1402411 1278445 1377928 1379289 1435495
5154 1435495 1296967 1358311 1463807 1461502 1412182 1380335 1386449 1450420 1420115 1376640 1450617
5143 1450617 1415847 1418391 1487434 1306162 1457105 1429786 1339684 1347324 1397663 1349100 1257209
5132 1257209 1302237 1341734 1404302 1342865 1416121 1426251 1570382 1478725 1460006 1390296 1488302
5121 1488302 1464285 1378545 1480134 1552634 1507419 1502049 1499769 1605030 1677911 1619997 1643615
5110 1643615 1711144 1689146 1688939 1561801 1696848 1750443 1578487 1635877 1621808 1703290 1694130
5099 1694130 1664962 1764600 1753672 1741873 1779731 1931088 1850810 1835951 1846441 1809633 1967734
5088 1967734 2039681 2050135 2163427 2310712 2518100 2600221 2569695 2780392 2607156 2648766
5078 2648766 2648073 2570307 2353069 2522863 2720820 2735081 2902748 2931512 2947452 2947209 2870654
5067 2870654 2840179 2747006 2745530 2696238 2616217 2531429 2566733 2608644 2680786 2683605 2670611 2757219
5055 2757219 2747368 2889874 2919370 3014821 3062020 3238663 3378079 3348846 3288698 3400590 3421401
5044 3421401 3308100 3336668 3311159 3412536 3379066 3397861 3521149 3655401 3623769 3750532
5034 3750532 3924348 4101647 4124704 4294183 4237309 4346773 4388043 4450907 4392313 4474324 4604452
5023 4604452 4560205 4658781 4750810 4701150 4727714 4905118 4855863 5079394 5005850 5054625 5091340
5012 5091340 5270696 5413417 5593867 5871677 6001401 6254195 6470926 6808256 7013124 7130772
5002 7130772 7497532 7644430 7848051 7986298 8036025 8028738 8071970 8202883 8199530 8281092 8344011
4991 8344011 8506555 8541737 8780043 8808274 8828021 9109834 9342418 9647471 9829828 10257036
4981 10257036 11129739 12272707 13575521 14826021 15537223 16237522 17084824 18289888 19987600
4972 19987600 21575499 22609274 22985818 23437129 23838234 23894518 24535218 25539403 27359640
4963 27359640 29971037 34027581 40326536 49895193 63648548 81384468 99767897 112970530
4955 112970530 118352758 117302087 110910730 100488274 87745143 75004159 63149341
4948 63149341 52976368 44881895 38692212 34185248 30604918 27570400 25064744 22807667
4940 22807667 20893004 19098449 17689927 16325222 15452146 14843246 14075995 13586003 13119135
4931 13119135 12655623 12077121 11501751 10956691 10496146 10030207 9685483 9446706 9218666
4922 9218666 8903252 8684069 8509608 8335129 8146038 8031831 7954235 7974512 8042663 7957852
4912 7957852 8157018 8150406 8316005 8395944 8497593 8713535 8805779 9310859 10135414 11810082
4902 11810082 14490484 17987443 21420802 23511937 24128915 23397137 21692454 19336499
4894 19336499 16996186 14435010 12303603 10411342 9049519 8035891 7379611 6857702
4886 6857702 6503313 6264794 5992406 5859564 5701717 5590653 5302587 5178552 4938070 4793248
4876 4793248 4701213 4538013 4406760 4285243 4117684 4203766 4068056 3979753 3934012 3832415
4866 3832415 3824234 3758175 3760596 3652543 3666297 3682153 3496976 3472995 3490353 3505700 3456687
4855 3456687 3554593 3439182 3472040 3334082 3350676 3387360 3472406 3425058 3369701 3347639 3486381
4844 3486381 3367685 3334512 3272801 3373578 3364316 3389000 3337626 3372054 3344151 3271899 3417175
4833 3417175 3349348 3469472 3360896 3538256 3591660 3453107 3466468 3455991 3578046 3580400 3597665
4822 3597665 3761223 3670137 3748770 3687956 3782400 3859776 3909052 3992317 3925432 4003479 4076941
4811 4076941 4001347 4127186 4296296 4230658 4188021 4281874 4314819 4426759 4418634 4420804 4379181
4800 4379181 4306417 4464429 4489500 4504174 4541085 4589137 4641297 4599186 4743228 4797160 4910143
4789 4910143 5015211 5188667 5344219 5413232 5438295 5559257 5609634 5761683 5753074 5840839 5970366
4778 5970366 5982915 6089436 6167525 6321322 6549498 6701640 7056613 7237061 7450032 7643288
4768 7643288 7724962 7811371 7893672 7980816 8013771 8207112 8303586 8507184 8647488 8885372 9001351
4757 9001351 9018614 9105661 9144906 9172885 9090096 8999596 8904759 8858680 8683692 8755367 8707192
4746 8707192 8697125 8798820 8631780 8646034 8578632 8574050 8354873 8203099 8068682 8010159 7967710
4735 7967710 7915549 7877049 7776928 7811461 7780206 7781298 7805138 7815189 7824777 7803793 7870069 7816902
4723 7816902 7785361 7800687 7774256 7938008 8074527 8047385 8202549 8366296 8495809 8596895
4713 8596895 8734983 9058536 9317952 9392682 9648180 9903265 9978745 10183247 10541533 10495789
4703 10495789 10616602 10727870 10884758 10978025 11074847 11105600 11011608 10914780 10887545 10781489
4693 10781489 10661862 10457509 10440326 10326596 10134298 10063672 9934040 9735974 9632864 9448026
4683 9448026 9405907 9234902 9092983 8951120 8916055 8783140 8636039 8510122 8399896 8275185
4673 8275185 8222359 8022443 7935884 7681237 7753193 7570357 7661794 7659411 7797964 7973942 8020893
4662 8020893 8060134 7873241 7737295 7469201 7395183 7092054 6877191 6809282 6745636 6708773
4652 6708773 6822080 6963015 6911342 6927622 6977238 7118255 7097335 7081138 7109773 7356618 7660355
4641 7660355 7639843 7491382 7450341 7283779 7175746 6947979 6870959 6686206 6572919 6413123
4631 6413123 6577385 6535691 6572914 6533915 6528596 6669426 6699577 6641623 6546437 6543504 6707735
4620 6707735 6525112 6456696 6524394 6540046 6566737 6516325 6657917 6670975 6724324 6746566 6759365
4609 6759365 6896165 7011763 7044208 7005610 7019737 7037534 7082488 7154549 7249941 7369877 7271164
4598 7271164 7400736 7434895 7479302 7598583 7635042 7660079 7896890 8001097 8078205 8133179 8261047
4587 8261047 8372055 8626808 8788947 9015502 9294758 9367704 9402469 9450590 9345412 9383573
4577 9383573 9396198 9286023 9377216 9525208 9643562 9756356 9870386 9977126 10091911 10238531
4567 10238531 10451097 10589137 10628522 10841739 10962557 11098099 11324315 11556000 11878448 12229009
4557 12229009 12651854 13147414 13481321 13786737 13936254 14159489 14223522 14306997 14326674 14656566
4547 14656566 14795184 14964631 15351037 15549764 15722381 16084026 16347033 16659267 16910310
4538 16910310 17385422 17676616 17998327 18385459 18741202 19183195 19605973 20070995 20425981
4529 20425981 20954910 21305562 21720691 21974038 22278796 22702037 22885130 23189385 23588703
4520 23588703 23957365 24402890 24806918 25294124 25752073 26356914 26964841 27387937 27945241
4511 27945241 28502964 29059582 29675140 30138151 30637088 31231545 31645460 31986482 32380640
4502 32380640 33004102 33374439 33727119 34261377 34834979 35209727 35814178 36473124 37117046
4493 37117046 37829115 38738061 39394974 40467374 41585315 42658652 43765108 45229251 46594310
4484 46594310 48045662 49382958 50778427 52218912 53827558 55326940 57092297 58978531
4476 58978531 61133641 63618774 66407793 69707610 73584724 78215275 83693288 90317028
4468 90317028 98278202 107816595 119779470 134643476 153054367 175288521 200231556
4461 200231556 225834563 249111704 267523597 279483872 284567845 282619928 274468836
4454 274468836 261497756 245394567 227628722 208943455 190738378 173606118 157691201
4447 157691201 143492391 130811834 119984814 110922146 103326680 96961683 91759385 87487397
4439 87487397 83922137 81096419 78582883 76699439 75139166 74081152 73661652 74071442
4431 74071442 74968342 76275045 77597304 78620685 79667392 80867042 82879698 86878904
4423 86878904 93805569 103119854 112017252 118026022 121800119 124758594 127854186 133483700
4415 133483700 147675477 179226628 230783963 283882246 311152415 313793740 305645776
4408 305645776 288743985 256884015 225355838 198457399 175188906 156352297 146569894
4401 146569894 145309589 151084936 160048247 170090620 180203467 188302074 193106484 197814431
4393 197814431 211255430 241191615 286830463 326451534 338932985 330336390 314044249
4386 314044249 287952776 250290422 216765683 188136636 162449941 141837166 128478569
4379 128478569 120781371 117045729 116406709 119277799 124591470 128566717 128384860 125005452
4371 125005452 120226154 113703241 105915061 98994818 93248150 88342052 83984357 80355121
4363 80355121 77572924 75405054 73799933 72958990 72458169 72023197 71402949 70621777 69495846
4354 69495846 67853112 66169671 64356164 62601991 61056013 59852005 59201537 58845963
4346 58845963 59099731 59818577 61129571 62223550 63445665 65274524 68484137 74225768
4338 74225768 85658343 106645743 134347737 156811516 165917528 165566022 161001414 150426142
4330 150426142 134834137 121016324 110199810 102842611 100341867 101203012 100699475 98168375
4322 98168375 94798213 90533634 85040321 80008489 76188655 73614732 72001727 72085597
4314 72085597 74032233 77876187 84667432 96576470 119859924 161860966 218311426 263197079
4306 263197079 280529841 278606753 268426808 245762814 213176362 185211805 163275319
4299 163275319 148368603 144037928 146419522 145987822 141242724 134507497 125905755 113917667
4291 113917667 101402936 90948605 81998849 74418424 69167672 65997467 65003243 66139257
4283 66139257 70361821 80375057 99446467 125167422 145722499 153601122 152128101 146277374
4275 146277374 134579899 118231281 103882774 92511473 84661692 81787997 82387720 82189577
4267 82189577 79852595 75938070 70977541 64600446 58027903 52441310 47619937 42957807
4259 42957807 39088080 36040231 33581666 31515793 29841394 28442673 27338134 26505154
4251 26505154 25667918 24775203 24041680 23317337 22299920 21561191 20836106 20112178 19662171
4242 19662171 18978475 18356478 17921927 17644107 17463580 17551717 17792785 18032430 17877900 17365493
4232 17365493 16892553 16273592 15465608 14795720 14329297 13730435 13198123 12793504 12409831
4223 12409831 12205213 11993826 11856013 11565885 11404808 11323038 11189221 11111893 10976193 10855496
4213 10855496 10620176 10568115 10477359 10410178 10234692 10114992 10004706 9857539 9632465 9421759
4203 9421759 9124998 9031174 8667616 8470533 8238736 8115102 7948757 7800393 7433055 7289214
4193 7289214 7098199 6907749 6744842 6701612 6668479 6504311 6264333 6229070 6119236 6001761
4183 6001761 5883060 5769078 5738696 5577290 5464014 5375431 5204042 5121328 5080600 4891776
4173 4891776 4860785 4799592 4699426 4588903 4631993 4547425 4554490 4491256 4462212 4392071 4349687
4162 4349687 4393860 4299158 4409954 4559038 4786729 4938922 5047848 4862391 4842665 4760163
4152 4760163 4415440 4247994 4092829 3951750 3809247 3660674 3661123 3612137 3607853 3634859 3653984
4141 3653984 3605000 3663627 3547726 3666370 3758771 4013170 4122008 4084116 4047522 3860132
4131 3860132 3664671 3462012 3204009 3011639 2942982 2696470 2550475 2676217 2641049 2606514
4121 2606514 2647137 2667618 2654281 2628480 2542917 2599531 2398720 2237107 2244394 2150807 2231029
4110 2231029 2213866 2096295 2136792 2064819 2083609 2032175 1980040 1994383 2003859 1934252 1866741
4099 1866741 1781220 1830541 1774648 1778563 1723772 1750251 1698818 1728802 1660853 1729601 1669073 1792423
4087 1792423 1689566 1930912 2148714 2174461 2268300 2310955 2296644 2245976 2013410 1985727 1839072
4076 1839072 1836395 1776840 1880681 1732961 1772558 1655545 1542144 1528023 1599821 1532302 1389293
4065 1389293 1512357 1518124 1440929 1451460 1470927 1564901 1686857 1873518 2248225 2556162 2601950
4054 2601950 2740736 2634761 2479107 2207128 2109579 2049222 1891839 1822611 1854055 1839554
4044 1839554 1862057 1776139 1742820 1642251 1600719 1542644 1460269 1370758 1438316 1390095 1419389
4033 1419389 1406635 1376097 1389328 1458996 1626665 1873660 1873572 1824439 1810899 1730302 1667869 1570613
4021 1570613 1634495 1449817 1556997 1537178 1582389 1581135 1632038 1532459 1475161 1517170 1544838
4010 1544838 1400812 1340017 1232905 1201004 1192335 1051168 1092320 961289 1035832 999194 1012450
3999 1012450 979543 928080 940528 1015999 1068843 1010942 929237 879248 926414 975328 1039641
3988 1039641 1001448 1023077 988012 971604 971557 913928 852604 786918 800570 878323 811977 723046
3976 723046 731623 688869 697169 620795 694388 769242 701768 634061 634303 634912 582132 518558 566590
3963 566590 563316 598412 527845 462398 560515 509274 444741 490128 604179 503666 411886
3952 411886 399350 457213 578415 422708 449524 372414 464167 389804 506580 401124 365850
3941 365850 354500 334261 384058 445884 417295 222354 273859 327497 425149 285297 377572
3930 377572 306336 251416 307826 361812 384019 280443 281897 299437 259266 203839 345527
3919 345527 279111 345364 392793 386043 234512 246819 338472 318329 254515 231145 259555 305043
3907 305043 336292 251395 239650 279340 289787 198856 131778 305718 215341 216602 210091 248242
3895 248242 203344 319134 185664 159514 177418 244798 164435 281029 218216 241711 163998
3884 163998 219139 206775 189263 181735 258962 5478 157662 283257 278671 107454 151866
3873 151866 184664 185843 196607 297644 201614 72628 107728 133631 -2540 95349 153068
3862 153068 183974 136708 274880 15884 177392 115023 172392 252948 88854 76443 208473
3851 208473 242645 160304 219897 181819 176616 166615 239522 133709 122338 57770 89710 12994
3839 12994 92723 143118 228327 80197 137352 146267 38217 94107 136859 140043 -12791 93851
3827 93851 101870 -12270 30559 85515 92941 25456 77926 59055 88727 68799 133524 94869
3815 94869 95655 128741 89583 139200 59274 65511 55487 93147 21167 147007 77780 123947
3803 123947 123682 95834 50926 139097 249334 46195 143729 167848 83427 82400 61783 32592
3791 32592 2962 22639 -12293 -5413 66027 67909 10514 92287 94662 85244 121560 58911 105673
3778 105673 105325 37916 -63654 27809 -27876 -5133 10209 51928 155010 60507 64002 151831
3766 151831 181053 83813 116604 30908 131843 -848 101272 2050 136900 73240 47099
3755 47099 39878 64697 94913 -33199 -41632 -73465 -23651 38174 139045 -8125 -40560 -4218
3743 -4218 -45968 4895 149856 128839 69400 71287 58475 82178 29104 94474 61876 6608
3731 6608 138378 1145 -11310 20632 49719 62335 82166 34839 24718 32113 51101 150775
3719 150775 49434 31152 60948 26567 16966 19743 95893 15957 27540 -20850 43175 54412
3707 54412 42888 51590 107966 -1180 80575 -25587 -81960 -12163 -79028 -68213 -40510 -3833
3695 -3833 1767 -28796 8240 -105272 1979 -1088 -15136 -22439 -61532 35558 4051 63620
3683 63620 -69945 65230 48814 75312 -77100 53012 32028 -44646 -25673 -71564 3221
3672 3221 -63529 -105148 56938 -72426 -40013 42083 35507 121376 53259 3176 -26942 -17806
3660 -17806 11754 -38238 -99530 -56265 20923 -82328 -11614 75487 115475 60941 32478 15808
3648 15808 -9409 -50247 -93995 -6995 -13292 -88096 -60238 -104452 -41843 115004 -25351 -104125
3636 -104125 9915 62906 25416 84702 61322 -19980 -19116 -84203 -69434 -138419 34304 -38878
3624 -38878 37182 9618 -30773 53868 921 14288 -1411 -23201 -2578 -25575 32806 25810
3612 25810 -10804 -28545 -49726 -91849 -28448 -53874 -110935 22978 66868 40820 41357 31398
3600 31398 15262 -105754 -6737 -20613 -5567 -57601 -46921 -7624 18507 31235 -33472 12172
3588 12172 73769 -23062 -27288 -3906 -186931 12793 -53109 -93699 -100358 -66329 -46313 5467
3576 5467 63762 -96493 -77636 -193109 8496 -18758 -64365 17877 14120 -24354 -58126 -110369
3564 -110369 -104991 -145281 -91622 -6857 -44095 -22362 -54473 -25271 80371 26765 4000 -177199
3552 -177199 2934 -93724 17126 -128623 51063 -100933 -52570 -62870 28796 12771 -72931
3541 -72931 42452 8741 -4736 -42918 -25010 -23778 -8779 -36168 -20413 -34590 -107568 -23342
3529 -23342 -33940 -112801 -69384 -40477 112406 20121 -63385 -90268 -22022 2647 -30033 -98741
3517 -98741 -29038 -71902 -32269 -48042 -15681 -92344 -28318 -87844 -53374 34967 -37033 -32077
3505 -32077 -31649 -77784 -40630 29297 -90268 -95967 4946 -92941 -138362 -133636 27650 21400
3493 21400 -108825 -58637 -36442 -39474 -64358 -64698 1587 54174 27239 -68753 4483 35327
3481 35327 -5790 -218228 -36200 45879 -49378 -172891 -90392 -59342 -21157 -41792 -109525
3470 -109525 68631 -36479 -123118 -122415 -33177 -4556 -40799 -138927 -103610 -24838 5775 -84659
3458 -84659 -13736 -82575 -85106 -106119 -105533 12123 -91452 -19662 -12688 -55787 40386 -59002
3446 -59002 -88457 36928 34175 -101211 -62268 -16104 53695 -76038 -86351 19497 -51161
3435 -51161 -85734 -46459 -84488 24822 38183 -70757 22497 -32539 -33468 -154412 40554
3424 40554 70948 -35490 -162355 9378 1400 -29659 10614 -37408 93275 -18622 -77597
3413 -77597 -63967 -50194 -8840 90803 -43380 -55590 -64701 -119255 -98675 -41121 -55573 -147230
3401 -147230 -43658 -40271 -104475 -7737 -108443 -59273 -98260 -100419 -97819 -27006 -6566 -75697
3389 -75697 38069 17006 -69660 -43062 3609 39613 16304 -38658 -91536 -9697 51157 -76190
3377 -76190 -43243 1928 149673 12767 77388 127416 32509 132942 20880 60464 -38647
3366 -38647 10192 -20202 35238 2395 25618 -25762 -16056 -15967 -46900 -81138 106113 -144080
3354 -144080 -22802 -41638 281 -54835 46749 -62302 -118856 -37303 9034 24118 28076
3343 28076 -48273 -148083 49435 61206 112677 -86748 40825 6904 68265 118642 27348
3332 27348 156193 171681 240853 178695 157625 114811 164541 193679 310912 308272 320971 449435
3320 449435 920807 1522717 2242005 2617604 2551123 2435226 2288912 1939472 1517294 1112250
3310 1112250 936336 703917 491134 371470 355078 261213 421544 325193 172414 195576
3300 195576 189014 214878 45601 161950 104444 77511 -1135 123010 79473 37154 2710
3289 2710 64135 36893 -51424 22486 86575 -126773 50355 45319 93455 40674 74839 36733
3277 36733 2850 26203 -33028 -48374 -59718 43060 14740 -78649 -21734 -25193 1557 -113213
3265 -113213 10874 -29274 -30546 -900 30440 -4529 -157356 -169762 64969 -61247 -43995
3254 -43995 -94292 9538 -54477 -85598 -63888 -45954 -50960 95616 -36345 -123562 9648
3243 9648 -20974 -57469 -79418 -71685 -215311 -67677 -56050 -92948 -83049 -68954 -31331 -181737
3231 -181737 -56019 30624 -132066 -143191 -25006 -55872 -15126 -48803 -118301 -11967 -64954
3220 -64954 -17418 3486 -50339 -15735 -107840 44398 -76121 -117225 17855 -17052 20016
3209 20016 -36864 1704 -27263 -105785 -74148 24408 -120609 -160985 -63882 -53554 -65671 -65221
3197 -65221 -144180 -80126 -44021 -104951 -107742 -52938 -68956 -75687 -34716 -74567 -113731 -50766
3185 -50766 -112060 -116685 -38203 -84732 -153557 -76521 -90754 -56377 -51259 -21314 -105506 -149728
3173 -149728 -53995 -145759 -58204 -136945 -73177 -46458 -82255 -212624 -134021 -83014 -37290
3162 -37290 -115802 1042 -83850 -129477 -61852 -85350 -43082 -46880 -102190 4858 -76119 -155400
3150 -155400 -77744 -25464 -73760 -26374 -61265 -189855 -126948 -12020 -167471 -177716 -81023
3139 -81023 -101339 -16069 -96739 -92919 -68935 -69861 -184717 -75156 3323 -136129 28393 -119278
3127 -119278 -108305 -92205 -155800 -139753 -27031 -82601 -67933 -46421 -42429 -30342 -162670
3116 -162670 -57573 -154558 -40556 -91293 -166038 -146246 67194 -36889 -78717 -103567 -104944
3105 -104944 -109661 -114877 -118882 27378 -46925 -7074 -206695 -27077 -38299 -52976 -127726 11675
3093 11675 -48275 -95498 -22504 3531 -52267 -71080 -168950 -146301 -27970 -48099 -143405 -134878
3081 -134878 -69183 -77058 -44636 -45160 -72718 -145266 -164294 -94439 -41 -223360 -125652 -74519
3069 -74519 -88977 -157270 -82491 -119676 -76060 69678 30836 -117255 -60532 -60191 -126891 -196742
3057 -196742 -158342 -19640 -134648 -67036 -89398 -122121 -100778 -189912 -106472 -215079 -116579
3046 -116579 -91135 -182768 -182240 -61482 -114886 -124417 -98622 -196354 -46509 -17858 -72906 -67790
3034 -67790 -73755 -44967 -128361 -113686 -56248 -50118 -90910 -78316 -117153 -143347 -144835 -175001
3022 -175001 -81410 -44767 -192727 -193633 -79770 -77348 -110356 -47483 -23871 -76145 -173946 -78782
3010 -78782 -149705 -136485 -89868 -66051 -170578 -184321 -83197 -60491 -102174 -190144 -62232
2999 -62232 -3054 -97217 -60647 -82546 -134727 70590 -99349 -177911 -99904 -143573 -101344
2988 -101344 -139135 -102705 -95309 -180907 -138073 -110287 -97246 -83248 -179209 -193101 -106828 -53423
2976 -53423 -128944 -68155 -131959 -61393 -205837 -95743 -72340 -39323 -138884 -48909 7804
2965 7804 -152918 -100554 -67649 -206445 -20833 -153955 -71896 2120 -37192 -38786 -133914
2954 -133914 -99729 -196733 -52423 -92487 -115133 -48124 -83267 -129498 -149324 -126784 -212679
2943 -212679 -147319 -76832 -22646 -143313 -136779 -181667 -118490 -124550 -134511 -163809 -203340 25715
2931 25715 -87916 -206520 -148483 -32299 -21640 -201955 -126780 -114857 -116513 -136356 -128584
2920 -128584 -14605 3378 -135146 -172011 -77414 -36240 -166778 -49667 -116959 -100155 -48953
2909 -48953 -177690 -123895 -83062 -135457 -96391 -146961 -90874 -67855 -69354 -47162 -63199 -104084
2897 -104084 -145528 -70438 -96220 -251168 -170028 -142110 -94194 -89653 -8605 -30501 -151110
2886 -151110 -111730 -88501 -145480 -123637 -62405 -131220 -201042 -83927 -140589 -88701 -30381
2875 -30381 -74017 -84089 -197816 -150694 -129010 -923 -194411 -187690 -125227 -232003 -139646
2864 -139646 -163577 -153922 -39384 -106014 -150840 -34145 -79994 -156480 -158326 -169524 -142884 -42635
2852 -42635 -143337 -151590 -187854 -51925 -63857 -144878 -132157 -167173 -104838 -60632 -87803 -179015
2840 -179015 -112901 -182207 -77530 -127763 -182446 -198643 -127728 -127082 -107705 -89556 -93144 -150736
2828 -150736 -227021 -68851 -59809 -150339 -138052 4699 -46051 -76199 -134422 -198196 -130091
2817 -130091 -209691 -203692 -197997 -112570 -84550 -77075 -190411 -156144 -55210 -167601 -149829 -137397
2805 -137397 -92556 -153298 -114136 -130996 -95905 -206036 -100397 -157865 -154014 -30904 -132840
2794 -132840 -143370 -167352 -85426 -112365 -160582 -114090 -46018 -107585 -138348 -78990 -125263 -260938
2782 -260938 -136553 -148101 -162627 -159081 -184068 -163020 -89309 -116151 -144337 -185801 -140006 -41624
2770 -41624 -117771 -130389 -210813 -95780 -155878 -130689 -136958 -123183 -214493 -105077 -128738 -159275
2758 -159275 -188556 -71439 -165428 -141884 -59672 -116347 -112971 -166041 -190864 -28128 -104236
2747 -104236 -84812 -115086 -92295 -65602 -107191 -29576 -119782 -90119 -43881 -112719 -168600 -157790
2735 -157790 -159927 -236723 -91529 -111597 -38497 -157674 -48326 -90498 -137270 -153883 -109855
2724 -109855 -140681 -87724 -100590 -138520 -142141 -149665 -13782 -58077 -194374 -137933 -31044
2713 -31044 -193096 -19075 -91738 -131577 -180412 -130487 -21778 -51589 -60185 -170772 -97843
2702 -97843 -122505 -131934 -140663 -58179 -91757 -157842 -49127 -117496 -138462 -182070 -114366 -139211
2690 -139211 -92476 -188968 -140120 -133145 -88996 -109638 -90451 -59103 -125305 -98300 -107866 -30880
2678 -30880 -113348 -169687 -237816 -162434 -153522 -134996 -135395 -86163 -149677 -90692 -228365 -97856
2666 -97856 -75225 -44282 -41352 -120540 -128710 -102434 -84135 -9554 -17016 -106004 -161347 -68961
2654 -68961 -51664 -66420 -145841 -127412 -161424 -157369 -76048 -227942 -98425 -103508 -182601 -169667
2642 -169667 -34724 -78799 -124000 -114074 -88049 -96323 -214725 -126418 -128256 -150970 -130074 -176842
2630 -176842 -159055 -141728 -65359 -155152 -147831 -85608 -118605 -148843 -113327 -192550 -91521 -185835
2618 -185835 -138763 -109032 -176304 -87465 -141792 -161315 -103678 -185529 -222819 -124162 -119822 -103597
2606 -103597 -83883 -161522 -93430 -128690 -160181 -72819 -71328 -148799 -89449 -189532 -118025 -131660
2594 -131660 -119524 -178193 -184040 -120334 -147606 -66051 -137444 -146335 -141786 -94831 -124470 -149655
2582 -149655 -148767 252 -139168 -67408 -84711 -143846 -128840 -112414 -94514 -183916 -58371
2571 -58371 -139722 -186923 -115456 -116376 -150393 -199704 -125788 21741 -151414 -164560 -80168 -135091
2559 -135091 -114384 -164714 -153176 -171615 -99269 -217363 -205608 -94964 -68878 -199856 -172636
2548 -172636 -11917 -213926 -97046 -144414 -132302 -127743 -128561 -122069 -158436 -93796 -124910 -251798
2536 -251798 -112854 -53691 -146027 -129991 -36733 -178671 -151138 -268864 6392 -97962 -63774
2525 -63774 -90546 -54862 -32225 -67600 -159019 -40906 -104030 -150086 -124149 -94825 -69370 -192763
2513 -192763 -136575 -181637 -138591 -97485 -145686 -128209 -173149 -250527 -126106 -113745 -71509
2502 -71509 -199624 -66370 -68984 -202264 -65873 -94363 -35414 -120131 -207961 -87069 -178418
2491 -178418 -71840 -81629 -155340 -136615 -63862 -115375 -128440 -106734 -127954 -199097 -131580 -37838
2479 -37838 -171056 -210466 -148499 -107635 -160523 -171458 -228423 -168437 -171473 -155782 -158885 -105324
2467 -105324 -89917 -137963 -60853 -134988 -81360 36385 -35800 -125469 -219728 -191488 -159111
2456 -159111 -99156 -125567 -135525 -82244 -190825 -103331 -120813 -130320 -87215 -147113 -105290 -120256
2444 -120256 -96959 -231715 -231417 -89651 -180486 -177688 -147735 -80531 -105895 -96404 14321 -148871
2432 -148871 -166902 -139251 -222824 -14984 -124373 -148384 -183954 -237327 -86414 -230140 -172482
2421 -172482 -116121 -86575 -101910 -133655 -134150 -142495 -123176 -232193 -142946 -180723 -237869 -134274
2409 -134274 -33487 -119241 -145650 -115123 -101371 -116743 -119880 -142782 -177467 -181987 -128827 -205927
2397 -205927 -115369 -148585 -215621 -185622 -128748 -62912 -94807 -92177 -205054 -225234 -124315
2386 -124315 -115879 -170211 -158947 -71241 -68424 -131101 -98745 -63081 -169159 -100465 -64482 -92464
2374 -92464 -100813 -178778 -149516 -75637 -157863 -165575 -121282 -28859 -178340 -112753 -86970 -137636
2362 -137636 -104240 -140255 -132794 -268894 -216421 -175936 -64455 -196380 -75920 -93198 -160506
2351 -160506 -117155 -62750 -100073 -80747 -233313 -44681 -212046 -68540 -10320 -211278 -186905
2340 -186905 -148284 -128228 -65843 -150512 -105071 -64230 -146692 -137322 -116411 -136847 -199271 -132576
2328 -132576 -100608 -123811 -24363 -86359 -106375 -119837 -163504 -93177 -145056 -60894 -158074 -58282
2316 -58282 -154873 -217971 -77844 -238938 -225857 -200416 -107303 -123805 -231434 -145970 -145822 -108337
2304 -108337 -68314 -87397 -301472 -173207 -50616 -99314 -115098 -106541 -114961 -149144 -77340
2293 -77340 -109050 -196481 -62889 -72181 -113459 -188634 -162539 -81365 -190486 -127576 -96028 -89924
2281 -89924 -160304 -72905 -12914 -105160 -243713 -144324 -124157 -152229 -110357 -114219 -247551 -99853
2269 -99853 -94347 -174203 -154818 -214019 -172302 -111112 -172476 -119339 -123709 -225374 -140941 -48601
2257 -48601 -130064 -160716 -294617 -135540 -102787 -52304 -138283 -130249 -90121 -51160 -75435 -190859
2245 -190859 -96866 -154034 -108286 -118227 -121048 -108011 -277933 -120721 -75664 -97253 -248163
2234 -248163 -139414 -128351 -138416 -146190 -211125 -204902 -246728 -184062 -104200 -95784 -97958 -65539
2222 -65539 -10789 -102824 -157833 -211755 -103024 -157641 -104221 -100571 -127826 -165947 -177520 -95564
2210 -95564 -81424 -151794 -122073 -185745 -129031 -136562 -191975 -119102 -169243 -123132 -96761 -199100
2198 -199100 -150336 -189879 -36300 -156421 -159931 -121931 -217978 -176716 -169731 -142714 -165503 -225179
2186 -225179 -147794 -91957 -114354 -146216 -190956 -78997 -29950 -83570 -74295 -199945 -237878
2175 -237878 -137631 -87281 -156832 -108924 -216368 -292153 -135882 -105513 -204372 -134604 -127563
2164 -127563 -136667 -48724 -93329 -181192 -152488 -183396 -129551 -224364 -203535 -164733 -145972 -140825
2152 -140825 -188733 -139459 -70944 -150363 -235002 -125169 -89582 -177025 -164180 -123238 -118094 -116134
2140 -116134 -144690 -89406 -122815 -70382 -169555 -195432 -132632 -285757 -265222 -159681 -213851
2129 -213851 -162539 -105249 -144708 -106747 -39519 -223527 -187730 -8916 -77369 -184871 -234393
2118 -234393 -137207 -56991 -183887 -68415 -201372 -30706 -106688 -208031 -112415 -140468 -202937
2107 -202937 -209593 -46214 -80350 -246845 -129690 -180881 -111966 -119534 -53652 -213534 -242336
2096 -242336 -91760 -138543 -140436 -125619 -160399 -137392 -206120 -241266 -154550 -143739 -136311 -1325
2084 -1325 -130151 -164891 -170827 -177180 -173330 -183161 -85613 -157670 -178368 -152853 -196795 -169823 -245722
2071 -245722 -187608 -160476 -103759 -193964 -260870 -222737 -209509 -221228 -104557 -27532 -98141
2060 -98141 -115223 -151662 -195869 -98865 -246933 -214213 -183392 -38935 -105350 -185957 -86109
2049 -86109 -128156 -211565 -135497 -101634 -120852 -222049 -137699 -211111 -153393 -43335 -134155
2038 -134155 -205590 -135001 -121356 -80394 -267754 -114325 -184852 -196859 -156070 -169584 -236712
2027 -236712 -172472 -195697 -134552 -76002 -138465 -110295 -133481 -235243 -154243 -182025 -158510
2016 -158510 -228595 -193971 -154257 -203458 -159135 -200774 -135555 -236371 -178531 -186612 -170674 -158262
2004 -158262 -101272 -162663 -234766 -103701 -126404 -99991 -212867 -129501 -151809 -186959 -116135
1993 -116135 -17414 -177616 -233245 -162051 -193170 -113450 -12939 -193274 -204828 -153720 -178907
1982 -178907 -139816 -157683 -186445 -145469 -71626 -127210 -79445 -106939 -105415 -42619 -142872 -123120
1970 -123120 -109773 -161299 -88697 -240111 -148646 -93316 -183884 -116966 -178835 -120070 -170515
1959 -170515 -254687 -196868 -136786 -145858 -133425 -92893 -186679 -126571 -101306 -233093 -148260 -79065
1947 -79065 -79231 -204118 -159928 -168934 -130424 -151550 -186414 -115481 -201800 -151487 -141555 -114057
1935 -114057 -203574 -219164 -204257 -177837 -137927 -90456 -211292 -156280 -95129 -160701 -185102
1924 -185102 -196097 -65725 -130583 -281792 -129363 -202079 -229872 -250067 -237414 -143222 -108952
1913 -108952 -163394 -118637 -79305 -132150 -137870 -150166 -104852 -71947 -67230 -201966 -134373 -94157
1901 -94157 -158585 -149191 -141286 -103191 -167069 -112555 -70419 -35825 -154529 -177964 -113377 -229667
1889 -229667 -147509 -172157 -150265 -150268 -164039 -204617 -150096 -192724 -106432 -195458 -98665 -97888 -205471
1876 -205471 -138165 -142436 -224086 -181301 -135653 -129806 -186703 -139424 -228504 -197376 -170269 -133273
1864 -133273 -172167 -226290 -191166 -192087 -200536 -188311 -89685 -165679 -197583 -230496 -167655 -151014
1852 -151014 -185358 -205056 -137029 -144986 -105873 -116191 -119064 -158593 -181319 -165754 -196032 -143178
1840 -143178 -139542 -129069 -53526 -74954 -184425 -182869 -142726 -129768 -117132 -143456 -213937 -113758
1828 -113758 -153650 -235428 -233598 -175756 -165804 -174535 -107281 -105766 -143904 -100081 -194363 -234028
1816 -234028 -104087 -158038 -203452 -192333 -138154 -237617 -193104 -75873 -148670 -93595 -106685
1805 -106685 -140238 -128885 -160626 -157831 -171802 -200804 -126819 -247742 -229410 -134347 -186837 -121537
1793 -121537 -178726 -175016 -39571 -187595 -107546 -77433 -193075 -186791 -85366 -174036 -129761
1782 -129761 -237061 -118643 -134058 -174877 -146348 -237766 -43331 -95230 -185562 -179345 -151738
1771 -151738 -197765 -97208 -163498 -227738 -52381 -82609 -101559 -112657 -95437 -92194 -141216
1760 -141216 -207877 -87225 -146769 -228944 -105571 -147335 -116464 -125780 -155252 -194805 -141051
1749 -141051 -117191 -93712 -104786 -98938 -48643 -268210 -187846 -215846 -160534 -205817 -60180
1738 -60180 -96223 -108006 -219093 -144600 -202587 -126691 -96727 -145463 -191571 -122481 -102106 -111167
1726 -111167 -121319 -100704 -163374 -133235 -184223 -196142 -139280 -100102 -168502 -110126 -128894 -121433
1714 -121433 -243117 -115150 -52316 -251964 -116967 -197524 -283913 -204608 -178340 -218509 -248197
1703 -248197 -154904 -110846 -201945 -262686 -147953 -159038 -169343 -139505 -209311 -151692 -114584
1692 -114584 -171961 -79036 -192660 -146824 -141924 -169919 -111481 -177649 -135447 -162792 -161282 -87466
1680 -87466 -120809 -255418 -205047 -65310 -219372 -63568 -182460 -210950 -127765 -97512 -165847
1669 -165847 -116891 -187450 -151242 -182667 -183684 -202433 -147958 -126880 -237027 -77259 -88965
1658 -88965 -208005 -210775 -155884 -227887 -113019 -198217 -200943 -152483 -100893 -138627 -223048 -214932
1646 -214932 -242484 -84342 -162003 -146056 -264974 -259218 -215634 -166560 -174528 -145071 -208512 -95879
1634 -95879 -101300 -111503 -128385 -188415 -139701 -89096 -141311 -156990 -146666 -262365 -95000 -159182
1622 -159182 -198252 -202326 -271852 -211229 -192413 -184938 -195723 -215277 -188666 -146677 -242606 -146345
1610 -146345 -198106 -157347 -215565 -127739 -195688 -219189 -221703 -158831 -183445 -134764 -161821 -210930
1598 -210930 -127392 -150348 -235295 -246062 -97195 -182025 -168531 -144906 -66817 -208394 -153751
1587 -153751 -204231 -110873 -145627 -92746 -185354 -117633 -90637 -175553 -254042 -109903 -170002
1576 -170002 -203527 -99859 -190849 -148410 -187784 -135552 -203493 -171354 -87427 -201261 -91578
1565 -91578 -131315 -86676 -182670 -151416 -143405 -137318 -181699 -153630 -57889 -192419 -156657 -134616
1553 -134616 -34627 -125779 -183271 -107309 -186259 -140321 -222114 -192147 -241535 -171799 -190611 -142276
1541 -142276 -133610 -93337 -125608 -66897 -121056 -165905 -95165 -147857 -166273 -265170 -157757 -94687
1529 -94687 -150406 -147730 -157331 -98052 -140075 -238227 -74101 -123718 -239910 -151129 -137908 -58617
1517 -58617 -69917 -202993 -49574 -109334 -141376 -262882 -206245 -170969 -256763 -237424 -146243
1506 -146243 -80693 -113974 -130559 -115919 -120735 -157728 -140912 -176374 -172139 -14499 -155498 -233780
1494 -233780 -144835 -118404 -94078 -210532 -217798 -201623 -158350 -194945 -98680 -142172 -173009 -131622
1482 -131622 -139305 -138706 -169276 -129756 -175500 -135039 -255715 -214186 -172144 -96787 -220786 -190478
1470 -190478 -163548 -195204 -162748 -148795 -182179 -175256 -28542 -255514 -109448 -165499 -209363
1459 -209363 -256034 -251726 -107491 -156459 -227193 -148836 -156153 -209929 -211338 -50558 -109970 -145870
1447 -145870 -177179 -146741 -161743 -127486 -201874 -131298 -168213 -123171 -280406 -228383 -59282
1436 -59282 -154955 -204375 -185544 -156647 -232320 -95679 -183220 -115983 -176332 -161235 -182069 -189277
1424 -189277 4519 -82766 -125076 -68621 -139093 -263476 -215462 -82223 -184034 -214813 -222397
1413 -222397 -224087 -181310 -116076 -95889 -116514 -128544 -41732 -202492 -174932 -78351 -65211 -144289
1401 -144289 -73245 -117456 -236641 -182650 -207289 -145515 -217748 -111438 -213677 -128519 -50132
1390 -50132 -142475 -210427 -222340 -121426 -156596 -147306 -166971 -68166 -118060 -179727 -110748 -217128
1378 -217128 -201430 -154042 -171796 -147240 -101085 -174860 -221704 -175865 -223346 -122055 -257524
1367 -257524 -183375 -133414 -223320 -162181 -260215 -173113 -138602 -108833 -121252 -138204 -166880 -102981
1355 -102981 -175053 -132960 -178868 -203706 -201072 -87143 -147590 -203112 -221767 -168342 -122428 -215286
1343 -215286 -168693 -147035 -199625 -238443 -284641 -302894 -176174 -216097 -82859 -209116 -214650
1332 -214650 -129071 -134956 -131655 -163840 -105142 -134792 -143290 -150623 -30288 -99147 -172608 -156914
1320 -156914 -84943 -121424 -166191 -187371 -154872 -161867 -109355 -149616 -216590 -161963 -249959 -131171
1308 -131171 -149661 -178417 -201223 -183313 -118779 -189206 -52884 -142338 -142676 -162840 -156130 -223604
1296 -223604 -100589 -78944 -124486 -139993 -131072 -237582 -301236 -133155 -156973 -188627 -284674
1285 -284674 -166025 -263520 -68514 -250392 -107283 -182885 -219931 -171770 -149230 -181768 -167489
1274 -167489 -103420 -95748 -174134 -107116 -239322 -202762 -185734 -161136 -205325 -242152 -75619
1263 -75619 -143701 -207596 -191302 -135332 -151101 -181760 -128234 -168906 -136049 -306315 -297892 -77992
1251 -77992 -129033 -130641 -124398 -235076 -79639 -130584 -154528 -201123 -172430 -89259 -178049 -109177
1239 -109177 -63894 -136604 -243817 -107673 -179645 -223392 -168712 -122913 -142822 -166296 -199167
1228 -199167 -169678 -248813 -166147 -185871 -147012 -165330 -168061 -235476 -204110 -257541 -154972 -172637
1216 -172637 -151165 -153652 -208468 -200136 -181611 -200483 -181609 -151066 -152715 -204727 -141079 -111537
1204 -111537 -179710 -175183 -189608 -114510 -238687 -135866 -291067 -249562 -110822 -116984 -156037
1193 -156037 -147870 -92111 -128787 -260808 -107529 -183320 -174912 -157711 -141463 -86425 -159951 -121344
1181 -121344 -154848 -227946 -218577 -165981 -246251 -122114 -125616 -222529 -137774 -80668 -44474 -98654
1169 -98654 -202438 -206873 -147541 -232974 -201311 -234794 -263729 -118082 -196046 -80969 -207737
1158 -207737 -166297 -98249 -141926 -181190 -170562 -126225 -100599 -141481 -198190 -221028 -197561 -310038
1146 -310038 -189389 -121344 -129248 -144797 -122953 -138953 -134076 -163795 -166823 -185369 -152679 -157305
1134 -157305 -145595 -197831 -206733 -110529 -224214 -133808 -105654 -183347 -201086 -207467 -153977 -131647
1122 -131647 -131228 -196417 -173891 -215132 -232095 -143258 -212376 -124365 -84341 -136669 -218195 -236625
1110 -236625 -175834 -165367 -141875 -137541 -114994 -144920 -169464 -152820 -145838 -184879 -145384 -92470
1098 -92470 -107350 -197467 -117487 -221044 -105407 -161277 -256252 -187451 -83462 -134780 -116149
1087 -116149 -123774 -213416 -198486 -215159 -108062 -97848 -200648 -209428 -216343 -217714 -188924 -143130
1075 -143130 -252150 -210139 -173646 -151300 -38562 -139026 -204165 -113699 -148529 -220221 -136422
1064 -136422 -197602 -199415 -61325 -181788 -208311 -195196 -106210 -57456 -173940 -160802 -109658
1053 -109658 -136398 -127557 -114868 -144297 -165724 -159244 -221367 -114730 -246522 -192666 -136487 -226745
1041 -226745 -128356 -117821 -259847 -209407 -158157 -163412 -203123 -186991 -127063 -156420 -214449 -162882
1029 -162882 -210368 -156232 -243823 -166775 -277453 -174374 -249530 -191140 -97876 -153060 -130137
1018 -130137 -206963 -245883 -179711 -267590 -162549 -147393 -261986 -294638 -139173 -97089 -166451
1007 -166451 -210305 -194833 -209259 -118392 -116153 -238830 -136990 -109422 -70631 -294417 -211740
996 -211740 -212953 -141947 -151644 -227037 -245338 -227049 -134309 -105603 -142001 -218575 -223248 -237385
984 -237385 -146510 -165202 -268199 -158736 -201189 -239022 -204029 -75893 -191795 -260593 -160022
973 -160022 -201134 -169657 -130498 -149066 -167409 -132244 -123030 -111298 -52239 -167008 -179520 -87218
961 -87218 -133499 -156516 -139965 -212755 -155395 -159822 -255895 -205084 -115912 -176188 -252822 -202034
949 -202034 -115486 -166532 -192102 -180982 -172468 -119066 -43163 -130721 -213495 -151391 -218947 -189106
937 -189106 -136265 -170355 -195033 -184815 -200860 -216691 -181488 -148443 -163602 -236936 -106557 -49049
925 -49049 -150248 -136686 -126279 -183804 -264769 -246692 -186733 -168991 -145166 -194390 -284415 -156191
913 -156191 -90005 -175613 -278383 -173578 -177826 -153819 -219467 -127758 -195583 -60707 -303688
902 -303688 -247722 13200 -134624 -286431 -128295 -109988 -144103 -197921 -195025 -109401 -164292
891 -164292 -253630 -145808 -113057 -36440 -175749 -114972 -157518 -227361 -296565 -226848 -140760
880 -140760 -107264 -321279 -260257 -133189 -125894 -234835 -265881 -69605 -144282 -145143 -148304 -89913
868 -89913 -162502 -116465 -169838 -156147 -116883 -182100 -61076 -217385 -165703 -146428 -150119 -233559
856 -233559 -184726 -82516 -114518 -240978 -144341 -176202 -258950 -111252 -122250 -247274 -175504
845 -175504 -126159 -85628 -381985 -154686 -145431 -148719 -195338 -326232 -133174 -140959 -203784 -119489
833 -119489 -225651 -118922 -49518 -150209 -201182 -97333 -99740 -187101 -224293 -142763 -132720
822 -132720 -173845 -181369 -82733 -166977 -111459 -200604 -104000 -153958 -239179 -135419 -137123 -149472
810 -149472 -152065 -287064 -174909 -158818 -70997 -167776 -166557 -140807 -128657 -224144 -254236 -199035
798 -199035 -153693 -159233 -250600 -63289 -226152 -244846 -266430 -47124 -99118 -177253 -229075
787 -229075 -164313 -228943 -89519 -240371 -223583 -242385 -34645 -321689 -279415 -138203 -100244
776 -100244 -224159 -180615 -132713 -104383 -219045 -257444 -161834 -166548 -120911 -190374 -115597 -190459
764 -190459 -163093 -93406 -309290 -120610 -144449 -230944 -94349 -41407 -216590 -269267 -200258
753 -200258 -222103 -212876 -160629 -190280 -203255 -189474 -182757 -174639 -219419 -248728 -167119 -90060
741 -90060 -236905 -197848 -116080 -112726 -216633 -150572 -147034 -146482 -184369 -124702 -209964 -219534 -241233
728 -241233 -159119 -131152 -289914 -147112 -174987 -296641 -180241 -155074 -200025 -286981 -133266
717 -133266 -136022 -229438 -317818 -176309 -164761 -173831 -161066 -171572 -170337 -249743 -192283 -173176
705 -173176 -201991 -257358 -198972 -168135 -140730 -174263 -231665 -204826 -205340 -185522 -186996 -273617
693 -273617 -175396 -244641 -159624 -160118 -181911 -151402 -165864 -204314 -201467 -257968 -154259 -163350
681 -163350 -65100 -176485 -273609 -111118 -232777 -196456 -95670 -114084 -220616 -184081 -136044
670 -136044 -124530 -121570 -223434 -187751 -172087 -273666 -137932 -186731 -113650 -237653 -171231
659 -171231 -182063 -128830 -151746 -252222 -190190 -107479 -123056 -201276 -201077 -183197 -193550 -242285
647 -242285 -198254 -181155 -182624 -130460 -155123 -146744 -112753 -208656 -187691 -260018 -178806 -118012
635 -118012 -301539 -133722 -129375 -163068 -192202 -169845 -232770 -143009 -268408 -218413 -168628
624 -168628 -188535 -162331 -189080 -106945 -99548 -148419 -208236 -123750 -279197 -171985 -172911 -190298
612 -190298 -149639 -135315 -154150 -228668 -179358 -148180 -239856 -206425 -118046 -179575 -225875 -153711
600 -153711 -185371 -280770 -242771 -72443 -191756 -185853 -172751 -167381 -218236 -162282 -52707 -236558
588 -236558 -209877 -57956 -188517 -218685 -250963 -113509 -110257 -218455 -130321 -200652 -144279
577 -144279 -211965 -172128 -181908 -160464 -142842 -275156 -153978 -167733 -232754 -195211 -215293 -183865
565 -183865 -46523 -130814 -209443 -121545 -124983 -200619 -154457 -61320 -165395 -200971 -163163 -173931
553 -173931 -152541 -255347 -103296 -141316 -150097 -241344 -177213 -162366 -223600 -130884 -132998 -223945
541 -223945 -155037 -191083 -151007 -127066 -90663 -207357 -286834 -182857 -210271 -255626 -238596
530 -238596 -126298 -123570 -163091 -185039 -137214 -195818 -187814 -190322 -236524 -257965 -175105 -243652
518 -243652 -160147 -171104 -176917 -197556 -76909 -131203 -186580 -88198 -208974 -148347 -167227 -156867
506 -156867 -245264 -156404 -107966 -257480 -274204 -187312 -276699 -241364 -220984 -127737 -113328 -227789
494 -227789 -239360 -156011 -217361 -194856 -171916 -159524 -119262 -192124 -132858 -169774 -221158 -144179
482 -144179 -145486 -121972 -204413 -122018 -223103 -216629 -71885 -146845 -278234 -232692 -134790 -186942
470 -186942 -210102 -229240 -133896 -167239 -179549 -207455 -260715 -192867 -219320 -106287 -199153 -64173
458 -64173 -127081 -249274 -131199 -113510 -162936 -211354 -182516 -126756 -70167 -279207 -221610
447 -221610 -215888 -194726 -176483 -207720 -215520 -97477 -186757 -262662 -143133 -207363 -168401 -239753
435 -239753 -226469 -163627 -119126 -255867 -231776 -129388 -135541 -278543 -209611 -202616 -146901 -236354
423 -236354 -179876 -274567 -233321 -197155 -206185 -138390 -231579 -181298 -166341 -196178 -186876 -197525
411 -197525 -208708 -250514 -201627 -226861 -120965 -177126 -183251 -151362 -179148 -274919 -259380 -206072
399 -206072 -284929 -207616 -199648 -165718 -156679 -151138 -130058 -98297 -102714 -244161 -138368 -149230
387 -149230 -259830 -289624 -157563 -178783 -190879 -127427 -212688 -177701 -143356 -162354 -194017
376 -194017 -137932 -151806 -131660 -201071 -211391 -159799 -263154 -286725 -164803 -194628 -102944
365 -102944 -207362 -72888 -167336 -163761 -155565 -137793 -150306 -293427 -103313 -93583 -224686
354 -224686 -215966 -217259 -138099 -166881 -58374 -210323 -257418 -136122 -166120 -161875 -299550 -152825
342 -152825 -175810 -229427 -138867 -111367 -89588 -232550 -161822 -204626 -251983 -206997 -84851
331 -84851 -209853 -180083 -198516 -166756 -205602 -150384 -154656 -161321 -173946 -219103 -109499 -286528
319 -286528 -228538 -183483 -228205 -161534 -149937 -208223 -210014 -103030 -154147 -115728 -180756 -221164
307 -221164 -217839 -205575 -163815 -157006 -196507 -179239 -202242 -205316 -212946 -156367 -188941 -152641 -186828
294 -186828 -206237 -220159 -174159 -181386 -184590 -218222 -250887 -98694 -128152 -244069 -145321 -101039
282 -101039 -134094 -140009 -267352 -118719 -196642 -142870 -227709 -184990 -152725 -172523 -177901 -172407
270 -172407 -169125 -113078 -270256 -244666 -196928 -122553 -167200 -201373 -176804 -146876 -293770 -191684
258 -191684 -161342 -174605 -115727 -171682 -180053 -159559 -176483 -264606 -250253 -180969 -212797 -207699
246 -207699 -210861 -110566 -250329 -194711 -186622 -135821 -189866 -192495 -241215 -251256 -197270 -172701
234 -172701 -268533 -179793 -219763 -202318 -200065 -258307 -184280 -242756 -229518 -240835 -205293 -227006
222 -227006 -225160 -185437 -283698 -235547 -128032 -164422 -228272 -187351 -6685 -195126 -169777
211 -169777 -172141 -140593 -191840 -221654 -171235 -162019 -72245 -199735 -259407 -226330 -137199 -211775
199 -211775 -194940 -177392 -176441 -214686 -303606 -194270 -110357 -217072 -209106 -212666 -123151 -196081
187 -196081 -259603 -186517 -89315 -178409 -231870 -243786 -155566 -177818 -346217 -188332 -297932
176 -297932 -204149 -174964 -235507 -297599 -220683 -161976 -332473 -271753 -109691 -234045 -360176
165 -360176 -227543 -224704 -182603 -262958 -163663 -95229 -193424 -269161 -203607 -174951 -215741 -147030
153 -147030 -287802 -216761 -269606 -250323 -237058 -205485 -117219 -226154 -212969 -220517 -203583 -266212
141 -266212 -173908 -271229 -238894 -253179 -242737 -252555 -193885 -330928 -243292 -221705 -315994 -389270
129 -389270 -207398 -188378 -237646 -305722 -223956 -157376 -245472 -234476 -187310 -241487 -322725 -268908
117 -268908 -259871 -188423 -183033 -330440 -299421 -230088 -180731 -246113 -285351 -276125 -105291 -341194
105 -341194 -298144 -285258 -229375 -355066 -307379 -275019 -311613 -249231 -289532 -238323 -288180 -284888
93 -284888 -308829 -279037 -261387 -354036 -323198 -272430 -296522 -326240 -237146 -291190 -254299 -269440
81 -269440 -348895 -319338 -283137 -282312 -300566 -412130 -237269 -329495 -321544 -363688 -245945 -309705
69 -309705 -314396 -328128 -295822 -332246 -305152 -324489 -323600 -311875 -309320 -317240 -291272 -338533 -290309
56 -290309 -272824 -258040 -386977 -320621 -330281 -394605 -338290 -367419 -367091 -288475 -325506 -326143 -315876
43 -315876 -333611 -276694 -387550 -374584 -282562 -296619 -357682 -302874 -326035 -384217 -313599 -356669
31 -356669 -363523 -344028 -358423 -324108 -381166 -309341 -309623 -384836 -410497 -318625 -372152 -437370 -402672
18 -402672 -474545 -337559 -383696 -360436 -328479 -310734 -352731 -340266 -421164 -381320 -368711 -414220
6 -414220 -389761 -424865 -389151 -401451 -420300 -410577
0 -410577
$$ Imaginary data points
##PAGE= N=2
##DATA TABLE= (X++(I..I)), XYDATA
16383 -926381 -946444 -938315 -934285 -953450 -847786 -870314 -763534 -758356 -795637 -825940 -775675 -720805
16371 -720805 -765398 -664561 -713087 -684819 -662326 -589555 -613886 -622885 -598325 -648563 -511430
16360 -511430 -538521 -470804 -437596 -474157 -462161 -409892 -391174 -438452 -360210 -331884 -391793
16349 -391793 -282008 -283990 -359554 -262034 -248316 -228032 -258758 -154352 -195868 -195002 -87040
16338 -87040 -144290 -180691 -153573 -86277 -12263 -85786 -80239 -5123 -14060 -9125 20419 29820
16326 29820 56274 96716 91230 149506 207030 124393 166403 128872 230834 285494 237991 284340
16314 284340 322046 332436 215179 340360 404210 291585 336755 379644 353596 310525 408704
16303 408704 405995 483468 382306 411372 444563 543676 547921 576361 542339 543677 639642 651412
16291 651412 528263 575536 583287 687711 619806 647216 664563 712557 657599 753764 715990
16280 715990 685387 737906 826592 869729 769549 777477 849249 830881 827054 934641 938301 852899
16268 852899 944361 979816 829186 974067 925620 999825 955431 963807 981493 969949 933505
16257 933505 1033502 1046755 1099539 1110300 1032416 1144948 1070497 1124135 1071313 1040202 1191554
16246 1191554 1203250 1075685 1115623 1178437 1250889 1188104 1274992 1156216 1247239 1199342 1220773
16235 1220773 1263753 1275604 1295695 1290582 1224396 1320705 1279239 1370506 1298285 1240033 1361844
16224 1361844 1362675 1419028 1373811 1321828 1406603 1324269 1390647 1460836 1334435 1318661 1458153
16213 1458153 1480251 1443407 1452498 1416164 1450707 1449339 1445024 1446260 1483368 1564878 1566603 1398701
16201 1398701 1462168 1529006 1508112 1471139 1486699 1563582 1516653 1470101 1497754 1562317 1618269
16190 1618269 1655708 1543672 1690298 1667895 1527357 1580797 1664379 1688448 1590583 1618973 1768983
16179 1768983 1654317 1616023 1697000 1608294 1599927 1581149 1708827 1706871 1699154 1712896 1747963
16168 1747963 1702387 1744719 1601957 1709599 1797715 1660735 1656010 1731905 1747040 1707946 1683917
16157 1683917 1799964 1692226 1797445 1716687 1773586 1796633 1757757 1713169 1846226 1780492
16147 1780492 1824346 1800254 1785731 1889432 1831727 1759486 1821866 1769170 1817940 1790491 1795645
16136 1795645 1798003 1800452 1767246 1832962 1829677 1819432 1929971 1813220 1855327 1833008 1929663
16125 1929663 1850022 1866285 1808544 1875430 1868260 1802000 1891331 1866800 1790696 1883472 1851798
16114 1851798 1752922 1917459 1995990 1936205 1830172 1846966 1936433 1900082 1870910 1953735 1848248
16103 1848248 1867758 1959651 1985768 1935997 1898106 1910608 1879961 1832532 1849642 1907791 1841478
16092 1841478 1979909 1949268 1890223 1866192 2060973 1822378 1866500 1881506 1918173 1903571 1994941
16081 1994941 1939462 1927081 1928346 1916205 1909664 1940591 1997474 1843859 1934966 1969766 1940264
16070 1940264 1860013 1992949 2011991 1882243 1972290 1946304 1930796 1984587 1881705 1917172 1990133
16059 1990133 1875175 1864430 1851404 1970010 2001487 1943643 1912487 2033718 1903812 1793562
16049 1793562 1978124 1964552 1895317 1958749 1938838 1922188 1846123 1959595 1981018 1968495 1987585
16038 1987585 1971075 1899798 1878138 1977757 1885106 1997109 2007941 1985094 1897510 1849223 1986536
16027 1986536 1992031 1947682 1872072 1985820 1935213 1944056 2047363 1929977 1949959 2010289 1984471
16016 1984471 1930516 1967881 1905695 1896707 1919292 1953298 1994791 1956860 2021978 1956788 1907709
16005 1907709 1964062 1844212 1920279 2117862 1944753 1873251 1939488 1926886 1995583 1891765
15995 1891765 1938601 2035466 1910238 1930779 1927096 1999431 2012332 1991032 2015039 2018163 2023429 1847129
15983 1847129 1976150 2003896 1900524 1948286 1961747 2009190 1959575 1919789 1982012 2005271 2067306
15972 2067306 2014352 2087542 2052278 2002702 1930748 1850084 1931003 2013941 2022902 1967146 1998082
15961 1998082 2064103 1939768 1866590 1904210 1961872 1921709 1981244 1944078 1965558 1953567 1912872
15950 1912872 1875304 1975313 1915702 1940363 1995157 2029185 2004684 1934185 1921172 2052594 1946100
15939 1946100 1907242 1937506 1990621 1947599 1968935 1969659 1923325 1998282 2036832 2034448 2057848 1961620
15927 1961620 1895467 1940969 2123800 2034311 1930441 1890438 2071019 2047914 1930477 2046323
15917 2046323 2064034 1951332 1913744 1958550 1961686 2000806 1944107 2045465 1971960 2042380 1888817
15906 1888817 1897453 2035414 1998412 1959080 1965044 1976247 1838301 1947453 2006853 1999183 2043519
15895 2043519 1911684 1947894 2030008 2077743 1995293 1935956 1994892 2038328 1980682 2003677 2046525
15884 2046525 2035880 1926617 1992162 2034683 2057295 1932949 1971198 1999303 1930260 1873262 2012069
15873 2012069 2003581 2057584 1959413 2055560 2046069 1963591 1921458 1943204 1970863 1979785 1991968 1916952
15861 1916952 1942116 1966575 1855527 1981171 1966022 1926583 1948117 2031596 2001808 1966190 1940017
15850 1940017 2056429 2002805 1917687 1977341 1986823 1940926 2026503 1979699 2104036 1949708 2016678
15839 2016678 1928670 1997318 2014876 1974704 1967047 2005098 1959755 1937997 2044328 1992722 2052091
15828 2052091 2118160 1936589 1967815 1991431 2098490 1989114 1988216 2055298 2059620 1954843 1996141
15817 1996141 2048085 2004420 2036968 1910100 1944524 1997774 1997994 2049834 1958486 2122465 2038068
15806 2038068 1951591 1955321 2082520 1991107 1948002 2082807 2056674 2054718 1967094 1958218 2050728
15795 2050728 1903216 2114612 1966723 2055148 2076919 2074658 2078986 1968559 2028028 1939126 1985141
15784 1985141 1969734 2036717 2008090 2049009 2009515 2031656 2050997 1909183 1948739 2094088 1938445
15773 1938445 2017146 2015971 2048895 1899004 2050556 2018375 2058050 2033167 1981199 2056927 2038173
15762 2038173 1944694 1894868 2014840 2011259 2009182 1951652 1919586 2020171 2040507 2008359 2083283
15751 2083283 1987922 1977726 1910980 2051042 2041239 1992019 1954313 1986507 2021626 2083612 2023510
15740 2023510 1988158 1952692 2064910 1976834 1985933 2077907 1990345 1924078 2006242 2055926 2043885
15729 2043885 2036815 1972197 1967975 2030784 2032465 1957671 2036898 2018563 1997935 2009807 2094176 1981952
15717 1981952 2027580 2056268 2045318 2090078 2065151 2010003 1968039 1978619 2078830 2108568 2024249
15706 2024249 1984632 2135804 1982361 2064937 2156517 1989908 1912184 1986802 2121286 2077866
15696 2077866 1927532 2059577 1977125 2012412 2067071 2000318 2004748 2052973 2097359 1999700 1973747
15685 1973747 2047105 2075424 2007667 2058604 2005363 1973833 2041535 1944628 1990449 2043448 2074409
15674 2074409 2007353 2022289 2134998 1949240 2073176 2094676 1991954 1972430 2085977 2049808
15664 2049808 1974865 1979957 2010442 2021775 2000110 1995581 2127522 2027542 1969357 1967443 2030709 1976179
15652 1976179 1957193 2002136 2062549 2045453 1979772 2046524 1951880 2056992 2000248 1892557 2071709
15641 2071709 2052015 2023842 2031517 2073327 2003428 2063585 1957373 2046924 1960456 1928434 1983311
15630 1983311 2040931 2008896 1979355 2001784 1891231 2106430 2055731 2062106 1998165 2054120 2010518
15619 2010518 1973295 2045567 1968363 1959790 2066505 1993860 1985555 2083074 2060514 2035427 2097338
15608 2097338 2046313 2054317 2141663 2119839 2025757 2017069 2103691 2037892 2018422 1988047 2080335 1998817
15596 1998817 2072801 2097579 2028642 2033380 2076174 2000665 2063235 2029721 1967425 2077162 2060298
15585 2060298 1947519 2088162 2075802 2024613 2109984 2057853 2006846 2091531 2075545 2090366 1988313
15574 1988313 2008421 2008093 2032588 2016824 2047221 1921727 2012629 2119157 2063728 2079030 1956990
15563 1956990 1951574 1986314 2042341 1996809 2025244 2028888 2011885 1900936 2065583 2000869 2011156
15552 2011156 2039383 2076448 2121279 2052319 2076430 2136490 2073872 2028494 2120267 2028454 2013145
15541 2013145 2101996 1975929 2068851 2020029 2004958 2016680 1981366 2070746 1994891 2115327 2043870
15530 2043870 2035294 2065207 2015870 2122555 2045720 2069872 2022739 2086939 2137896 1939577 2064196
15519 2064196 1937962 1992954 2043138 2062864 2066105 2056632 2067806 2089741 2108379 2062100 2113485
15508 2113485 2068905 2038835 2021311 2072333 2099733 2037230 2045935 2085740 1948421 2072878 2061521
15497 2061521 2185774 2017120 2066790 2157602 2088280 2077215 2078976 1985081 1951905 2001631 2082573
15486 2082573 2029379 1950960 2066850 2003834 2051503 2008617 2083636 2044127 2131159 2108584 1994962
15475 1994962 1995006 2008780 2131738 2072739 2028585 2007917 2055598 2072884 2060794 2051980 2067622 2021661
15463 2021661 2038536 2038690 2077150 2054481 2002655 2001541 1959477 2090402 2066168 2118746 2050546 1961860
15451 1961860 2099207 2160353 2024829 1974664 2030047 2152826 2136133 2016619 2010771 2078999 2102080
15440 2102080 2067914 2059526 2099113 2171730 1993855 1968324 2052804 2092853 2074924 2095020 2058535
15429 2058535 2061109 2085968 2078229 2128285 2035356 2164274 2148307 2076760 2199992 2136146 2012947
15418 2012947 1996713 2081905 2156365 2074944 2091557 2228397 2109923 2062053 2089819 2095504 2069933
15407 2069933 2143282 2054259 2011022 2156883 2093883 2006693 2013145 2146917 2015371 2033073 2086499
15396 2086499 2123561 2076556 2121817 2024208 2070290 2027895 2227012 2023087 2105744 2213004 2053552
15385 2053552 2035755 2131685 2083523 2080516 2071161 2126456 2166896 2057887 2129009 2046830 2131435
$$ [...]
##END NTUPLES=NMR SPECTRUM
##END=
