##TITLE=abcd
##JCAMPDX= 6.0         $$ Bruker NMR JCAMP-DX V2.0
##DATA TYPE= NMR SPECTRUM
##DATA CLASS= NTUPLES
##ORIGIN= UXNMR, Bruker Analytische Messtechnik GmbH
##OWNER= root
$$ XWIN-NMR		Version 3.5
$$ Thu Aug  6 19:11:52 2026 Russian Standard Time (UT+4h)  servis@DPX200
##.OBSERVE FREQUENCY= 200.131235884673
##.OBSERVE NUCLEUS= ^1H
##.ACQUISITION MODE= SIMULTANEOUS
##.ACQUISITION SCHEME= undefined
##.AVERAGES= 16
##.DIGITISER RES= 18
##SPECTROMETER/DATA SYSTEM= spect
##.PULSE SEQUENCE= zg
##.SOLVENT NAME= CDCl3
##.SHIFT REFERENCE= (INTERNAL, CDCl3, 0, 16.4885)
##AUDIT TRAIL= $$ (NUMBER, WHEN, WHO, WHERE, WHAT)
$$ ##TITLE= Audit trail, XWIN-NMR		Version 3.5
$$ ##JCAMPDX= 5.01
$$ ##ORIGIN= Bruker BioSpin GmbH
$$ ##OWNER= servis
$$ F:\spectra/data/av/nmr/H1/1/pdata/1/auditp.txt
$$ ##AUDIT TRAIL=  $$ (NUMBER, WHEN, WHO, WHERE, WHAT)
(   1,<2026-08-06 19:11:31.17 +0400>,<servis>,<DPX200>,
      <created by zg, POWCHK disabled, PULCHK disabled
       terminated by command 'halt'
       configuration hash MD5:
       00 E9 B6 7A A2 85 ED C7 34 08 36 98 17 FE 4E 26
       data hash MD5: 32K
       20 C0 1A 90 8C 04 C5 C0 B8 4B 5A 8B 7A 47 05 22>)
(   2,<2026-08-06 19:11:32.96 +0400>,<servis>,<DPX200>,
      <Start of raw data processing
       efp BC_mod = 2 LB = 0.05 FT_mod = 6 PKNL = 1 PHC0 = -413.9518 PHC1 = 3.101563 SI = 16K 
       data hash MD5: 16K
       E1 45 86 A4 6D 6A 43 7F 85 94 87 CB 28 A0 BC 18>)
$$ ##END=
$$ 
$$ hash MD5
$$ 14 0B 3B 60 99 85 F8 5F 44 B3 7D 79 08 EF B5 36
##$RELAX= 
##$RELAX= 
##$RELAX= 
##$RELAX= 
##$RELAX= 
##$RELAX= 
##$RELAX= 
##$RELAX= 
$$ Bruker specific parameters
$$ --------------------------
##$DU= <F:\spectra>
##$EXPNO= 1
##$NAME= <H1>
##$PROCNO= 1
##$TYPE= <nmr>
##$USER= <av>
##$AMP= (0..31)
100 100 100 100 100 100 100 100 100 100 100 100 100 100 100 100 100 100 
100 100 100 100 100 100 100 100 100 100 100 100 100 100 
##$AQSEQ= 0
##$AQ_mod= 1
##$AUNM= <au_zg>
##$AUTOPOS= <>
##$BF1= 200.13
##$BF2= 200.13
##$BF3= 200.13
##$BF4= 200.13
##$BF5= 500.13
##$BF6= 500.13
##$BF7= 500.13
##$BF8= 500.13
##$BYTORDA= 1
##$CFDGTYP= 0
##$CFRGTYP= 5
##$CHEMSTR= <none>
##$CNST= (0..31)
1 1 145 1 1 1 1 1 1 1 1 1 1 1 1 1 1 1 1 1 1 1 1 1 1 1 1 1 1 1 1 1 
##$CPDPRG= <>
##$CPDPRG1= <>
##$CPDPRG2= <>
##$CPDPRG3= <>
##$CPDPRG4= <mlev>
##$CPDPRG5= <mlev>
##$CPDPRG6= <mlev>
##$CPDPRG7= <mlev>
##$CPDPRG8= <mlev>
##$CPDPRGB= <>
##$CPDPRGT= <>
##$D= (0..31)
0 2 0 0 0 0 0 0 0 0.06 0 0 0 0 0 0 0.0002 0 0 0 0 0 0 0 0 0 0 0 0 0 0 
0 
##$DATE= 1786029090
##$DBL= (0..7)
120 120 120 120 120 120 120 120 
##$DBP= (0..7)
150 150 150 150 150 150 150 150 
##$DBP07= 0
##$DBPNAM0= <>
##$DBPNAM1= <>
##$DBPNAM2= <>
##$DBPNAM3= <>
##$DBPNAM4= <>
##$DBPNAM5= <>
##$DBPNAM6= <>
##$DBPNAM7= <>
##$DBPOAL= (0..7)
0.5 0.5 0.5 0.5 0.5 0.5 0.5 0.5 
##$DBPOFFS= (0..7)
0 0 0 0 0 0 0 0 
##$DE= 6
##$DECBNUC= <off>
##$DECIM= 32
##$DECNUC= <off>
##$DECSTAT= 4
##$DIGMOD= 1
##$DIGTYP= 9
##$DL= (0..7)
0 120 120 120 120 120 120 120 
##$DP= (0..7)
$$ [...]
##$SUBNAM4= <"">
##$SUBNAM5= <"">
##$SUBNAM6= <"">
##$SUBNAM7= <"">
##$SUBNAM8= <"">
##$SUBNAM9= <"">
##$SW= 20.6817932712277
##$SWIBOX= (0..15)
0 0 3 0 0 0 0 0 0 0 0 0 0 0 0 0 
##$SW_h= 4139.07284768212
##$TD= 32768
##$TD0= 1
##$TE= 0
##$TE2= 300
##$TE3= 300
##$TEG= 300
##$TL= (0..7)
0 120 120 120 120 120 120 120 
##$TP= (0..7)
150 150 150 150 150 150 150 150 
##$TP07= 0
##$TPNAME0= <>
##$TPNAME1= <>
##$TPNAME2= <>
##$TPNAME3= <>
##$TPNAME4= <>
##$TPNAME5= <>
##$TPNAME6= <>
##$TPNAME7= <>
##$TPOAL= (0..7)
0.5 0.5 0.5 0.5 0.5 0.5 0.5 0.5 
##$TPOFFS= (0..7)
0 0 0 0 0 0 0 0 
##$TUNHIN= 0
##$TUNHOUT= 0
##$TUNXOUT= 0
##$USERA1= <user>
##$USERA2= <user>
##$USERA3= <user>
##$USERA4= <user>
##$USERA5= <user>
##$V9= 5
##$VALIST= <valist>
##$VCLIST= <CCCCCCCCCCCCCCC>
##$VD= 0
##$VDLIST= <DDDDDDDDDDDDDDD>
##$VPLIST= <PPPPPPPPPPPPPPP>
##$VTLIST= <TTTTTTTTTTTTTTT>
##$WBST= 1024
##$WBSW= 30
##$XGAIN= (0..3)
0 0 0 0 
##$XL= 0
##$YL= 0
##$YMAX_a= 369006
##$YMIN_a= -460762
##$ZGOPTNS= <>
##$ZL1= 120
##$ZL2= 120
##$ZL3= 120
##$ZL4= 120
##$ABSF1= 0
##$ABSF2= 0
##$ABSG= 0
##$ABSL= 0
##$ALPHA= 0
##$AQORDER= 0
##$ASSFAC= 0
##$ASSFACI= 0
##$ASSFACX= 0
##$ASSWID= 0
##$AUNMP= <proc_1d>
##$AZFE= 0.1
##$AZFW= 0.1
##$BCFW= 0
##$BC_mod= 2
##$BYTORDP= 0
##$COROFFS= 0
##$CY= 18.4799938201904
##$DATMOD= 1
##$DC= 0
##$DFILT= <>
##$DTYPP= 0
##$F1P= 9.9274215381318
##$F2P= -0.165520771350173
##$FCOR= 1
##$FTSIZE= 16384
##$FT_mod= 6
##$GAMMA= 0
##$GB= 0
##$INTBC= 1
##$INTSCL= 4.127829e-11
##$ISEN= 128
##$LB= 0.05
##$LEV0= 0
##$LPBIN= 0
##$MAXI= 10000
##$MC2= 0
##$MEAN= 0
##$ME_mod= 0
##$MI= 50
##$NCOEF= 0
##$NC_proc= -5
##$NLEV= 6
##$NOISF1= 3.799351
##$NOISF2= 2.8
##$NSP= 0
##$NTH_PI= 0
##$NZP= 0
##$OFFSET= 16.48848
##$PC= 4
##$PHC0= -413.9518
##$PHC1= 3.101563
##$PH_mod= 1
##$PKNL= yes
##$PPARMOD= 0
##$PSCAL= 4
##$PSIGN= 0
##$REVERSE= no
##$SF= 200.130005582386
##$SI= 16384
##$SIGF1= 3
##$SIGF2= 2
##$SINO= 400
##$SIOLD= 16384
##$SREGLST= <1H.CDCl3>
##$SSB= 0
##$STSI= 16384
##$STSR= 0
##$SW_p= 4139.07284768211
##$SYMM= 0
##$S_DEV= 0
##$TDeff= 32768
##$TDoff= 0
##$TI= <>
##$TILT= no
##$TM1= 0
##$TM2= 0
##$TOPLEV= 0
##$USERP1= <user>
##$USERP2= <user>
##$USERP3= <user>
##$USERP4= <user>
##$USERP5= <user>
##$WDW= 1
##$XDIM= 16384
##$YMAX_p= 515777484
##$YMIN_p= -380454
$$ End of Bruker specific parameters
$$ ---------------------------------
##NTUPLES= NMR SPECTRUM
##VAR_NAME=  FREQUENCY,     SPECTRUM/REAL,   SPECTRUM/IMAG
##SYMBOL=    X,             R,               I
##VAR_TYPE=  INDEPENDENT,   DEPENDENT,       DEPENDENT
##VAR_FORM=  AFFN,          ASDF,            ASDF
##VAR_DIM=   16384,         16384,           16384
##UNITS=     HZ,            ARBITRARY UNITS, ARBITRARY UNITS
##FACTOR=    0.252644378177508, 1,           1
##FIRST=     3299.83951724647, 0,            0
##LAST=      -839.233330435636, 0,           0
##MIN=       -839.233330435636, -380454,     0
##MAX=       3299.83951724647, 515777484,    0
$$ Real data points
##PAGE= N=1
##DATA TABLE= (X++(R..R)), XYDATA
$$ [...]
7461a07564l135K1596J2383K414n8007O7305J855j3931P8513r1442O4830o1047
7449h6230L825m291m302j1713L4812K3500l6497j9918N0565k1593M4033j7633
7437d5442l5613M0486m3250q635L0963M4522J3907r7376O937J7085N8909q367
7425b5874o9126O6518k4383j9862L1162k2210K8251o1643L4093M0439m2638M7585
7413a7688p4655N5564n71M9332n618n0999L7638n5032n070M9388L9263m7977n7549
7400h3974R149m8434K8937Q1228L3966l1009j8560M55o875n0092P920M3092L3941
7387b56m3603L6280j718L1349n9710k991M8860q3759R65O5136N9270j08662M9063
7374i776l4931K361M9020j6615j6862m2793M7067J5823p9815Q4744l7307r7436
$$ y = [-107564, -110699, -89103, -76720, -74306, -132313, -65008, -63153, -77084, 1429, -90013, -25183, -86230, -82405, -86696, -90998, -102711, -67899, -44399, -80896, -100814, -50249, -71842, -27809, -45442, -81055, -40569, -83819, -92454, -61491, -16969, -3062, -100438, -93501, -76416, -17507, -25874, -95000, -28482, -52865, -72727, -41565, -63775, -35524, -97167, -63074, -22635, -65273, -17688, -92343, -36779, -37350, 11982, 6364, -44635, -6997, -62029, -67099, -17711, 21552, -26425, -83974, -74825, -123259, -94322, -13094, 20872, -10137, -28697, -28242, -35117, -85209, -77289, -34197, -256, -43859, -7579, -9297, 22052, -37658, -40649, 8211, -75548, -74583, -9447, 49823, -58839, -9776, -44707, -42346, 6674, -9941, -26803, -69596, -22529, -6706, -86521, -1777, -39084, -136520]
7362a36520R1999O2784j27274Q0278r7644N5221O0133j1084o680R631k515k037
7350b3708J6345o007K660m0170J3325P692m7979L4154m253K4023J937k8938O3473
7337A2554p9098K3760q044L781k3908k0299N0965q1557N4707K382J00517j7707
7325A8053l5549K3525k7172Q990n4258K0238M4540k687j2426l4220J8383m2218
7313g4801N8374K525m0654m3814K5987M1207J3830J6447J7705O9740l0297m1851
7301A4398k5683j0796J5801j3196L3963m7093J4055n2196M0972P8254o651p7317
7289c5489K313M6613j3876M2219n9296K0570l3270O1672O302l3146k508j0797
7277h693K768j0143l5514N9775k2975K5434j9204R929j0857r155m6365M1634M6686
$$ y = [-136520, -44521, 18263, -109011, -28733, -126377, -71156, -11023, -22107, -28787, -19156, -21671, -23708, -7363, -13370, -10710, -50880, -37555, -29863, -77842, -43688, -47941, -23918, -21981, -50919, 12554, -66544, -42784, -50828, -47047, -70955, -91254, -40289, -121846, -67139, -64757, 35760, 18053, -17496, 6029, -21143, -12153, -66411, -46173, -1633, -4320, -16746, -50966, -32583, -74801, -16427, -13902, -54556, -98370, -72383, -31176, -17346, -899, 16806, 86546, 56249, 14398, -11285, -22081, -6280, -19476, 14487, -32606, -18551, -70747, -29775, 48479, 41828, -35489, -33176, 13437, -439, 41780, -17516, 3054, -30216, 31456, 37758, 4612, 2104, -8693, -5925, -16068, -51582, 8193, -14782, 10652, -8552, 1377, -9480, -18635, -65000, -23366, 23320]
7264B3320l6719P51j9685L4132O2081l4226j6484n927N47M8438m5814k1098P2996
7251F2312m1021m471J2599K1438j0145N4521k4598r0980P2377K1735o7777j640
7239D350J2939N567J9136K1586M403n8999O4410j668K2075l3838j16L6281K6633
7226A22759N4237q2598n9584k8566R4111l4630r8011O7623k7187L661R0532R206
7214A11553n7575k1940o0085K6662J13587l7421K5339p4284P5437j6836j8693
7203F5744O2721o0955P899l1688P0657p8885q16L369m344R1871r9115P1846l824
7190I4480L4404M6751o8643r18n6318P9849N4881n0210j3158L7423o666j4139
7178A37736J4424l1675M3956q1072J16180l3312N1045k3375n2134O7775m954L7372
$$ y = [23320, -13399, -12648, -32333, 1799, 63880, 29654, 13170, 7243, 7790, 56228, 10414, -10684, 62312, 21291, 16820, 29419, 50857, 40712, 95233, 70635, -20345, 52032, 73767, 5990, 4350, 17289, 22856, 41992, 63578, 67981, 8982, 73392, 71724, 93799, 59961, 59845, 96126, 122759, 176996, 94398, 34814, 6248, 100359, 65729, -32282, 35341, 8154, 11815, 102347, 111553, 53978, 32038, -28047, -1385, 112202, 74781, 100120, 25836, 101273, 84437, 65744, 128465, 67510, 75409, 43721, 114378, 35493, 34677, 38046, 33702, 125573, 26458, 98304, 94480, 128884, 175635, 106992, 106074, 49756, 129605, 184486, 134276, 121118, 158541, 151875, 137736, 152160, 120485, 164441, 83369, 199549, 166237, 217282, 193907, 141773, 209548, 204594, 241966]
7166B41966L1974q5036q58L7483k6270m932j2159N2061m4598K1011L170P1861
7154B85673p3573J7479l5337Q0814m486k2100k7939j2706P0450k8576P8750j9613
7142C08836p2387P3186J3081k4994J9645l0705Q886k2402J6915K8253k4737n8593
7130B34984N5147J12379j00617o3664J41329o0625K6153J4941m2338L0169n015
7119C42843K2017K7015n4059j9931Q6213n9522M8644m8783M7485k0529j7483J3489
7107C67399O0620p2850j8188J20499j7601m5440L7791j7895J7036P4079o4784
7096D40666o6261M2289j0959J55151m1116k0067n5191K5241O123N0570M6212q2265
7084D90393K5534q049Q0201n2989R4046n2543O1656n2372N8151J5759m20R182
$$ y = [241966, 273940, 188904, 188046, 225529, 199259, 194327, 182168, 234229, 189631, 210642, 213812, 285673, 212100, 229579, 194242, 275056, 270570, 248470, 220531, 207825, 278275, 249699, 328449, 308836, 236449, 309635, 322716, 297722, 317367, 286662, 295548, 273146, 290061, 318314, 293577, 234984, 290131, 402510, 301893, 238229, 379558, 318933, 345086, 360027, 317689, 347858, 342843, 364860, 391875, 337816, 317885, 404098, 344576, 393220, 344437, 391922, 371393, 353910, 367399, 428019, 355169, 336981, 457480, 439879, 394439, 432230, 414335, 431371, 505450, 440666, 374405, 416694, 405735, 560886, 519770, 499703, 444512, 469753, 475876, 526446, 572658, 490393, 515927, 507878, 588079, 535090, 629136, 576593, 638249, 585877, 644028, 659787, 659367, 668549]
7072F68549L3517k0148L6081o533n4497J39459N675R0997j8504j921j2775N4623
7060I14523l1488J4426Q167P5857N1901J3442L0317J660m1323L005R7710m646
7048A133551l336l2405R4513Q0943N9268m9748M8691j0911J15248M9016P4137
7037A558967n8360K2113P7743R6532l0732M3949L3024L9566k028J07469L0783
7026A919026M9652P7518L2099Q9505K3985J9885k8497J66761N8610J23177j999
7015B529722J48254K0924J03558J35150L0942J28000R6711J24091J01912J55783
7005C575047J21825O0989J13915R4934J79884O9218J50977J72777Q4833K39085
6995D863484O3641K04457R1411R8870J79004K13179J08351J45329J86468R0452
$$ y = [668549, 702066, 681918, 717999, 711466, 656969, 796428, 802103, 893100, 874596, 872675, 859900, 914523, 883035, 897461, 905628, 981485, 1033386, 1046828, 1077145, 1078805, 1037482, 1040487, 1138197, 1133551, 1130215, 1097810, 1192323, 1273266, 1332534, 1282786, 1331477, 1320566, 1435814, 1484830, 1558967, 1500607, 1522720, 1600463, 1696995, 1666263, 1710212, 1743236, 1782802, 1780774, 1888243, 1919026, 1968678, 2046196, 2078295, 2167800, 2191785, 2211670, 2183173, 2349934, 2408544, 2531721, 2529722, 2677976, 2698900, 2802458, 2937608, 2968550, 3096550, 3193261, 3317352, 3419264, 3575047, 3696872, 3757861, 3871776, 3966710, 4146594, 4215812, 4366789, 4539566, 4624399, 4863484, 4927125, 5131582, 5222993, 5321863, 5500867, 5714046, 5822397, 5967726, 6154194, 6244646]
6985F244646J62985J20687J64364J42964J22389J41550N3573J87214K6745J85159
6975G552276R0404J20491J20934P6020J19736O5736Q9680R2131M5679M4883N0612
6964H468582R2183K1684M0920p3373J4026K3519J527K226j41821j7186j06650
6953H325637o6968j45723n5329n9382j16850r5967r0254m4137j81177j33986j08748
6942G227116o3706k18129n2296j51925j25230o7081j41778k14237j09941l8638
6932F044155k14196o8415k31933j0191k75553k0082j27721j64910j71094o2657
6922D697403k35323j16571o7551j36887q9942j56294j28839m5157r7406K10j97050
6911C426593j09045m3951r6356l3779j11954p5140k1741q7574r2212j1064J2477
$$ y = [6244646, 6407631, 6528318, 6692682, 6835646, 6958035, 7099585, 7153158, 7340372, 7367117, 7552276, 7642680, 7763171, 7884105, 7960125, 8079861, 8145597, 8235277, 8327408, 8373087, 8417970, 8468582, 8560765, 8582449, 8623369, 8549996, 8564022, 8587541, 8589068, 8591294, 8449473, 8432287, 8325637, 8258669, 8112946, 8057617, 7998235, 7881385, 7785418, 7695164, 7651027, 7469850, 7335864, 7227116, 7163410, 6945281, 6892985, 6741060, 6615830, 6548749, 6406971, 6192734, 6082793, 6044155, 5829959, 5761544, 5529611, 5519420, 5243867, 5223785, 5096064, 4931154, 4760060, 4697403, 4462080, 4345509, 4277958, 4141071, 4051129, 3894835, 3765996, 3720839, 3623433, 3623643, 3426593, 3317548, 3273597, 3177241, 3143462, 3031508, 2956368, 2934627, 2847053, 2754841, 2743777, 2756254]
6900B756254j06775m9627l3864q8413O608q7237K0347o1270j26345N3236q5175
6889B197739j02289Q0534r6087Q07Q498m9710j01669J597k0907r829l7540j6399
6877A854745K294p0036J671k8046j4730o1800N3689m9796n5864j7208q1130Q5564
6865A619353o3582k5420n1764P0373l7724P423m2190o1594J2080j9387l1721O1894
6853A437741k9699k4307n9823n200l2534o417O825j2808O947j27777P1248P920
6841A232116j8468o255j88j00577J4753L5224n5537o1916L9517M3419K3308j66592
6829I78804L9857j2038L3045r9902O2249k6838K8056r5933J1098j5579l6431K7825
6817H94213L6645n9452o0119O6153O4870r7835k8919n647M3926j5411m1603Q1647
$$ y = [2756254, 2649479, 2599852, 2565988, 2477575, 2484183, 2396946, 2417293, 2356023, 2229678, 2282914, 2197739, 2095450, 2175984, 2079897, 2080704, 2089202, 2039492, 1937823, 1939420, 1918513, 1908684, 1871144, 1854745, 1857039, 1787003, 1788674, 1760628, 1745898, 1684098, 1737787, 1687991, 1632127, 1614919, 1533789, 1619353, 1555771, 1530351, 1478587, 1548960, 1511236, 1518659, 1476469, 1414875, 1426955, 1407568, 1375847, 1437741, 1408042, 1383735, 1323912, 1318712, 1286178, 1279761, 1286586, 1273778, 1280725, 1152948, 1224196, 1232116, 1213648, 1207393, 1207205, 1106628, 1121381, 1156605, 1101068, 1039152, 1078669, 1122088, 1145396, 978804, 1018661, 1006623, 1039668, 939766, 1002015, 975177, 1003233, 907300, 918398, 902819, 866388, 894213, 930858, 871406, 811287, 877440, 942310, 844475, 815556, 809909, 853835, 838424, 796821, 878468]
6805H78468p2669k7211n1419O1249m5866o3029j3333N3484o364J1196l4940K0152
6793G09718m7571k0365m601p617l728L8486r6512P9156m2898r343p7165O4470
6781E82030N8062p0370o4602O6830n8409O4297o4086N7613r2527O5225L316N6965
6769F04344n6992o5259o492P4666q4704l796P5747L2353m5870k9276J2161J3711
6757E20593l418K0618q1093l373R0789n6812l4098Q0750n7724O7225j5900k1960
6745E05597j499L1647l5954N0296j4436j0112r4785J23737K5301l8190k9102J09943
6733F22443n1792K8905k6589N4614J81K6407q5202K7692J1356k3164K7416M6352
6721F58619L5592o620l1604P3534l420K9176M884m242J8002Q0927l6593L5104
$$ y = [878468, 805799, 778588, 727169, 788418, 742552, 679523, 666190, 719674, 713310, 724506, 689566, 709718, 662147, 641782, 637181, 629564, 625836, 664322, 567810, 646966, 604068, 594725, 517560, 582030, 640092, 569722, 505120, 571950, 513541, 577838, 513752, 571365, 478838, 544063, 547379, 604344, 547352, 482093, 475601, 550267, 465563, 461767, 537514, 569867, 523997, 494721, 506882, 520593, 517175, 537793, 456700, 453327, 544116, 487304, 453206, 533956, 476232, 543457, 527557, 505597, 504098, 535745, 499791, 550087, 535651, 525539, 430754, 554491, 579792, 541602, 512500, 622443, 570651, 599556, 572967, 627581, 627762, 654169, 568967, 596659, 608015, 584851, 612267, 658619, 694211, 687591, 655987, 729521, 726101, 755277, 760161, 755919, 773921, 854848, 818255, 853359]
6709H53359L7623L1723P2971j7567O4050Q992O2651P6716O3129J24231J32253
6698A510131K82875K60552N14689O91287O19435L72992J15393r9390l21289m77738
6688C468937k96774l23158k77140j20071k20747o7415j2326n9124Q7628m6011
6678B133799M4517P5091J59088J88481J03858J24720L28353L60843N67226P61440
6668D847416J551790K311077K005744J322528L70248j77014j203831j275580j296909
6659H455469r14883q00255p74041m27308l85879j63395r6890k5165P0392J44900
6649E082945J85461L07319K32271L20374L45963N55272N65906P99933J031217
6640I426661J572269K440874K400416J701128O00955m2151j095494j386726j495802
$$ y = [853359, 890982, 922705, 995676, 978109, 1042159, 1051151, 1113802, 1190518, 1253647, 1377878, 1510131, 1793006, 2053558, 2568247, 3259534, 3878969, 4251961, 4367354, 4267964, 3946675, 3468937, 3172163, 2849005, 2571865, 2451794, 2231047, 2163632, 2151306, 2092182, 2179810, 2133799, 2178316, 2253407, 2412495, 2600976, 2704834, 2829554, 3157907, 3518750, 4085976, 4847416, 6399206, 8710283, 10716027, 12038555, 12408803, 12231789, 11027958, 9752378, 8455469, 7540586, 6740331, 5966290, 5538982, 5153103, 4989708, 4892818, 4867653, 4938045, 5082945, 5268406, 5575725, 5807996, 6128370, 6474333, 7029605, 7595511, 8395444, 9426661, 10998930, 13439804, 15840220, 17541348, 18142303, 18100152, 17004658, 15617932, 14122130]
6631A4122130j260479j124859j204277r56444p85021p80097m87225n60326m66778
6622F496624m37690l56288l50858k51104k75062k18221j48048p5718q3990j0180
6612D289465L25527N46147N60552L21273R2687r8486l95304o23394m97686n87153
6602C933628m31959l57212l03718k92931k69963r5940j88528k6842p9073j79797
6592A707665k2200r8503q2672j5519p8039q5960n3281j8856l0597r33q1560K7870
6580A167415j10043j4781k6195r938m6912k8861k3109n7245l5909j8698K7044
6569H22768o6093N0999m8651n5295N7646k0063m4058j4293j9470k9072l2021L7595
6557F39992o4693m922N8132q8154r794K645K151o3827K442p931L8626J9821j20661
$$ y = [14122130, 12861651, 11736792, 10532515, 9576071, 8791050, 8010953, 7523728, 6963402, 6496624, 6058934, 5702646, 5351788, 5100684, 4825622, 4607401, 4459353, 4383635, 4299645, 4289465, 4614992, 5161139, 5721691, 6042964, 6135651, 6037165, 5641861, 5018467, 4520781, 3933628, 3501669, 3144457, 2840739, 2547808, 2277845, 2181905, 1993377, 1966535, 1887462, 1707665, 1685465, 1586962, 1504290, 1488771, 1410732, 1324772, 1271491, 1252635, 1222038, 1221105, 1139545, 1167415, 1057372, 1042591, 1016396, 1006458, 959546, 930685, 907576, 850331, 814422, 795724, 822768, 756675, 807674, 759023, 703728, 761374, 741311, 697253, 682960, 663490, 634418, 602397, 639992, 575299, 570377, 628509, 540355, 530561, 533206, 535357, 471530, 473972, 466041, 504667, 524488, 403827]
6544D03827p099N8274n8332M9698n1545j7744O0903l5215K6621m3298o055j9711
6532C60324R7337j61239L6865P852L318R145n7595k5296j2468N6517p499k4404
6520B82857J1253m7057L4586m0422p644Q520J7203l241o387p0367P4860m3624
6508B10537n645M4713M677j2017m3681J8263j0145l150j8622J4061k6556L5488
6496B07923p9727J15033o0013M560j4131l1797j3330N6257n7316l9673K9744m217
6484A13313O0915r152L1871q2373k2531j455M5329j7155Q8925j05783J3904M1156
6472A56964j5483K5062n6596O1682l9005K8139m0400k651r218J5180L3568n6658
6460A00584m8054O0325O3640l5989p8106L6075M5441o3187p55J971K396m8719
$$ y = [403827, 396728, 455002, 396670, 446368, 394823, 377079, 437982, 402767, 429388, 386090, 380035, 360324, 457661, 296422, 333287, 341139, 344457, 353602, 296007, 270711, 258243, 314760, 307261, 282857, 294110, 247053, 281639, 241217, 233573, 242093, 259296, 256055, 249668, 179301, 254161, 210537, 204892, 249605, 254282, 242265, 198584, 216847, 206702, 203552, 184930, 198991, 172435, 207923, 128196, 243229, 183216, 187776, 173645, 141848, 128518, 184775, 127459, 87786, 117530, 113313, 174228, 165076, 196947, 114574, 92043, 90588, 135917, 118762, 207687, 101904, 115808, 156964, 141481, 166543, 109947, 171629, 132624, 160763, 120363, 117712, 108494, 123674, 157242, 100584, 52530, 112855, 176495, 140506, 62400, 98475, 143916, 80729, 79974, 81945, 84341, 35622]
6448C5622O539j1609K5621J8164P001q8598J15783r3651P4228M129m5972m0684
6436F573K5503O1852r4783K7250k7928M5578o544p780O235O5429j13755Q9031
6424G6661j5451k6333L9303N6788n0888q559k3196N3768m8224j737J2702N2650
6412A17484j04393q864K9025m8560R5023k1038p84l1334M2511J8827p8206J06999
6400A16690n2292l2840J4992O391l062l1273N200P3805q22m7879q851K2687k0865
6387D1881O151r170l1476O3696k0261j2773J8159n3347R9519o5499M2011J7405
6375I6296p6329M1238L4153K9873p5126P9866l5574O027L4334O36n7072L4687
6363A13009m2914K8145p1172R9689j8145r4181K3304O154O2119l7608J9369o8790
$$ y = [35622, 42161, 30552, 56173, 74337, 81338, -7260, 108523, 14872, 89100, 93229, 47257, 6573, 32076, 93928, -855, 26395, -1533, 44045, 37501, 29721, 35956, 101385, -12370, 76661, 61210, 34877, 74180, 130968, 80080, 71521, 48325, 102093, 53869, 52132, 64834, 117484, 13091, 4227, 33252, -15308, 79715, 58677, 57893, 26559, 69070, 87897, 9691, 116690, 64398, 31558, 46550, 52941, 49879, 18606, 23806, 97611, 96789, 48910, 40059, 62746, 41881, 48032, 38862, 7386, 71082, 50821, 38048, 56207, 2860, 102379, 36880, 78891, 96296, 19967, 61205, 95358, 125231, 50105, 129971, 94397, 100424, 134758, 135394, 78322, 113009, 70095, 98240, 27068, 126757, 108612, 14431, 37735, 43889, 106008, 68400, 87769, 18979]
6351A8979N4430k6433m3075N1987j416Q1895q578j0199K203L1254l393n104j6465
6338A26085o1922j2651L1844L099l9595L8806l7330K2606P1518j24327N1681M5712
6326A15526J663j678m6081J6958m9522K1881R342K785L3446m7201L8781K0258
6314A16158n0460r947O0074q7134P2147O4089p1042m787l728j9054K7998J7995
6302A12309l1248J6627P0287m7353K4149q2600L776N0531q7446R0321r7161J10613
6290A32805j8761k6249k7868L8495J471l1752N8259p6278K1451r764L1214j7752
6278G5271q560L5416m7867M6243n8296J9414P7650n3068J4987j8335k2011Q826
6266F9670K7691l5584o013M2723M407J4251Q638k0158l1545l2299J4307M4281
$$ y = [18979, 73409, 46976, 3901, 55888, 54472, 136367, 127789, 117590, 119793, 151047, 147654, 142550, 126085, 64163, 51512, 83356, 86455, 46860, 85666, 48336, 70942, 142460, 18133, 69814, 115526, 117189, 115511, 69430, 86388, 36866, 58747, 68089, 70874, 104320, 57119, 95900, 116158, 65698, 55751, 115825, 28691, 100838, 164927, 93885, 89098, 85370, 66316, 94314, 112309, 81061, 97688, 167975, 120622, 144771, 62171, 65947, 116478, 29032, 119353, 22192, 132805, 114044, 87795, 59927, 98422, 99893, 68141, 126400, 50122, 71573, 61809, 93023, 75271, 66711, 102127, 54260, 100503, 42207, 61621, 139271, 86203, 101190, 82855, 60844, 69670, 97361, 61777, 55764, 98487, 102894, 117145, 125783, 105625, 74080, 41781, 56088, 100369]
6254A00369k6317K4058J4419k2353K666J8186O0867o7725m8269L6378P2070p645
6242A56704q8145N8594j8165M381j2104L7492J6632n25M021R055J7380m9734j2154
6229A23432L3338l07l9590q0256J20729o5685j9360O1380q0548J09886j6892q5816
6217F0311P5389m8682M2745j6199l1092K0560P1816m3731n290K2286L1168Q535
6205A87816Q7828j40726N2450l8683P3967p2207J6612n191N0988o695j35708N6671
6193A27122P7204r6608R5917j6142k5612p3613Q6523m9787n2370K5281M9879K679
6181A50473n2652N6589j0873Q919J5691j03061O4385Q3539r7546M3106n4020L8244
6169A42794k71j7752P6365q9820K5179L1264M1868o5289M776P98m811L5399l9294
$$ y = [100369, 74052, 98110, 112529, 90176, 92842, 111028, 171895, 104170, 55901, 92279, 164349, 156704, 68559, 127153, 108988, 113369, 101265, 138757, 155389, 154864, 158885, 167940, 185320, 135586, 123432, 156770, 156463, 116873, 36617, 157346, 91661, 72301, 133681, 53133, 163019, 146127, 60311, 135700, 87018, 129763, 113564, 82472, 103032, 174848, 131117, 125827, 148113, 179281, 187816, 275644, 134918, 187368, 148685, 222652, 150445, 167057, 161866, 212854, 206159, 70451, 127122, 204326, 107718, 203635, 187493, 161881, 88268, 174791, 125004, 72634, 97915, 147794, 150473, 97821, 154410, 143537, 152456, 168147, 65086, 129471, 213010, 115464, 158570, 104550, 142794, 142523, 124771, 201136, 111316, 136495, 167759, 209627, 144338, 149114, 149912, 145101, 180500, 141206]
6156A41206J3179n1485L9724K9072J3663M0917r1600N8565n0614J8240P367o831
6144A61403k421j6881J5024R4779q6426L536l8283M6024j0771j3042O5962n5719
6132A63185O017P906J7135p6386K4285L4420N626K4892o9122N3286L231K3854
6120B18329m0627m5348P5090L8576m1772p8347J18635m6311N8181j4203m3861
6109A98342K0119J2601n2066L6149m6497R7712l5185L3838m4520L483l7620K0266
6097B06622K475R6928j22117Q3388k6900J1710o8644M5670q601m8705K9508K1715
6085B23049M7741o5050Q2931K734o5033N2364m6594J5348k7105M0416L3152L1314
6073C25267o6944K8232P718M180j5364m6663M1685k7873O1970l8989J7304o444
$$ y = [141206, 154385, 102900, 142624, 171696, 185359, 226276, 134676, 193241, 142627, 160867, 168234, 161403, 158982, 142101, 157125, 251904, 165478, 169014, 130731, 176755, 165984, 152942, 218904, 163185, 169202, 177108, 194243, 117857, 142142, 176562, 182188, 207080, 137958, 191244, 194475, 218329, 177702, 132354, 207444, 246020, 204248, 125901, 244536, 198225, 256406, 242203, 198342, 218461, 231062, 178996, 215145, 168648, 266360, 231175, 265013, 220493, 223976, 186356, 206622, 209097, 306025, 183908, 267296, 240396, 252106, 183462, 229132, 220531, 171826, 201334, 223049, 270790, 205740, 288671, 291405, 226372, 278736, 232142, 247490, 220385, 260801, 293953, 325267, 258323, 286555, 294273, 298453, 283089, 236426, 278111, 250238, 312208, 273219, 290523, 284079]
6061B84079K0056J1634L4440j4073M5316k0136R5376m0559o3799K0374J6296L5718
6049D24722m694j5602m3124P5290l3077j5140L4510k0839j3678k2232j4219J1384
6037C63301K4600j9581L9928O3802O2070j35524K9498K7766J2741O6308q9617
6026D45292J0169Q9975q0226J02896j14013n0837M7593N5203k9267K6024m3819
6015D58990P5565n5502K6145P795R304k4697K9410n4296M6601m3252Q653J3199
6003D97915j160n2799K9386L9618k2306O1525m4216j0735K7567r489j266N1474
5991E65514M6101k0627J2839m36M0947R1353M8079J858m0198m6167N6395n577
5979G50081q481l3602l7521o3422O2668N8948j03450j4802P1627j26192R2046
$$ y = [284079, 304135, 315769, 350209, 336136, 381452, 361316, 456692, 416133, 352334, 372708, 389004, 424722, 420028, 404426, 361302, 436592, 403515, 388375, 422885, 402046, 388368, 366136, 351917, 363301, 387901, 368320, 408248, 472050, 534120, 398596, 428094, 455860, 468601, 534909, 445292, 455461, 545436, 465210, 568106, 454093, 403256, 450849, 506052, 476785, 502809, 458990, 534555, 479053, 505198, 512993, 522297, 497600, 527010, 472714, 519315, 476063, 484716, 497915, 496755, 443956, 473342, 512960, 490654, 552179, 507963, 497228, 524795, 515306, 514040, 565514, 611615, 590988, 603827, 603391, 644338, 735691, 783770, 785628, 745430, 699263, 755658, 750081, 741600, 707998, 670477, 607055, 669723, 728671, 625221, 610419, 682046, 555854, 647900]
5968F47900O9575j7853o630j7810P1724M3239L4882Q345O0925M5599O0067L2486
5956A032449m6951M5182O8751m0310j691k7784m1252j2928k2956l3840q017m8860
5944H61793l8708Q847N1984n1884R009o651J0456P5276L1894M9040J4305R9119
5932A114480O4635J7054n8211j5806J8033M3208q733p7828k471J5764K1551l4047
5920A097629Q585N7519j24366N5793l3422j036J8702m4223O1684N4181L1737o768
5908A176015R9582N3244O8493M5134J4834J7131P365O2909r112K3607p9664M4372
5896A523910J3293m2750L2124j9296m7032r27M0293J423l0836M6400N403p6207
5884A445798J18130K9857L4875R0087L7814n71J97365Q488J65458n4746Q6023
$$ y = [647900, 717475, 699622, 692992, 675182, 746906, 790145, 825027, 833372, 894297, 939896, 999963, 1032449, 985498, 1030680, 1099431, 1059121, 1057430, 1029646, 988394, 975466, 952510, 918670, 910653, 861793, 823085, 831932, 883916, 832032, 841041, 834390, 844846, 920122, 952016, 1001056, 1015361, 1114480, 1179115, 1196169, 1137958, 1122152, 1140185, 1183393, 1174660, 1096832, 1094361, 1110125, 1131676, 1097629, 1106214, 1163733, 1039367, 1095160, 1061738, 1060702, 1079404, 1035181, 1096865, 1151046, 1182783, 1176015, 1275597, 1328841, 1397334, 1442468, 1457302, 1474433, 1481798, 1544707, 1535595, 1559202, 1479538, 1523910, 1537203, 1494453, 1526577, 1507281, 1460249, 1459322, 1499615, 1501038, 1470202, 1516602, 1522005, 1445798, 1563928, 1593785, 1628660, 1718747, 1756561, 1755990, 1953355, 1961843, 2127301, 2072555, 2158578]
5873B158578R3343j1935L5737q6419n112L4028l5273k0429m3307j0269p2052O0471
5861B097361o7318O7744m9686M9742k9445J33431m6280Q4590p042J14973J9807
5850B367877O6027J29994Q3377J6298R2014p295L7216l655J06458J6919k4786
5839B880444J926K964O1851j6956P1693P5643L8451M3069N4722N1405J22219R2527
5827C479958J41863K22250J58283K36908K45573K45295L04600L68721M38615M06780
5817F248846N18007M85641O11128P29449O88556O34452O53799M50089M39212K70252
5807A1729431J20480J26877l3680j2809j45744m4112q9028L1313J91872J13546
5797A1988146L21079L88460N46689Q06810R07167J083827J162353J458809J490593
$$ y = [2158578, 2251921, 2239986, 2275723, 2189304, 2184192, 2218220, 2182947, 2162518, 2119211, 2108942, 2036890, 2097361, 2030043, 2097787, 2048101, 2097843, 2068398, 2201829, 2155549, 2240139, 2233097, 2348070, 2367877, 2433904, 2563898, 2647275, 2663573, 2755587, 2748292, 2785508, 2781853, 2888311, 2905230, 2880444, 2882370, 2885334, 2947185, 2930229, 3001922, 3077565, 3116016, 3159085, 3213807, 3265212, 3387431, 3479958, 3621821, 3844071, 4002354, 4239262, 4484835, 4730130, 5034730, 5403451, 5842066, 6248846, 6766853, 7252494, 7863622, 8593071, 9281627, 9916079, 10569878, 11019967, 11459179, 11729431, 11849911, 11976788, 11943108, 11930299, 11784555, 11740443, 11651415, 11682728, 11874600, 11988146, 12309225, 12697685, 13244374, 14051184, 14958351, 16042178, 17204531, 18663340, 20153933]
5788B0153933J608403J538791J457975J296345R74185O83247L24006K2013m59541
5779B7599357o06301q21708r26093r36398r77322r26909q29328o64553m05117
5770B0505628k98264k0029K20844M21502O11213Q05812J040621J157788J173479
5761B5618594J262459J129300Q54311Q17662K97138O1998l18864o19125r56082
5752B8147391j196788j288226j433460j276466j400669j248801j198129r61464
5744A8143388r14204o21326o99223l56191l47463j70336n862J33783J47211L42214
5734A5651991L12732K77402J98532k9095k67472l42689m67504n70057o66837o98524
5724A3398479p66461n81394o58317m73973n98166m96847m02764l04217l05300
$$ y = [20153933, 21762336, 23301127, 24759102, 26055447, 27029632, 27712879, 28036885, 28058898, 27599357, 26993056, 26171348, 25245255, 24308857, 23331535, 22404626, 21575298, 20910745, 20505628, 20207364, 20187335, 20408179, 20829681, 21440894, 22246706, 23287327, 24445115, 25618594, 26881053, 28010353, 28864664, 29682326, 29979464, 30041462, 29722598, 29103473, 28147391, 26950603, 25662377, 24228917, 22952451, 21551782, 20302981, 19104852, 18143388, 17229184, 16607858, 15908635, 15552444, 15204981, 15034645, 15028783, 15162566, 15309777, 15651991, 15964723, 16242125, 16440657, 16411562, 16144090, 15801401, 15333897, 14763840, 14097003, 13398479, 12632018, 12050624, 11392307, 10918334, 10320168, 9823321, 9420557, 9116340, 8811040]
5715H811040k41791l15947j70197j55061j86160j81454n5767p2906M085O9964
5705G505806k4218J10391K61192L05236K73046L86416M35060L94808L19324J85420
5695A0152481P2785o6723j25029l40937k77815l32754m12028l13795k25343k34372
5685G896470k42917j03129K594m3010q467O5927J37025K60002K45035L64026N29027
5674I102583O72883Q53684J018589J140211J249509J407462J318378J079293Q47023
5665A8689615M63154N6679k72903o97207q32360j100493j044035j047855r72301
5656A3242294r41973p05089o51501m28871l37249k37685j24387J16377r197K48369
5646A0171088K76036M44768P10370P18554J076167J089251J355407J326665J339082
$$ y = [8811040, 8569249, 8253302, 8083105, 7928044, 7741884, 7560430, 7504663, 7431757, 7435842, 7505806, 7481588, 7591979, 7853171, 8158407, 8431453, 8817869, 9252929, 9647737, 9967061, 10152481, 10225266, 10158543, 10033514, 9692577, 9414762, 9082008, 8669980, 8356185, 8130842, 7896470, 7653553, 7550424, 7553018, 7510008, 7501541, 7567468, 7704493, 7964495, 8209530, 8573556, 9102583, 9775466, 10629150, 11647739, 12787950, 14037459, 15444921, 16763299, 17842592, 18689615, 19152769, 19209448, 18936545, 18239338, 17406978, 16306485, 15262450, 14214595, 13242294, 12300321, 11595232, 10943731, 10514860, 10177611, 9939926, 9815539, 9931916, 9922719, 10171088, 10447124, 10891892, 11602262, 12320816, 13396983, 14486234, 15841641, 17168306, 18507388]
5637A8507388J330724J024778O62461L51523Q9529k78525o02176p24097q69486
5628A9492119r24139q79830q22731p14469o60577m86983m17859k99083j06582
5619A4179866p7433O3866P0523L53077L63902O41080O99192R86727J198729J207013
5609A9686542J232040J282157J027731Q35981K30417j897l79106n08703q34021
5600B2571141q88159r58942q68373r04418p83766o75024n56039m21314l38275
5591A6176831k00106m9332Q1023K41245L20356O26288P01100R94996J087533J086080
5581B1066014J063611R21824N77195J87613k24551n57144p11909r67058j044193
5572B0311402j060117r83956q81447q15687o59703m95701m42407k27481j26126
$$ y = [18507388, 19838112, 20862890, 21525351, 21876874, 21966403, 21687878, 21085702, 20361605, 19492119, 18567980, 17688150, 16865419, 16150950, 15490373, 15003390, 14585531, 14286448, 14179866, 14102433, 14166299, 14236822, 14589899, 14953801, 15594881, 16294073, 17280800, 18479529, 19686542, 20918582, 22200739, 23228470, 24064451, 24294868, 24292971, 23913865, 23405162, 22571141, 21682982, 20724040, 19855667, 18951249, 18167483, 17492459, 16936420, 16515106, 16176831, 15976725, 15927393, 16008416, 16249661, 16570017, 17196305, 17897405, 18892401, 19979934, 21066014, 22129625, 23051449, 23628644, 23816257, 23591706, 23034562, 22322653, 21355595, 20311402, 19251285, 18267329, 17385882, 16570195, 15910492, 15414791, 14972384, 14744903, 14618777]
5563A4618777j28372l9769N0278Q1388K53183J63523L58705K72572L75999L40663
5553A6346947L27631L54326J84789N6103q3319k58063l30537n07111o52216o60037
5543A4778513p67415o57567o93745n62006m98447n70442l77364l32982k78755
5534A0039790k37990l65919l12999k65066l94790k42612l44090k74581k73513
5525G328230k93243k77569j08947l05647k22061j49076j13410k36238l6336k05331
5515E380372o3677j14041r284J7530j28427o9099l365m1597p2704p991k7576J3789
5503D873930k0696J5526k9391K5246J0045O3337N8813J5857M7167J38126R9405
5492E297365J97805J53049K39799K55462L86399M49021M45073M94057N44276M42157
$$ y = [14618777, 14490405, 14450636, 14500914, 14582302, 14835485, 14999008, 15357713, 15630285, 16006284, 16346947, 16674578, 17028904, 17213693, 17269796, 17186477, 16928414, 16597877, 16090766, 15438550, 14778513, 14011098, 13353531, 12659786, 12097780, 11599333, 11028891, 10651527, 10318545, 10039790, 9801800, 9435881, 9122882, 8857816, 8463026, 8220414, 7876324, 7601743, 7328230, 7034987, 6757418, 6648471, 6342824, 6120763, 5971687, 5858277, 5622039, 5585703, 5380372, 5316695, 5202654, 5193370, 5210900, 5082473, 5013374, 5010009, 4968412, 4895708, 4887717, 4860141, 4873930, 4853234, 4868760, 4839369, 4864615, 4874660, 4937997, 4996810, 5012667, 5059834, 5197960, 5297365, 5495170, 5648219, 5888018, 6143480, 6529879, 6978900, 7423973, 7918030, 8462306, 8904463]
5482H904463M69724N93684L68848L36932L16558M14500M64795N45241Q55989J116966
5472A4387700J400768J627705J613387J136635P88498K76846m6471l94792n93463
5463B0196813n22767n91509m33416k81741m6285J05994L56531M97042O15611P93030
5453B0689303Q43536J023237J123770J315031J459779J870989K043889K415817
5445C2785351K448465K305199J775963R40525j58962j044655k076941k613159
5437C4361786k872786k830238k612644k422980j990952j677101j356845q80149
5429A7718091n45721k93916n1809K25255L59082N70408O90830Q46486J079560
5420B0598266J137992J586785J781543J745000J328162N32603k49485j088717
$$ y = [8904463, 9374187, 9967871, 10336719, 10673651, 10990209, 11404709, 11869504, 12414745, 13270734, 14387700, 15788468, 17416173, 19029560, 20166195, 20954693, 21231539, 21185068, 20790276, 20196813, 19674046, 19082537, 18649121, 18367380, 18321095, 18427089, 18783620, 19280662, 19896273, 20689303, 21532839, 22556076, 23679846, 24994877, 26454656, 28325645, 30369534, 32785351, 35233816, 37539015, 39314978, 40255503, 40096541, 39051886, 36974945, 34361786, 31489000, 28658762, 26046118, 23623138, 21632186, 19955085, 18598240, 17718091, 17172370, 16878454, 16826645, 17051900, 17410982, 17981390, 18672220, 19518706, 20598266, 21736258, 23323043, 25104586, 26849586, 28177748, 28710351, 28460866, 27372149]
5412B7372149j682246k007616j959455j852535j699597j445806j082290j086485
5404A4556119q42622n81496p16829m52636m30763l71397l70806l08142k35209
5395A0246219k39927j21940r9964p689M5906J32130P4670J98824L17608J87295
5385A0733132L18171K79847L10070K33267K27051J17476M0543n6502j83453k27276
5375A1792326j31115l86499l42937l86160l37387k55870l49098k01676j71252
5366I230332k55956j16055j32267j04608l6711k777j33068j26459n3453j92511
5356H076467k49087k42357k63456l29492k79288k96810l98551k06124l52978k43267
5346E215057l08752k39037j19184j97924j53643j43298j18964k16346j84953l5343
$$ y = [27372149, 25689903, 23682287, 21722832, 19870297, 18170700, 16724894, 15642604, 14556119, 13713497, 13132001, 12415172, 11962536, 11531773, 11160376, 10789570, 10481428, 10246219, 10006292, 9884352, 9784388, 9776699, 9822605, 9954735, 10029405, 10228229, 10545837, 10733132, 11051303, 11331150, 11641220, 11874487, 12101538, 12219014, 12259557, 12203055, 12019602, 11792326, 11661211, 11274712, 10931775, 10545615, 10208228, 9952358, 9603260, 9401584, 9230332, 8974376, 8858321, 8726054, 8621446, 8584735, 8581958, 8448890, 8322431, 8268978, 8076467, 7827380, 7585023, 7321567, 6992075, 6712787, 6415977, 6017426, 5811302, 5458324, 5215057, 4906305, 4667268, 4548084, 4350160, 4196517, 4053219, 3934255, 3717909, 3532956, 3497613]
5336C497613r7173j20873p7379q9812p5337j12251o5654l6117q5369J3834q6167
5325B665315m1438l2383o5352k1428o8784n83q0834n6958Q439j15417l7151J7487
5313B170913N64n2572k5899n3066r2969K3186L5593j07623O5677p8229j5614m670
5301A865291p9551M4376j2619M452l0795K2205N703o1585M5420m4776L0243j5036
5289A773328K3525n7705O428m2056k1560J12470j51747Q7402k8588P0215q8745
5278A682967O2480J5406R9879p825n3233P222n452K6680R1069r736N8169k0661
5266A946965J25634O1850N0093N8573P9517J41071J36074J00475J23343J51427
5256B975022K42722J15195L03851J39530Q7237K42453J15178J21313J54861J55003
$$ y = [3497613, 3400440, 3279567, 3202188, 3112376, 3037039, 2924788, 2859134, 2823017, 2737648, 2751482, 2665315, 2623877, 2591494, 2526142, 2504714, 2435930, 2435347, 2354513, 2297555, 2305994, 2190577, 2153426, 2170913, 2171477, 2118905, 2093006, 2039940, 1946971, 1970157, 2005750, 1898127, 1963804, 1885575, 1869961, 1865291, 1785740, 1830116, 1817497, 1821949, 1791154, 1813359, 1819062, 1757477, 1802897, 1758121, 1788364, 1773328, 1796853, 1739148, 1745576, 1703520, 1681960, 1794430, 1642683, 1730085, 1701497, 1771712, 1682967, 1745447, 1760853, 1860732, 1852907, 1799674, 1806896, 1801444, 1828124, 1919193, 1909457, 1967626, 1946965, 2072599, 2134449, 2184542, 2243115, 2322632, 2463703, 2599777, 2700252, 2823595, 2975022, 3217744, 3332939, 3636790, 3776320, 3863557, 4106010, 4221188, 4342501, 4497362, 4652365]
5246D652365O4029N5635J06954J02694J19404Q3057L7349J47268J77414K01997
5236E748166J35530K40206K46078K46233J81237K55440K45025R4511J38478R0939
5226G621843o3241j07866j4972k47380j79145k02999k68610k44052k44083k44511
5216E804984k23204k39719j59347k13143j8629r6895K7764j06932n5926J4887
5206D733840r485o1654M7063o3848j25932q7667r7822k11055j68190k03745k33025
5195C518480k24737j88825j79224j84459j39699j05730r0078q5078q3134j22337
5185B115179p3532j6893p9639j4348j7008j02839K8623K3711j44429O1332m7881
5174A732276K9118n4910n0041K0035m0582J5098L3690p4494n2001p0874M6493
$$ y = [4652365, 4716394, 4772029, 4878983, 4981677, 5101081, 5184138, 5221487, 5368755, 5546169, 5748166, 5883696, 6123902, 6369980, 6616213, 6797450, 7052890, 7297915, 7392426, 7530904, 7621843, 7558602, 7450736, 7435764, 7188384, 7009239, 6806240, 6537630, 6293578, 6049495, 5804984, 5581780, 5342061, 5182714, 4969571, 4950942, 4854047, 4881811, 4774879, 4718953, 4733840, 4724355, 4662701, 4709764, 4645916, 4519984, 4432317, 4334495, 4123440, 3955250, 3751505, 3518480, 3293743, 3104918, 2925694, 2741235, 2601536, 2495806, 2405728, 2320650, 2237516, 2115179, 2041647, 2024754, 1945115, 1930767, 1913759, 1810920, 1839543, 1863254, 1718825, 1780157, 1732276, 1761394, 1706484, 1656443, 1676478, 1635896, 1650994, 1684684, 1610190, 1558189, 1487315, 1533808]
5163A533808M7083r3756N3212j14571O4376O5997n9154k6938J5800J1790O7305
5152A564952m9008P0950k4710k9667o202O9135k7969J0618J374k0940J2051o5085
5140A505499L2010L9321o7458m1642R9433P2704q1721K5530j3842L1867P9933
5129A681634r120j10354J64155k5090j768P0308n0917K0882O4063P3955m1110
5118A836638l6811M6550j2670q093J03316l7013L0934M6118l6163J03181k6391
5107B009596P0075m4659K4404R9946K7449L212Q360L3640M1323J03789J00987
5096B478122n1552P6589L8967P569R4922j1633N0123j0612P1580J0000P0069M767
5084B828911J2884n0615N5115j353N168o633P6414Q8411p326O3850K6412J14962
$$ y = [1533808, 1580891, 1487135, 1540347, 1425776, 1490152, 1556149, 1496995, 1470057, 1485857, 1497647, 1564952, 1515944, 1586894, 1562184, 1532517, 1526315, 1595450, 1567481, 1578099, 1579473, 1558533, 1570584, 1505499, 1537509, 1576830, 1509372, 1467730, 1567163, 1639867, 1558146, 1583676, 1569834, 1601701, 1681634, 1672514, 1562160, 1726315, 1701225, 1699457, 1769765, 1718848, 1739730, 1803793, 1877748, 1836638, 1799827, 1846377, 1833707, 1825614, 1928930, 1891917, 1922851, 1968969, 1932806, 2035987, 2009596, 2079671, 2035012, 2059416, 2159362, 2186811, 2190023, 2198383, 2232023, 2273346, 2377135, 2478122, 2426570, 2503159, 2542126, 2549695, 2644617, 2632984, 2683107, 2672495, 2744075, 2754075, 2824144, 2828911, 2841795, 2791180, 2846295, 2844942, 2850110, 2843477, 2919891, 3008302, 3000976, 3064826, 3091238, 3206200]
5072C206200L0575O2288M5638N2423O0244P3458N4092N8649Q0874N7016Q4919
5061C866376M2751O9062j7864P3902J32511K5075R2267L9186L5381R6726J33317
5050D588690J56264J64565K25953J61624M03402K18990J97276J64117N0324J44514
5040F475719J01491J6080M4981m8983o6626k9889L1069P9544k3476J60894J16574
5029F857378J77136J90223M7218K54998K15935L09216K97463M30203M64962N45562
5019I790294O82766P14147P34246O90179O97884N36047K93080J09620j12229j75570
5009A3960464k62935l45971k25843q4414o8033O137Q5335K29519K17799K36085
4999A3748143L31048L33696M89724N25820O14023P39657Q76485J045102J322823
$$ y = [3206200, 3236775, 3299063, 3344701, 3397124, 3457368, 3530826, 3584918, 3643567, 3724441, 3781457, 3866376, 3909127, 3978189, 3960325, 4034227, 4166738, 4191813, 4284080, 4323266, 4358647, 4455373, 4588690, 4744954, 4909519, 5135472, 5297096, 5700498, 5919488, 6116764, 6280881, 6331205, 6475719, 6577210, 6593290, 6638271, 6589288, 6522662, 6492773, 6523842, 6603386, 6579910, 6740804, 6857378, 7034514, 7224737, 7271955, 7526953, 7742888, 8052104, 8349567, 8779770, 9244732, 9790294, 10473060, 11187207, 11921453, 12611632, 13309516, 13845563, 14138643, 14248263, 14136034, 13960464, 13697529, 13351558, 13125715, 13041301, 12973268, 12979405, 13064740, 13294259, 13512058, 13748143, 14079191, 14412887, 14902611, 15428431, 16042454, 16782111, 17658596, 18703698, 20026521]
4990B0026521J247315J382153J584559J644863J427140J155734Q85805M88501
4982B9842591J13391j06045j87887k49779k15190k06140J3886J54599K69105L14210
4972B9742741L81449M29012N21381N94612N68611M29688N26104O31968N92359
4963C4417925P80844P14866Q40272R43285J016308R30055P05131L60564m577m86572
4953D0218101j041826j252912j523010j643099j719249j500910j438716j302041
4945B8796338j232872j106602r75667q68512q05283o94661q22840o59584o26615
4936B1003702m76125n25684m03401j98583j35900j21525J42477L28987J55712
4927A9769660J37542p5033m17692n75077o74851q72230q51577q67142q12977q04048
$$ y = [20026521, 21273836, 22655989, 24240548, 25885411, 27312551, 28468285, 29354090, 29842591, 29955982, 29849937, 29662050, 29412271, 29197081, 28990941, 29004827, 29159426, 29428531, 29742741, 30124190, 30553202, 31074583, 31669195, 32237806, 32667494, 33193598, 33825566, 34417925, 35198769, 35913635, 36753907, 37697192, 38713500, 39643555, 40348686, 40709250, 40704673, 40218101, 39176275, 37923363, 36400353, 34757254, 33038005, 31537095, 30098379, 28796338, 27563466, 26456864, 25481197, 24612685, 23807402, 23112741, 22289901, 21630317, 21003702, 20527577, 20001893, 19598492, 19399909, 19264009, 19142484, 19284961, 19613948, 19769660, 19907202, 19832169, 19414477, 18839400, 18164549, 17292319, 16440742, 15573600, 14760623, 13956575]
4917A3956575o04094o35133n80385l41399m93448l57823l33343l33531k78379
4908I999040j72647k47002k04393j71167j42150r2233j90413O0238j38801Q5428
4898H785900r8399P7511k06954j19255k04214k63394k42172k35367j88398l06013
4888F999245j74909k12101j42223k28226j19287j67535o5665p5726j74546j9139
4878E619888j08968j10630n8645k00115J8532p9151r4374j01640n9493q5389M9226
4867D789241j14538K352m6092o309L7561o3533K0864m979j21437p4167j09571
4856D309392O6208j78348m9185n3686l8745J6048o5446j8182o2992m067J4821
4845C935818k600J3017n1464O7161k1344J09505k7208L466M0675l059R8034N7781
$$ y = [13956575, 13352481, 12717348, 12136963, 11795564, 11302116, 10944293, 10610950, 10277419, 9999040, 9826393, 9579391, 9374998, 9203831, 9061681, 8969448, 8779035, 8839273, 8700472, 8785900, 8687501, 8765012, 8558058, 8438803, 8234589, 7971195, 7729023, 7493656, 7305258, 6999245, 6824336, 6612235, 6470012, 6241786, 6122499, 5954964, 5889299, 5813573, 5639027, 5619888, 5510920, 5400290, 5341645, 5141530, 5160062, 5080911, 4986537, 4884897, 4825404, 4740015, 4789241, 4674703, 4677055, 4630963, 4624654, 4662215, 4598682, 4619546, 4614567, 4493130, 4418963, 4309392, 4375600, 4197252, 4148067, 4094381, 4055636, 4071684, 4006238, 3988056, 3925064, 3920997, 3935818, 3933218, 3946235, 3894771, 3961932, 3940588, 4050093, 4022885, 4026351, 4067026, 4063967, 4162001, 4219782]
4833D219782M1234M8424J30777J02368J11124L4453O6901O6359J76817J36245
4823E134484J56233N0264J23709R5880J46314J39392J53385k7138J41469J68474
4813F282466K07905M0098K34582J27012p250J28930J73613j1280O4049J88746
4803G428871N7290J08591K24352J08135L57662K73478L57280L49760L63617L42127
4793I971163L43818M50291N59488M99478N71421N88543N56929M45517L56472L65142
4783A4708262K54385J90916L09814M06657N52726O80806Q50831P47765O81891
4774A9384053M15195L48289L42060L34231O04901R22029R64112J072174J124123
4765B5511167Q02701O95702N54227K43885K82316J33195j31559k55595k70229
$$ y = [4219782, 4261016, 4309440, 4440217, 4542585, 4653709, 4688162, 4755063, 4821422, 4998239, 5134484, 5290717, 5340981, 5464690, 5560570, 5706884, 5846276, 5999661, 5972523, 6113992, 6282466, 6490371, 6530469, 6765051, 6892063, 6884813, 7013743, 7187356, 7176076, 7240125, 7428871, 7486161, 7594752, 7819104, 7927239, 8284901, 8558379, 8915659, 9265419, 9629036, 9971163, 10314981, 10765272, 11324760, 11824238, 12395659, 12984202, 13541131, 13986648, 14343120, 14708262, 14962647, 15153563, 15463377, 15870034, 16422760, 17103566, 17954397, 18702162, 19384053, 19799248, 20147537, 20489597, 20823828, 21428729, 22350758, 23314870, 24387044, 25511167, 26313868, 27009570, 27563797, 27807682, 28089998, 28223193, 28091634, 27836039, 27565810]
4756B7565810l27267l07035k41185j76663j06012J04565M8384j65039m58859n83873
4746B5352826n96137o39043n70231l96270l55698j48072l17211l79383n45077
4737B1405704o36798p57379p26074p05791o66436n76716o08468m66615m07845
4728A5853582m37408l59234l71396m03232k58499k66049k56281l48714l45012
4719A2807757l65540k85007l24113k23559k76084j64427j13581j18290o0689r021
4709A0867446j16144R3223r313O0675J8709r7709n531r5110l27882k51162m12031
4698I725171m00741k78534l91055l76484m10405l04033k93426k74009k72852k21679
4688F501953j61011j67538j54304k26414j95639j79278j08859r0822n2858j60677
$$ y = [27565810, 27238543, 26931508, 26690323, 26513660, 26407648, 26512213, 26560597, 26395558, 25936699, 25352826, 24756689, 24117646, 23547415, 23151145, 22795447, 22647375, 22330164, 21950781, 21405704, 20768906, 20011527, 19285453, 18579662, 17913226, 17336510, 16728042, 16261427, 15853582, 15416174, 15056940, 14685544, 14282312, 14023813, 13757764, 13501483, 13152769, 12807757, 12442217, 12157210, 11833097, 11609538, 11333454, 11169027, 11055446, 10937156, 10876467, 10867446, 10751302, 10844525, 10835212, 10895887, 10914596, 10816887, 10811356, 10716246, 10388364, 10137202, 9725171, 9324430, 9045896, 8654841, 8278357, 7867952, 7563919, 7270493, 6996484, 6723632, 6501953, 6340942, 6173404, 6019100, 5792686, 5597047, 5417769, 5308910, 5218088, 5165230, 5004553]
4678E004553j32917n5304j44624j59584j54005p408q7378q4054j20811q7100l9279
4667C932089o0944l2667l4897o5635p6375o2541p9499L2779j22500n2702P0015
4656C447123j1694m6330q496m9136n9292j8951l3159M376l1224r971j956J2751
4644C194041L0355p000n2819l679J10168q3056q0009L7555N3472n9495l632r1943
4632C043958j026L0454L3943k0480K7234P2586o1330L6533p7691J4798M2277Q033
4620C149289l7428O7134m4434l8773J0681p1548M1983l5347N4869O506P4533k5143
4608C152322K7666J7717R6552k1741J26174L6625J32806Q6656M3983J7038O2684
4597C778482P2701l3768J07659N4206N8314M3195L7264M7919M4732l0077L6088
$$ y = [5004553, 4871636, 4816332, 4671708, 4512124, 4358119, 4350711, 4263333, 4179279, 4058468, 3971368, 3932089, 3871145, 3838478, 3803581, 3737946, 3661571, 3599030, 3519531, 3552310, 3429810, 3377108, 3447123, 3435429, 3389099, 3380603, 3331467, 3272175, 3253224, 3220065, 3224441, 3193217, 3183246, 3181290, 3194041, 3224396, 3217396, 3164577, 3160898, 3271066, 3188010, 3108001, 3145556, 3199028, 3139533, 3135901, 3043958, 3042932, 3073386, 3107329, 3086849, 3114083, 3186669, 3125339, 3161872, 3084181, 3098979, 3141256, 3149289, 3111861, 3178995, 3134561, 3095788, 3106469, 3034921, 3076904, 3041557, 3096426, 3102932, 3177465, 3152322, 3179988, 3197705, 3294257, 3272516, 3398690, 3435315, 3568121, 3654777, 3698760, 3715798, 3778482, 3851183, 3817415, 3925074, 3979280, 4037594, 4080789, 4118053, 4165972, 4210704, 4180627, 4216715]
4586D216715M9125M906J7096N8370Q0461p7605Q2415j8081J74522m4595Q1118
4575D624447O6070P8681J9609J30818N5804R9847J79718M9282J51304K5136J33750
4564E614466J03998J69691J25660J80354P2518M9491K00881O5084J03475J87103
4554F872721Q3858J52118Q3645K15862J70675K49570J99737K19200K61572K45189
4544H754147K71620K43173M05877K44070L96810M10129K88780M31110L63297L66808
4534A2175821L18030M08618K76820M06146L18030L72767L41740M55925L64273
4525A5438170M70659M71984M50289M79275O59081O53716O61199P15593Q22455
4516B0822421Q18769Q58762Q48833R94269R48509J087386R18663J001605R10970
$$ y = [4216715, 4265840, 4270746, 4287842, 4346212, 4426673, 4349068, 4431483, 4413402, 4587924, 4543329, 4624447, 4690517, 4769198, 4788807, 4919625, 4975429, 5075276, 5254994, 5304276, 5455580, 5480716, 5614466, 5718464, 5888155, 6013815, 6194169, 6266687, 6316178, 6517059, 6582143, 6685618, 6872721, 6956579, 7108697, 7192342, 7408204, 7578879, 7828449, 8028186, 8247386, 8508958, 8754147, 9025767, 9268940, 9674817, 9918887, 10315697, 10725826, 11014606, 11445716, 11809013, 12175821, 12493851, 12902469, 13179289, 13585435, 13903465, 14276232, 14617972, 15073897, 15438170, 15908829, 16380813, 16831102, 17310377, 17969458, 18623174, 19284373, 19999966, 20822421, 21641190, 22499952, 23348785, 24343054, 25291563, 26378949, 27297612, 28299217, 29210187]
4507B9210187P98276O38770P52032N65052M14738M97339M12381N82765O47939
4498C4519479N66733Q09238Q22215R20015J049783J110949J259908J200215J397624
4489D3656159J341531J426506J473595J396366J470058J521605J545793J473601
4481E5305214J538861J564841J484883J472829J602995J666426J885076K215348
4473F8736473K502341K894770L354395L985256M589911N472464O473981P787789
4465A05797380R143361J1000551J3154877J6344733K1206631K8497334L9815774
4458B44960641N5042473O7902618O8285508N2396707K7169897J9640k5444440
4451D90333044m2720856m9265250m9243480m5608717m0878748l5765723l0459257
$$ y = [29210187, 30008463, 30647233, 31399265, 31964317, 32379055, 32876394, 33288775, 33871540, 34519479, 35086212, 35895450, 36717665, 37637680, 38687463, 39798412, 41058320, 42258535, 43656159, 44997690, 46424196, 47897791, 49294157, 50764215, 52285820, 53831613, 55305214, 56844075, 58408916, 59893799, 61366628, 62969623, 64636049, 66521125, 68736473, 71238814, 74133584, 77487979, 81473235, 86063146, 91535610, 98009591, 105797380, 114940741, 125941292, 139096169, 155440902, 176647533, 205144867, 244960641, 300003114, 367905732, 436191240, 488587947, 515757844, 515777484, 490333044, 447612188, 398346938, 349103458, 303494741, 262615993, 226850270, 196391013]
4444A96391013k5264642k0656122j6931221j3733289j1232891r299359p705604
4437I1567885o197859n228227m376417l612855l201122k764237k401395k236066
4429F1549707k025406j934480j812434j605401j608397j600821j475244j302428
4421D8185096j287676j128382j012024r05428q01813p06051o12783m74098m78915
4412D0777926m36548m00755l70045l53195m09936n30992m20228l25189m16202
4403C7114836k01785q8928o5308Q6430K46571M41940N07808O91858Q54904J089604
4393D0677930J353796J628311J889025K039657K186095K105922J868143J403531
4385E5152410J097563Q14680P98842J568512K227958J999713J237922N81449j13700
$$ y = [196391013, 171126371, 150470249, 133539028, 119805739, 108572848, 99273489, 91567885, 85370026, 80141799, 75765382, 72152527, 68951405, 66187168, 63785773, 61549707, 59524301, 57589821, 55777387, 54171986, 52563589, 50962768, 49487524, 48185096, 46897420, 45769038, 44757014, 43851586, 43049773, 42343722, 41730939, 41256841, 40777926, 40341378, 39940623, 39570578, 39217383, 38807447, 38276455, 37856227, 37531038, 37114836, 36913051, 36824123, 36758815, 36845245, 37091816, 37533756, 38041564, 38733422, 39588326, 40677930, 42031726, 43660037, 45549062, 47588719, 49774814, 51880736, 53748879, 55152410, 56249973, 57064653, 57863495, 59432007, 61659965, 63659678, 64897600, 65479049, 65365349]
4376F5365349r88500j283242j397804j350618j226144j162087q21805n96976k83026
4367E6255147j8189K07880K16935J89190Q3619K7862n2453k72517l19492n15416
4357E5802566n21999k75554J39172J661811L322571L350943J590592j09394j315309
4348F3645399l256343l661652l288467k870469k494912k321167k215281k033378
4340D1503730k134130j924836j909483j804865j600675j398498j224949j018229
4332B8488065r13535q46429o25071l85141l65595j35155K88998J133608J295689
4323B7935434N37305l83114r51650j919368k311126k162559k012597j557900j386750
4314A5787675j216363j020118p49502o63210m83776l19112l48043k52754k24966
$$ y = [65365349, 64376849, 63093607, 61695803, 60345185, 59119041, 57956954, 57135149, 56538173, 56255147, 56236958, 56444838, 56661773, 56850963, 56934582, 56962444, 56909991, 56637474, 56317982, 55802566, 55280567, 55005013, 55144185, 56805996, 60128567, 63479510, 65070102, 64960708, 63645399, 60389056, 56727404, 53438937, 50568468, 48073556, 45752389, 43537108, 41503730, 39369600, 37444764, 35535281, 33730416, 32129741, 30731243, 29506294, 28488065, 27574530, 26728101, 26103030, 25717889, 25352294, 25217139, 25506137, 26639745, 27935434, 28472739, 28089625, 27137975, 25218607, 22907481, 20744922, 18732325, 17174425, 15787675, 14571312, 13551194, 12801692, 12138482, 11654706, 11335594, 10987551, 10734797, 10509831]
4305A0509831l04534k59060k87839k21368l63511k48295m30281k81634l35480
4296G777829k95390l03935k59272l38634j42580l10762k15729j83629j80791j50306
4286E396801k12645j08065k02666j04735r9198j75824p8229q9830j32556q4852
4276D108201l1160n3355q1566j28161l237j20311n0165l4636j27319j08633p5684
4265C293974j21811k8997l5955j5906n1430p9358l1114o115j25954J1057j12133
4254B696258m4281r387j08063n125n2415m0731m3492m9895N7177m7230m785n4570
4242B293461j7758j4063N8177J9004M9918K9721L5683o2846l4917r7603o7857
4231B190920k8457l9988n2198r5537m1296p932r3057j9953N1548m9032q9866N9519
$$ y = [10509831, 10205297, 9946237, 9658398, 9437030, 9073519, 8825224, 8394943, 8113309, 7777829, 7482439, 7178504, 6919232, 6580598, 6438018, 6127256, 5911527, 5727898, 5547107, 5396801, 5184156, 5076091, 4873425, 4768690, 4669492, 4493668, 4415439, 4325609, 4193053, 4108201, 4077041, 4023686, 3942120, 3813959, 3810722, 3690411, 3640246, 3605610, 3478291, 3369658, 3293974, 3172163, 3143166, 3107211, 3091305, 3039875, 2960517, 2929403, 2923288, 2797334, 2808391, 2696258, 2651977, 2642590, 2534527, 2529402, 2476987, 2436256, 2392764, 2342869, 2400046, 2352816, 2348031, 2293461, 2275703, 2261640, 2319817, 2338821, 2388739, 2418460, 2454143, 2391297, 2356380, 2258777, 2190920, 2162463, 2122475, 2070277, 1974740, 1933444, 1925512, 1832455, 1812502, 1864050, 1815018, 1725152, 1784671]
4219A784671q9200P8824l7953J3623J28259k5992J56490Q4040K22574K52092K16647
4208B784075K20915J49432J90309Q8171J37835Q2672q983l8029j98018j10030
4198C298349k64265j93477k46336j73405k30744k21501j99025l0652k00974o9226
4188A468744q3450j5912m2308j04751k0329J3126K9602R266N9850m0485R4472
4177A367825j60494q4740p6226M2876j37337m2126l0207Q705j02599K7678O3918
4166H77273r3021N3623q0332m9808P4717n4852k6034J1450m5030N3739l1838n1456
4154F38431M2302k7763l9500N589P8613k8969K0297o1501j3938k8550L7246k4154
4142E98103L3468k9371Q727p1199M5623J6803M76m6708l3316J20903j20101M8586
$$ y = [1784671, 1695471, 1774295, 1736342, 1749965, 1878224, 1852232, 2008722, 2092762, 2315336, 2567428, 2784075, 3004990, 3154422, 3344731, 3432902, 3570737, 3653409, 3644426, 3606397, 3408379, 3298349, 3034084, 2840607, 2594271, 2420866, 2190122, 1968621, 1769596, 1738944, 1537970, 1468744, 1385294, 1369382, 1327074, 1222323, 1201994, 1215120, 1244722, 1253988, 1313838, 1273353, 1367825, 1207331, 1122591, 1046365, 1089241, 951904, 909778, 879571, 888276, 785677, 813355, 877273, 784252, 837875, 757543, 707735, 782452, 727600, 701566, 713016, 667986, 721725, 689887, 638431, 680733, 652970, 613470, 619059, 697672, 668703, 689000, 627499, 613561, 585011, 622257, 598103, 631571, 602200, 610927, 539728, 585351, 602154, 602630, 555922, 522606, 643509, 523408, 571994]
4130E71994o274k3372q646l0053P2720k3852P658J5250o6654L7130p8327N0657
4118E18231m8489O6864q6729j2284j5771m1993Q9023j2447q4541P8404M747K3355
4106D78370L1357o4406J5248o3776J12292K5171m5853k2282M1458l7391K2600
4095D92788N86p0419K5203p9520J0454k6081n2788O185p047K4371K8532J3422
4083C65686l0748j5123n905k4483J14448n7637j6372k5250k076m2591j6618M3276
4071B86607R190L221O0122o0479P926K4609p1772R5804m4553j597n4644R430N7131
4058C20995j46071J3353J3769J518L764j9076K3682R6077p1780j8793n6188L9142
4046B00392K0854l9338J8912K5594q2047J740P4127r783l9401L4918m185m6745
$$ y = [571994, 565720, 542348, 533702, 503649, 576369, 552517, 560175, 575425, 508771, 545901, 467574, 518231, 469742, 536606, 449877, 437593, 421822, 379829, 468852, 456405, 371864, 450268, 455015, 478370, 509727, 445321, 460569, 396793, 509085, 534256, 488403, 466121, 507579, 470188, 492788, 493374, 422955, 448158, 368638, 379092, 353011, 300223, 306408, 299361, 323732, 352264, 365686, 334938, 319815, 313910, 289427, 403875, 346238, 329866, 304616, 302540, 259949, 243331, 286607, 295797, 299018, 359140, 298661, 306587, 331196, 259424, 355228, 310675, 309078, 254434, 263864, 320995, 174924, 188277, 202046, 203564, 207328, 188252, 211934, 308011, 236231, 217438, 161250, 200392, 221246, 181908, 200820, 226414, 144367, 146107, 220234, 210451, 171050, 205968, 201783, 155038]
4034A55038Q9880n8819L2642k2880j1843N1907j9978j0050l1252L0907n8257J7472
4022A64767L2511N3025k2467r4048J3948J14428n8106O9028K863J4791M439m12
4010B94767q139L1963o5779M8603m3309n7081k5343M1315J4312r3514K5361j4440
3998A48716k970L778L8945r2789Q1794j3380k0676N7221o04j258k3603P6036k1464
3985B29746m0409O294M9893q5309M6961m6575o7744N0232o46K724j9767M1324
3973A66724Q379o0278j9020R8473r7619k2506Q6312M4461j19254N5561k6792p728
3961A06713J9854k341J2837l3577l9728J2220n822M196o4236O9775k5477k6498
3949B7916k251J6257L3012j4313l2820J0769j025M0485L742m2531N8796n1931
$$ y = [155038, 244918, 186099, 218741, 195861, 184018, 235925, 215947, 205897, 174645, 205552, 147295, 164767, 197278, 250303, 227836, 133788, 147736, 262164, 204058, 273086, 275949, 290740, 295179, 294767, 286628, 318591, 252812, 301415, 258106, 201025, 175682, 216997, 231309, 137795, 163156, 148716, 145746, 149524, 188469, 95680, 177474, 164094, 143418, 200639, 200035, 198777, 175174, 251210, 229746, 189337, 195631, 245524, 160215, 207176, 160601, 92857, 143089, 142443, 145167, 125400, 166724, 175103, 114825, 95805, 194278, 96659, 74153, 160465, 204926, 85672, 141233, 114441, 106713, 126567, 124226, 137063, 103486, 63758, 75978, 70156, 74352, 10116, 79891, 54414, 27916, 25665, 41922, 74934, 60621, 27801, 38570, 37545, 78030, 81772, 39241, 98037, 46106]
3937D6106J0210J3222p4976Q9050r4994N4622j9350o6255O8559k8176J5050Q883
3925B1951M7437j03949L2571L2430j4213M328m0304j3097L7653J4970o321k5527
3913a2071m3805M088L2123P194j8272k1968l9244J4961K8949J2715m5664O8505
3901a2489p0528P2852J4891n2020L147k202O0569m1622N8653q6427k2276K795
3889g4657k9474J13630j39874O0592J1232M8650L5732o2668J44K9929k6877j1184
3877d4825j9934m2385O0654L5530n8760R4571j31439R6116m4602M9504k4027j9924
3865d9521J5243n5979N4853l8675N4439o5432m1765M1601k535M613J3827k0395
3853h9726R0447n2339j0048L906L2609k1115j4378K9370N1514j03805O7174q3767
$$ y = [46106, 56316, 69538, -5438, 83612, -11382, 43240, 23890, -42365, 26194, -1982, 13068, 21951, 69388, -34561, -1990, 30440, 16227, 20555, -19749, -32846, 4807, 19777, 13456, -12071, -55876, -51788, -19665, -12471, -30743, -52711, -91955, -76994, -48045, -35330, -80994, -12489, -83017, -10165, 4726, -47294, -44147, -46349, 14220, -27402, 31251, -55176, -77452, -74657, -104131, 9499, -130375, -69783, -58551, -9901, 25831, -36837, -36693, -6764, -33641, -44825, -64759, -107144, -46490, -10960, -69720, 24851, -106588, -10472, -55074, -5570, -29597, -49521, -34278, -90257, -35404, -74079, -19640, -85072, -126837, -85236, -87771, -83158, -69331, -89726, 721, -51618, -61666, -57760, -25151, -46266, -60644, -31274, 20240, -83565, -16391, -100158]
3841a00158O7568j50543J98766o6490k1017p085n120O9080j9135o2159L4941K1195
3829d0157j3268o9148L8390O205m8255K8344R4420o1888l1979J7869J3939O973
3817e8555j9322J5764J4555L057K437m1228k2348M3106n2683L9299Q969o2668
3805a29617N8292l848N9201n4330n2646J7272k066j1282O0757K5531r5853k3784
3793a52373Q0558r930M2931o5106L4113M4046j10175M5165N618M3292k9323J3658
3781e7526j3714o1071q385N2897M1409n2564J9692P1118j04723k0435K6668J03209
3769c425o2317J7499o1778j1379J3770P1438p6682P11K0867J1019P261J1164l6877
3756i8729j7739L6063J857K4895n1743P2997J2024o7763N7133l9468k3698k8352
$$ y = [-100158, -32590, -183133, 15633, -50857, -71874, -78959, -84079, -14999, -34134, -96293, -61352, -40157, -53425, -122573, -84183, -77978, -126233, -97889, -3469, -65357, -97336, -79467, -65528, -58555, -77877, -62113, -47558, -44501, -42064, -83292, -105640, -62534, -115217, -75918, -66949, -129617, -71325, -75173, -15972, -70302, -122948, -105676, -107742, -119024, -58267, -32736, -128589, -152373, -71815, -81745, -38814, -103920, -69807, -25761, -135936, -90771, -85153, -41861, -71184, -57526, -71240, -132311, -140696, -87799, -46390, -98954, -79262, -8144, -112867, -133302, -106634, -3425, -65742, -48243, -110021, -121400, -107630, -36192, -112874, -112163, -91296, -80277, -73016, -61852, -98729, -116468, -80405, -78548, -53653, -105396, -32399, -20375, -88138, -31005, -70473, -94171, -122523]
3744a22523M6970P2745q1210k8862M7529R81O3062r6283K6370K8535p9601N3687
3732f8600M8663o7763l124N667l3404O5061p0549j8505L5290K6802J4877j3615
3720g9200k8399o8806M6695J0959L0471l9947O8690k0807p294o757Q76K2024P299
3707f4196m0021N8022r6448Q5744j10512K4356N1413O719k3392L3931j1620L5043
3695e0961o0071k2998J8257J3931m8644O5565J7619o20p3192N9931l9470m7893
3683a68546R8472L4563q8391Q3379j8631l4866L1789q4518J10987K3805o8641
3672h0598m2146N9723R989L559l9832K7574M8533p7560o88Q88L0072J10l3864
3659i4240J2917J2765l3086p8386L1776N7507K5490K6331l3170r1178Q8339l0070
$$ y = [-122523, -75553, -2808, -84018, -112880, -65351, -64370, -1308, -97591, -71221, -42686, -122287, -68600, -19937, -87700, -90824, -85157, -118561, -53500, -124049, -142554, -107264, -80462, -65585, -79200, -107599, -176405, -129710, -118751, -88280, -128227, -59537, -80344, -87638, -94395, -93519, -71495, -64196, -104217, -46195, -142643, -56899, -167411, -143055, -91642, -84923, -108315, -74384, -86004, -50961, -111032, -134030, -115773, -101842, -150486, -84921, -67302, -67922, -141114, -81183, -120653, -168546, -70074, -35511, -123902, -40523, -59154, -94020, -62231, -146749, -35762, -11957, -80598, -122744, -63021, -53032, -49473, -89305, -61731, -13198, -90758, -91446, -90558, -60486, -60376, -94240, -81323, -68558, -101644, -180030, -148254, -90747, -65257, -38926, -72096, -163274, -74935, -105005]
3647a05005N7300o4328L425M7274p0702L8344J207K2121r7316M399M6584k0568
3635a37265P8052n5214M3014j05147P3848K6658k4179J9818j0270j60k3391M6193
3623f8043J6302l2159m1303Q8516m1411o293L8721m2653L5854m3054l3531O1184
3611f7870o5800N5560m7382P0408l0692o5126P29L4807O169L5840k638J3242j1681
3598g4434n0682K5904k36n6661J3071M2233K9735o9500M7015K6626q0602Q7300
3586f0231J9925l3351p1159L6464M7927n5835m3432J2861M0507K3215K2270q1175
3574a42014K6182J7898j8753L375K9329n5287Q6539n418m0700R616J3266p2146
3562a48113k312L5699L2792k2564m7923P8423j4175m8078Q051P1377n0119k386
$$ y = [-105005, -47705, -112033, -108608, -61334, -132036, -93692, -92485, -70364, -167680, -163281, -116697, -137265, -59213, -114427, -71413, -176560, -102712, -76054, -100233, -80415, -90685, -90845, -114236, -68043, -51741, -83900, -125203, -36687, -78098, -84391, -45670, -88323, -52469, -95523, -129054, -67870, -133670, -78110, -125492, -55084, -85776, -150902, -150173, -115366, -109197, -73357, -75995, -62753, -74434, -125116, -99212, -99448, -156109, -143038, -100805, -71070, -140570, -93555, -66929, -147531, -60231, -40306, -73657, -144816, -108352, -60425, -116260, -159692, -146831, -106324, -83109, -60839, -142014, -115832, -97934, -116687, -113312, -83983, -139270, -52731, -58149, -98849, -89233, -75967, -148113, -150425, -114726, -81934, -104498, -152421, -73998, -88173, -136251, -128200, -56823, -106942, -109328]
3550a09328l744O8465q6742M327O1131m3343j4619Q60L0005l8549k6187J01265
3538e6459l0042J714o3148P3224k9678J9149L7523n4325m6230N5228l1343M300
3526a20087J7693k8943M2924J2182n5970m705K7113L2347j5441j0716K1682l3942
3514a15863M8469k7849l3722L7450M07r3309O2934n4952O9087K0487o8767O2001
3502i3627p0212K1241O2693m188n2153O0409o100M1817l0720j7829J272l3158
3490a20555O544K8070q022j7415M1397o4355Q1638j25919N1450R4289n9333J5364
3478g6847l6822l5023M6981l9728L9447r462j0317k4536L6994K6435O4964j15354
3466a33268O3579j0512M2667k4465J7384J9833j02105L8768j9708K745M4820p220
$$ y = [-109328, -113072, -44607, -131349, -127022, -65891, -109234, -123853, -122993, -92988, -131537, -157724, -56459, -86501, -84787, -147935, -74711, -104389, -85240, -47717, -102042, -148272, -93044, -124387, -120087, -102394, -131337, -88413, -76231, -132201, -136906, -109793, -77446, -92887, -103603, -81921, -115863, -67394, -95243, -128965, -91515, -91108, -184417, -121483, -176435, -107348, -86861, -155628, -93627, -163839, -142598, -79905, -84093, -136246, -75837, -81937, -40120, -70840, -88669, -87397, -120555, -114011, -85941, -93963, -111378, -69981, -134336, -52698, -178617, -127167, -32878, -92211, -76847, -113669, -148692, -101711, -141439, -101992, -111454, -121771, -146307, -109313, -82878, -17914, -133268, -69689, -80201, -37534, -61999, -44615, -24782, -126887, -88119, -107827, -105082, -60262, -67482]
3454f7482q467k9740n81k7721J8141L0961p1396P1390j4690J3564m0113m1651
3442a67785J13906p7648N0326q287o1254J5855N105O8175N3238j62188P8851l7097
3430a28803J01829j54462R5491n2178M5020K1481J3916n3201k371O3202k8202
3419g8278l2662Q5730j02460K2252j9812N967K6994O485j25177J65968n8885M882
3407i8996j4799J8632l4356N3054j1779k0991K860m922j8688J6831Q923k5331
3395a29562N6285j5138O989r696j2725q154j7641J13540r2914M0457k9052l4270
3383a31881N2360m8738P5943l8132l5488M9608Q4088m0876J1549o4801N6533K4364
3371e471L0942N8066J2929J544j9214l4650r9927O325m626m2431K4031M6693K9750
$$ y = [-67482, -75949, -105689, -106270, -133991, -115850, -84889, -156285, -84895, -99585, -86021, -126134, -167785, -53879, -131527, -81201, -89488, -150742, -134887, -129782, -61607, -8369, -170557, -91706, -128803, -26974, -181436, -85945, -138123, -93103, -71622, -57706, -110907, -113278, -50076, -78278, -110940, -25210, -127670, -105418, -125230, -119263, -92269, -85784, -210961, -44993, -103878, -98996, -113795, -95163, -129519, -76465, -88244, -109235, -106375, -111297, -129985, -113154, -104231, -129562, -73277, -88415, -81426, -91122, -103847, -112001, -129642, -16102, -109016, -68559, -97611, -131881, -79521, -128259, -52316, -90448, -125936, -76328, 7760, -33116, -21567, -86368, -29835, -5471, 25471, 83537, 96466, 98010, 78796, 44146, -55781, -49456, -54082, -96513, -72482, -25789, 3961]
3358C961j41725K5660M4014O2800l5118J3280l0976J5900l8914k0185k0810r204
3346a31317M1892L443k9361K4651k511L2008J1880n5514l7116N3769J8635l2888
3334a02429K2261J3383r066j341k3376K2984J0225k3052L4336n0598J04683J0115
3322H125l2512j7915m798K8145O8258p3195L0279J96282P0999J22284k8754L8358
3310D05556r2888l0063o9702O519q5541j23993o8077J12655p8394k2892N4563
3299G743n9401Q105j8170J3129l3091Q1362k2999n2053R2794j24956P8781j19545
3287a48301O8402o1359P6115k3330L7080K6696m054k6356p8992R4012K8820m2353
3275e3620K0139J8733j0103m5015l4428l7057J04080l4741K9905m0378m3985R317
$$ y = [3961, -137764, -112104, -68090, -5290, -40408, -27128, -58104, -42204, -81118, -101303, -122113, -131317, -89425, -85982, -115343, -90692, -93203, -61195, -49315, -104829, -141945, -88176, -69541, -102429, -80168, -66785, -75851, -77192, -100568, -77584, -67359, -90411, -56075, -106673, -1990, 8125, -24387, -42302, -47100, -18955, 49303, -23892, 6387, 202669, 273668, 395952, 367198, 405556, 312668, 282605, 212903, 219422, 133881, 9888, -58189, 54466, -23928, -46820, 7743, -51658, -43553, -61723, -48594, -81685, -323, -23322, -75375, 17419, -107537, -28756, -148301, -79899, -141258, -65143, -88473, -51393, -24697, -28751, -55107, -134099, -40087, -11267, -53620, -33481, -14748, -24851, -69866, -104294, -141351, -37271, -72012, -42107, -82485, -126470, -117153]
3263a17153P9035o6450N6761J4162k0750k2629l8242m2019M1176O9524j09740
3252a56325N7343j5660m6977J00015p5040M5597m995K2263p377n6829L4517K6458
3240g7010j9778L9245R068K0932j30685O1073j4737O3066n8150L9822n4016M4088
3228g7082m1968l5559J9868P9911L4636j22107L4347J4284k3845K8920j1460L256
3216i6799n0519Q3996o0108M6754j6281M5002j12069P2301K1416o2363O7759m4449
3204a05360j6345N003L4818j7032K2411q127n5954M2356q146o1599l367P5942
3192i5400m334j4322l145Q562j3155M3439r819J5311n055l3826r996L0715K394
3179h8631q8855L3038K1265j1297K1764j9327L4198m2594J4269M6953l8730r3069
$$ y = [-117153, -38118, -104568, -47807, -33645, -54395, -77024, -115266, -157285, -116109, -46585, -156325, -98982, -114642, -161619, -61604, -136644, -91047, -96042, -73779, -81156, -137985, -103468, -77010, -96788, -57543, -48475, -27543, -158228, -97155, -111892, -48826, -106976, -67154, -121170, -77082, -119050, -154609, -134741, -54830, -20194, -142301, -107954, -93670, -117515, -88595, -100055, -96799, -147318, -63322, -123430, -76676, -92957, -47955, -160024, -87723, -66307, -128670, -60911, -105360, -121705, -116702, -81884, -98916, -76505, -84632, -140586, -98230, -106376, -167975, -171342, -95400, -99734, -114056, -117201, -108639, -121794, -78355, -88174, -72863, -77918, -111744, -121740, -91025, -88631, -177486, -144448, -123183, -134480, -112716, -132043, -97845, -140439, -126170, -79217, -117947, -211016]
3167b11016J17946n0618M7760l0370K1142n5666J1326P0149K2632n5802J4864
3156i7653n8164N8505K7623p4796j1587M2216M5603l7438P7977q7845k8147L0423
3144a13283l9568Q0029l8975m392N1034n8211n195M4267j7581P5321p4138J27
3132a00565O8086p5521k4757K0163r9011Q6717N3425o7043j2966L0375J3502L9885
3120f7710m9763K3215o102J0697n738J7270p7149m748J4539j53M7201n2428K4819
3107a26050l318j4896n202J4726l30m266J7943P0961m857q8381k5924Q5729l0527
3094a14392M0774o9427N2222Q583p979r637O6323K8703j30601L0657R4706m5222
3082e5290r7385O6151n1347M4367n8164O5996k1686l0104J3562J5546L6770j1851
$$ y = [-211016, -93070, -143688, -95928, -126298, -105156, -160822, -149496, -79347, -56715, -112517, -97653, -155817, -97312, -69689, -144485, -156072, -113856, -68253, -105691, -27714, -115559, -143706, -113283, -152851, -72822, -111797, -116189, -65155, -123366, -128561, -84294, -101875, -26554, -100692, -100565, -32479, -108000, -132757, -112594, -211605, -124888, -71463, -138506, -151472, -121097, -107595, -67710, -117473, -94258, -100360, -89663, -95401, -78131, -155280, -160028, -145489, -145642, -98441, -150869, -126050, -129368, -144264, -149466, -134740, -135070, -139336, -121393, -50432, -55289, -143670, -169594, -83865, -114392, -73618, -143045, -90823, -82240, -90219, -99856, -33533, -4830, -135431, -104774, -10068, -55290, -152675, -86524, -137871, -93504, -151668, -85672, -107358, -137462, -123900, -108354, -71584, -83435]
3070h3435r5418K7344K9625l7607O1333m9230K1822J15570j38958J4461J6465
3059a18028K5641N8856n0955K296j83968J19515O3898p6741L3522l4806O2866
3048i7904m358M1771r8248O5486l3165j9978m3626N2649R3976n0553p577J0205
3036i1322J6423l994m8667O5321l8723P108p198q0026M6879R675N831L2544N6631
3023b9518o2412j1648p1275K5264N9752j14478M0349O4063M0570p2614N6808k3102
3011i8241p3030N0929N9874m0199q378l6666J38R031j0381M1928m3365J2623K471
2998a33266R0175j12721J10961j9658n9283p2578N7029L3964o6363J02484L0260
2987c8996j10367N931j250J7252q20L9549j5534j8586J3894O2971m1996m9111
$$ y = [-83435, -178853, -151509, -121884, -159491, -98158, -147388, -125566, -9996, -148954, -134493, -118028, -92387, -33531, -84486, -82190, -266158, -146643, -82745, -159486, -125964, -160770, -97904, -102262, -60491, -158739, -93253, -126418, -146396, -190022, -137373, -43397, -93950, -101527, -91322, -74899, -78893, -127560, -62239, -100962, -93854, -101052, -181078, -134199, -124524, -118693, -86149, -29518, -91930, -103578, -174853, -149589, -89837, -204315, -163966, -99903, -59333, -131947, -75139, -98241, -171271, -120342, -60468, -100667, -109045, -145711, -145573, -136542, -146923, -104995, -148360, -135737, -133266, -43091, -155812, -44851, -64509, -123792, -196370, -139341, -105377, -171740, -69256, -38996, -149363, -143432, -144682, -127430, -128250, -88701, -104235, -122821, -108927, -45956, -87952, -137063]
2975a37063l5752j8068R9818l6296M3515J1880j0616m3351J5659M4085m4164K1146
2963h9207j9074m5471j2638K4340J4287O8587j7635q136j6730J3367o9535M5179
2951a12666J2146j6707L0257m0223p024J6559K6311k6681l8106N4663l2737N521
2939a28687M9815l3412j8712j4773Q2706j08897J0854L8635j039o2294P0460M4317
2927g1027l3435l034O3743k2890q9893N7293l8392j1290O9068m034q6441j8738
2915a89070K5451R6241o2450k9136K2430m5166J11346j9221J2306r095o5449O7044
2903h4769l4250J2992Q4805m3792l2352L557j0649M9040j34735Q9965l1285n066
2891a36539l2980L2228k4242L6944P1696n1616l9541R4354j12475L3908K3161
$$ y = [-137063, -172815, -190883, -91065, -127361, -83846, -71966, -82582, -125933, -110274, -66189, -110353, -89207, -108281, -153752, -166390, -142050, -127763, -59176, -76811, -84947, -101677, -88310, -157845, -112666, -100520, -117227, -86970, -127193, -134217, -117658, -91347, -118028, -156134, -101471, -134208, -128687, -78872, -112284, -130996, -145769, -63063, -171960, -161106, -122471, -123510, -185804, -115344, -71027, -104462, -107496, -43753, -66643, -156536, -99243, -137635, -148925, -79857, -83891, -170332, -189070, -163619, -67378, -129828, -158964, -136534, -181700, -70354, -89575, -77269, -86364, -151813, -84769, -119019, -106027, -21222, -65014, -97366, -93809, -104458, -55418, -190153, -100188, -131473, -136539, -169519, -137291, -161533, -124589, -52893, -104509, -144050, -49696, -162171, -128263, -105102]
2880a05102Q167n3394L0812M2562k5228m6965M0798k5534o210n2038N6814l0437
2868a65755M131N1633M2429q8231L3419M2267l0290m295Q2188n0880l8467j4576
2856a36427k4352Q2052o3765K8550k4912Q896K2399p087l289k3375k2309J9987
2844a43632J22654o6158l9208J0145l7979P8003j7732j8165j1493n0792L7319
2833a37038O61m660j6668Q1201j19022N1522J1119O212l9863M1538L6258l7814
2821a26554M2634l6271j0088j0177K0049q905K1739K5100j8313n8407M2911K6684
2809h9598n2262N2635r1443Q2966M7038l6226o134k5910m2100P4179j6540n937
2797a09332j5945R810J7908L3067j02416P2527l1822N1174m3774m4400K0135K9299
$$ y = [-105102, -96935, -150329, -119517, -76955, -102183, -149148, -108350, -133884, -140094, -192132, -135318, -165755, -161624, -109991, -67562, -155793, -122374, -80107, -110397, -114692, -32504, -83384, -121851, -136427, -160779, -78727, -142492, -113942, -138854, -129958, -107559, -114646, -117935, -141310, -163619, -143632, -20978, -87136, -126344, -116199, -154178, -76175, -93907, -112072, -123565, -174357, -137038, -136377, -141037, -157705, -76504, -195526, -144004, -132885, -126673, -166536, -124998, -88740, -126554, -83920, -120191, -130279, -140456, -120407, -129312, -107573, -82473, -100786, -159193, -116282, -89598, -141860, -89225, -180668, -97702, -50664, -86890, -93024, -118934, -161034, -86855, -103395, -109332, -125277, -115467, -97559, -64492, -166908, -94381, -126203, -75029, -118803, -163203, -143068, -113769]
2785a13769m3454L1724k3177M8332P488j4678M4903p1193l9367J4231P1079P540
2773h0341q0394P2530p0559M1024J06194p5326J2321j9087L5057l8138n3025q958
2761a58702J2605M5438o8097K6766K2248O2079l6192n1264J28150j47957N3779
2750a11147M0584l7715J6578l1281n9300J13485n5351L3925o23o0198N0136j3752
2738a14659j09791O0634M8068n611L8584l2768L7697l9284K2455o1821Q4766o2176
2726a33906j5361k0151L1127L6009L5190l8003n3194J5971K6401K8019J197m5644
2714a32345R76L9744P7L2013j5860n3396m1269N8495j1035o7762J49979j04278
2702a44661L1917j8870O2999o6067Q6302r4792M498M0325m8154N8640l4451M7894
$$ y = [-113769, -157223, -125499, -148676, -100344, -92856, -107534, -62631, -133824, -173191, -158960, -87881, -80341, -160735, -88205, -158764, -117740, -11546, -86872, -74551, -93638, -58581, -96719, -149744, -158702, -146097, -100659, -168756, -141990, -119742, -57663, -93855, -145119, -16969, -164926, -111147, -70563, -108278, -91700, -122981, -182281, -68796, -124147, -90222, -90845, -151043, -100907, -114659, -224450, -163816, -115748, -121359, -82775, -115543, -77846, -117130, -94675, -156496, -71730, -133906, -149267, -169418, -138291, -102282, -67092, -105095, -158289, -142318, -115917, -87898, -86701, -132345, -131369, -91625, -91548, -59535, -75395, -128791, -170060, -111565, -122600, -190362, -40383, -144661, -112744, -131614, -68615, -134682, -48380, -143172, -138674, -98349, -146503, -87863, -122314, -74420]
2690g4420j0227q1760K0889O9958r8552O6427k6782J1771j3455k9665O5241k8939
2678a29514Q8108K539p9635N7677q6979J9785J9478N625m201p8537K8410N5276
2666a01968j4226n396l94k1846N018M3327p0175M8608L7439l6772J4849L1854
2654f9682n8400L7176n9698k4351L1185Q2344j17646Q5805M0406n0599l4728L0405
2642a07783J4264o5946R9127p5852Q932K3705p014J0156n5717K7332k695L894
2630a27597l535Q715J0358O3069p8791J1618j0609J9902j4519J3575L5082k6953
2618i9685K7994j07924O8884J0743o9519L9111l3985N1053q956K2923l3207M0257
2606i2311j9898j3020L8895m2445l2905K5728o855K0556K1086n1652m137Q8627
$$ y = [-74420, -84647, -166407, -145518, -75560, -174112, -107685, -134467, -122696, -136151, -165816, -100575, -129514, -41406, -38867, -118502, -60825, -147804, -128019, -108541, -102916, -107117, -185654, -157244, -101968, -116194, -121590, -121984, -143830, -138812, -95485, -165660, -117052, -79613, -116385, -101536, -69682, -128082, -90906, -150604, -174955, -143770, -61426, -179072, -93267, -52861, -103460, -138188, -107783, -93519, -159465, -60338, -136190, -127258, -103553, -110567, -100411, -156128, -128796, -131491, -127597, -131132, -122417, -112059, -48990, -127781, -116163, -126772, -106870, -121389, -107814, -72732, -99685, -71691, -179615, -110731, -99988, -169507, -130396, -164381, -113328, -122284, -99361, -132568, -92311, -112209, -125229, -86334, -128779, -161684, -135956, -142811, -122255, -101169, -152821, -156958, -68331]
2594f8331o4711j0518O6023o0223j2203k3995K0770J4414Q273K8724n4200Q517
2582a47460K5412l8754N5192j8677K0221J6962K2031n895k7290m224J2070P1230
2570a9182j08193N3875r5367J06780m7174R600p481m4349k2535P1077N1721r6962
2558a48190K9518o1971N2175N9173p1491j4116L6355K5031n5269n8215O9975P2590
2546f4435m7926n5827O0165k5947o2076P7289k2483j5308R1861r7502L9767Q450
2534a13972k8385k3359J8053O7619m3209L4615Q624n1162q2732L9567J14246l8867
2522i8962q3861R3037n5862O9654m3746k3759P523L0879J5828k033p3557O3115
2510a01744n0764k2216L9187O8144j06769L249L3501M6076p872L16r669k6846
$$ y = [-68331, -133042, -143560, -77537, -137760, -149963, -173958, -153188, -138774, -130501, -101777, -155977, -147460, -122048, -160802, -105610, -124287, -104066, -87104, -65073, -70968, -98258, -102482, -90412, -19182, -127375, -73500, -168867, -62087, -109261, -99661, -107142, -151491, -174026, -102949, -51228, -148190, -118672, -180643, -128468, -69295, -140786, -154902, -118547, -93516, -148785, -207000, -137025, -64435, -112361, -168188, -108023, -133970, -196046, -118757, -141240, -156548, -64687, -162189, -122422, -113972, -142357, -165716, -147663, -80044, -123253, -88638, -80014, -131176, -213908, -174341, -60095, -98962, -182823, -89786, -145648, -75994, -119740, -143499, -135976, -105097, -89269, -91302, -164859, -101744, -152508, -174724, -135537, -67393, -174162, -170913, -137412, -91336, -99208, -98892, -108561, -135407]
2498a35407O0055q3813P2952m0472N7794J6067q9737J6863m8554R8521k7639L7485
2486f5885m6570N4211r6305L1420K4547o3777R0966l6508r530M0283m2020k3194
2474a42362L2003N2396o5798K5628p9948M10p429P2481N582k5102l4035O1884
2462a04290j8977k9467J2715l7884j9854J16445j02485O8782k0514O2946p0349
2451a42932N8446q489k2765k6160K9790p8186P7238o4916J04443l5807m4288O0828
2439i2798k1408J1852q796L2655N638o3046O7406l8280k4101k2385L0754K1010
2427a01499l4316p706K1672J1104j7936m3589K5809K0633L158K1207j8958J78
2415a20243m0861L4617N2436o2476L777K9246p860O9183J9396o5743n1001M3712
$$ y = [-135407, -75352, -159165, -86213, -126685, -68891, -52824, -142561, -125698, -174252, -75731, -103370, -65885, -112455, -58244, -154549, -123129, -98582, -162359, -71393, -107901, -117431, -77148, -119168, -142362, -110359, -57963, -123761, -98133, -178081, -177671, -185100, -112619, -107037, -132139, -166174, -104290, -123267, -152734, -140019, -177903, -197757, -81312, -183797, -115015, -135529, -72583, -142932, -84486, -92975, -115740, -141900, -112110, -190296, -113058, -177974, -73531, -109338, -153626, -92798, -114206, -102354, -111150, -78495, -72857, -135903, -68497, -106777, -130878, -153263, -122509, -101499, -135815, -143521, -121849, -110745, -128681, -172270, -146461, -125828, -122670, -101463, -120421, -120243, -161104, -126487, -74051, -136527, -132750, -103504, -111364, -42181, -22785, -88528, -139529, -95817]
2403i5817j2300L3057l3118p9689O0717k5347j0921O5216p2359L9710m6744M3595
2391a34000k1059N1909q3161P1202O7532p0832K7344J0134m4191j1002M5754k5362
2379a15732K1110Q0191j05047K7628J4136j05062M2063Q5475q8253L0099K5685
2368h7707k2157l5758K7643l1652O7158o505k2190j9192M3402K7659j9546q9257
2356a68102j507P1562o7958N7358k56n0466M8499L3049k5970L2523n4416N6184
2344f9500p120k8005m805K0729k7572l3459J0558L8614N1767p0493j1291L6193
2332i4384O739m0433N6345M1818j15402M7141m2238l4176P4905k6316M3221j8500
2320a01280m6000J8606K0149L150K7040p0941O2775l2687M5253m8230L2337n5734
$$ y = [-95817, -108117, -75060, -108178, -187867, -127150, -152497, -163418, -98202, -170561, -130851, -177595, -134000, -155059, -103150, -186311, -115109, -47577, -118409, -91065, -80931, -125122, -136124, -90370, -115732, -94622, -14431, -119478, -91850, -77714, -182776, -140713, -55238, -143491, -113392, -87707, -109864, -145622, -117979, -149631, -82473, -88978, -111168, -130360, -86958, -59299, -78845, -168102, -169609, -98047, -166005, -108647, -108903, -159369, -110870, -77821, -103791, -71268, -125684, -69500, -76620, -104625, -109430, -88701, -116273, -149732, -139174, -100560, -48793, -119286, -130577, -94384, -87645, -128078, -71733, -29915, -145317, -98176, -140414, -174590, -99685, -126001, -82780, -101280, -147280, -128674, -108525, -105375, -78335, -149276, -86501, -119188, -73935, -122165, -89828, -145562]
2308a45562l8886P6452l3727r165P0147j7350m2056K402l4175O5177j3041K4862
2296i4922p2452J5659P4700n1106j3P853l4204M0011l0804J8827l544K04K5246
2283a04545j8263L5399J2225m4144K7467k1520O4104p2839K9586K6204q0878k5909
2271a73113P3606o7825N0561p30N289l0781m7111M1641N4062l74n8444j0788M8060
2258a15947o6429J0865J42696r1234o7060J00325J737j05694J24803j15125J40951
2247d0112p5835l746m2957M1907N2941r9294N118M8443n3717J20718o2482K39
2235a08777n9774K0255M4583M5254l5860j5834k8133k0463K4954K1057j2903L2379
2223i3262o040q943K3212q8185O5806m0164J1921L1319K7783j1106k2287j9745
$$ y = [-145562, -184448, -107996, -141723, -150888, -80741, -98091, -140147, -137745, -171920, -106743, -119784, -94922, -167374, -151715, -77015, -128121, -128134, -120281, -154485, -114474, -145278, -126451, -129995, -129791, -104545, -122808, -87409, -75184, -119328, -91861, -113381, -49277, -122116, -92530, -66326, -147204, -173113, -99507, -167332, -116771, -117501, -112212, -142993, -190104, -148463, -94401, -94775, -153219, -164007, -115947, -182376, -171511, -28815, -120049, -187109, -86784, -85047, -190741, -65938, -181063, -40112, -115947, -119693, -162650, -120743, -67802, -167096, -161978, -113535, -167252, -46534, -109016, -108777, -168551, -148296, -103713, -58459, -94319, -110153, -138286, -158749, -133795, -112738, -125641, -93262, -99302, -108245, -85033, -173218, -107412, -147576, -135655, -104336, -76553, -87659, -109946, -129691]
2211a29691M281J2820K3692k8064L119j0685J0433j1489r415P833p848M6619j2086
2198a00481o3640j842J0782P0413n284Q445j4251k0251K7982j7950N0686q9074
2186a44465L6739m217M8244r427m8316j7028L7609j1619k3174K6685K2375m7571
2174a34165k4628O6344J3094p8444J32983n3747j44454J31320n4178M7800m6398
2163a44473p9992J82431r6897Q1253n1868r7j1194L6486l9444l1146Q4073o8231
2151a39099K9440L0809L6624m4568k0317J7749m720m9631K0185J0302p9998J02135
2139i1089l1838P873l4819K7002j2077N1806p87m1117M8406o5055j0361Q3368
2127f8688n0673K0559m0242R7391r9765J4394P048K8027k9057K8685j6289n5842
$$ y = [-129691, -125410, -112590, -88898, -116962, -113843, -124528, -114095, -125584, -134999, -127166, -135014, -88395, -100481, -164121, -165963, -155181, -84768, -90052, -81607, -95858, -116109, -88127, -106077, -55391, -144465, -107726, -111943, -63699, -73126, -121442, -138470, -100861, -112480, -135654, -108969, -86594, -134165, -158793, -92449, -79355, -157799, -24816, -78563, -223017, -91697, -145875, -98075, -144473, -224465, -42034, -138931, -57678, -109546, -109643, -120837, -84351, -123795, -154941, -70868, -139099, -109659, -78850, -42226, -86794, -107111, -89362, -94082, -143713, -123528, -113226, -193224, -91089, -122927, -115054, -149873, -122871, -134948, -83142, -83929, -125046, -76640, -141695, -152056, -68688, -119361, -98802, -139044, -41653, -141418, -127024, -119976, -91949, -121006, -92321, -108610, -164452]
2115a64452K8705J198k1633j8896J5570L3702N6388k2875P16n3449J5726M5093
2103h4207l6243l8610O8223N482m164n5251k678M5540m2246k9934P1393k0073
2091a22768m9460N1725J2743p875R95K7049o9304p742M9027L3805L600m1494j286
2078a20985k3470P9766l7057j6636K6591L3778o2070j0612k6565K9601l6132P2312
2066i1479l1458J8029l8148M1952n5363J03127l8810p0617M9740l3558n630N5418
2054i6797m1796R9531m5935P2115j15913k3217N3442o1628N2688o4852K3087k321
2042a51596L9497j0567q158K8945k1864M95q060L4153l2780k6009J12962q9335
2030a32317k448m3030J22310r6847N8058n4585N1618N421l0904K6633J7144o870
$$ y = [-164452, -135747, -134549, -156182, -175078, -159508, -125806, -69418, -92293, -91577, -145026, -129300, -84207, -120450, -159060, -90837, -85355, -89519, -144770, -147448, -101908, -144154, -174088, -102695, -122768, -172228, -120503, -107760, -115635, -114640, -87591, -156895, -164637, -115610, -81805, -78205, -119699, -120985, -144455, -64689, -101746, -118382, -91791, -58013, -120083, -130695, -157260, -127659, -163791, -91479, -122937, -104908, -143056, -101104, -156467, -53340, -92150, -162767, -113027, -146585, -152215, -96797, -138593, -39062, -84997, -12882, -128795, -152012, -98570, -160198, -107510, -172362, -149275, -151596, -112099, -122666, -130824, -101879, -123743, -123248, -131308, -97155, -129935, -155944, -42982, -132317, -134765, -177795, -55485, -152332, -94274, -148859, -97241, -91820, -122724, -96091, -78947, -85817]
2018h5817k2050j2636k9755L862M3597l3963P0618o2673L3820J4718n4505j8872
2006a53656L6603Q5472o5935k6021O674M0465k5642O1346r8711O6329k3002j6565
1994a12643n6236M0748O3122l7835k4405p4979N6815M2093p2358Q2953l1627l5256
1982a59608J00735m6743J7081r1696J02820l4692J4295k7962N6674q6688K2495
1971a33289O0500k2794l3401P7706j09381o456L4083k1962P4636k9053k4704O6565
1959f7550l5928j9567K624M557k9236m9657L8549J4423J4443P171l815M6476q9265
1946a66775O9507p4835L7076l432K8790n8145J7063Q207P0152K974n6839m9096
1934a75353P9570j8919o329l419k4294J3747O9267n7580K6369o9675O429O904
$$ y = [-85817, -107867, -120503, -150258, -146396, -102799, -136762, -66144, -128817, -94997, -80279, -134784, -153656, -117053, -31581, -97516, -123537, -116863, -76398, -102040, -40694, -139405, -73076, -96078, -112643, -168879, -128131, -65009, -102844, -127249, -202228, -145413, -103320, -175678, -92725, -124352, -159608, -58873, -105616, -88535, -180231, -77411, -112103, -97808, -125770, -69096, -155784, -133289, -72789, -95583, -128984, -51278, -160659, -167115, -133032, -154994, -80358, -109411, -134115, -67550, -103478, -123045, -120421, -115864, -145100, -194757, -156208, -141785, -127342, -120171, -123986, -77510, -166775, -97268, -172103, -135027, -138459, -109669, -167814, -150751, -142544, -72392, -69418, -126257, -175353, -95783, -114702, -121031, -124450, -148744, -134997, -65730, -123310, -96941, -166616, -160187, -153283]
1922a53283L6051k2237n1807Q0549p0828Q1471P4632p6361L1591r4068K4601K2591
1910a17098m683N380J0711J5285R557m6151M1043m1241N5692j1688l0807L193
1898a10807q7968J45138q6313K0189Q9002j16578L768J2222M0829q0371P0289
1887a00600n1685M2826k3818J2435O3655r4416J0774L9015M0268k2571m8772J5541
1875a17348k7290M6005m1356L8009m7067N0763o0954O8568k3101M9617j18523
1864a82677N24J66085q7683j03259P5019Q5951q8629m0685P0980n1280K8723Q783
1852a18148k8446P5361n6613J30175j65078R1667n1736N710k166l6382N6971j8836
1840a17521k3807Q1678q5534P027J0367K625J6411K1243k1974L5681n3098P163
$$ y = [-153283, -117232, -139469, -191276, -110727, -181555, -100084, -25452, -101813, -70222, -164290, -139689, -117098, -121781, -116401, -105690, -90405, -80848, -126999, -85956, -127197, -71505, -83193, -114000, -110807, -198775, -53637, -139950, -119761, -30759, -147337, -143569, -131347, -90518, -170889, -100600, -152285, -109459, -133277, -120842, -57187, -151603, -140829, -101814, -61546, -84117, -132889, -117348, -144638, -98633, -139989, -101980, -149047, -98284, -159238, -90670, -113771, -64154, -182677, -182153, -16068, -103751, -207010, -131991, -46040, -134669, -175354, -104374, -155654, -126931, -118148, -146594, -71233, -127846, 2329, -162749, -71082, -122818, -117108, -119274, -155656, -98685, -117521, -141328, -59650, -145184, -138157, -127790, -125165, -108754, -87511, -109485, -73804, -126902, -119739]
1828a19739M8679p1983J05560o4838M5817j10828O8304j2487M7514j02271l103
1817a69375L1864N596L0420k2383j9097k7901N4276N0012k0005o262k2067L694
1805a11228n0231L8639l620k8597O377l6507J39769k9353M891m0349m4548L5434
1793a19323J9578M7875n1028j8646n1795R7502l6927l8901P9543o2180L6714k4863
1781a22451j459K2556q5375P3622J6491j8389K6047m2183J0836l45o0495O9691
1769a11454K092j3321M4416k5405L0970m6962j9975Q3371k9408m0076j0860j0276
1757a46888P3517r0478K8334J8719r509j3950l1089J9630L0425L3436k6406l6577
1745a50836O8867l8334j7667Q644l3296O7404k8234N8240j61470J40465r2338
$$ y = [-119739, -71060, -143043, -37483, -102321, -56504, -167332, -99028, -111515, -64001, -166272, -169375, -137511, -131915, -101495, -123878, -142975, -170876, -116600, -66588, -86593, -92855, -114922, -111228, -161459, -122820, -126440, -155037, -148660, -185167, -45398, -74751, -69860, -110209, -154757, -119323, -99745, -51870, -102898, -121544, -173339, -75837, -112764, -151665, -72122, -134302, -97588, -122451, -123910, -101354, -186729, -113107, -96616, -115005, -88958, -131141, -120305, -120650, -181145, -111454, -109362, -122683, -78267, -103672, -72702, -119664, -139639, -56268, -85676, -125752, -136612, -146888, -73371, -163849, -135515, -116796, -126305, -140255, -171344, -151714, -121289, -87853, -114259, -150836, -81969, -120303, -137970, -129326, -162622, -95218, -123452, -65212, -226682, -86217, -178555]
1734a78555N3014m789m851k9213M4364l7772K4748J3780Q462l1583K2183J0039
1722a10173m6682O3581j0456p5160R6162o2604R6909n9314k5917O9040k2422m2141
1710a29177n3236J10673r7407L4006M8367l0814P84P3209n4921k7668J3420n24
1698a13288K7514o2409O4689r9156P9266l5736P666k7095K9046L2722K7502k3305
1686i2584P31k1860k68L7584j2231k9906L1394p3285L0080K1275m8732R7183o0069
1673a20688M3473p4478K3135L1115j8277j6867N3384n4115O3211o9669M073M255
1661a31448l7591M6238k0560J3530k261L3051o2880M9249k26l5262J9150n730
1649a34740L1271J0112l0755m4832L0707J4355J879j8926j9529M0299k2858M768
$$ y = [-178555, -125541, -130330, -135181, -164394, -120030, -157802, -133054, -119274, -110812, -142395, -120212, -110173, -156855, -93274, -103730, -178890, -82728, -145332, -48423, -107737, -133654, -64614, -87036, -129177, -182413, -71740, -169147, -135141, -86774, -117588, -116804, -43595, -98516, -126184, -112764, -113288, -85774, -148183, -83494, -182650, -103384, -139120, -131454, -158549, -129503, -96781, -69279, -92584, -91853, -113713, -113981, -76397, -88628, -118534, -87140, -160425, -130345, -109070, -157802, -60619, -120688, -77215, -151693, -128558, -97443, -115720, -132587, -79203, -133318, -70107, -139776, -135703, -131448, -169039, -122801, -143361, -129831, -132092, -99041, -161921, -112672, -112898, -148160, -129010, -134740, -103469, -93357, -124112, -168944, -138237, -123882, -122003, -140929, -160458, -120159, -143017, -138249]
1637a38249l561n9787l2666J08835j5627m054K3988J26082j04485p7890J6068
1626a61346Q4360k9844j8676K6716K7591p7390J4508O441L5479l5209L9281L3429
1614e4660m6795N8284j08514P8445k6649k3031J9520j6960j1911K3057o3747L1322
1602a41639M3039R999k0717j0528K6999p4568O6297j1907o1083J20434k4517j19440
1590a97631P4808L8109o2015P7521q480R253n1145l0693Q4131o2561L6330m0974
1578a33347L2560K0518K0033j5737j3624l1720J3063m016o561k0349J0080m4091
1566a73191O1044J7310J3271m7364L7569p3355J9316L9670p0685N1141M1228j9155
1554a03201l5111J0223N145r914J9005o668J2769m419n5049M8210n3214O4636
$$ y = [-138249, -141810, -201597, -234263, -125428, -141055, -145109, -121121, 4961, -99524, -177414, -161346, -76986, -106830, -125506, -98790, -71199, -148589, -134081, -127640, -92161, -127370, -88089, -54660, -101455, -43171, -151685, -73240, -99889, -122920, -103400, -120360, -132271, -109214, -172961, -141639, -98600, -88601, -109318, -119846, -92847, -167415, -101118, -113025, -174108, -53674, -78191, -197631, -122823, -84714, -146729, -69208, -77688, -68435, -119580, -150273, -66142, -128703, -92373, -133347, -100787, -80269, -60236, -75973, -89597, -121317, -108254, -112270, -118831, -139180, -129100, -173191, -112147, -94837, -81566, -128930, -91361, -164716, -145400, -105730, -176415, -125274, -84046, -103201, -138312, -128089, -122944, -132858, -113853, -120521, -107752, -112171, -167220, -119010, -172224, -107588]
1542a07588J4152j1865J8404k0376m6Q670j7853Q480o6971Q1679q3723M2657K577
1529a31803j6892K7907p860M0018j7785L5970l0j08964j0687N9697j9822M4858
1517a05393j6143q303l2049p413Q451P4146l4410k8032j1151j1001P991N3209
1505a10098j7875k3894n235K8786J9419k2273k3665N9844j2264K411K681l7999
1493a40162P4508m2003m7252p565L6211j3975M7275K1971k7852k6206P4290n4892
1481a05652m537k4392r099j4496N8851r3414Q4512k8680l647L5524n6612N6438
1469a05204l9843J1674P688n4995M1324M5233n1056R1170r9489O2017L6957j04437
1457a58961O3704l7320L8193l4387K2583n9779O6232L3228o7308l6639K0020L7072
$$ y = [-107588, -93436, -105301, -86897, -107273, -107319, -98649, -116502, -108022, -174993, -93314, -177037, -134380, -131803, -148695, -120788, -128648, -88630, -106415, -70445, -70475, -179439, -190126, -130429, -150251, -105393, -121536, -129839, -161888, -169301, -160850, -86704, -121114, -149146, -160297, -171298, -163307, -110098, -127973, -151867, -157102, -128316, -108897, -131170, -154835, -94991, -107255, -104844, -102163, -140162, -65654, -107657, -154909, -162474, -126263, -140238, -92963, -70992, -98844, -125050, -50760, -105652, -110189, -134581, -143680, -158176, -99325, -192739, -108227, -136907, -140554, -105030, -161642, -105204, -145047, -133373, -125685, -180680, -139356, -94123, -145179, -54009, -153498, -91481, -54524, -158961, -95257, -132577, -94384, -128771, -106188, -165967, -99735, -66507, -133815, -170454, -150434, -113362]
1445a13362m0678N0574N0976q4757J5700R831k6774K6121k3733O7813q8178M0198
1433a16269o7121L3069r026N3995j2592m5447p36q851l853O2555J255m3822M4340
1420a12503J011M4846q2624p072K0357Q473J1239j753O921m6750K5704P1223r9362
1407a60290l1947l5518O7145L3702M701L5646m7741k2235m01P4407j21214L9375
1395a64370R3465k2054L0K342q4256Q0558l3537k4871M18K6457n4376Q8328j5719
1382a07585Q830M1210q1614M7921k1021j3884Q9382k9422l1133K5397m641o7163
1370a43723k7443O9168j5385K2434l2500N3553l9982J6036l4048l274J14121r7848
1358a18891N6520n0398J8841n2596K9203K9738j9358j1015q007L9596p9879l5097
$$ y = [-113362, -154040, -103466, -52490, -137247, -121547, -111716, -138490, -112369, -136102, -68289, -156467, -116269, -183390, -150321, -159347, -105352, -117944, -163391, -164127, -172978, -176831, -114276, -113021, -156843, -112503, -111492, -66646, -149270, -156342, -135985, -127512, -116273, -118026, -111105, -157855, -132151, -60928, -160290, -192237, -227755, -160610, -126908, -122207, -86561, -134302, -156537, -156938, -82531, -203745, -164370, -70905, -92959, -92929, -90587, -174843, -94285, -127822, -152693, -152275, -125818, -180194, -91866, -107585, -98755, -57545, -139159, -91238, -112259, -126143, -36761, -66183, -97316, -71919, -76560, -143723, -171166, -101998, -117383, -94949, -127449, -73896, -113878, -97842, -131890, -135164, -21043, -118891, -62371, -112769, -93928, -146524, -117321, -87583, -106941, -117956, -125963, -86367, -166246, -201343]
1346b01343o325J29952o3414R474k8266N4223K5802p3102N1640l6376O0625o0832
1334a37942Q9692o3385p683m2949j4617M5039O584M8772l483o5486M3073N0315
1322e2070m9184L175l9331n0639J4358P078L4777J122K2636k5632l9567O9474
1310a03803j9028q1606P2360J6991O7761p9895j4709J5821K6462r4028M1862O2740
1298h9072m8760p342L2819m6228L8719j5825M6822k3781j08918J42500m9125J5593
1286a12598n382K0183J5639m1798K8346o1044J25026p3476k3540Q790l736N2213
1274g1377m0350M0852M5570l3800n0437l9623P1475q8578J23073n8152Q329j7310
1262a10328k8598j1158N7963n7681l4605J15018q1131J3349L2624k957J112j9453
$$ y = [-201343, -207668, -77716, -141130, -131656, -159922, -105699, -79897, -152999, -101359, -137735, -77110, -137942, -48250, -111635, -119318, -162267, -176884, -131845, -125261, -76489, -79972, -145458, -102385, -52070, -101254, -98079, -137410, -188049, -173691, -166613, -131836, -130714, -108078, -133710, -173277, -103803, -122831, -204437, -132077, -115086, -47325, -127220, -141929, -126108, -99646, -193674, -151812, -89072, -137832, -145174, -112355, -158583, -119864, -135689, -88867, -112648, -221566, -79066, -128191, -112598, -117980, -97797, -82158, -123956, -95610, -156654, -31628, -105104, -128644, -119854, -123590, -71377, -111727, -70875, -25305, -59105, -109542, -149165, -77690, -166268, -43195, -101347, -93018, -110328, -138926, -150084, -92121, -149802, -184407, -69389, -150520, -137171, -104547, -107504, -106392, -125845]
1250a25845M0822j3244r1552K8463R3620L849p8838M7895j8436o6345N7462L124
1238a19025P05K3427q3768J00972l4128j3830k2091l1932N1040J3022j0403L5706
1226i0305K7853n9526K0157k3317k0790J4393j2385o11j5595M8045M9813j04514
1214a66782J9918J07523j01289j0642K0537p1533J19272L275q5226K1651J1994
1203a31302K9345l1993k0369N5002o6603K3151P1777p5634j3718M8514K1459n5783
1191a46154k3637R5301l0763K1624K911o9234K9681O9951o0230J9533L3356m5161
1179a02822K4099K4405q7928j5216P3708o3704N6985r2234N7927o2376J4064J11798
$$ y = [-125845, -85023, -98267, -189819, -161356, -67736, -63887, -142725, -94830, -113266, -179611, -122149, -119025, -118320, -94893, -178661, -77689, -111817, -125647, -147738, -179670, -128630, -115608, -126011, -90305, -62452, -121978, -101821, -125138, -145928, -131535, -143920, -144531, -160126, -112081, -62268, -166782, -146864, -39341, -140630, -151272, -130735, -202268, -82996, -79721, -164947, -143296, -131302, -101957, -133950, -154319, -99317, -165920, -142769, -70992, -146626, -160344, -111830, -90371, -146154, -169791, -74490, -105253, -83629, -80718, -149952, -120271, -50320, -110550, -91017, -57661, -102822, -78723, -54318, -142246, -157462, -83754, -147458, -90473, -182707, -124780, -187156, -173092, -61294]
$$ [...]
##END NTUPLES=NMR SPECTRUM
##END=
