##TITLE=abcd
##JCAMPDX= 6.0         $$ Bruker NMR JCAMP-DX V2.0
##DATA TYPE= NMR SPECTRUM
##DATA CLASS= NTUPLES
##ORIGIN= UXNMR, Bruker Analytische Messtechnik GmbH
##OWNER= root
$$ XWIN-NMR		Version 3.5
$$ Mon Apr 13 17:59:12 2026 Russian Standard Time (UT+4h)  servis@DPX200
##.OBSERVE FREQUENCY= 200.131235884673
##.OBSERVE NUCLEUS= ^1H
##.ACQUISITION MODE= SIMULTANEOUS
##.ACQUISITION SCHEME= undefined
##.AVERAGES= 32
##.DIGITISER RES= 18
##SPECTROMETER/DATA SYSTEM= spect
##.PULSE SEQUENCE= zg
##.SOLVENT NAME= CDCl3
##.SHIFT REFERENCE= (INTERNAL, CDCl3, 0, 16.4885)
##AUDIT TRAIL= $$ (NUMBER, WHEN, WHO, WHERE, WHAT)
$$ ##TITLE= Audit trail, XWIN-NMR		Version 3.5
$$ ##JCAMPDX= 5.01
$$ ##ORIGIN= Bruker BioSpin GmbH
$$ ##OWNER= servis
$$ F:\spectra/data/av/nmr/H1/1/pdata/1/auditp.txt
$$ ##AUDIT TRAIL=  $$ (NUMBER, WHEN, WHO, WHERE, WHAT)
(   1,<2026-04-13 17:58:44.39 +0400>,<servis>,<DPX200>,
      <created by zg, POWCHK disabled, PULCHK disabled
       configuration hash MD5:
       00 E9 B6 7A A2 85 ED C7 34 08 36 98 17 FE 4E 26
       data hash MD5: 32K
       41 DA 4E D6 74 7B 8C A4 D1 34 B9 00 52 D6 A6 31>)
(   2,<2026-04-13 17:58:46.34 +0400>,<servis>,<DPX200>,
      <Start of raw data processing
       efp BC_mod = 2 LB = 0.05 FT_mod = 6 PKNL = 1 PHC0 = -264.2274 PHC1 = 3.101563 SI = 16K 
       data hash MD5: 16K
       FE B2 6F 35 9B 5A E9 C6 55 6C B0 98 22 90 FC 9A>)
$$ ##END=
$$ 
$$ hash MD5
$$ 17 B5 5A AF DF AE 4B 43 AA C8 84 3E 61 05 8A 70
##$RELAX= 
##$RELAX= 
##$RELAX= 
##$RELAX= 
##$RELAX= 
##$RELAX= 
##$RELAX= 
##$RELAX= 
$$ Bruker specific parameters
$$ --------------------------
##$DU= <F:\spectra>
##$EXPNO= 1
##$NAME= <H1>
##$PROCNO= 1
##$TYPE= <nmr>
##$USER= <av>
##$AMP= (0..31)
100 100 100 100 100 100 100 100 100 100 100 100 100 100 100 100 100 100 
100 100 100 100 100 100 100 100 100 100 100 100 100 100 
##$AQSEQ= 0
##$AQ_mod= 1
##$AUNM= <au_zg>
##$AUTOPOS= <>
##$BF1= 200.13
##$BF2= 200.13
##$BF3= 200.13
##$BF4= 200.13
##$BF5= 500.13
##$BF6= 500.13
##$BF7= 500.13
##$BF8= 500.13
##$BYTORDA= 1
##$CFDGTYP= 0
##$CFRGTYP= 5
##$CHEMSTR= <none>
##$CNST= (0..31)
1 1 145 1 1 1 1 1 1 1 1 1 1 1 1 1 1 1 1 1 1 1 1 1 1 1 1 1 1 1 1 1 
##$CPDPRG= <>
##$CPDPRG1= <>
##$CPDPRG2= <>
##$CPDPRG3= <>
##$CPDPRG4= <mlev>
##$CPDPRG5= <mlev>
##$CPDPRG6= <mlev>
##$CPDPRG7= <mlev>
##$CPDPRG8= <mlev>
##$CPDPRGB= <>
##$CPDPRGT= <>
##$D= (0..31)
0 2 0 0 0 0 0 0 0 0.06 0 0 0 0 0 0 0.0002 0 0 0 0 0 0 0 0 0 0 0 0 0 0 
0 
##$DATE= 1776088723
##$DBL= (0..7)
120 120 120 120 120 120 120 120 
##$DBP= (0..7)
150 150 150 150 150 150 150 150 
##$DBP07= 0
##$DBPNAM0= <>
##$DBPNAM1= <>
##$DBPNAM2= <>
##$DBPNAM3= <>
##$DBPNAM4= <>
##$DBPNAM5= <>
##$DBPNAM6= <>
##$DBPNAM7= <>
##$DBPOAL= (0..7)
0.5 0.5 0.5 0.5 0.5 0.5 0.5 0.5 
##$DBPOFFS= (0..7)
0 0 0 0 0 0 0 0 
##$DE= 6
##$DECBNUC= <off>
##$DECIM= 32
##$DECNUC= <off>
##$DECSTAT= 4
##$DIGMOD= 1
##$DIGTYP= 9
##$DL= (0..7)
0 120 120 120 120 120 120 120 
##$DP= (0..7)
150 150 150 150 150 150 150 150 
##$DP07= 0
##$DPNAME0= <>
$$ [...]
##$SUBNAM4= <"">
##$SUBNAM5= <"">
##$SUBNAM6= <"">
##$SUBNAM7= <"">
##$SUBNAM8= <"">
##$SUBNAM9= <"">
##$SW= 20.6817932712277
##$SWIBOX= (0..15)
0 0 3 0 0 0 0 0 0 0 0 0 0 0 0 0 
##$SW_h= 4139.07284768212
##$TD= 32768
##$TD0= 1
##$TE= 0
##$TE2= 300
##$TE3= 300
##$TEG= 300
##$TL= (0..7)
0 120 120 120 120 120 120 120 
##$TP= (0..7)
150 150 150 150 150 150 150 150 
##$TP07= 0
##$TPNAME0= <>
##$TPNAME1= <>
##$TPNAME2= <>
##$TPNAME3= <>
##$TPNAME4= <>
##$TPNAME5= <>
##$TPNAME6= <>
##$TPNAME7= <>
##$TPOAL= (0..7)
0.5 0.5 0.5 0.5 0.5 0.5 0.5 0.5 
##$TPOFFS= (0..7)
0 0 0 0 0 0 0 0 
##$TUNHIN= 0
##$TUNHOUT= 0
##$TUNXOUT= 0
##$USERA1= <user>
##$USERA2= <user>
##$USERA3= <user>
##$USERA4= <user>
##$USERA5= <user>
##$V9= 5
##$VALIST= <valist>
##$VCLIST= <CCCCCCCCCCCCCCC>
##$VD= 0
##$VDLIST= <DDDDDDDDDDDDDDD>
##$VPLIST= <PPPPPPPPPPPPPPP>
##$VTLIST= <TTTTTTTTTTTTTTT>
##$WBST= 1024
##$WBSW= 30
##$XGAIN= (0..3)
0 0 0 0 
##$XL= 0
##$YL= 0
##$YMAX_a= 2460132
##$YMIN_a= -2094466
##$ZGOPTNS= <>
##$ZL1= 120
##$ZL2= 120
##$ZL3= 120
##$ZL4= 120
##$ABSF1= 0
##$ABSF2= 0
##$ABSG= 0
##$ABSL= 0
##$ALPHA= 0
##$AQORDER= 0
##$ASSFAC= 0
##$ASSFACI= 0
##$ASSFACX= 0
##$ASSWID= 0
##$AUNMP= <proc_1d>
##$AZFE= 0.1
##$AZFW= 0.1
##$BCFW= 0
##$BC_mod= 2
##$BYTORDP= 0
##$COROFFS= 0
##$CY= 18.4799938201904
##$DATMOD= 1
##$DC= 0
##$DFILT= <>
##$DTYPP= 0
##$F1P= 9.9274215381318
##$F2P= -0.165520771350173
##$FCOR= 1
##$FTSIZE= 16384
##$FT_mod= 6
##$GAMMA= 0
##$GB= 0
##$INTBC= 1
##$INTSCL= 4.127829e-11
##$ISEN= 128
##$LB= 0.05
##$LEV0= 0
##$LPBIN= 0
##$MAXI= 10000
##$MC2= 0
##$MEAN= 0
##$ME_mod= 0
##$MI= 50
##$NCOEF= 0
##$NC_proc= -5
##$NLEV= 6
##$NOISF1= 3.799351
##$NOISF2= 2.8
##$NSP= 0
##$NTH_PI= 0
##$NZP= 0
##$OFFSET= 16.48848
##$PC= 4
##$PHC0= -264.2274
##$PHC1= 3.101563
##$PH_mod= 1
##$PKNL= yes
##$PPARMOD= 0
##$PSCAL= 4
##$PSIGN= 0
##$REVERSE= no
##$SF= 200.130005582386
##$SI= 16384
##$SIGF1= 3
##$SIGF2= 2
##$SINO= 400
##$SIOLD= 16384
##$SREGLST= <1H.CDCl3>
##$SSB= 0
##$STSI= 16384
##$STSR= 0
##$SW_p= 4139.07284768211
##$SYMM= 0
##$S_DEV= 0
##$TDeff= 32768
##$TDoff= 0
##$TI= <>
##$TILT= no
##$TM1= 0
##$TM2= 0
##$TOPLEV= 0
##$USERP1= <user>
##$USERP2= <user>
##$USERP3= <user>
##$USERP4= <user>
##$USERP5= <user>
##$WDW= 1
##$XDIM= 16384
##$YMAX_p= 361828129
##$YMIN_p= -2403059
$$ End of Bruker specific parameters
$$ ---------------------------------
##NTUPLES= NMR SPECTRUM
##VAR_NAME=  FREQUENCY,     SPECTRUM/REAL,   SPECTRUM/IMAG
##SYMBOL=    X,             R,               I
##VAR_TYPE=  INDEPENDENT,   DEPENDENT,       DEPENDENT
##VAR_FORM=  AFFN,          ASDF,            ASDF
##VAR_DIM=   16384,         16384,           16384
##UNITS=     HZ,            ARBITRARY UNITS, ARBITRARY UNITS
##FACTOR=    0.252644378177508, 1,           1
##FIRST=     3299.83951724647, 0,            0
##LAST=      -839.233330435636, 0,           0
##MIN=       -839.233330435636, -2403059,    0
##MAX=       3299.83951724647, 361828129,    0
$$ Real data points
##PAGE= N=1
##DATA TABLE= (X++(R..R)), XYDATA
$$ [...]
7353C91162K30986J30075n553k64827J69324o4340m33792K0509L09030N64075
7343A046649q93058L92668l66271M26319p62342R98224K50096n66034M86386j239393
7333b26756O36296o3815K1626L51619l50742m09307K45379J22835k02262L58302
7323D83175J74151k79517L7112R2760j4560K83717k7442k90478J69637k77369
7313C51186M8820M6735P54765n97329l99645O53773j57428k19557Q00328n11205
7303G70443k23502O5128k8589K74779m97437O70363k54855j07008k53849M93427
7293I08900n40675l76J89670q9616L21391n30228R0966K22562O11519j38810j91970
7282H53333k63190O79736n48985R7130k33904M77481n05144m1885j97379M35512
$$ plain form
7353 391162 622148 752223 746670 481843 651167 586827 153035 173544 482574 1046649
7343 1046649 153591 546259 179988 606307 -156035 842189 1092285 526251 1012637 -226756
7333 -226756 409540 345725 367351 718970 368228 -41079 204300 327135 124873 483175
7323 483175 657326 377809 414921 507681 493121 776838 749396 458918 628555 351186
7313 351186 400006 446741 1201506 604177 204532 858305 700877 481320 1281648 770443
7303 770443 546941 612069 583480 858259 360822 1031185 776330 669322 415473 908900
7293 908900 368225 367849 557519 467903 789294 259066 350032 572594 1184113 1045303 853333
7282 853333 590143 1269879 720894 818024 584120 1061601 556457 514572 317193 752705
7272G52705L1674r3397j55841J72334Q9908r2931M4973J50494k49794J42171k78757
7261E13539M78940m80526J64541j63278L51338k70015J79096m50312Q67336o12877
7251E77782M13041J54706O6614m37530L4188P4967k59222O48786n52485K89464
7241A010311l28774L3477Q6959R8917K02039k53623J37295L53930o39292M78350
7231A179589l04145r0133N60954p76836Q7560M08994m3307L64490o20959J38168
7221I04375M58607l44691O5723l41766O63831l91498J49380P67646j702208R60025
7211A189424l43559N11980k24334K95444n27777n25308J95347L85843J8709l1412
7201I44357l81205M06609o3136K20497L33796l53620K85304L34400k65095Q1355
$$ plain form
7272 752705 784379 690982 535141 707475 797383 704452 749425 899919 650125 792296 513539
7261 513539 992479 511953 676494 513216 864554 594539 773635 323323 1190659 577782
7251 577782 990823 1145529 1212143 774613 808801 883768 624546 1273332 720847 1010311
7241 1010311 681537 715014 801973 900890 1102929 849306 986601 1340531 701239 1179589
7231 1179589 875444 785311 1346265 569429 656989 1065983 1022676 1387166 766207 904375
7221 904375 1362982 1018291 1084014 742248 1406079 1014581 1163961 1931607 229399 1189424
7211 1189424 845865 1357845 1133511 1428955 901178 375870 571217 957060 975769 944357
7201 944357 563152 969761 906625 1127122 1460918 1107298 1392602 1727002 1461907 1543262
7191A543262P3512m77367R6378J3748l0735O522l90432R98639r4858l19738l1587
7180A387344o6543K93998m28791O44044n85849k6956O05012n16543J80029J05202
7170A590947L31238j09725l99613J00886Q4744m8256M53007k67801n4250j22703
7160A558474m90654L87132k36510N35818O428P5521M6265n57069R86357o34357
7150A677405k85189K06488J24136j0212k15210J08113j76786Q71627o01033M25148
7140B124487m93269K1845j35053Q60180m93606J49679l26872n89611O17390m72727
7130A262443O17906N20631n33702n14341k13995J122860J40418j263797Q12661
7121A951084J01476p75417L47731K74778k52833L38215m3648p1468p9482L4837
$$ plain form
7191 1543262 1616774 1139407 1235785 1249533 1218798 1225320 834888 1833527 1738669 1418931 1387344
7180 1387344 1320801 1614799 1186008 1830052 1244203 1217247 1822259 1305716 1485745 1590947
7170 1590947 1922185 1812460 1412847 1513733 1598477 1550221 2003228 1735427 1681177 1558474
7160 1558474 1067820 1454952 1218442 1754260 1760688 1836209 1882474 1325405 2311762 1677405
7150 1677405 1392216 1598704 1722840 1712628 1497418 1605531 1428745 2300372 1699339 2124487
7140 2124487 1631218 1653063 1518010 2378190 1884584 2034263 1707391 1117780 1735170 1262443
7130 1262443 1880349 2400980 1867278 1352937 1138942 2261802 2402220 1138423 1951084
7121 1951084 2052560 1277143 1624874 1899652 1646819 1985034 1941386 1869918 1790436 1825273
7111A825273M0765L35276J36591l72656l57218N30663J97732l82396J47915j13787
7101A988158L75984l37301J46140o6575o8317N05780k58235r1942l4998l99816
7091A758878M21362l91772K43299N08267k88853k35302k61560N77936Q20295j140032
7081B012518j72690J22065J51648Q3185L65182m07133N55653k09690j83316M81875
7071B799297o9849R402L00256q18983M54960j96930j08079j59946J005361k21746
7061B993743l56441m80502M16620k04516O17909J22642k46711O78461m98848n85340
7051B457017N53338J6978J02766r1617L8789J59056J17847J57917p6033j81194
7041C254864K01785k20976Q2902n44435P49808L3308o65769P26401q7971K58927
$$ plain form
7111 1825273 1866038 2201314 2337905 1965249 1608031 2138694 2336426 1954030 2101945 1988158
7101 1988158 2364142 2026841 2172981 2106406 2038089 2543869 2285634 2193692 2158694 1758878
7091 1758878 2180240 1788468 2031767 2540034 2251181 2015879 1754319 2332255 3152550 2012518
7081 2012518 1839828 1961893 2113541 2196726 2561908 2154775 2710428 2500738 2317422 2799297
7071 2799297 2729448 2738850 3039106 2220123 2675083 2478153 2370074 2210128 3215489 2993743
7061 2993743 2637302 2156800 2573420 2368904 2986813 3109455 2862744 3541205 3042357 2457017
7051 2457017 3010355 3027333 3130099 3038482 3077271 3236327 3354174 3512091 3436058 3254864
7041 3254864 3456649 3235673 3318575 2774140 3523948 3557256 2891487 3617888 3529917 3788844
7031C788844n21865O60404o98264O52925L20539n38482M39513n82577J87135K62023
7021C970195m87760N45119m23632Q65692m82349J63920J17777N5748j38853L13607
7011D499464j81110j79770J07530J85499j44009N88654m67660r6487K7984M56422
7001D796517J98358l10453J97979M38280j84118j17020M35766j75218M33313l31640
6991E381764K48560l45111R70649m40044J91791J27540L62111n07346L66190o70126
6981E685978R55236N36489j14991p49835P91403J84060n19273L63175P12940n75029
6971G270153O49482l72175J38919K27028P9406k70556O10942L85914k81715L51537
6961H788935J63698L7048j05273J98006K31244P37158m18014K12290K63497Q42857
$$ plain form
7031 3788844 3266979 3927383 3229119 3882044 4202583 3664101 4103614 3521037 3708172 3970195
7021 3970195 3482435 4027554 3603922 4469614 3987265 4151185 4268962 4324710 4185857 4499464
7011 4499464 4318354 4138584 4246114 4431613 4287604 4876258 4408598 4312111 4340095 4796517
7001 4796517 4994875 4684422 4882401 5320681 5136563 5019543 5455309 5280091 5713404 5381764
6991 5381764 5630324 5285213 6255862 5815818 6007609 6135149 6497260 5989914 6356104 5685978
6981 5685978 6641214 7177703 7062712 6312877 7104280 7288340 6769067 7132242 7845182 7270153
6971 7270153 7919635 7547460 7686379 7913407 7992813 7722257 8333199 8719113 8437398 8788935
6961 8788935 8952633 8989681 8884408 9082414 9313658 10050816 9632802 9845092 10108589 10951446
6951A0951446l52419M39144o10676O24197P74586n74939J040602j69293r6747
6942A2025901L25186J276252m58520Q00681l73617M62761n19005P66629N13931
6933A4820199P65887O58899l04668k27935R63583j91448J509862O43272j06206
6924A8531445j97898R82756L80878L30526Q09419O98214j32678Q90256N04799
6915B2797717N42812L06314J098829M18593k89898J278381M9102p1474J450098
6906B7580474L6583O53489J579366Q8404M24841O27991M67473P09217Q27987M65746
6896C3461571Q11772P08142L47768R19629N05865J58023J284075K74003L24968
6887C8795816J089726J279188j62197P93244M72533O55980P75269J56780K87446
$$ plain form
6951 10951446 10599027 11038171 10427495 11051692 11826278 11251339 12291941 12122648 12025901
6942 12025901 12351087 13627339 13168819 13969500 13595883 14058644 13539639 14306268 14820199
6933 14820199 15586086 16244985 15940317 15712382 16675965 16484517 17994379 18637651 18531445
6924 18531445 18333547 19316303 19697181 20027707 20837126 21535340 21402662 22292918 22797717
6915 22797717 23340529 23646843 24745672 25164265 24874367 26152748 26201850 26130376 27580474
6906 27580474 27617057 28270546 29849912 29938316 30363157 30991148 31458621 32167838 32995825 33461571
6896 33461571 34273343 34981485 35329253 36248882 36754747 36912770 38196845 38470848 38795816
6887 38795816 39885542 41164730 41002533 41795777 42268310 42924290 43699559 43856339 44143785
6878D4143785M22927O73871R28337k50226k19626J210360j65608K92959o6693
6869D6970086R94108J54104o96772J050486K48315Q8493J08195K76668N7072K66850
6859D9517605O50525n32315l44778P66510q09799L45717M13448l16237n68524
6850D9122152k49318J46094L7862m51338n53765o35604k39205K70084q77554n58108
6840D6011300l29860o83268n79182K76232m29006p49392l1052o08901r86749r9435
6830D1790687q25357j134037j80688j294792j19407n05261l55866p96565q55120
6821C5723594l32842p26101o35092p89054p84665k58780r80759m55922r21953
6812B9838426L52982j103498o69230r98165r5561n55713r71830O9277j232151
$$ plain form
6878 44143785 44566712 45240583 46168920 45918694 45699068 46909428 46743820 47036779 46970086
6869 46970086 47964194 48118298 47421526 48472012 48720327 48808820 48917015 49193683 49250755 49517605
6859 49517605 50168130 49635815 49291037 50057547 49247748 49593465 50006913 49690676 49122152
6850 49122152 48872834 49018928 49056790 48605452 48051687 47416083 47176878 47446962 46569408 46011300
6840 46011300 45681440 44998172 44418990 44695222 44266216 43516824 43485772 42876871 41890122 41790687
6830 41790687 40965330 39831293 39650605 38355813 38236406 37731145 37375279 36578714 35723594
6821 35723594 35390752 34664651 34029559 33240505 32455840 32197060 31216301 30760379 29838426
6812 29838426 30191408 29087910 28418680 27420515 27324954 26769241 25797411 25866688 24634537
6803B4634537o35804k62947j032033K0938j006589k58956p63495l78754p16793
6794A9600104k12151k558j337627o0212q61378l98496l4811n63007p63259J07593
6784A5474198p35145J81522j090132m40058K60769k59959k88887m84283k81695
6775A2336330K18795j150276K24329j81737k28485o36712o9035m87545j1744l09838
6765I704082L66264j090112l72128J96506j62211m82655K80946l83382j96743
6756G860567P63039q11810L4954l57697Q7817J14122m66850N95572p43969J19631
6746G195376K03846l59653J61738k97104r21738P45193j17366K07547m09624l64640
6736F043575J14094K57145K20865j174030M24030j37997j3178K99743q13014j52804
$$ plain form
6803 24634537 23998733 23735786 22703753 22724691 21718102 21459146 20695651 20316897 19600104
6794 19600104 19387953 19385395 18047768 17987556 17126178 16727682 16692871 16129864 15366605 15474198
6784 15474198 14739053 14920575 13830443 13390385 13651154 13391195 13102308 12618025 12336330
6775 12336330 12555125 11404849 11629178 11447441 11218956 10582244 10513209 10025664 10013920 9704082
6765 9704082 10070346 8980234 8608106 8804612 8642401 8159746 8440692 8057310 7860567
6756 7860567 8623606 7811796 7846750 7489053 7576870 7690992 7224142 7819714 7075745 7195376
6746 7195376 7399222 7039569 7201307 6904203 5982465 6727658 6610292 6817839 6408215 6043575
6736 6043575 6157669 6414814 6635679 5461649 5885679 5747682 5734504 6034247 5221233 5068429
6726E068429N74806M47374l98542k65051J42435l30399j06895j93052K29559o8574
6716E100090j08278M59381l79277K56238k86513R1827O92007j011605o043L40851
6706E148678j54340k00621Q11249r13963L09535M122J9975L97398J07685p61194
6696D768524L34870K4520J19466m6582K9618L94152r41588L86472k12975L68691
6686E225168O0010M05855m70301N87511J11589o29944K77482J51844k00551M61719
6676E980382j8620j55904j37601J7083O24476j07974K17506r9443l55347L45799
6666F310357o83119O82384j86966J125644p89789l4279l97533O87329l84399j89703
6656F139926J69692P16158J46275k50779M22111l48701j32209K74901M20973n16208
$$ plain form
6726 5068429 5643235 6090609 5692067 5427016 5569451 5239052 5132157 4939105 5168664 5100090
6716 5100090 4991812 5451193 5071916 5328154 5041641 5133468 5825475 4813870 4807827 5148678
6706 5148678 4994338 4793717 5604966 4691003 5000538 5004660 5024635 5422033 5529718 4768524
6696 4768524 5103394 5127914 5247380 5200798 5230416 5624568 4682980 5069452 4856477 5225168
6686 5225168 5285178 5691033 5220732 5808243 5919832 5289888 5567370 5719214 5518663 5980382
6676 5980382 5961762 5805858 5668257 5685340 6309816 6201842 6419348 6319905 5964558 6310357
6666 6310357 5627238 6309622 6122656 7248300 6458511 6424232 6026699 6714028 6329629 6139926
6656 6139926 6309618 7025776 7172051 6921272 7343383 6994682 6862473 7137374 7558347 7042139
6646G042139Q6010K37803O09774n2620J21960q66788P04551l60544N41108j45024
6636G918369Q01918j073861K57754K19158L96702q47248Q20855j201653R76005
6627H267999k37254R84019j055820J21212K02558O12K01415K3681k46512O4537
6617H326447K33625m25166p7482K81968j1445O74609l83705o52851L80316k7638
6607H318678K33138o45867Q8539J15350N94981l2156j096196P45223n00891P6080
6597G896879M63669K06348o43788J42766j35410p44963O29373k13297j84331M42748
6587G859994L11829l75285k07012k30412l02255P29071k64371p24363q5467K00737
6577F912466K38688m56001o7315J84633m14305O73087k47534l66038M82375r10212
$$ plain form
6646 7042139 7128149 7365952 7975726 7923106 8045066 7178278 7882829 7522285 8063393 7918369
6636 7918369 8720287 7646426 7904180 8123338 8520040 7672792 8493647 7291994 8267999
6627 8267999 8030745 9014764 7958944 8080156 8282714 8283326 8484741 8508422 8261910 8326447
6617 8326447 8560072 8134906 8057424 8339392 8327947 9002556 8618851 7966000 8346316 8318678
6607 8318678 8551816 7905949 7994488 8109838 8704819 8672663 7576467 8321690 7820799 7896879
6597 7896879 8360548 8566896 7923108 8065874 7930464 7185501 7814874 7601577 7417246 7859994
6587 7859994 8171823 7796538 7589526 7359114 7056859 7785930 7521559 6797196 6711729 6912466
6577 6912466 7151154 6695153 6627838 6812471 6398166 7071253 6823719 6457681 6940056 6029844
6567F029844K18918q0064j93278k2061M44670k76678j07063j11155l1573m05864
6557E465696K99628N38l539J05038q14828K41707M62471J11867K8605r55992M59119
6546E400310j04648j15550k4098j53687m21053K55867K2505L01065o94094P1709
6536D538326M05022O4714m93645J75275Q3113q8758n6748p39454P49560j01256
6526D536149j11994m0700O19427j068896K85292j15619M23357l8924m45239Q6843
6516D129696l20538M34658o54331L46052J85745k09209k0518K93645p74774O64619
6506D075045m24411M14483m61189l22502N03417m39051O54028L4465n18869q7227
6496C428189K69381K22113k24415j56643K52960o04583J56832J63096l9426P1997
$$ plain form
6567 6029844 6248762 6168698 5975420 5953359 6398029 6121351 6014288 5903133 5871560 5465696
6557 5465696 5765324 5765862 5762323 5867361 5052533 5294240 5756711 5868578 5897183 4941191 5400310
6546 5400310 5295662 5180112 5156014 5002327 4581274 4837141 4859646 5160711 4466617 4538326
6536 4538326 4943348 5008062 4514417 4689692 4772805 4684047 4627299 3887845 4637405 4536149
6526 4536149 4424155 4383455 5002882 3933986 4219278 4103659 4527016 4488092 4042853 4129696
6516 4129696 3809158 4243816 3589485 3935537 4121282 3912073 3891555 4185200 3410426 4075045
6506 4075045 3650634 4065117 3603928 3281426 3784843 3345792 3999820 4034285 3515416 3428189
6496 3428189 3697570 3919683 3695268 3538625 3791585 3187002 3343834 3506930 3467504 3539501
6486C539501p39315k28930J379665j041844O93246l2960N82296j157112j80044
6477B814503M33999n06773J55460M61043M79839n10097J4033m85452q4774N49695
6467C321476k19982l03069N86903Q9528n78980K93750J23437l25467K38410m99752
6457B726254K16240L15265n90236L60820N4291k71705K6252K70935j39468m28711
6447B539937L54815R1472k27354O26213k43441k82215M74321k88711n97660J095726
6437C543103q97640j8646n1591L41300j58498J10677K01506j59188m29366P37823
6427C219480j62140r4034m33496L53535n66365O37207M7718j5988r7180k10470
6417B678267k46767K81015j49886k28791N69861j03220j46360M18056l50063L17037
$$ plain form
6486 3539501 2800186 2571256 3950921 2909077 3602323 3569363 4151659 2994547 2814503
6477 2814503 3248502 2741729 2897189 3358232 3838071 3327974 3342007 2856555 2771781 3321476
6467 3321476 3101494 2798425 3385328 3474856 2895876 3189626 3313063 2987596 3226006 2726254
6457 2726254 2942494 3257759 2667523 3028343 3082634 2810929 2837181 3108116 2968648 2539937
6447 2539937 2894752 2986224 2758870 3385083 3141642 2859427 3333748 3045037 2447377 3543103
6437 3543103 2645463 2626817 2575226 2916526 2758028 2868705 3070211 2911023 2481657 3219480
6427 3219480 3057340 2963306 2529810 2883345 2316980 2954187 3001905 2985917 2888737 2678267
6417 2678267 2431500 2712515 2562629 2333838 2903699 2800479 2654119 3072175 2722112 3039149
6407C039149J06231M5770k15563j44793K79203j6575j76732J31288k58984J14813
6397B903807J98643l99342M40776k75126J24939k24068J82523K73563l7987q4851
6387C102877k90689J63057J05614l49670j50472Q03171q7922J00630K04637n47856
6377C053377r9204J62263k02477P4781q0086l08448P2606J97416L80574l12408
6367B938394M39196k51745m584K83182m54174K79078j03761k86269R09008m73755
6357C274570L71447l97978Q3382j05923M9207P1144k9360J13585n12196N24124
6347C442002n41696N28048o96489P29199Q1628j70333K69578k14617O9020j65881
6337C330459J19451q4211j09322l41620j59681Q45713l28865R12690n21465K10603
$$ plain form
6407 3039149 3145380 3191150 2975587 2830794 3109997 3093422 2916690 3047978 2788994 2903807
6397 2903807 3102450 2703108 3143884 2868758 2993697 2769629 2952152 3225715 3187728 3102877
6387 3102877 2812188 2975245 3080859 2731189 2580717 3383888 3295966 3396596 3601233 3053377
6377 3053377 2954173 3116436 2913959 2988740 2908654 2600206 2672812 2870228 3250802 2938394
6367 2938394 3377590 3125845 3121261 3404443 2950269 3229347 3125586 2839317 3748325 3274570
6357 3274570 3646017 3248039 3331421 3225498 3274705 3345849 3316489 3430074 2917878 3442002
6347 3442002 2900306 3428354 2731865 3461064 3542692 3372359 3641937 3427320 3496340 3330459
6337 3330459 3449910 3365699 3256377 2914757 2755076 3600789 3271924 4184614 3663149 3873752
6327C873752n25630J46886J4744p4925R4113J28848k36396J80930j029870R30717
6317C503169o44210O33495L41896n6953L73990q05545K41328j35936J9852m33512
6307C037574L95110k6126k88086J27597L04139n7020M06009l72588q4194P730
6297C450145k65410K59009j41082N02715k77182m27571J0343P58341q91483J078213
6287D056038j083089J171341m97512L28762k24695M17763n89032m56289J013622
6278D136909n27270o04874Q38372n88462P23421n465N6493k48384M69710o17413
6268C633037k0130L24718k70812M69951n01712M10512K78504K9399o28339l58143
6258C366985M11073L4693p5327R5666q0019k67657O20437j97074K96032L71548
$$ plain form
6327 3873752 3348122 3495008 3509752 3434827 3528940 3657788 3421392 3602322 2572452 3503169
6317 3503169 2858959 3492454 3834350 3777397 4151387 3345842 3587170 3451234 3471086 3037574
6307 3037574 3432684 3406558 3118472 3246069 3550208 3493188 3899197 3526609 3442415 3450145
6297 3450145 3184735 3443744 3302662 3805377 3528195 3100624 3110967 3869308 2977825 4056038
6287 4056038 2972949 4144290 3646778 3975540 3750845 4168608 3579576 3123287 4136909
6278 4136909 3609639 3004765 3843137 3254675 3978096 3972631 4029124 3780740 4250450 3633037
6268 3633037 3612907 3937625 3666813 4136764 3635052 4045564 4324068 4353467 3725128 3366985
6258 3366985 3778058 3812751 3737424 3833090 3753071 3485414 4105851 3908777 4204809 4576357
6248D576357j87364P3724p89521N42731l7947L32518j6859p10548O0424J24283
6238C967798J64244J44211j07399L62538l26643J13810k2899M10529n22721R9
6228D183567L58079L11287l17627j45680L3430n62478Q90800J81351n28989j73334
6218D230406k1515J1906P5795O37613q07988K37180m7999j39158N62402l50093
6208D388549O76600m91466K85490k93073O91556o22179L06957l76536L34630n8965
6198D841563r0557k41554P33893l86959L95666r246R0491n10369J31207L40159
6188E294294l15112K35332l82072N50605N44874J73267q17456K70252N27789m50498
6178E631275K80557n28525L55343k90324j28431N36209j26103L13754n41823L14725
$$ plain form
6248 4576357 4388993 4462717 3673196 4215927 4177980 4510498 4493639 3783091 3843515 3967798
6238 3967798 4132042 4276253 4168854 4531392 4204749 4318559 4295660 4706189 4183468 4183567
6228 4183567 4541646 4852933 4535306 4389626 4423056 3860578 4751378 4932729 4403740 4230406
6218 4230406 4208891 4220797 4296592 4934205 4126217 4363397 4315398 4176240 4738642 4388549
6208 4388549 5065149 4573683 4859173 4566100 5257656 4635477 4942434 4565898 4900528 4841563
6198 4841563 4751006 4509452 5243345 4856386 5252052 5242806 5333297 4822928 4954135 5294294
6188 5294294 4979182 5214514 4832442 5383047 5927921 6101188 5283732 5553984 6081773 5631275
6178 5631275 5911832 5383307 5738650 5448326 5319895 5856104 5730001 6043755 5501932 5816657
6168E816657K54050r06335M28533k07780M61537q7936m26706J51877j6973N74593
6158F041517K45658j31381k07961n4632J92239j06464J91470j37543K99302n40040
6148E792165j44638N28182k90272M49515L35048k73466l70279K03689J85961n2390
6138F363515k98857j58200M58923j13210K52662k1984K59779p24709M74007M10472
6128F902398J78171p62665k89587N84930O6526j40048J47573R3985j09227o9757
6118F602299m7036J180152n14319j89964J68957l37619J01829J73603l8626J23279
6108G222555j58493M6218J6819M60028j86341o13581L16492N81933o3991j98158
6098G423481k88296K98065M8669K12250k91221O4100l54089O00789m96694N69080
$$ plain form
6168 5816657 6070707 5164372 5592905 5385125 5846662 5758726 5332020 5483897 5466924 6041517
6158 6041517 6287175 6155794 5947833 5893201 6085440 5978976 6170446 6032903 6332205 5792165
6148 5792165 5647527 6175709 5885437 6334952 6670000 6396534 6026255 6229944 6415905 6363515
6138 6363515 6064658 5906458 6365381 6252171 6504833 6482849 6742628 6017919 6491926 6902398
6128 6902398 7080569 6317904 6028317 6613247 6679773 6539725 6687298 6781283 6672056 6602299
6118 6602299 6555263 7735415 7221096 7031132 7200089 6862470 6964299 7137902 7099276 7222555
6108 7222555 7064062 7110280 7127099 7587127 7400786 6787205 7103697 7685630 7621639 7423481
6098 7423481 7135185 7433250 7481919 7694169 7402948 7467048 7112959 7713748 7217054 7786134
6088G786134m3474l24203L15147J65559M93521q1322k79837m41133K48557j69269
6078G669680J081242n02979k38769L64067k53811L97518L23199j13310m32180
6069H294657k9104M93034k68552M56457K4630k89503P71378k89068n66937J241955
6059I838947q4136p97977K12498J52771L37114N45604n59025L36091n5963O9338
6049I995262Q3299j9939K95727l21823J69369K44394N33286m95329j43082O71164
6039A1012328l6401j08202K2158P9986K04566l49027R71708k05048L29433p92182
6029A1129319O37686n94759P22286K46652j34374r827L21251n18580P44443l50198
6019A2193899J021663j037029R50548l01004j6923N76119p66083J192343j91309
$$ plain form
6088 7786134 7742660 7418457 7733604 7899163 8392684 8311362 8031525 7590392 7838949 7669680
6078 7669680 8750922 8247943 8009174 8373241 8119430 8516948 8840147 8726837 8294657
6069 8294657 8265553 8758587 8490035 8946492 8971122 8681619 9452997 9163929 8596992 9838947
6059 9838947 9754811 8956834 9169332 9322103 9659217 10204821 9645796 9981887 9925924 9995262
6049 9995262 10078561 10058622 10354349 10032526 10201895 10446289 10979575 10484246 10341164 11012328
6039 11012328 10975927 10867725 10889883 10969869 11174435 10825408 11797116 11592068 11921501 11129319
6029 11129319 11767005 11172246 11894532 12141184 12006810 11996983 12318234 11799654 12544097 12193899
6019 12193899 13215562 12178533 13129081 12828077 12811154 13387273 12621190 13813533 13622224
6010A3622224K00880k26964M0499M62880L16508K23645K48241o8914J77878k44130
6000A4752747K39995N47262R2709q55903M31759L25716N90794K9195J59643J51684
5990A6465601l37058J296013k60177j89311O73608l50133N93882k60597M10518
5981A8042346J08328K13858Q62569K91225j52583L97126K49188m0612M74730k50654
5971B0195521J03877K26605L25396P86074L52529n3704M06321k95668J348147
5962B3395098p61790L90624Q46665L09444K22497R48235m35799N95710R76469
5953B6487153j90887M84120J133981n92875L46043J088464L35825J9072R10401
5944C0021297L91738J64125L4516J012798K56632M58224P21152O73105N81237
$$ plain form
6010 13622224 13823104 13596140 13636639 14099519 14416027 14639672 14887913 14818999 14996877 14752747
6000 14752747 14992742 15540004 15632713 14776810 15208569 15534285 16125079 16154274 16313917 16465601
5990 16465601 16128543 17424556 17164379 16975068 17648676 17298543 17892425 17631828 18042346
5981 18042346 18150674 18364532 19227101 19518326 19365743 19762869 20012057 19971445 20446175 20195521
5971 20195521 20299398 20526003 20851399 21637473 21990002 21936298 22342619 22046951 23395098
5962 23395098 22633308 23023932 23870597 24180041 24402538 25350773 24914974 25510684 26487153
5953 26487153 26296266 26780386 27914367 27321492 27667535 28755999 29091824 29110896 30021297
5944 30021297 30413035 30577160 30611676 31624474 31881106 32339330 33060482 33733587 34314824
5935C4314824O95236K75445L76103K34916R38227P69762O51995L55193P92435
5926C9404136R50043O52358K13591O11516M77350N40535J144938J235282N4518
5917D5284267R28137O17384Q10131O54746J318581N88157J97787J458761J90787
5908E2048738O53929P30529O83299J177073M11870R95580O93199O47993J143835
5899E9186045J598193o12591J405166R34368l35771J289309Q95053J423006J78414
5890F5961192M19625J126500M55808J111655N84853L82682M72265R61200L13137
5881G1788917R48013J058476L37299M82846J286127P34583M86877N0073O77584
5872G7850795Q12508M06531N92809J07734M14207J253163R3959o7096J54167L50184
$$ plain form
5935 34314824 35010060 35285505 35661608 35896524 36834751 37604513 38256508 38611701 39404136
5926 39404136 40354179 41006537 41220128 41831644 42308994 42849529 43994467 45229749 45284267
5917 45284267 46212404 46829788 47639919 48294665 49613246 50201403 50399190 51857951 52048738
5908 52048738 52702667 53433196 54116495 55293568 55705438 56701018 57394217 58042210 59186045
5899 59186045 60784238 60171647 61576813 62511181 62175410 63464719 64359772 65782778 65961192
5890 65961192 66380817 67507317 67963125 69074780 69659633 70042315 70514580 71475780 71788917
5881 71788917 72736930 73795406 74132705 74615551 75901678 76636261 77123138 77173211 77850795
5872 77850795 78663303 79069834 79662643 79770377 80184584 81437747 81531706 81464610 81618777 81968961
5862H1968961o0770P33387o4010R11473k31503L45855J03629M07060L43922l94976
5852H4063028L30875j39919J86541R53270l50394L15657j00287J95436J7780M4243
5842H5516230l12830m47813J119036K30567k9231o68468Q78215q6624P9880j83085
5832H6095877M01193o22719J92407L16604M8K77672M2931J50025L92599N9048
5822H7305685L31494J93130l71297M99849R22954J20773o41701J128469K8969
5813H9518325L02981J061992l86065P29158Q52945j36172J439069K61710M55884
5804I4099827M17303L2789Q54566J020158P66834P4084O96208J231910N51528
5795I9745207N71709J096242j23624J404794M69668M53963J052685Q32308O98294
$$ plain form
5862 81968961 81908191 82641578 82577568 83489041 83257538 83603393 83707022 84114082 84458004 84063028
5852 84063028 84393903 84253984 84440525 85393795 85043401 85359058 85258771 85454207 85471987 85516230
5842 85516230 85203400 84755587 85874623 86105190 86075959 85407491 86285706 86199082 86278962 86095877
5832 86095877 86497070 85874351 86066758 86383362 86383410 86661082 86704013 86854038 87246637 87305685
5822 87305685 87637179 87830309 87459012 87958861 88881815 89002588 88360887 89489356 89518325
5813 89518325 89821306 90883298 90497233 91226391 92079336 91943164 93382233 93643943 94099827
5804 94099827 94517130 94549919 95404485 96424643 97191477 97265561 97961769 99193679 99745207
5795 99745207 100316916 101413158 101289534 102694328 103163996 103617959 104670644 105502952 106201246
5786A06201246P85393L86380Q17037J178733M13206J133545J074715K33961L97949
5777A12622165Q84706P35191R96602L10940N08374N75063L48342N07865R85833
5768A18475081Q22196K53689q52693J867292j03888L44444L52318M3123N36255
5759A21737817P94005M45700R30153q64468Q88722j25564N94971Q66076J27638
5750A25395050n03125O13456j41444J312028J54575P59457j41342N3167O81083
5741A28182905N05014J4379N83194L66111J095989P40333J06511L23674N19873
5732A32437983J771370K57972Q31350J245290M19342O68696J241367J500034J039337
5723A41412741J242264J929111J446479P34788K517170J065881J766693J905302
$$ plain form
5786 106201246 106986639 107373019 108190056 109368789 109781995 110915540 111990255 112224216 112622165
5777 112622165 113506871 114242062 115238664 115549604 116057978 116633041 116981383 117489248 118475081
5768 118475081 119297277 119550966 118698273 120565565 120461677 120806121 121158439 121201562 121737817
5759 121737817 122531822 122977522 123907675 123043207 123931929 123806365 124401336 125267412 125395050
5750 125395050 124891925 125505381 125363937 126675965 126830540 127589997 127448655 127501822 128182905
5741 128182905 128687919 128702298 129285492 129651603 130747592 131487925 131594436 131918110 132437983
5732 132437983 134209353 134467325 135298675 136543965 136963307 137632003 138873370 140373404 141412741
5723 141412741 142655005 144584116 146030595 146765383 149282553 150348434 152115127 154020429
5715A54020429K059248J601658K230075K250110K396011K327918K234307K471568
5707A71591324K511652K978419K338329L083844K363294L226375K593801K825193
5699A93512231L112663L271359L532616K931812K771354L200679L040561M298965
5691B19672240K965961L325033L408338L058852M359828K641921L680220M047194
5683B47159587L357648L677870L589544L331106L037493M270973K954950L677327
5675B75056498L192112K933362L354924L791990K294350K904714L296704K490123
5667B99314777K513478K481266K794262K418159J789949K522304K412609J677697
5659C17924501J691356K094931Q22722K535785Q97775J713028J179373J003603
$$ plain form
5715 154020429 156079677 157681335 159911410 162161520 164557531 166885449 169119756 171591324
5707 171591324 174102976 177081395 179419724 182503568 184866862 188093237 190687038 193512231
5699 193512231 196624894 199896253 203428869 206360681 209132035 212332714 215373275 219672240
5691 219672240 222638201 225963234 229371572 232430424 236790252 239432173 243112393 247159587
5683 247159587 250517235 254195105 257784649 261115755 264153248 268424221 271379171 275056498
5675 275056498 278248610 281181972 284536896 288328886 290623236 293527950 296824654 299314777
5667 299314777 301828255 304309521 307103783 309521942 311311891 313834195 316246804 317924501
5659 317924501 319615857 321710788 322533510 325069295 325967070 327680098 328859471 329863074
5651C29863074R29922J98952O98754Q7821L25821O43689P07465j129924M52560
5642C32778134p78934J38153k02148j452897n85548n78479n51619j470086o38506
5633C26658070j362940j616179j305830j159468j280967j428969j981978j196004
5625C15325735j378250j502549j603297j595178j683698j625865k405702j859060
5617C01672136j181299j987257j671503j412374k003921j302351j471923j842944
5609B88798564j454668k082597j718098o15007j626541j018535j265167j295358
5601B77722593l35769k036109l64745j045989j116886o73367j251004P893j031072
5592B69875545o06440q53779q48392j05515q78349o62933l19703o01281p01430
$$ plain form
5651 329863074 330792996 330991948 331690702 331778523 332104344 332748033 333455498 332325574 332778134
5642 332778134 331999200 332137353 331935205 330482308 329896760 329318281 328766662 327296576 326658070
5633 326658070 325295130 323678951 322373121 321213653 319932686 318503717 316521739 315325735
5625 315325735 313947485 312444936 310841639 309246461 307562763 305936898 303531196 301672136
5617 301672136 300490837 298503580 296832077 295419703 293415782 292113431 290641508 288798564
5609 288798564 287343896 285261299 283543201 282928194 281301653 280283118 279017951 277722593
5601 277722593 277386824 275350715 274985970 273939981 272823095 272149728 270898724 270906617 269875545
5592 269875545 269269105 268415326 267566934 267461419 266583070 265920137 265600434 264999153 264297723
5583B64297723j77514p72569k95902j158916j6450r64373k40522J0874k030093
5574B58652258m19161m44819j077657q49974r46018j168131q26103j364914p63837
5565B50791644j152991j158027j751106j363681j579124j665499r24502j931202
5557B39265512j896510j763848j757950j764935k356368j719172k399489l069097
5549B22538143j857164j389839l078284k587495k333886k440378k673662k077853
5541B04099582k752191k453255l115791k206937k412612k233292k852459l187092
5533A82885953k041144k734460k194470k823461k240637k824935k545226k262412
5525A63219208j973652l004154k556113j920900k378766j985019j940769j861557
$$ plain form
5583 264297723 264120209 263347640 263051738 261892822 261876372 260911999 260671477 260682351 258652258
5574 258652258 258233097 257788278 256710621 255860647 254914629 253746498 252920395 251555481 250791644
5565 250791644 249638653 248480626 246729520 245365839 243786715 242121216 241196714 239265512
5557 239265512 237369002 235605154 233847204 232082269 229725901 228006729 225607240 222538143
5549 222538143 220680979 219291140 216212856 213625361 211291475 208851097 206177435 204099582
5541 204099582 201347391 198894136 195778345 193571408 191158796 188925504 186073045 182885953
5533 182885953 180844809 178110349 175915879 173092418 170851781 168026846 165481620 163219208
5525 163219208 161245556 158241402 155685289 153764389 151385623 149400604 147459835 145598278
5517A45598278k108533j884689k154584k056308n79861k386745j476927j471872
5509A31478759j655972j830904p26983j414671q28681j179443j438931m62569
5501A21940605r65564j93634p79030m28220n77487r27887R1048k31326l87618
5492A17540887O33513o08133n27109M55202P75065r3239K65185M46949J016475
5483A19904795O3849M97143K85293J443399o6622J144423O34643J157549Q35580
5474A25900052O49911Q85304J154207Q74718P25420Q91323N54879J028556J483152
5465A34147522J163369Q49485O73288N96315J401480J323676O9442R32695Q84024
5456A42041296Q34199J137611n5979P93479N28325m87074J21803J85501J222909
$$ plain form
5517 145598278 143489745 141605056 139450472 137394164 136814303 134427558 132950631 131478759
5509 131478759 129822787 127991883 127264900 125850229 125021548 123842105 122403174 121940605
5501 121940605 120975041 120781407 120002377 119574157 118996670 118068783 118159831 117928505 117540887
5492 117540887 118174400 117566267 117039158 117494360 118269425 118176186 118441371 118888320 119904795
5483 119904795 119968644 120465787 120751080 122194479 122127857 123272280 123906923 125064472 125900052
5474 125900052 126549963 127435267 128589474 129464192 130189612 131080935 131635814 132664370 134147522
5465 134147522 135310891 136160376 136833664 137429979 138831459 140155135 140224577 141157272 142041296
5456 142041296 142875495 144013106 143957127 144750606 145278931 144791857 144913660 145099161 146322070
5447A46322070q77651P09706j60627J93878n35508q03022r1634p47191j88798
5438A43821223p42033n99194j122766q57048j469200m40488j454138q82991j447687
5429A34805678j915736r24749j514236j572881j476803q22030k430483k188541
5421A21960219j863923j565116j486169j647498k047284k367859j417600j769538
5413A07795232j702156k094575j929692k013761k484205j479605j918063j792120
5405I2381055k167035k403855j185213k075977j945300j305955j716448k027000
5397G7554272j329243k069226j374305j750060j962970q83874j745360j869149
5389F4570085j187194j756229n04079k094988r79795j260634j542570j184402
$$ plain form
5447 146322070 145444419 146154125 145993498 146187376 145651868 144848846 144757212 144010021 143821223
5438 143821223 143079190 142479996 141357230 140500182 139030982 138590494 137136356 136253365 134805678
5429 134805678 132889942 131965193 130450957 128878076 127401273 126579243 124148760 121960219
5421 121960219 120096296 118531180 117045011 115397513 113350229 110982370 109564770 107795232
5413 107795232 106093076 103998501 102068809 100055048 97570843 96091238 94173175 92381055
5405 92381055 90214020 87810165 86624952 84548975 82603675 81297720 79581272 77554272
5397 77554272 76225029 74155803 72781498 71031438 69068468 68184594 66439234 64570085
5389 64570085 63382891 61626662 61122583 59027595 58047800 56787166 55244596 54060194
5381E4060194j141942o61779j427540j459629j368021n87212o49818p28466r61576
5372D5074211p97971q72584j656436l43418k74571r42279j115343q52230l54942
5363C7864437q09292l65586j334048j61431l21295n55148p78059N8371n57511
5354C3040438j244855n63336P0616q0228r77689q12171J92267j076946O95288
5345B9243384r43238J99989p96598l08887j3976l23482l51930n63517K05439k852
5335B6344332j146089k88217J42782k33196N68025j019674Q7635m5898j397975
5326B3011725R21938j54625M44008j174334J03538j21321m08787N21717K30797
5317B3374656n58506L11168p15240N81444k97157l03489J434k3503J76838k37050
$$ plain form
5381 54060194 52918252 52256473 50828933 49369304 48001283 47414071 46764253 46035787 45074211
5372 45074211 44276240 43403656 41747220 41403802 41129231 40186952 39071609 38219379 37864437
5363 37864437 37055145 36689559 35355511 35194080 34872785 34317637 33539578 33597949 33040438
5354 33040438 31795583 31232247 31302863 31222635 30244946 29432775 29625042 28548096 29243384
5345 29243384 28300146 28500135 27703537 27394650 27380674 27057192 26705262 26141745 26347184 26344332
5335 26344332 25198243 24910026 25052808 24819612 25387637 24367963 24455598 24409700 23011725
5326 23011725 23933663 23779038 24223046 23048712 23152250 23030929 22622142 23143859 23374656
5317 23374656 22816150 23127318 22412078 22993522 22696365 22392876 22394310 22370807 22547645 22310595
5307B2310595j93408R4553M45422l00111K0088J48400M8270r4366L39403M2731
5297B2861577N8544l74252J20156p48239P01697L13312l19948L27664n02293M68128
5287B2906346N72805m10123L38345m09207J42410p35010K85253M12766q1674L60177
5277B3382088M59871o20038K03311L58739j141629J321505m90179J66914J91630
5268B3832212n63936P77652q00818N32848k31676K83580p36159L98546J54928
5259B3647177n6706J92147j86536k43261m38214M00117j47572J17597o23775M15797
5249B3076771l3910J33865m7038m56877j57678N1950K89416j008158L43553k79368
5239B1912526m53652L99274k27372R3021n7169l90948k7023J37015j89684N41513
$$ plain form
5307 22310595 22117187 22211740 22657162 22357051 22377139 22525539 22573809 22479443 22818846 22861577
5297 22861577 22920121 22545869 22666025 21917786 22619483 22932795 22612847 22940511 22438218 22906346
5287 22906346 23479151 23069028 23407373 22998166 23140576 22405566 22690819 23103585 23021911 23382088
5277 23382088 23841959 23221921 23425232 23783971 22642342 23963847 23473668 23640582 23832212
5268 23832212 23268276 24045928 23245110 23777958 23546282 23829862 23093703 23492249 23647177
5259 23647177 23590471 23782618 23596082 23352821 22914607 23314724 23167152 23284749 22660974 23076771
5249 23076771 23042861 23176726 23129688 22672811 22515133 22567083 22856499 21848341 22191894 21912526
5239 21912526 21458874 21858148 21630776 21723797 21666628 21275680 21248657 21385672 21195988 21737501
5229B1737501j075982k84824J01931r3448k5861J00908q23394l1622Q28581m39176
5219A9994614k28448J94673k21700p07755P3609j7654N64443q5892m88459m02870
5209A8674561R9773o9224M58211k06408J54572j79631q66619O08215j58552J79626
5199A8694524j16158J76817j87086k51981l17670J92914R12810j226079M15330
5190A8293421J17592n86274J023752n59184j85705K38511j45074K10447o2633
5181A8344853O65592j13327o43594J23942J92033M22467O584j97044O68479p24704
5171A8745281k50722K80004P53161l66725J38895J68218L7490J17584M12879L26214
5161B0362279q17562N67931J39452j77895L53944J02095L07943O07778m95074
$$ plain form
5229 21737501 20661519 20376695 20478626 20385178 20359317 20460225 19636831 19605209 20433790 19994614
5219 19994614 19766166 19960839 19739139 19031384 19104993 19087339 19651782 19565890 19077431 18674561
5209 18674561 18774334 18705110 19163321 18956913 19111485 18931854 18065235 18673450 18514898 18694524
5199 18694524 18578366 18755183 18568097 18316116 17998446 18191360 19104170 17878091 18293421
5190 18293421 18411013 17824739 18848491 18289307 18103602 18342113 18197039 18407486 18344853
5181 18344853 19010445 18897118 18253524 18377466 18569499 18991966 18998550 18801506 19469985 18745281
5171 18745281 18494559 18774563 19527724 19160999 19299894 19468112 19505602 19623186 20036065 20362279
5161 20362279 19544717 20112648 20252100 20074205 20428149 20530244 20838187 21445965 20950891
5152B0950891Q65134J07622o25675M73001L18400J19717m0472K00607k35996Q69472
5142B3002701m5375L29351L09638K961K59132j82490P37501n07699J356880m70795
5132B4791805N12678J33961M71468j30022Q47302l27416J089230M08910J78579
5123B7976495j19110Q08627R3027K95105N21813Q32858K67457P1480N13929O81574
5113C1943255N37407L1892R14490M53599j47720J378162J62218O39949M02593
5104C6315845J161412n07541R01672M09326J127217J288836j47974R65711J31359
5095D1645863J562133N26620M92277J517485K78873J009637O66503R11209Q19666
5086D9430266P58877P66098J142522J033907P64471R36509J039975J120964J502718
$$ plain form
5152 20950891 21816025 21923647 21297972 21770973 22089373 22209090 22168618 22369225 22133229 23002701
5142 23002701 22957326 23286677 23596315 23599276 23858408 23675918 24413419 23905720 25262600 24791805
5132 24791805 25304483 25438444 25909912 25779890 26627192 26299776 27389006 27797916 27976495
5123 27976495 27857385 28666012 28759039 29054144 29575957 30408815 30676272 30747752 31261681 31943255
5113 31943255 32480662 32512554 33427044 33880643 33732923 35111085 35273303 35913252 36315845
5104 36315845 37477257 36969716 37871388 38280714 39407931 40696767 40548793 41514504 41645863
5095 41645863 43207996 43734616 44226893 45744378 46023251 47032888 47699391 48610600 49430266
5086 49430266 50189143 50955241 52097763 53131670 53896141 54832650 55872625 56993589 58496307
5077E8496307R26660J438250J083343M96658J217714J252595R69570J665119P07357
5068F8253573J940900J135628J314222J091310J823331R34065J701297J489925
5060G9684251J589502J023170J535079J565963J674761J301894J571133J411639
5052I1357392J595119J375660J878386J450790R66532K244167R64398K412528
5044A04244972J043317J302880J902500J913811J128694J458426J674692J355857
5036A16025149J068439K089183J905319J260256J887406Q48469K013954J102426
5028A28200601J511104J046718K180753J274170J363531J557386R55369J611487
5020A39701119J058277J462448J365261N76690J335032M54074J582244O48815
$$ plain form
5077 58496307 59422967 60861217 61944560 62441218 63658932 64911527 65881097 67546216 68253573
5068 68253573 70194473 71330101 72644323 73735633 75558964 76493029 78194326 79684251
5060 79684251 81273753 82296923 83832002 85397965 87072726 88374620 89945753 91357392
5052 91357392 92952511 94328171 96206557 97657347 98623879 100868046 101832444 104244972
5044 104244972 105288289 106591169 108493669 110407480 111536174 112994600 114669292 116025149
5036 116025149 117093588 119182771 121088090 122348346 124235752 125084221 127098175 128200601
5028 128200601 129711705 130758423 132939176 134213346 135576877 137134263 138089632 139701119
5020 139701119 140759396 142221844 143587105 144163795 145498827 145952901 147535145 148183960
5012A48183960L05890Q19196R03606Q46729P69896O70444O20893O38292Q5449
5003A53844355J344442N69105m50703J73004P23175M21380K19765P1956M46480
4994A57362959J43376l89307M9691j18848K75545p10511j46242m10911q76567
4985A55179185n50003o24768L58197j303960n59492p06804n46367j504569k59343
4976A49482076r34216j014727o16955j886581j252818j10356j690418r02660j412123
4967A39661222n41512k020365p46776j259040n86337k049338j762928j017785
4959A29677141p29909j606162j353968j413551k106756j184780k118163j328072
4951A17835780j233641j490450j666331j980843j239770j183630j967516k168046
$$ plain form
5012 148183960 148489850 149309046 150212652 151059381 151829277 152499721 153120614 153758906 153844355
5003 153844355 155188797 155757902 155307199 155480203 156203378 156624758 156844523 156916479 157362959
4994 157362959 157506335 157117028 157166719 157047871 157323416 156612905 156466663 156055752 155179185
4985 155179185 154629182 154004414 154362611 153058651 152499159 151792355 151245988 149741419 149482076
4976 149482076 148547860 147533133 146916178 145029597 143776779 143666423 141976005 141073345 139661222
4967 139661222 139119710 137099345 136352569 135093529 134507192 132457854 130694926 129677141
4959 129677141 128947232 127341070 125987102 124573551 122466795 121282015 119163852 117835780
4951 117835780 116602139 115111689 113445358 111464515 110224745 109041115 107073599 104905553
4943A04905553p87819j840018j636454j327090j103163j696861j375807j459818
4935I3678523j844556j883364m44314j872387j184215l65433k436085j226582
4927H2421587j134284j043161j973449r68512j035308j161508j779419q54478
4919G2471468j254591m09479j256293j223594j138186n45865r85537j050371o94088
4910F3913464j557967n65682r84728p80053l91770m85955j036337o15113j573356
4901E5922503L93881j209802m56773m46259j065197j13372q28717n0814l93212
4892E1752238n54356p48110j21276n18443o60534j89994J00601J15949j68039
4883D9008036k61657j51426l73980l20656R8108J31927m13642K07706l01284P7410
$$ plain form
4943 104905553 104117734 102277716 100641262 99314172 98211009 96514148 95138341 93678523
4935 93678523 91833967 89950603 89506289 87633902 86449687 86084254 83648169 82421587
4927 82421587 81287303 80244142 78270693 77302181 76266873 75105365 73325946 72471468
4919 72471468 71216877 70807398 69551105 68327511 67189325 66643460 65657923 64607552 63913464
4910 63913464 62355497 61789815 60805087 60025034 59633264 59147309 58110972 57495859 55922503
4901 55922503 56316384 55106582 54649809 54203550 53138353 53024981 52196264 52145450 51752238
4892 51752238 51197882 50449772 50328496 49810053 49149519 48959525 49060126 49176075 49008036
4883 49008036 48746379 48594953 48220973 47900317 47998425 48130352 47716710 47924416 47623132 47700542
4873D7700542M49163l96791n07426Q10018m64530Q8173K31644J89983M61307O56482
4863D9218565j34471j40142j44309N52525J223199k70349k54186O84456j40037
4854E0595251M28027Q30270P37346K00092O24147M42564O93793k61981J217617
4845E5507126O359J179763Q14591M19940K85906M20467P02027J066018J281151
4836F1683348O98392Q15791Q03913N92717R14989J162866Q2222K023236O33491
4827F9410965O13321J490809J338289K94267J959011J972132K01408J845797R68803
4818H0094802J304693J945559J051434J913652J930837J087238J455473K368829
4810I3152517J396157J845818K104938J521901K324607J388962K663513K579438
$$ plain form
4873 47700542 48149705 47752914 47245488 48055506 47590976 47679149 47910793 48100776 48562083 49218565
4863 49218565 49084094 48943952 48799643 49352168 50575367 50305018 50050832 50735288 50595251
4854 50595251 51023278 51853548 52590894 52790986 53415133 53857697 54551490 54289509 55507126
4845 55507126 55513485 56693248 57507839 57927779 58213685 58634152 59336179 60402197 61683348
4836 61683348 62381740 63197531 64001444 64594161 65509150 66672016 66754238 68777474 69410965
4827 69410965 70024286 71515095 72853384 73147651 75106662 77078794 77280202 79125999 80094802
4818 80094802 81399495 83345054 84396488 86310140 88240977 89328215 90783688 93152517
4810 93152517 94548674 96394492 98499430 100021331 102345938 103734900 106398413 108977851
4802A08977851J441469J942471K717196K251981K985957K340378K213490K926777
4794A27797570K181127L244873K710024K594571L346263K859388J989631M197453
4786A50920900L647276L557354K891589L487298K534275M463415L953676M032550
4778A79488333L453197M040138L580312M360423M100173M298917L856699M868115
4770B12046307M163149M599415M061325M746355M576647M861880M923733M543974
4762B48522785M051931N752111M582031M449053N767668M395461M288214M454287
4754B86263541M792781M399045M659117M577973L987444M676827L693406M714263
4746C21764397L145995L436086M225692K890116M019348K723635K971121K464405
$$ plain form
4802 108977851 110419320 112361791 115078987 117330968 120316925 122657303 124870793 127797570
4794 127797570 129978697 133223570 135933594 138528165 141874428 144733816 146723447 150920900
4786 150920900 154568176 158125530 161017119 164504417 167038692 171502107 175455783 179488333
4778 179488333 182941530 186981668 190561980 194922403 199022576 203321493 207178192 212046307
4770 212046307 216209456 220808871 224870196 229616551 234193198 239055078 243978811 248522785
4762 248522785 252574716 258326827 262908858 267357911 273125579 277521040 281809254 286263541
4754 286263541 291056322 295455367 300114484 304692457 308679901 313356728 317050134 321764397
4746 321764397 324910392 328346478 332572170 335462286 339481634 342205269 345176390 347640795
4738C47640795K717230K252408K144544J931607P42611J390026J147528J164393
4730C61131142O96987j80723k41303J22838j090896l19621o92378j076727k142100
4721C56207219j175957k381279k185103k359566k224333l740194k208782l244269
4713C36687736l966420l206335l795568m209207l749620l867029m250632m325680
4705C05317245l881195n435260m061322n496682n451700m260249m980820m485869
4697B67264148n284701m614153n392979n812691m267326m717509n392971n344040
4689B26437778l930234n737429m982627m661822m141088m868153n691935m023975
4681A88400515n114225l801272m472430l946806m410811m717954l582164l993263
$$ plain form
4738 347640795 350358025 352610433 354754977 356686584 357429195 358819221 359966749 361131142
4730 361131142 361828129 361647406 361406103 361528941 360438045 360118424 359426046 358349319 356207219
4721 356207219 355031262 352649983 350464880 348105314 345880981 342140787 339932005 336687736
4713 336687736 332721316 329514981 325719413 321510206 317760586 313893557 309642925 305317245
4705 305317245 301436050 296000790 291939468 286442786 280991086 276730837 271750017 267264148
4697 267264148 261979447 257365294 251972315 246159624 241892298 237174789 231781818 226437778
4689 226437778 222507544 216770115 211787488 207125666 202984578 198116425 192424490 188400515
4681 188400515 183286290 179485018 175012588 171065782 166654971 161937017 158354853 154361590
4673A54361590l734848l829427m497073k821061l569027m193215l707492l021645
4665A24987802l095633l205231k695488l099815k521027l769700k322195k582083
4657A01696630l126114k222627k848292j439944k695456k944942j500401k365510
4649H2553344k041529k456176k312345r48449k100404k045576j612215j457166
4641F7579484j546866j785250j403662j866052j182561j706152k014466j66462
4633E5908013j564332j642351p05726r71482j652989p03004j281576j113895q29771
4624D5442887j291848j048073k71508j101619p90182p97618n60120j038180j176123
4615C7367616m47225n15567p07680j269201k60936j170262l1979p16933n65730
$$ plain form
4673 154361590 150626742 146797315 142300242 139479181 135910154 131716939 128009447 124987802
4665 124987802 121892169 118686938 115991450 112891635 110370608 106600908 104278713 101696630
4657 101696630 98570516 96347889 93499597 92059653 89364197 86419255 84918854 82553344
4649 82553344 80511815 78055639 75743294 74794845 72694441 70648865 69036650 67579484
4641 67579484 66032618 64247368 62843706 60977654 59795093 58088941 56074475 55908013
4633 55908013 54343681 52701330 51995604 51024122 49371133 48668129 47386553 46272658 45442887
4624 45442887 44151039 43102966 42831458 41729839 40939657 40142039 39581919 38543739 37367616
4615 37367616 36920391 36404824 35697144 34427943 34167007 32996745 32964766 32247833 31682103
4606C1682103l28646j109049j03930j05557n46972n28184j61124r11027m34370
4597B7453244o07022n39459l95956l83269j42015p81313k04910J90105l48533
4588B4240872m19224p09258J484p46618j1739n70865k97399j5688n5845p92898
4578B0622822J30397j30054j140337O01799p61982L83973o2701n38672j36858
4569A8968387m09517K46651k31818k41342j75235l23532o08482N77156n86847
4560A7215421l88434k19839l18924k70729L14509j19470J9191j60891J54741j20290
4550A6105285K93337j023432j08787j93578J84510r10601N40434K81517k53718
4541A4914967m17860J87201q2214o39023L97244K4187q8209r3328K69537p07365
$$ plain form
4606 31682103 31353457 30244408 30140478 30034921 29487949 28959765 28798641 27887614 27453244
4597 27453244 26846222 26306763 25910807 25527538 25385523 24604210 24399300 24589405 24240872
4588 24240872 23821648 23112390 23113874 22367256 22355517 21784652 21487253 21471565 21415720 20622822
4578 20622822 20753219 20623165 19482828 20084627 19322645 19706618 19643917 19105245 18968387
4569 18968387 18558870 18805521 18573703 18332361 18157126 17833594 17225112 17802268 17215421
4560 17215421 16826987 16607148 16288224 16017495 16332004 16212534 16231725 16070834 16225575 16105285
4550 16105285 16398622 15375190 15266403 15072825 15257335 14346734 14887168 15168685 14914967
4541 14914967 14497107 14684308 14602094 13963071 14360315 14384502 14296293 14202965 14472502 13765137
4531A3765137L12443j11322m3054M9714o56492K74040N1719O64957p69158j84388
4521A3353596P1019k55689J4006K79089r44555O07492o0163K58668k83432M4752
4511A3084783J15985O1948K00849o82725o00804L10383Q79921n8894j7521L24252
4501A3618177m34127q07581P90270J65904M5558M44472j166777j524N64797K91330
4491A3510499M53026k18267r6557k82870l59376L59938P08555p83892L97923k07326
4481A3481653L89485l41845R45417p08497J35713j84998N29824N78378l09020
4472A4516110l28062k30812P6079L4823L2503K56078P53886o56482M54562J47831
4462A5056516j21211K69508k00796J68028q7447L23203J65637l3452n3281M68160
$$ plain form
4531 13765137 14077580 13966258 13923204 13972918 13316426 13590466 13642185 14307142 13537984 13353596
4521 13353596 13424615 13168926 13182932 13462021 12517466 13124958 13064795 13323463 13040031 13084783
4511 13084783 13200768 13262716 13463565 12780840 12180036 12490419 13370340 13311446 13293925 13618177
4501 13618177 13184050 12376469 13166739 13332643 13378201 13822673 12655896 12654372 13219169 13510499
4491 13510499 13963525 13745258 13648701 13365831 13006455 13366393 14074948 13291056 13688979 13481653
4481 13481653 13871138 13529293 14474710 13766213 13901926 13716928 14246752 14825130 14516110
4472 14516110 14188048 13957236 14033315 14068138 14100641 14356719 15110605 14454123 14908685 15056516
4462 15056516 14935305 15204813 15004017 15172045 15084598 15407801 15573438 15539986 15486705 15954865
4452A5954865M70305n82026M70833j59174L67279n04535L7892O45306L05953l91871
4442A6614827Q12052K59461p99378K81158Q48193k95459M79624j92550J15851
4433A8123779K85617O10139R2920O0375M4054j09597K23208N37355P78208J60255
4423B0806313N22430k46828N50457l64303Q63146j66485O41897L45325J48131
4414B3100083O55553k9532M33473N76113L41483M45137O48066k76934O13980P94673
4404B7302095N33052N29793K39077K52425J422891L60152L60044R29249L6691
4395C1965469J068072M14992N63240J256174R2785J104702J110122J081991M95645
4386C9153192k8624J388290J444551J180401N89510J213215R22893J184034O43971
$$ plain form
4452 15954865 16425170 15843144 16313977 16154803 16522082 16017547 16055439 16700745 17006698 16614827
4442 16614827 17426879 17686340 16886962 17168120 18016313 17720854 18200478 18007928 18123779
4433 18123779 18409396 19019535 19112455 19172830 19216884 19107287 19330495 19867850 20646058 20806313
4423 20806313 21328743 21081915 21632372 21268069 22131215 21964730 22606627 22951952 23100083
4414 23100083 23755636 23726104 24159577 24735690 25077173 25522310 26170376 25893442 26507422 27302095
4404 27302095 27835147 28364940 28604017 28856442 30279333 30639485 30999529 31928778 31965469
4395 31965469 33033541 33448533 34011773 35267947 35360732 36465434 37575556 38657547 39153192
4386 39153192 39124568 40512858 41957409 43137810 43727320 44940535 45863428 47047462 47691433
4377D7691433J346710J231732R40941J243382R30530J384673N95432J839406R76117
4368E8180356J252641J612836L90579J539670N46545J528043J409422J205456
4360F7665548R45514Q65121J099992Q91661J575279N29823J618410J460191Q85473
4351G7537012R02681J286244J003868Q83725J020384P39703J534045N43358N65940
4342H6016960J436939r5036J945756L19820K93704N49283N92738N91840M31688
4333I2083692N2653k84480N24301J44745K05707l95211O38861j240700N72177
4324I2301745j06009L79617K8002j221134K91760o00686M28522m62020n82259
4315I0457538n06343q31298l82696k58201r2450j290558r48564k94821o99830
$$ plain form
4377 47691433 49038143 50269875 51210816 52454198 53384728 54769401 55364833 57204239 58180356
4368 58180356 59432997 61045833 61436412 62976082 63522627 65050670 66460092 67665548
4360 67665548 68611062 69476183 70576175 71467836 73043115 73572938 75191348 76651539 77537012
4351 77537012 78439693 79725937 80729805 81613530 82633914 83373617 84907662 85451020 86016960
4342 86016960 87453899 87358863 89304619 89624439 89918143 90467426 91060164 91652004 92083692
4333 92083692 92136345 91851865 92376166 92520911 92726618 92331407 92970268 91729568 92301745
4324 92301745 92195736 92575353 92603355 91382221 91673981 91073295 91501817 91039797 90457538
4315 90457538 89951195 89119897 88737201 88479000 88386550 87095992 86147428 85852607 85152777
4306H5152777j610166K81666j830524r86075O3903k146593j58952j135987j137765
4297G6492284j348341o59614m03554j641919r02155r42750r73416j546815k57898
4288F7815822j187171o04265j366272j568587j065561j425120k39675m10457j261412
4279E8687302r64439j477978j093647l17054j192438m91562j243747n62380j242421
4270E0101636q57587m13938n52190j975575m1007j051686j204977o96106j213264
4261D2095306K55069j147119o92366j036432q09344q09739m97746p05448j318502
4252C5333679m76155m65650n36994j076507m46944j014461n97147m87745q85210
4243B9346866q50275n31303k08423q70989l67768j015023o3224p11609n76390
$$ plain form
4306 85152777 83542611 83824277 81993753 81007678 81071581 78924988 78766036 77630049 76492284
4297 76492284 75143943 74484329 74080775 72438856 71536701 70593951 69620535 68073720 67815822
4288 67815822 66628651 66024386 64658114 63089527 62023966 60598846 60359171 59948714 58687302
4279 58687302 57722863 56244885 55151238 54834184 53641746 53150184 51906437 51344057 50101636
4270 50101636 49244049 48830111 48277921 46302346 46261339 45209653 44004676 43308570 42095306
4261 42095306 42350375 41203256 40510890 39474458 38665114 37855375 37357629 36652181 35333679
4252 35333679 34857524 34391874 33854880 32778373 32331429 31316968 30719821 30232076 29346866
4243 29346866 28496591 27965288 27756865 26885876 26518108 25503085 25439861 24728252 24151862
4234B4151862q22037m83294r43490j77922n84663k26149r51427Q4048l71120o48942
4224A9026866p32367k49518n42396r26724M42934o08661q04168j83508n98183
4215A4824275j36321K4197p23937K30566p19126n62688k45714L65572j236186
4206A1820638K39472l26189k80491p2933n17953l84556K91906p14844O27681p47702
4196I935029o68748J45480n53200o91407M59263q12941J81164K32077J55829r24679
4186G457867O82346q4878p22199J45348n76965l7079M0939k38061j45750k35601
4176F285967J281844j379197J40045l73573L51644o85345M11723m74514k65144
4167E293450l01779L64474m49335J66651L02549l19260m82222L28416L3708Q2488
$$ plain form
4234 24151862 23329825 22846531 21903041 21725119 21140456 20914307 19962880 20046928 19675808 19026866
4224 19026866 18294499 18044981 17502585 16575861 17018795 16410134 15605966 15422458 14824275
4215 14824275 14687954 14712151 13988214 14218780 13499654 12936966 12691252 13056824 11820638
4206 11820638 12060110 11733921 11453430 11380497 10862544 10477988 10769894 10055050 10682731 9935029
4196 9935029 9266281 9411761 8858561 8167154 8626417 7813476 7994640 8226717 8382546 7457867
4186 7457867 8140213 8055335 7333136 7478484 6901519 6864440 6905379 6667318 6521568 6285967
4176 6285967 7567811 6188614 6328659 5955086 6306730 5621385 6033108 5558594 5293450
4167 5293450 4991671 5356145 4906810 5073461 5376010 5056750 4574528 4902944 4936652 5019140
4157E019140m84056L77353n50825l65533M3780j28828J86209K81469j44515j6371
4147D217823J5637O5590m83403K29833r6361r0325j18869m4687j52794L73544
4137C915988r31466J086702m76141j35054l44453J25754J78622n48481P58280
4128C629751m90625L64749m38516J99858O41169p56098J60835K20582j067630
4119B464075M24684O95013j016304n6469J50937J3750K89462J01443P0607N4574
4109C191772n78607j60629N37070m47285N84996o39806n4135P8663K65176o2820
4099B714395m0903J37633n9331M51876o4787o96810j05844P21770L851p2546m79676
4088B509628R8133j4918o34844O43291O05932p17278J12632J150k27781j35616
$$ plain form
4157 5019140 4535084 4912437 4361612 3996079 4039859 3911031 4097240 4378709 4234194 4217823
4147 4217823 4233460 4299050 3815647 4045480 3949119 3858794 3739925 3695238 3542444 3915988
4137 3915988 2984522 4071224 3595083 3460029 3115576 3241330 3419952 2871471 3629751
4128 3629751 3139126 3503875 3065359 3265217 3906386 3150288 3311123 3531705 2464075
4119 2464075 2888759 3583772 2567468 2510999 2661936 2675686 2965148 3066591 3137198 3191772
4109 3191772 2613165 2452536 2989606 2542321 3127317 2487511 2433376 2512039 2777215 2714395
4099 2714395 2673492 2811125 2751794 3203670 3138883 2442073 2336229 3057999 3061850 2989304 2509628
4088 2509628 2607761 2592843 1957999 2601290 3207222 2489944 2602576 2603726 2375945 2240329
4078B240329n9599R11636n88657J90938n87852M92653q3832M91226l74692j6138
4068B616012O46911q96783K24372k56539L66333m29135N18819k94776j22180o6475
4058B306559N69878j46641j62030l04241K99454j31686j36486N79833o9433J66518
4048B971725m81495N19899n32283K53495j15706M81315n72549M45349K1175l27993
4038B662932K16865O12533m27348L05045L78135o03122o1369L37354J16306P5349
4028C612680o00449K5281O01995K39369j44167J58706n23648M16871J12632J1544
4018C910814L83573n56167Q23478n40352L32009K39907k91605P57310p61675J67826
4008D465118P06459k40690m1930J44089J57400k82923K51997j49904J72062O86200
$$ plain form
4078 2240329 2180730 3092366 2503709 2694647 2106795 2599448 2515616 3006842 2632150 2616012
4068 2616012 3262923 2366140 2590512 2333973 2700306 2271171 2789990 2495214 2373034 2306559
4058 2306559 2876437 2729796 2567766 2263525 2562979 2431293 2294807 2874640 2805207 2971725
4048 2971725 2490230 3010129 2477846 2731341 2615635 3096950 2524401 2969750 2990925 2662932
4038 2662932 2879797 3492330 3064982 3370027 3748162 3145040 3083671 3421025 3537331 3612680
4028 3612680 3012231 3037512 3639507 3878876 3734709 3893415 3369767 3786638 3899270 3910814
4018 3910814 4294387 3738220 4561698 4021346 4353355 4593262 4301657 5058967 4297292 4465118
4008 4465118 5171577 4930887 4888957 5033046 5190446 4907523 5159520 5009616 5181678 5867878
3998E867878Q1849J58931j19385K25831K28480J25408M1931n0087j270j46262
3988F413304K89906M81883r4247K38503k36842L29338J7309j35996J1549P29066
3978H043773n59563K8563J90240K77001q926J64810N41963n82364l06596N80475
3968H369376n92270O13919l31977J83738M04653J71226p70412l13869R81956o87160
3958H029180m35850M81192j80669l6396j34737J35973j79006j24084K64785k75936
3948G544452m53722J143157j062833P35321m07242K32268j062398M65863o96758
3939F438108M26586r7503L56364j267855N78389j21424l18514m3916n94331L32562
3929E688466m19786J90349m7625K8718k04826k20738j66842K25848q8622k06533
$$ plain form
3998 5867878 5949727 6108658 5989273 6215104 6443584 6568992 6610923 6560836 6559566 6413304
3988 6413304 6703210 7185093 7090846 7329349 7092507 7421845 7439154 7303158 7314707 8043773
3978 8043773 7484210 7512773 7703013 7980014 7971088 8135898 8677861 8095497 7788901 8369376
3968 8369376 7777106 8391025 8059048 8242786 8647439 8818665 8048253 7734384 8716340 8029180
3958 8029180 7593330 8074522 7893853 7857457 7722720 7858693 7679687 7555603 7820388 7544452
3948 7544452 7090730 8233887 7171054 7906375 7499133 7731401 6669003 7134866 6438108
3939 6438108 6864694 6767191 7123555 5855700 6434089 6312665 5994151 5950235 5355904 5688466
3929 5688466 5268680 5459029 5411404 5440122 5235296 5014558 4847716 5073564 4984942 4778409
3919D778409o76418J54586M3326L34387q13472m61288M49921r8824J86742n84185
3909C313184j71659m53076N6248J67166J81418m91638l96213q87J79302N24252
3899B908097j020550P61570n40089K43259n45873K8660J69989j09990M688p50244
3889A149517M42537j04055l95023L05303l14951M02111k86964o52129j69194N52672
3879I29824r07M94929q60417j44994N92308j34053m01547O98801n13048k166J18457
3868G77187J02983K46533m05344o60538M49031j0404k91070M02757n19679L25512
3858D16968k8964n18391M66468m94521K41429M33308o60830m46022J183365l63420
3848B29390l94274k29203L08563j75227M38646k64237n1039l87089L82891L85032
$$ plain form
3919 4778409 4101991 4256577 4299903 4634290 3820818 3359530 3809451 3710627 3897369 3313184
3909 3313184 3141525 2688449 2744697 2911863 3093281 2601643 2205430 2204543 2383845 2908097
3899 2908097 1887547 2649117 2109028 2352287 1806414 1835074 2005063 1895073 1899761 1149517
3889 1149517 1592054 1487999 1092976 1398279 1083328 1485439 1198475 546346 377152 929824
3879 929824 928917 1423846 563429 418435 1010743 876690 475143 1173944 660896 658730 777187
3868 777187 880170 1126703 721359 60821 509852 499448 208378 611135 91456 416968
3858 416968 388004 -130387 336081 -158440 82989 516297 -144533 -590555 592810 229390
3848 229390 -164884 -394087 -85524 -260751 177895 -86342 -137381 -524470 -141579 243453
3838B43453k53644J24382j47769k76610j95147J035195q64100J71957r0917j30325
3828c83525J56590R5710n23966N3066K28307K0425L08086j35932k44568l27375
3818g53182m267J67076O29368q03069j57572n36810N14376N1169L68255O49338
3808A24682p39490o58841O76126J2682K2063n44174O32301m2384k25024N9013
3798f83046j05003M16153m36507K62617r9995l82654K18529m07764L77866K57846
3788e81958K22569l41669N43739j97133j26465n96557N06416J57925n7014l95254
3778h65401K48511l73796m46264N57890l02549K93854k485m44239J80042N31297
3768f23140O3388p73855p394m19967J297576k96608J60955p26144M87840q29320
$$ plain form
3838 243453 -10191 114191 -33578 -310188 -505335 529860 -334240 -162283 -253200 -383525
3828 -383525 -226935 -131225 -655191 -602125 -373818 -353393 -45307 -181239 -425807 -753182
3818 -753182 -757449 -590373 38995 -764074 -921646 -1458456 -944080 -892911 -524656 124682
3808 124682 -614808 -1273649 -597523 -584841 -562778 -1106952 -474651 -517035 -742059 -683046
3798 -683046 -788049 -371896 -808403 -545786 -645781 -1028435 -809906 -1217670 -839804 -581958
3788 -581958 -359389 -701058 -157319 -354452 -480917 -1077474 -571058 -413133 -470147 -865401
3778 -865401 -616890 -990686 -1436950 -879060 -1181609 -887755 -890240 -1334479 -1154437 -623140
3768 -623140 -559752 -1333607 -1341001 -1760968 -463392 -760000 -599045 -1325189 -837349 -1666669
3758a666669J202073m92109K85024K40889m08667J48373l11229R0225N05031l62209
3748g69268m06392m99520J097186o03995J84660L47423o71240l23988R77232o22096
3738a289998m2478M71821k39418N6191K85636j62336n63720L45046m39908M92382
3728a086782k07510O90036q16815M6416M00832o37340Q11853l34303j68116j76652
3718a478381O48319l97863K07843j93559M57078m09505k00724M86553k31366j11296
3708a222901K49279j7563J80964K08325k58509l49395M32896n6043n50360N64196
3698h19111O4458l15337k55887M09561J19411n37545R7969L93899j00252n98503
3688a541337j02907N15973K53538p97884O98668k37589K08839J21060K01301l65768
$$ plain form
3758 -1666669 -464596 -956705 -671681 -430792 -839459 -691086 -1002315 -912090 -407059 -769268
3748 -769268 -1175660 -1675180 -577994 -1181989 -997329 -649906 -1321146 -1645134 -667902 -1289998
3738 -1289998 -1332476 -860655 -1100073 -1043882 -758246 -920582 -1484302 -1139256 -1579164 -1086782
3728 -1086782 -1294292 -604256 -1421071 -1374655 -973823 -1611163 -799310 -1133613 -1301729 -1478381
3718 -1478381 -830062 -1227925 -1020082 -1213641 -756563 -1166068 -1366792 -880239 -1111605 -1222901
3708 -1222901 -973622 -991185 -810221 -601896 -860405 -1209800 -776904 -832947 -1383307 -819111
3698 -819111 -754653 -1069990 -1325877 -916316 -796905 -1334450 -1236481 -842582 -942834 -1541337
3688 -1541337 -1644244 -1128271 -874733 -1672617 -973949 -1211538 -1002699 -881639 -680338 -1046106
3678a046106J2797m6887j08431P1602k38768M34473l42922l8464N1496j59680
3668a410890k6511O25162k09785n1663m21855J17447N6698j49694N25206q939
3658i54824l30739l49346Q1919j08971M47536J84036n31989q347k17035N92861
3648a194899L74417l00144N7695J09368l28811N43927l73775J5298K16341J46660
3638g33923j97627q0719n49379l3263K87598L1569K68331k63365m0497j69271
3628a480546M85758l30031O58269m64889Q694l83265J80811n25583L15848N07898
3618a027036j1977m0852p23137P07265k07128L65365j85567j01537K43759k62422
3608a243267L66079p51492Q62090j96098l0307k57195j00848J11495m49689O23555
$$ plain form
3678 -1046106 -1033309 -1080196 -1188627 -1117025 -1355793 -921320 -1264242 -1302706 -1251210 -1410890
3668 -1410890 -1437401 -812239 -1022024 -1073687 -1495542 -1378095 -1321397 -1471091 -945885 -954824
3658 -954824 -1285563 -1634909 -1552990 -1661961 -1214425 -1030389 -1562378 -1570725 -1787760 -1194899
3648 -1194899 -820482 -1120626 -1062931 -953563 -1282374 -738447 -1112222 -1096924 -880583 -733923
3638 -733923 -931550 -1012269 -1561648 -1594911 -1307313 -1275744 -1007413 -1270778 -1311275 -1480546
3628 -1480546 -994788 -1324819 -666550 -1131439 -1122745 -1506010 -1325199 -1850782 -1534934 -1027036
3618 -1027036 -1039013 -1079865 -1803002 -1095737 -1302865 -937500 -1123067 -1224604 -980845 -1243267
3608 -1243267 -877188 -1628680 -766590 -962688 -992995 -1250190 -1351038 -1239543 -1689232 -1065677
3598a065677n7059L4228n8011L5940n61291P97061k46084k14256J89687K10537
3588i34925m63240L52901N0918J10209p51780Q50735k55821l13416J78641K42371
3578i33407J144m65337M38196o19291m7737K49370J56008k62413N69845n90841
3568a504463K87772n03920M68389l87024L13435J56517k93805j67084J89068K26300
3558a214815m8321l06427l8493J94223j21643j13504M37088K74312j92175J93272
3548i36483j82963k86664J24755j26073j89300M41637n04628P27686L2362k68350
3538a168021q3033J81261n45933O42913o13114L90715P7938m04402L12831j88354
3528a397199j27742l24855Q23350k15576N56475j316548M44458j28584J83448
$$ plain form
3598 -1065677 -1122736 -1088508 -1146519 -1110579 -1671870 -874809 -1120893 -1335149 -1145462 -934925
3588 -934925 -1398165 -1045264 -994346 -884137 -1635917 -785182 -1041003 -1354419 -1175778 -933407
3578 -933407 -932263 -1397600 -959404 -1578695 -1626432 -1377062 -1221054 -1483467 -913622 -1504463
3568 -1504463 -1216691 -1720611 -1252222 -1639246 -1325811 -1169294 -1463099 -1630183 -1441115 -1214815
3558 -1214815 -1263136 -1569563 -1608056 -1413833 -1535476 -1648980 -1211892 -937580 -1129755 -936483
3548 -936483 -1119446 -1406110 -1281355 -1407428 -1596728 -1155091 -1659719 -932033 -899671 -1168021
3538 -1168021 -1251054 -1069793 -1615726 -972813 -1585927 -1195212 -1117274 -1521676 -1208845 -1397199
3528 -1397199 -1524941 -1849796 -1026446 -1242022 -685547 -2002095 -1557637 -1686221 -1502773
3519a502773L20952k68028O11403q44387J47288K24039N54988l76223O05650q71647
3509a398738n9798L56728J49857m68489L64198J5746K8619o36373Q64154k53380
3499a037476o3524K97218k08719o98722L80036K68766l58911l68109J031761k21088
3489i78768m01338k4664N46144k21770Q4245j75345J05339K98644o10944K0349
3479a358108j26867O44755j36812l7247n05573J29590L64907l48000P80080p09932
3469a303207J13336M35555l5205n79605N6786P0517k18128P18749k30789n79378
3459a551369k7598N71675J03776o3729m31793P79896q60148L20814k04301L83836
3449i78941r1943l18893P9136l6710o81454K64129J008892k48369j40318k56959
$$ plain form
3519 -1502773 -1181821 -1449849 -838446 -1682833 -1535545 -1311506 -756518 -1132741 -527091 -1398738
3509 -1398738 -1458536 -1101808 -951951 -1420440 -1056242 -1040496 -1011877 -1648250 -784096 -1037476
3499 -1037476 -1101000 -803782 -1012501 -1711223 -1331187 -1062421 -1421332 -1789441 -757680 -978768
3489 -978768 -1380106 -1404770 -858626 -1080396 -996151 -1171496 -1066157 -767513 -1378457 -1358108
3479 -1358108 -1484975 -840220 -977032 -1014279 -1519852 -1390262 -1025355 -1373355 -593275 -1303207
3469 -1303207 -1189871 -754316 -789521 -1369126 -1312340 -1241823 -1459951 -741202 -971991 -1551369
3459 -1551369 -1578967 -1007292 -903516 -967245 -1399038 -619142 -1479290 -1158476 -1362777 -978941
3449 -978941 -1070884 -1389777 -1310641 -1347351 -2028805 -1764676 -755784 -1004153 -1144471 -1401430
3439a401430j45308K55322k01633N35116p72461J185323m20938k34381R4347J93807
3429i12236j76043j90729N26984k36239L1357j01495N88004j93499K08457r85718
3419a441157O01535l77965k70820M77081J58035m33775Q6834L94041L17528n96959
3409a085622K77597L73166o43383P1949N81747k01500k82230J4662k2233k85589
3399a201436L81639p6484l63218P04908j88990k54365L36815K85451n48935J603
3389i23012j81830O71885m46236M72106m87949M42466n29422J70389O7847L01429
3379d42327Q32821j056678l7641L58713q1959M1983j2163P69801o82880j66067
3369d76397j55873Q82503j02629l25916k71694j7436l64M40358J2690k28762M49734
$$ plain form
3439 -1401430 -1546738 -1291416 -1493049 -957933 -1730394 -545071 -966009 -1200390 -1106043 -912236
3429 -912236 -1088279 -1279008 -752024 -988263 -956906 -1058401 -470397 -663896 -455439 -1441157
3419 -1441157 -839622 -1217587 -1488407 -1011326 -853291 -1287066 -1200232 -806191 -488663 -1085622
3409 -1085622 -808025 -434859 -1078242 -1006293 -424546 -626046 -908276 -893614 -915847 -1201436
3399 -1201436 -819797 -896281 -1259499 -554591 -743581 -997946 -661131 -375680 -924615 -923012
3389 -923012 -1104842 -432957 -879193 -407087 -895036 -452570 -981992 -811603 -743756 -442327
3379 -442327 390494 -666184 -703825 -345112 -427071 -385088 -397251 372550 -310330 -476397
3369 -476397 -632270 250233 147604 -178312 -450006 -467442 -467806 -27448 -14758 -243520 206214
3358B06214J73845j90219K21342j88442m4132J06516L47876j30760j64886J70680
3348E08034J71209J07576N7004k51372M45306k15009l93473P72319k22071p19996
3338B59527L90865L10581o31358J009793r51852N40530n64795P03177m93288J85108
3328G58288j54211m69848M32144q4594R8756j05438L56087l6545j05070k79580
3318D09989q2421J84479r9106M98522j082836K03111J92963m16602J02998k21830
3308c10733n28866O21711K42042L51971k52423k45778m01495L97998n00844j56111
3298g82528L9689Q3185j86303J74079K50278o8366q8163k26126J06616r4466j37173
3287i29278j13107Q93363j76869n51493N58497m4747q38907O50254k44229j38961
$$ plain form
3358 206214 380059 189840 411182 222740 178608 285124 633000 502240 337354 508034
3348 508034 679243 786819 843823 592451 1037757 822748 429275 1201594 979523 259527
3338 259527 650392 960973 329615 1339408 387556 928086 363291 1066468 573180 758288
3328 758288 604077 134229 566373 481779 580535 475097 831184 794639 689569 409989
3318 409989 327568 512047 412941 911463 -171373 31738 224701 -191901 -88903 -310733
3308 -310733 -839599 -217888 24154 376125 123702 -122076 -523571 -125573 -626417 -782528
3298 -782528 -742839 -659654 -845957 -671878 -421600 -489966 -578129 -804255 -697639 -792105 -929278
3287 -929278 -1042385 -149022 -325891 -877384 -318887 -363634 -1202541 -552287 -796516 -935477
3277i35477o15050K66092M94697K60315j02576q05085M31788N43178j45257N5984
3267e51391k45155p18053Q47900n02657K93045k27747J69914j12658k42175j26257
3257a415234P7907J16560K82130j43385j19513m60808K14569o644J80989J15016
3247a158413j03279M5158k02619N25521R8965j71901J54899k19935k86792M06450
3237i11946j5784j15745m04376M97165j34692j0937j41080K00587L48280k47465
3227i35993j07938n61605J44154j89156K72589J6036J26164n18649N46938M00210
3217h07250k50477j58417l95845R119L7777O0270L76044L0766m71011j77060N45680
3206a200404o79949P73043M81983j312421P82562j13977l06130O00885l78424
$$ plain form
3277 -935477 -1550527 -1284435 -789738 -529423 -631999 -1437084 -1005296 -462118 -607375 -551391
3267 -551391 -796546 -1514599 -666699 -1169356 -876311 -1104058 -934144 -1046802 -1288977 -1415234
3257 -1415234 -1337327 -1220767 -938637 -1082022 -1201535 -1662343 -1447774 -1454418 -1273429 -1158413
3247 -1158413 -1261692 -1216534 -1419153 -893632 -794667 -966568 -811669 -1031604 -1318396 -911946
3237 -911946 -927730 -1043475 -1447851 -950686 -1085378 -1096315 -1237395 -1036808 -688528 -935993
3227 -935993 -1043931 -1605536 -1461382 -1650538 -1377949 -1361913 -1235749 -1754398 -1207460 -807250
3217 -807250 -1057727 -1216144 -1611989 -1602870 -1565093 -1504823 -1128779 -1098013 -1569024 -1746084 -1200404
3206 -1200404 -1880353 -1107310 -625327 -1937748 -1155186 -1269163 -1575293 -974408 -1352832
3197a352832J06281k70887L90544l15729N8217J65857m38998M10214j52735K13021
3187a187047o12508N47328k61134p7509N92756j84526l90760Q74282r54439K24928
3177a428629m55854M97709J75162l55897p8246N41855O10056m41770j041649N71495
3167a405768M40724k91202m21520O56862O9860n08614j44116K04611O78857n13782
3157a234088k88432K72374O81467q92552k00291K24180M97584k42679j34346m16683
3147a733466M01003m6163l81253N78160j23821j57557k11880L5701O54395r2505
3137a077386k85832K32936k84213j9405M98345m75271J78254o030o63342M76709
3127a425235k52601j30783L38379N07071p65470R13200m82418k18819M90643k33090
$$ plain form
3197 -1352832 -1246551 -1517438 -1126894 -1442623 -1384406 -1218549 -1657547 -1247333 -1400068 -1187047
3187 -1187047 -1799555 -1252227 -1513361 -1590870 -998114 -1182640 -1573400 -699118 -1653557 -1428629
3177 -1428629 -1884483 -1386774 -1211612 -1567509 -1645755 -1103900 -493844 -935614 -1977263 -1405768
3167 -1405768 -965044 -1256246 -1677766 -1020904 -951044 -1459658 -1603774 -1399163 -720306 -1234088
3157 -1234088 -1522520 -1250146 -568679 -1461231 -1661522 -1437342 -939758 -1182437 -1316783 -1733466
3147 -1733466 -1332463 -1378626 -1759879 -1181719 -1305540 -1463097 -1674977 -1639276 -984881 -1077386
3137 -1077386 -1363218 -1130282 -1414495 -1433900 -935555 -1410826 -1232572 -1238602 -1901944 -1425235
3127 -1425235 -1677836 -1808619 -1470240 -963169 -1728639 -815439 -1297857 -1516676 -1026033 -1259123
3117a259123m85453J32781M56635k12314k1054j0406l3890J89915P8216J19296
3107a045397p16411m3145K24295K91140K77391o25090L1195l4245L54389K13983
3097a071895o86115M66688j92688L07770l67099K60378l15143N50267l63907q91755
3087b303499P34967l1133O50693r7624l16403m26918L92448k68525L0907j98641
3077a833728L97145o2707K75579m67664M10410j96189m6723K43951J00523l21088
3067a500491k4751J38828j10271j63799K30691M11201q66341R39636p12051J66718
3057a490630j26583N74629l84104k39650N97414q7980o02002N04361j59226o05058
3047b018829M09408l03444L89112l82824N89371J44492j80507j3427m30936Q24764
$$ plain form
3117 -1259123 -1744576 -1611795 -1155160 -1367474 -1388528 -1398934 -1432824 -1242909 -1164693 -1045397
3107 -1045397 -1761808 -1804953 -1580658 -1289518 -1012127 -1637217 -1606022 -1640267 -1285878 -1071895
3097 -1071895 -1758010 -1291322 -1484010 -1176240 -1543339 -1282961 -1598104 -1047837 -1411744 -2303499
3087 -2303499 -1568532 -1599665 -948972 -1046596 -1362999 -1789917 -1397469 -1665994 -1635087 -1833728
3077 -1833728 -1436583 -1499290 -1223711 -1691375 -1280965 -1477154 -1523877 -1279926 -1179403 -1500491
3067 -1500491 -1525242 -1386414 -1496685 -1660484 -1429793 -1018592 -1884933 -945297 -1657348 -1490630
3057 -1490630 -1617213 -1042584 -1426688 -1666338 -1068924 -1156904 -1758906 -1254545 -1413771 -2018829
3047 -2018829 -1609421 -1912865 -1523753 -1906577 -1317206 -1172714 -1353221 -1366648 -1797584 -972820
3037i72820j85428k76925M56294l63820J30946l33796j86097j03148l2149R53755
3027i13188l75646m77330j85023M97083Q11517l2690q57971K10541k37571j90238
3017a750516K53815k14403K47414J062k8181m3589L47305k52090K86967m80961
3007a633177m47681P08385k95939M5751N72351l11687J76474K60723p33060O73402
2997i84458q8442m33720k50293R73337j304452Q27360o0740k87767P42088l63523
2987a230610r2162M57730l62036r73287Q62996N5796K69162k31437k81826j82340
2977a708014M55078n45435M45723m64667L53668l8848R6217O7757o61589P52726
2967a247384L68947q2443o40698J9529R9897N21399j54240o25768L30417L44893
$$ plain form
3037 -972820 -1158248 -1435173 -978879 -1342699 -1211753 -1545549 -1731646 -1834794 -1866943 -913188
3027 -913188 -1288834 -1766164 -1951187 -1454104 -642587 -675277 -1533248 -1322707 -1560278 -1750516
3017 -1750516 -1496701 -1711104 -1463690 -1462628 -1490809 -1534398 -1187093 -1439183 -1152216 -1633177
3007 -1633177 -2080858 -1372473 -1668412 -1622661 -1050310 -1361997 -1185523 -924800 -1657860 -984458
2997 -984458 -1072900 -1506620 -1756913 -783576 -2088028 -1260668 -1321408 -1609175 -867087 -1230610
2987 -1230610 -1322772 -865042 -1227078 -2200365 -1337369 -1281573 -1012411 -1243848 -1525674 -1708014
2977 -1708014 -1252936 -1798371 -1352648 -1817315 -1463647 -1502495 -1406278 -1338521 -2000110 -1247384
2967 -1247384 -878437 -960880 -1601578 -1582049 -1482152 -960753 -1114993 -1740761 -1410344 -1065451
2957a065451l89630J08730J49149l25471L29255r62919Q92586O37995j78776q48551
2947a653083M40130n09125J90738n81744N15930L45438j25684L5862n02845j21541
2937a965924P0789J165563r71058K43037k38208K1197K9689O11453l09228k35627
2927a578317M84973q8246M961k5187l92781K97543L9728N8264L22810n90738Q1082
2916a385908J07499n10628Q0062M48632j07779n14786p8155q6029J98848P95715
2906a052529q2451k55717j54751j15274K29470N986K17084j9461J55173o06423
2896a678893j57935P99418p53809L29984L09767l40297j47067N57678k67721k3283
2886a372158o3837l5901L94911k78888r2301j09052O97137m18631J54572n1330
$$ plain form
2957 -1065451 -1455081 -1346351 -1197202 -1522673 -1193418 -2156337 -1263751 -625756 -804532 -1653083
2947 -1653083 -1212953 -1722078 -1531340 -2113084 -1597154 -1251716 -1377400 -1341538 -1844383 -1965924
2937 -1965924 -1895135 -729572 -1700630 -1457593 -1695801 -1674604 -1644915 -1033462 -1342690 -1578317
2927 -1578317 -1093344 -1181590 -1176629 -1201816 -1594597 -1297054 -1257326 -1199062 -876252 -1466990 -1385908
2916 -1385908 -1278409 -1789037 -1708975 -1260343 -1368122 -1882908 -1961063 -2047092 -1848244 -1052529
2906 -1052529 -1134980 -1390697 -1545448 -1660722 -1431252 -1425266 -1208182 -1227643 -1072470 -1678893
2896 -1678893 -1836828 -1037410 -1791219 -1461235 -1151468 -1491765 -1638832 -1081154 -1348875 -1372158
2886 -1372158 -1435995 -1471896 -1076985 -1355873 -1448174 -1557226 -860089 -1278720 -1124148 -1175478
2876a175478m22613L36345J7860m72711J44747L2316Q49699o87803n4853k29092
2866a661583m00675L42439N48999k27849j20522J79831k75858L50000K96825j162607
2856b131000L12675M78149n18548l27506O40181N36370q26404P81180j7315m88857
2846a561075K12352O04863q30367L8229j04290N08048q29020M54556j43851j22662
2836a773217M53246m36597K03407K88540j18608j18837o48575P22177p0069L1756
2826a466777n73360L94207K13042L50648M38295r26466j00583K65993J35553o01948
2816a871396P95685k58700m7376J11040J19398n50409q4554N30326k98209N04058
2806a050137j27864N61495p07550O25470n15769l62115M8273m49399L63545L77954
$$ plain form
2876 -1175478 -1598091 -1261746 -1243886 -1716597 -1571850 -1539534 -689835 -1377638 -1432491 -1661583
2866 -1661583 -2062258 -1719819 -1170820 -1398669 -1519191 -1339360 -1615218 -1265218 -968393 -2131000
2856 -2131000 -1818325 -1340176 -1858724 -2186230 -1546049 -1009679 -1836083 -1054903 -1072218 -1561075
2846 -1561075 -1348723 -743860 -1574227 -1535998 -1640288 -1132240 -1961260 -1506704 -1650555 -1773217
2836 -1773217 -1319971 -1756568 -1553161 -1264621 -1383229 -1502066 -2150641 -1428464 -1498533 -1466777
2826 -1466777 -2040137 -1645930 -1432888 -1082240 -643945 -1570411 -1670994 -1405001 -1269448 -1871396
2816 -1871396 -1075711 -1334411 -1381787 -1270747 -1151349 -1701758 -1786312 -1255986 -1554195 -1050137
2806 -1050137 -1178001 -616506 -1324056 -698586 -1214355 -1576470 -1528197 -1977596 -1614051 -1236097
2796a236097M01216m24461m93783M44909k2933l17011K03445L78155k60061o8082
2786a394703Q6676l5867L14665l21815N2957m67563N93883m29503L93183o87436
2776a895523k47041Q32589L35j84596K64380j98724K35076p56010O78149j24108
2766a395473N4747k17558O12050o43392N72438j44546m97629K94500j64499K1768
2756a507594N46470l08661j59235L28513j75779m99722M07949k41991N21979o08635
2746a696706K59740J54124O8330l27101O27011p10847K0910K1122P2266L84260
2736a126891P3599m62919J04863j02677j13881J55191j42352L79042J03042m60762
2726a593745K8076K92025K28126K17187m87950l36271N3947n81216P53408J76243
$$ plain form
2796 -1236097 -834881 -1259342 -1753125 -1308216 -1331149 -1648160 -1444715 -1066560 -1326621 -1394703
2786 -1394703 -1308027 -1343894 -1029229 -1351044 -1298087 -1765650 -1171767 -1601270 -1208087 -1895523
2776 -1895523 -2142564 -1309975 -1309640 -1494236 -1229856 -1428580 -1193504 -1949514 -1271365 -1395473
2766 -1395473 -1340726 -1558284 -946234 -1589626 -1017188 -1161734 -1659363 -1364863 -1529362 -1507594
2756 -1507594 -961124 -1269785 -1429020 -1100507 -1276286 -1776008 -1368059 -1610050 -1088071 -1696706
2746 -1696706 -1436966 -1282842 -1214512 -1541613 -914602 -1625449 -1604539 -1583417 -1511151 -1126891
2736 -1126891 -1053292 -1516211 -1411348 -1514025 -1627906 -1472715 -1615067 -1236025 -1132983 -1593745
2726 -1593745 -1565669 -1273644 -1045518 -828331 -1316281 -1652552 -1598605 -2179821 -1426413 -1250170
2716a250170m01096K23493J9821o1332K07854k16604K2044K54128p58356J004051
2706i56167p80041J4090N76O632L75269k55173J41769J07593j78994K12499Q66752
2695d45195j004925J07546L07898o87192K02406k80588K51266J53016M32165j45606
2685a109209o46405L28256r2196J28461m02576J60545K6898P6386J29470j47859
2675a548229J54315j4959k90653N8279Q57692l65679n65810L92213j09782L15152
2665a117461K42241m53032m1189k63927k63658M60797L86415N5103m33919K55204
2655a173426r48410L02322K58890K98102K01386j19694j64759L10931j28124p7474
2645a240256J28781p116r7695m96336O94802k66321o3606R6411k03820K29067
$$ plain form
2716 -1250170 -1651266 -1427773 -1407952 -1469284 -1261430 -1478034 -1455990 -1201862 -1960218 -956167
2706 -956167 -1736208 -1722118 -1721542 -1714910 -1339641 -1594814 -1453045 -1345452 -1524446 -1311947 -445195
2695 -445195 -1450120 -1342574 -1034676 -1721868 -1519462 -1800050 -1548784 -1395768 -963603 -1109209
2685 -1109209 -1755614 -1427358 -1519554 -1391093 -1793669 -1633124 -1606226 -1529840 -1400370 -1548229
2675 -1548229 -1393914 -1408873 -1699526 -1641247 -783555 -1149234 -1715044 -1322831 -1432613 -1117461
2665 -1117461 -875220 -1328252 -1369441 -1633368 -1897026 -1436229 -1049814 -994711 -1428630 -1173426
2655 -1173426 -2121836 -1819514 -1560624 -1262522 -1061136 -1180830 -1345589 -1034658 -1162782 -1240256
2645 -1240256 -1111475 -1118591 -1216286 -1712622 -1017820 -1284141 -1347747 -1251336 -1455156 -1226089
2635a226089K97902o17729q0984L47435k74942r9549k28267Q03492k05477o30803
2625a915011J81387N29413k92939L6583P57676l13552o37909J78324J9737O54645
2615h01646o24554R9178o1727K1246j75181O59893n77117M32838j98066k78976
2605a504112N29513o32167l27583J79724L02371K3322l68272K26109O6056K67479
2595a237560O3697k78584J90645k88119Q9150k99067M00917Q32906o26906j12601
2585a265522k96459k20076R6823K87184l4952K26610K70835q98318O61314n04162
2575a676723J136579j088636J55936k14962j42662J86536k50469M24728N24953
2566i44720k28286J58901j68372p15372k73419J153129j18086L63194n29170n40939
$$ plain form
2635 -1226089 -928187 -1545916 -1626900 -1279465 -1554407 -1653956 -1882223 -1078731 -1284208 -1915011
2625 -1915011 -1733624 -1204211 -1497150 -1460567 -702891 -1016443 -1654352 -1476028 -1456291 -801646
2615 -801646 -1426200 -1327022 -1388749 -1367503 -1542684 -882791 -1459908 -1027070 -1225136 -1504112
2605 -1504112 -974599 -1606766 -1934349 -1754625 -1452254 -1428932 -1797204 -1571095 -1505039 -1237560
2595 -1237560 -1173863 -1452447 -1261802 -1549921 -1460771 -1759838 -1358921 -526015 -1152921 -1265522
2585 -1265522 -1561981 -1782057 -1685234 -1398050 -1433002 -1206392 -935557 -1833875 -1172561 -1676723
2575 -1676723 -540144 -1628780 -1472844 -1687806 -1830468 -1643932 -1894401 -1469673 -944720
2566 -944720 -1173006 -1014105 -1182477 -1897849 -2171268 -1018139 -1136225 -773031 -1302201 -1843140
2556a843140O71830k3956K06710L322k93936l82191K22840j36366L26014l09496
2546a558369M31510J95856n22173R4285M46525o33910K56734n6940Q745m3719
2536a381456k32483K91738n4783K50657n0164K43246n33170M6564J66128o9272
2526a322995j13351K79843j79315j44254M00738n51284k20840O34357j64504o1762
2516a443367k46261P18660j07819n01128P67531p30265K29349m62313N73075K36617
2506i65921o46969K74305o4455j03090K72234p7773j6978L04549m60580m14210
2496a898888N6022L84828L1985m7698K21670k56600j15530Q4942N05582k50196
2486a283883l69661J31727L31188r2642m7347O20719J43643r06678l94724M56431
$$ plain form
2556 -1843140 -1171310 -1195266 -988556 -985234 -1279170 -1661361 -1438521 -1574887 -1248873 -1558369
2546 -1558369 -1126859 -931003 -1453176 -1358891 -912366 -1546276 -1289542 -1346482 -1337737 -1381456
2536 -1381456 -1613939 -1322201 -1376984 -1126327 -1176491 -933245 -1466415 -1419851 -1253723 -1322995
2526 -1322995 -1436346 -1156503 -1335818 -1480072 -1079334 -1630618 -1851458 -1217101 -1381605 -1443367
2516 -1443367 -1689628 -970968 -1078787 -1579915 -812384 -1542649 -1313300 -1775613 -1202538 -965921
2506 -965921 -1612890 -1338585 -1403040 -1506130 -1233896 -1311669 -1328647 -1024098 -1484678 -1898888
2496 -1898888 -1842866 -1458038 -1426053 -1473751 -1252081 -1508681 -1624211 -1539269 -1033687 -1283883
2486 -1283883 -1653544 -1521817 -1190629 -1283271 -1330618 -709899 -566256 -1472934 -1867658 -1411227
2476a411227j1384K12257j31400J83915m68621L97190J72436n23655K03337j3417
2466a390569R0897k10325n3222k07776J24054Q06107m86097k06096j88769O72458
2456a049338l44040K16320Q3194k44482R6643K886m286J41452j66485k045K39544
2445a030637p42339K07995r7634Q628J8197J42214j86142M80313j44747j39518
2435a483670j38375M5737L88634n01465m06099O51395M62331k49261J32628p9381
2425a177526J07296k40979j16358J30930j03176M25805j76927j22557M44225p25447
2415a554714J24790J8702K0415m00338M15988K1867N11023K46246l49065n56368
2405a501454K35794k58293K7252L32076l86623P531M21061m11483L51959l19348
$$ plain form
2476 -1411227 -1422611 -1210354 -1341754 -1157839 -1626460 -1229270 -1056834 -1580489 -1377152 -1390569
2466 -1390569 -1299672 -1509997 -1563219 -1770995 -1646941 -840834 -1326931 -1533027 -1721796 -1049338
2456 -1049338 -1393378 -1177058 -1093864 -1338346 -1241703 -1238817 -1243103 -1101651 -1268136 -1270181 -1030637
2445 -1030637 -1772976 -1564981 -1662615 -1653987 -1635790 -1493576 -1679718 -1199405 -1344152 -1483670
2435 -1483670 -1622045 -1576308 -1187674 -1689139 -2095238 -1443843 -981512 -1230773 -1098145 -1177526
2425 -1177526 -1070230 -1311209 -1427567 -1296637 -1399813 -974008 -1150935 -1273492 -829267 -1554714
2415 -1554714 -1429924 -1411222 -1390807 -1791145 -1375157 -1353290 -842267 -596021 -945086 -1501454
2405 -1501454 -1265660 -1523953 -1496701 -1164625 -1551248 -1543717 -1122656 -1534139 -1182180 -1501528
2395a501528K05954L508n3549R1718R2707l94704M50794l14212N5342J36534o06329
2384a833765L72025N66644m17682P591K53215K12631l70297p21999M48149M67477
2374a016011l36040J60378k04754j58263J30866l46509N45595j58216j22121M4958
2364a460117Q89902p23989J45457k46553l4346N3509j08525k12002N64740l95798
2354a527722j83310j52955M39645K84032l99096J22646R2550m94704O5618Q34833
2344i18463o39029p4353K86756j29799n9538M33012L08956n76555l28544J13569
2334a583988j38179J81957J47108J4472K13919M88263q98565R43343r72342m3413
2324a647425M72532m22250L90570k63990k1682l6723L64476l17281M20068k16200
$$ plain form
2395 -1501528 -1295574 -1292066 -1345615 -1253897 -1161190 -1555894 -1105100 -1419312 -1363970 -1227436 -1833765
2384 -1833765 -1461740 -895096 -1312778 -1305187 -1051972 -839341 -1209638 -1931637 -1483488 -1016011
2374 -1016011 -1352051 -1191673 -1396427 -1554690 -1423824 -1770333 -1224738 -1382954 -1505075 -1460117
2364 -1460117 -570215 -1294204 -1148747 -1395300 -1429646 -1376137 -1484662 -1696664 -1131924 -1527722
2354 -1527722 -1711032 -1863987 -1424342 -1140310 -1539406 -1416760 -1324210 -1818914 -1753296 -918463
2344 -918463 -1557492 -1631845 -1345089 -1474888 -1534426 -1101414 -792458 -1369013 -1697557 -1583988
2334 -1583988 -1722167 -1540210 -1393102 -1378630 -1164711 -676448 -1575013 -631670 -1604012 -1647425
2324 -1647425 -1174893 -1597143 -1206573 -1470563 -1492245 -1528968 -1164492 -1481773 -1061705 -1277905
2314a277905l97955N16638m92810M18868K95020j79158n21219m8328O58206m0241
2304a068884K40354n17716r6132l98775R83478j95277l12907P77918p65645L26127
2294a027459n85712k0712K72176j06935K06020j0582L54133p89334M20261j33566
2284a421710j07582K5775j2944M4909k72861O87128m72761k50012P80864o40733
2274a639927L34111R2237L81942q62331P40506q8333K1024m04292p76725O08957
2264a592831K45520M15259m20352J79104o4057j51884L73951p00683M46733J0334
2254a258906l79304N26242j92052l2470Q1403J98331n61204K92485l00298K44816
2244a380957j97277K26890L19103m08617n24261Q62728K47284J64686l92139p8735
$$ plain form
2314 -1277905 -1675860 -1159222 -1652032 -1233164 -938144 -1117302 -1638521 -1686849 -1028643 -1068884
2304 -1068884 -828530 -1346246 -1442378 -1841153 -857675 -1052952 -1365859 -587941 -1353586 -1027459
2294 -1027459 -1613171 -1633883 -1361707 -1468642 -1262622 -1273204 -919071 -1708405 -1288144 -1421710
2284 -1421710 -1529292 -1503517 -1516461 -1471552 -1744413 -1057285 -1530046 -1780058 -999194 -1639927
2274 -1639927 -1305816 -1213579 -831637 -1693968 -953462 -1041795 -1020771 -1425063 -2201788 -1592831
2264 -1592831 -1347311 -932052 -1352404 -1173300 -1237357 -1389241 -1015290 -1715973 -1269240 -1258906
2254 -1258906 -1638210 -1111968 -1304020 -1336490 -1255087 -1056756 -1617960 -1325475 -1625773 -1380957
2244 -1380957 -1578234 -1351344 -1032241 -1440858 -1965119 -1102391 -855107 -690421 -1082560 -1161295
2234a161295n96113M64644q6151l50719J272027n76738p30503M57085l40137M39722
2224a208178N11628m38511m14765M52472m01008L33909M59252r02161N95803k18028
2214a229587o6417r02145J354513p27971O39776p51197M02917k87122Q3982L63794
2204a119457m52926R2754l35622J48935K78907J54076J50123k87357K25565j95181
2194a340183j32672K85585m75405P13046J990j35751j53203J03083L6094k76630
2184a374046j56645M93632l21902n7848m03101j17894M09798O25270o41360P71147
2174g72949n07208Q885r29491Q79719J25844m39448J53292j92374L93712L00897
2164i79121l10572L8768p1421J29114j94114J35321k6954o31750K88377K71397
$$ plain form
2234 -1161295 -1757408 -1292764 -1378915 -1729634 -457607 -1034345 -1764848 -1307763 -1647900 -1208178
2224 -1208178 -696550 -1135061 -1549826 -1097354 -1498362 -1164453 -705201 -1607362 -1011559 -1229587
2214 -1229587 -1296004 -2198149 -843636 -1571607 -931831 -1683028 -1280111 -1567233 -1483251 -1119457
2204 -1119457 -1572383 -1479629 -1815251 -1666316 -1387409 -1233333 -1083210 -1370567 -1145002 -1340183
2194 -1340183 -1472855 -1187270 -1662675 -949629 -947639 -1083390 -1236593 -1133510 -1097416 -1374046
2184 -1374046 -1530691 -1037059 -1358961 -1416809 -1819910 -1937804 -1528006 -902736 -1544096 -772949
2174 -772949 -1280157 -1271272 -2200763 -1321044 -1195200 -1634648 -1481356 -1673730 -1280018 -979121
2164 -979121 -1289693 -1250925 -1322346 -1193232 -1387346 -1252025 -1278979 -1910729 -1622352 -1350955
2154a350955j35927L20746r73006O21883L63430k92697L74223n92250P20517j033021
2144a977057J247207r41280O69916l37339j05890M1541J62210m6265N9308J56848
2134a070801r4777l179j16134j59261o31183K44598K3679O92180p55846M33086
2124a437638Q6168P0619K09545m71172J90683O32246q8103r23856L51011j7757
2114a398254m50421J064120n59813n05940Q03196n05393m25991Q27757K65746
2105h84993o33365M94627n79744p19723J153110j7260J32549o14563l05617J73975
2095a801004L38836L80459p8808k61356J54229k64799o7023K45640j08657J13055
2085a349428l10851N94923j47237k45210j063j01506l3767k96283M53734j26062
$$ plain form
2154 -1350955 -1486882 -1166136 -2139142 -1517259 -1153829 -1446526 -1072303 -1664553 -944036 -1977057
2144 -1977057 -729850 -1671130 -1001214 -1338553 -1444443 -1402902 -1240692 -1286957 -1227649 -1070801
2134 -1070801 -1165578 -1168757 -1284891 -1444152 -2075335 -1830737 -1807058 -1114878 -1870724 -1437638
2124 -1437638 -1351470 -1280851 -1071306 -1542478 -1351795 -719549 -807652 -1731508 -1380497 -1398254
2114 -1398254 -1848675 -784555 -1344368 -1850308 -1047112 -1552505 -1978496 -1150739 -884993
2105 -884993 -1518358 -1023731 -1603475 -2323198 -1170088 -1187348 -1054799 -1669362 -1974979 -1801004
2095 -1801004 -1462168 -1081709 -1160517 -1421873 -1267644 -1532443 -1599466 -1353826 -1462483 -1349428
2085 -1349428 -1660279 -1065356 -1212593 -1457803 -1458866 -1560372 -1594139 -1890422 -1436688 -1562750
2075a562750J93491q7581L14002q60516J138105o43637O09785n40669P3824l38297
2065a704243L05099J39380k00388J14838n1801j37126M76126K8415r6330l03794
2055a429824Q1226k10995n47380P88095O5635j11189K04766L47237m09562j61161
2045a383152j7202L88503L7705k69798j0182m12319o7897P04334R4209p8292j36258
2034a150349n73471L59217m25815M93576M82753m28742k45003J91054l05099P17449
2024h84430n61516L84358r76181L86833P2688j9343K14909J02086K29359J34967
2014i16270K075n07241k5020m69445J42256O24302j62952Q3148k59199l59976
2004a848322l5299M20111n20891P08016k08468L68180n57793O32332l15242K31480
$$ plain form
2075 -1562750 -1369259 -1456840 -1142838 -2003354 -865249 -1508886 -899101 -1439770 -1365946 -1704243
2065 -1704243 -1399144 -1259764 -1460152 -1345314 -1397115 -1534241 -1058115 -1029700 -1126030 -1429824
2055 -1429824 -1348598 -1559593 -2106973 -1318878 -1253243 -1364432 -1159666 -812429 -1221991 -1383152
2045 -1383152 -1400354 -1011851 -974146 -1243944 -1254126 -1666445 -1734342 -1030008 -935799 -1014091 -1150349
2034 -1150349 -1723820 -1364603 -1790418 -1296842 -814089 -1242831 -1487834 -1296780 -1601879 -884430
2024 -884430 -1445946 -1061588 -2037769 -1650936 -1578248 -1597591 -1382682 -1280596 -1051237 -916270
2014 -916270 -914195 -1421436 -1446456 -1915901 -1773645 -1149343 -1312295 -1229147 -1488346 -1848322
2004 -1848322 -1883621 -1463510 -1984401 -1276385 -1484853 -1116673 -1674466 -1042134 -1357376 -1125896
1994a125896K7445p63720N51460m93047J83393L96719j65794J51555M00443l89211
1984a226653k30493N6711O0906m53544N18755K72750n09861L95267j43476K63163
1974i96475l01518j72661Q9178k71096M21434j125934J006471R7361M24009n92747
$$ plain form
1994 -1125896 -1098451 -1862171 -1310711 -1803758 -1620365 -1223646 -1389440 -1237885 -837442 -1226653
1984 -1226653 -1457146 -1400435 -1339529 -1793073 -1274318 -1001568 -1511429 -1116162 -1259638 -996475
1974 -996475 -1297993 -1470654 -1381476 -1652572 -1231138 -2357072 -1350601 -1253240 -829231 -1421978
$$ [...]
##END NTUPLES=NMR SPECTRUM
##END=
