##TITLE=abcd
##JCAMPDX= 6.0         $$ Bruker NMR JCAMP-DX V2.0
##DATA TYPE= NMR SPECTRUM
##DATA CLASS= NTUPLES
##ORIGIN= UXNMR, Bruker Analytische Messtechnik GmbH
##OWNER= root
$$ XWIN-NMR		Version 3.5
$$ Thu Jul 23 19:58:33 2026 Russian Standard Time (UT+4h)  servis@DPX200
##.OBSERVE FREQUENCY= 200.131235884673
##.OBSERVE NUCLEUS= ^1H
##.ACQUISITION MODE= SIMULTANEOUS
##.ACQUISITION SCHEME= undefined
##.AVERAGES= 32
##.DIGITISER RES= 18
##SPECTROMETER/DATA SYSTEM= spect
##.PULSE SEQUENCE= zg
##.SOLVENT NAME= DMSO
##.SHIFT REFERENCE= (INTERNAL, DMSO, 0, 16.4885)
##AUDIT TRAIL= $$ (NUMBER, WHEN, WHO, WHERE, WHAT)
$$ ##TITLE= Audit trail, XWIN-NMR		Version 3.5
$$ ##JCAMPDX= 5.01
$$ ##ORIGIN= Bruker BioSpin GmbH
$$ ##OWNER= servis
$$ F:\spectra/data/av/nmr/H1/1/pdata/1/auditp.txt
$$ ##AUDIT TRAIL=  $$ (NUMBER, WHEN, WHO, WHERE, WHAT)
(   1,<2026-07-23 19:56:27.04 +0400>,<servis>,<DPX200>,
      <created by zg, POWCHK disabled, PULCHK disabled
       configuration hash MD5:
       00 E9 B6 7A A2 85 ED C7 34 08 36 98 17 FE 4E 26
       data hash MD5: 32K
       6A FF 76 94 AD AE AC 2F 32 6E DE 52 F0 6D 5C 4C>)
(   2,<2026-07-23 19:57:59.20 +0400>,<servis>,<DPX200>,
      <Start of raw data processing
       efp BC_mod = 2 LB = 0.05 FT_mod = 6 PKNL = 1 PHC0 = -532.0226 PHC1 = 3.101563 SI = 16K 
       data hash MD5: 16K
       27 E8 F9 CA C9 8E 1B D2 01 A4 C4 C2 1C A6 E8 94>)
$$ ##END=
$$ 
$$ hash MD5
$$ 86 00 53 D5 8F 99 70 0C 39 3A 0D 30 E7 98 FE 6C
##$RELAX= 
##$RELAX= 
##$RELAX= 
##$RELAX= 
##$RELAX= 
##$RELAX= 
##$RELAX= 
##$RELAX= 
$$ Bruker specific parameters
$$ --------------------------
##$DU= <F:\spectra>
##$EXPNO= 1
##$NAME= <H1>
##$PROCNO= 1
##$TYPE= <nmr>
##$USER= <av>
##$AMP= (0..31)
100 100 100 100 100 100 100 100 100 100 100 100 100 100 100 100 100 100 
100 100 100 100 100 100 100 100 100 100 100 100 100 100 
##$AQSEQ= 0
##$AQ_mod= 1
##$AUNM= <au_zg>
##$AUTOPOS= <>
##$BF1= 200.13
##$BF2= 200.13
##$BF3= 200.13
##$BF4= 200.13
##$BF5= 500.13
##$BF6= 500.13
##$BF7= 500.13
##$BF8= 500.13
##$BYTORDA= 1
##$CFDGTYP= 0
##$CFRGTYP= 5
##$CHEMSTR= <none>
##$CNST= (0..31)
1 1 145 1 1 1 1 1 1 1 1 1 1 1 1 1 1 1 1 1 1 1 1 1 1 1 1 1 1 1 1 1 
##$CPDPRG= <>
##$CPDPRG1= <>
##$CPDPRG2= <>
##$CPDPRG3= <>
##$CPDPRG4= <mlev>
##$CPDPRG5= <mlev>
##$CPDPRG6= <mlev>
##$CPDPRG7= <mlev>
##$CPDPRG8= <mlev>
##$CPDPRGB= <>
##$CPDPRGT= <>
##$D= (0..31)
0 2 0 0 0 0 0 0 0 0.06 0 0 0 0 0 0 0.0002 0 0 0 0 0 0 0 0 0 0 0 0 0 0 
0 
##$DATE= 1784822186
##$DBL= (0..7)
120 120 120 120 120 120 120 120 
##$DBP= (0..7)
150 150 150 150 150 150 150 150 
##$DBP07= 0
##$DBPNAM0= <>
##$DBPNAM1= <>
##$DBPNAM2= <>
##$DBPNAM3= <>
##$DBPNAM4= <>
##$DBPNAM5= <>
##$DBPNAM6= <>
##$DBPNAM7= <>
##$DBPOAL= (0..7)
0.5 0.5 0.5 0.5 0.5 0.5 0.5 0.5 
##$DBPOFFS= (0..7)
0 0 0 0 0 0 0 0 
##$DE= 6
##$DECBNUC= <off>
##$DECIM= 32
##$DECNUC= <off>
##$DECSTAT= 4
##$DIGMOD= 1
##$DIGTYP= 9
##$DL= (0..7)
0 120 120 120 120 120 120 120 
##$DP= (0..7)
150 150 150 150 150 150 150 150 
##$DP07= 0
##$DPNAME0= <>
$$ [...]
##$SUBNAM4= <"">
##$SUBNAM5= <"">
##$SUBNAM6= <"">
##$SUBNAM7= <"">
##$SUBNAM8= <"">
##$SUBNAM9= <"">
##$SW= 20.6817932712277
##$SWIBOX= (0..15)
0 0 3 0 0 0 0 0 0 0 0 0 0 0 0 0 
##$SW_h= 4139.07284768212
##$TD= 32768
##$TD0= 1
##$TE= 0
##$TE2= 300
##$TE3= 300
##$TEG= 300
##$TL= (0..7)
0 120 120 120 120 120 120 120 
##$TP= (0..7)
150 150 150 150 150 150 150 150 
##$TP07= 0
##$TPNAME0= <>
##$TPNAME1= <>
##$TPNAME2= <>
##$TPNAME3= <>
##$TPNAME4= <>
##$TPNAME5= <>
##$TPNAME6= <>
##$TPNAME7= <>
##$TPOAL= (0..7)
0.5 0.5 0.5 0.5 0.5 0.5 0.5 0.5 
##$TPOFFS= (0..7)
0 0 0 0 0 0 0 0 
##$TUNHIN= 0
##$TUNHOUT= 0
##$TUNXOUT= 0
##$USERA1= <user>
##$USERA2= <user>
##$USERA3= <user>
##$USERA4= <user>
##$USERA5= <user>
##$V9= 5
##$VALIST= <valist>
##$VCLIST= <CCCCCCCCCCCCCCC>
##$VD= 0
##$VDLIST= <DDDDDDDDDDDDDDD>
##$VPLIST= <PPPPPPPPPPPPPPP>
##$VTLIST= <TTTTTTTTTTTTTTT>
##$WBST= 1024
##$WBSW= 30
##$XGAIN= (0..3)
0 0 0 0 
##$XL= 0
##$YL= 0
##$YMAX_a= 67710
##$YMIN_a= -76566
##$ZGOPTNS= <>
##$ZL1= 120
##$ZL2= 120
##$ZL3= 120
##$ZL4= 120
##$ABSF1= 0
##$ABSF2= 0
##$ABSG= 0
##$ABSL= 0
##$ALPHA= 0
##$AQORDER= 0
##$ASSFAC= 0
##$ASSFACI= 0
##$ASSFACX= 0
##$ASSWID= 0
##$AUNMP= <proc_1d>
##$AZFE= 0.1
##$AZFW= 0.1
##$BCFW= 0
##$BC_mod= 2
##$BYTORDP= 0
##$COROFFS= 0
##$CY= 18.4799938201904
##$DATMOD= 1
##$DC= 0
##$DFILT= <>
##$DTYPP= 0
##$F1P= 9.9274215381318
##$F2P= -0.165520771350173
##$FCOR= 1
##$FTSIZE= 16384
##$FT_mod= 6
##$GAMMA= 0
##$GB= 0
##$INTBC= 1
##$INTSCL= 4.127829e-11
##$ISEN= 128
##$LB= 0.05
##$LEV0= 0
##$LPBIN= 0
##$MAXI= 10000
##$MC2= 0
##$MEAN= 0
##$ME_mod= 0
##$MI= 50
##$NCOEF= 0
##$NC_proc= -11
##$NLEV= 6
##$NOISF1= 3.799351
##$NOISF2= 2.8
##$NSP= 0
##$NTH_PI= 0
##$NZP= 0
##$OFFSET= 16.48848
##$PC= 4
##$PHC0= -532.0226
##$PHC1= 3.101563
##$PH_mod= 1
##$PKNL= yes
##$PPARMOD= 0
##$PSCAL= 4
##$PSIGN= 0
##$REVERSE= no
##$SF= 200.130005582386
##$SI= 16384
##$SIGF1= 3
##$SIGF2= 2
##$SINO= 400
##$SIOLD= 16384
##$SREGLST= <1H.CDCl3>
##$SSB= 0
##$STSI= 16384
##$STSR= 0
##$SW_p= 4139.07284768211
##$SYMM= 0
##$S_DEV= 0
##$TDeff= 32768
##$TDoff= 0
##$TI= <>
##$TILT= no
##$TM1= 0
##$TM2= 0
##$TOPLEV= 0
##$USERP1= <user>
##$USERP2= <user>
##$USERP3= <user>
##$USERP4= <user>
##$USERP5= <user>
##$WDW= 1
##$XDIM= 16384
##$YMAX_p= 521024171
##$YMIN_p= -9655509
$$ End of Bruker specific parameters
$$ ---------------------------------
##NTUPLES= NMR SPECTRUM
##VAR_NAME=  FREQUENCY,     SPECTRUM/REAL,   SPECTRUM/IMAG
##SYMBOL=    X,             R,               I
##VAR_TYPE=  INDEPENDENT,   DEPENDENT,       DEPENDENT
##VAR_FORM=  AFFN,          ASDF,            ASDF
##VAR_DIM=   16384,         16384,           16384
##UNITS=     HZ,            ARBITRARY UNITS, ARBITRARY UNITS
##FACTOR=    0.252644378177508, 1,           1
##FIRST=     3299.83951724647, 0,            0
##LAST=      -839.233330435636, 0,           0
##MIN=       -839.233330435636, -9655509,    0
##MAX=       3299.83951724647, 521024171,    0
$$ Real data points
##PAGE= N=1
##DATA TABLE= (X++(R..R)), XYDATA
$$ [...]
$$ plain form
9200 3648961 2537011 2391291 980832 2966435 3671542 2324461 3642636 2666166 3447705
9191 3447705 2574986 2404057 2884240 1912751 2861597 1797812 3655711 -87616 2413001
9182 2413001 -3974846 5681667 4176114 4634210 3290982 3649214 3572071 1170809 1586493
9173 1586493 3530882 1655684 4198018 2689421 2947506 2380410 2152744 4110487 3770906
9164 3770906 1537920 3057015 817415 1702509 2659309 2869586 4155232 4482284 2287791
9155 2287791 1821008 3757292 3341172 4628809 3810802 1943722 4572885 4251160 2091801
9146 2091801 3491691 2570247 2716838 2254933 2355084 4381963 1966210 2364988 4431587
9137 4431587 1140320 1376965 2902408 3741062 4536161 3631587 3228875 1683827 3483708
$$ packed form
9200C648961j111950j45720j410459J985603P05107j347081J318175r76470P81539
9191C447705q72719j70929M80183r71489R48846j063785J857899l743327K500617
9182B413001o387847R656513j505553M58096j343228L58232p7143k401262M15684
9173A586493J944389j875198K542334j508597K58085n67096k27666J957743l39581
9164C770906k232986J519095k239600Q85094R56800K10277J285646L27052k194493
9155B287791m66783J936284m16120J287637q18007j867080K629163l21725k159359
9146B091801J399890r21444J46591m61905J00151K026879k415753L98778K066599
9137D431587l291267K36645J525443Q38654P95099r04574m02712j545048J799881
$$ plain form
9128 3483708 1983538 1764696 2659467 1626611 5289949 5480064 3116440 1459633 2886368
9119 2886368 3195788 2103631 958328 2787335 2520011 4575511 2562375 4388396 2515951
9110 2515951 1442349 3664949 2736222 6066231 1526009 2092100 3386425 2629357 856815
9101 856815 3704699 4205300 4481041 3842596 1419018 2808956 4081811 4417409 1547052
9092 1547052 3746432 3207066 2778436 4015999 4043348 3010633 2472409 448691 3234730
9083 3234730 1632581 2032000 82380 2437416 2173297 1570239 2763329 1870939 3362542
9074 3362542 2333149 2799999 2452581 3414492 3421810 2656242 3655338 4025213 2407682 4211132
9064 4211132 3651939 3294033 2895722 2857469 3690422 1275480 1835623 1236888 2406401
$$ packed form
9128C483708j500170k18842Q94771j032856L663338J90115k363624j656807J426735
9119B886368L09420j092157j145303J829007k67324K055500k013136J826021j872445
9110B515951j073602K222600r28727L330009m540222N66091J294325p57068j772542
9101H56815K847884N00601K75741o38445k423578J389938J272855L35598k870357
9092A547052K199380n39366m28630J237563K7349j032715n38224k023718K786039
9083C234730j602149L99419j949620K355036k64119o03058J193090q92390J491603
9074C362542j029393M66850l47418R61911P318p65568R99096L69875j617531J803450
9064D211132n59193l57906l98311l8253Q32953k414942N60143n98735J169513
$$ plain form
9055 2406401 3238508 3886096 1726135 220856 2412834 846018 4585997 3542967 892098
9046 892098 2638382 2355630 3457307 3124484 1963154 3275000 2145214 4808181 2562256
9037 2562256 1239471 2390197 3081849 384944 1829368 4017922 3488058 2884229 1771520
9028 1771520 1526842 3346049 2833886 1471374 2443235 1876116 1979091 377631 3048001
9019 3048001 2727277 -53906 2833895 1715994 1461962 1830720 4106575 1912782 3834326
9010 3834326 2642903 2570601 2977701 2975478 4040322 3404078 3609514 3330568 2465416 2648377
9000 2648377 1746351 2445747 2957807 3415200 4340635 3672149 5711128 1321869 4185201
8991 4185201 4227276 2791176 2757677 2368191 3518831 1088281 3634859 3683266 1915975
$$ packed form
9055B406401Q32107O47588k159961j505279K191978j566816L739979j043030k650869
9046H92098J746284k82752J101677l32823j161330J311846j129786K662967k245925
9037B562256j322785J150726O91652k696905J444424K188554n29864o03829j112709
9028A771520k44678J819207n12163j362512R71861n67119J02975j601460K670370
9019C048001l20724k781183K887801j117901k54032L68758K275855k193793J921544
9010C834326j191423p2302M07100k223J064844o36244K05436k78946q65152J82961
9000B648377r02026O99396N12060M57393R25435o68486K038979m389259K863332
8991D185201M2075j436100l3499l89486J150640k430550K546578M8407j767291
$$ plain form
8982 1915975 3976184 3933728 3292572 3652371 1700532 2119578 2086854 2661919 1774954 2880313
8972 2880313 6317249 1923322 4168389 1280424 2584174 3941466 577298 2716962
8964 2716962 3689343 2441963 1724457 1895887 3363575 3860789 2090809 2249541 4018141
8955 4018141 3584318 2944664 4077979 3213586 3076579 2726472 2458629 4520381 3028493
8946 3028493 2483632 3142606 2417692 2322370 3153138 3589009 3696347 3477866 5323513 3436227
8936 3436227 4236243 1706654 929119 3203011 3825185 3286550 5178719 2004484 783424
8927 783424 2400880 3712485 3953684 3219870 2598604 1805800 2439892 1787642 1899508
8918 1899508 2867434 2476094 3695241 2542125 3012195 4625381 2870718 2279940 3310906
$$ packed form
8982A915975K060209m2456o41156L59799j951839M19046l2724N75065q86965J105359
8972B880313L436936m393927K245067k887965J303750J357292l364168K139664
8964B716962R72381j247380p17506J71430J467688M97214j769980J58732J768600
8955D018141m33823o39654J133315q64393j37007l50107k67843K061752j491888
8946C028493n44861O58974p24914r5322Q30768M35871J07338k18481J845647j887286
8936C436227Q00016k529589p77535K273892O22174n38635J892169l174235j221060
8927G83424J617456J311605K41199p33814o21266p92804O34092o52250J11866
8918A899508R67926l91340J219147j153116M70070J613186j754663n90778J030966
$$ plain form
8909 3310906 1970332 3047385 2620936 1164265 3879296 3324767 3013394 4191659 1082990
8900 1082990 3288828 1500470 3088701 3161109 2909660 3537411 2187684 2787166 1265632
8891 1265632 1770516 4448458 4584128 2823662 3329453 3201021 4083311 2309771 3099339
8882 3099339 2212575 1508622 2638855 3596532 4783464 3154993 2028270 -526095 1049228
8873 1049228 2861331 3952041 3855941 4893327 2814658 2447231 1808012 2537769 4224251
8864 4224251 2481622 2346428 3070666 3930414 2503494 2210408 3058349 3548506 1727104
8855 1727104 4560599 4821988 4267455 1842669 780918 1020144 4497379 4834119 3114002
8846 3114002 3339350 2109945 3341310 3882504 3133719 3748076 3524435 2599845 3651534
$$ packed form
8909C310906j340574J077053m26449j456671K715031n54529l11373J178265l108669
8900A082990K205838j788358J588231P2408k51449O27751j349727N99482j521534
8891A265632N04884K677942J35670j760466N05791j28432Q82290j773540P89568
8882C099339q86764p03953J130233R57677J186932j628471j126723k554365J575323
8873A049228J812103J090710r6100J037386k078669l67427o39219P29757J686482
8864D224251j742629j35194P24238Q59748j426920k93086Q47941M90157j821402
8855A727104K833495K61389n54533k424786j061751K39226L477235L36740j720117
8846C114002K25348j229405J231365N41194p48785O14357k23641r24590J051689
$$ plain form
8837 3651534 1316967 2685300 2174918 4439532 2871027 1860620 2697515 2490196 3238172
8828 3238172 2256009 2021055 3641955 3481001 3776479 2235320 2841597 3652853 2786643
8819 2786643 3265603 3545833 3641193 3187063 1524606 1474652 4457174 2280590 2693422
8810 2693422 4325549 3177499 1228682 1988313 2057103 2808695 4008188 3084192 4561034
8801 4561034 3180151 2925728 1990471 5030003 2331464 3778640 3893029 3491652 4212268
8792 4212268 2211199 3376836 3007509 3501865 3959261 2592490 3955996 1709821 3866774
8783 3866774 2114800 3818228 2384655 3393906 3379482 3797758 1294594 1771283 4783606
8774 4783606 4361633 2979915 2469620 2322043 2660997 846549 940596 3691564 2904546
$$ packed form
8837C651534k334567J368333n10382K264614j568505j010407Q36895k07319P47976
8828C238172r82163k34954J620900j60954K95478j541159O06277Q11256q66210
8819B786643M78960K80230R5360m54130j662457m9954K982522k176584M12832
8810B693422J632127j148050j948817P59631O8790P51592J199493r23996J476842
8801D561034j380883k54423r35257L039532k698539J447176J14389m01377P20616
8792D212268k001069J165637l69327M94356M57396j366771J363506k246175K156953
8783C866774j751974J703428j433573J009251j4424M18276k503164M76689L012323
8774D783606m21973j381718n10295j47577L38954j814448R4047K750968p87018
$$ plain form
8765 2904546 2920518 4511836 3619374 3856953 3475534 2060754 1864749 3572020 2130066
8756 2130066 3293381 6056358 1903562 3599028 2211531 4351094 2603260 2750920
8748 2750920 2670926 1859462 2757038 4416201 4091278 2983493 3200928 3212099 3489590 5350968
8738 5350968 2071246 3348702 3668572 2064812 3091501 3639900 3662015 2974114 4674540
8729 4674540 2045547 2734170 3704765 3778285 2496741 2438078 2782148 2163509 2870809 3246931
8719 3246931 6127903 3808277 1825819 4306294 2847748 3078604 2084334 2385772 4760655
8710 4760655 3417343 4330217 5984450 2789114 2535911 1734226 2509114 1548173 3566425
8701 3566425 4787308 394291 3755212 4140172 2801489 4413142 3883812 2978576 1852246
$$ packed form
8765B904546J5972J591318q92462K37579l81419j414780j96005J707271j441954
8756B130066J163315K762977m152796J695466j387497K139563j747834J47660
8748B750920p9994q11464Q97576J659163l24923j107785K17435J1171K77491J861378
8738E350968l279722J277456L19870j603760J026689N48399K2115o87901J700426
8729D674540k628993O88623R70595P3520j281544n8663L44070o18639P07300L76122
8719C246931K880972k319626j982458K480475j458546K30856r94270L01438K374883
8710D760655j343312R12874J654233l195336k53203q01685P74888r60941K018252
8701C566425J220883m393017L360921L84960j338683J611653n29330r05236j126330
$$ plain form
8692 1852246 4162313 3034784 2965530 1992440 2025776 2263430 3138145 5133154 2590189
8683 2590189 3875876 2227878 2243911 2305630 2878858 4608097 2766792 5564216 2915079
8674 2915079 2853118 3282270 1555703 5481936 3455493 2972962 3357380 2572522 2846770
8665 2846770 2698320 3357088 4569219 3253384 4174808 2694512 2738767 4293223 4809797
8656 4809797 3660440 3629234 2766345 4155919 2987276 1933916 3164215 3535391 2332289
8647 2332289 3208240 4926939 3841927 3823907 3263567 3193686 3164921 3797654 2180480 3294823
8637 3294823 5053004 3982747 1140904 3154285 3416844 4313580 5113194 3271079 4299494
8628 4299494 4212515 3382634 4910457 4586659 4910557 3791858 5238458 4058145 3290492
$$ packed form
8692A852246K310067j127529o9254r73090L3336K37654Q74715J995009k542965
8683B590189J285687j647998J6033O1719N73228J729239j841305K797424k649137
8674B915079o1961M29152j726567L926233k026443m82531L84418p84858K74248
8665B846770j48450O58768J212131j315835R21424j480296M4255J554456N16574
8656D809797j149357l1206q62889J389574j168643j053360J230299L71176j203102
8647B332289Q75951J718699j085012j8020n60340o9881k8765O32733j617174J114343
8637C294823J758181j070257k841843K013381K62559Q96736P99614j842115J028415
8628D299494q6979q29881J527823l23798L23898j118699J446600j180313p67653
$$ plain form
8619 3290492 3957419 4077195 3634323 5447552 3882681 4666235 4668858 3989616 4600294 4116021
8609 4116021 2000645 4290421 2932018 4579510 2384481 3759835 4517356 4106984 4333977
8600 4333977 3113958 5055842 3870966 3875077 3938756 3194855 5301704 4206565 3717989
8591 3717989 4480891 3434398 5205663 5725991 3777534 5186941 4600642 5914430 3680289
8582 3680289 5077926 5005955 4997663 5728049 3373782 3944605 3635675 3114416 4476453 4773537
8572 4773537 3518516 3864888 5820587 4226737 3970360 3794200 4421310 3115904 5025338
8563 5025338 5167406 5353171 4526684 6065014 5194390 6957389 6480430 5844491 6489603
8554 6489603 5139453 6077583 3100928 4555852 4723974 5079041 3849944 5592842 6238300
$$ packed form
8619C290492O66927J19776m42872J813229j564871P83554K623o79242O10678m84273
8609D116021k115376K289776j358403J647492k195029J375354P57521m10372K26993
8600D333977j220019J941884j184876M111O3679p43901K106849j095139m88576
8591C717989P62902j046493J771265N20328j948457J409407n86299J313788k234141
8582C680289J397637p1971q292P30386k354267N70823l08930n21259J362037K97084
8572D773537j255021L46372J955699j593850k56377j76160O27110j305406J909434
8563E025338J42068J85765q26487J538330q70624J762999m76959o35939O45112
8554F489603j350150R38130k976655J454924J68122L55067j229097J742898O45458
$$ plain form
8545 6238300 3927727 6271766 4002111 2764400 2871532 3967277 5345325 3384902
8537 3384902 2043866 -9655509 27836138 14640743 10329814 8002218 6299284 8467908
8529 8467908 6738810 5511467 6967157 7075681 7336245 7913082 7267476 4464574 4740728
8520 4740728 7240474 6608998 5182905 7867617 8326799 7591180 5981814 9247579 6293641
8511 6293641 7702526 7822081 8051208 7952724 7116460 7372132 7089521 7216151 6306942 9065085
8501 9065085 9085989 8411486 9187101 7858362 5896008 6743977 8742740 6316784 10352015
8492 10352015 9096801 7385883 6637879 6384298 8648691 8068995 9591720 9547945 10029893
8483 10029893 6965446 8235882 7974445 8835435 8131085 10544260 9831871 9178123 8770293
$$ packed form
8545F238300k310573K344039k269655j237711J07132J095745J378048j960423
8537C384902j341036j1699375L7491647j3195395m310929k327596j702934K168624
8529H467908j729098j227343J455690J08524K60564N76837o45606k802902K76154
8520D740728K499746o31476j426093K684712M59182p35619j609366L265765k953938
8511F293641J408885J19555K29127r8484q36264K55672k82611J26630r09209K758143
8501I065085K0904o74503P75615j328739j962354Q47969J998763k425956M035231
8492A0352015j255214j710918p48004k53581K264393n79696J522725m3775M81948
8483A0029893l064447J270436k61437Q60990p04350K413175p12389o53748m07830
$$ plain form
8474 8770293 8579191 7860779 9181401 9342793 10492543 9205814 11304812 9869417 10267990
8465 10267990 11309769 11508287 11016992 10876460 12028656 9130193 10519443 13159861 11515951
8456 11515951 12290288 13084755 12516018 10230165 11164310 12614416 10781350 12637690 14012483
8447 14012483 12833053 12878197 15025047 15840689 13946865 14133721 13094443 13647586 13770826
8438 13770826 14706981 16707480 16906543 15063603 15296573 14434182 15181154 14890606 16103847
8429 16103847 16040860 14538907 18093087 17270976 16748125 18393303 20042767 17657747 19783104
8420 19783104 18595451 17227301 19756146 21631994 19807961 19974447 20317307 19546078 22179203
8411 22179203 21683505 24074428 21025095 22826457 23581112 22147926 23622230 24173822 23728771
$$ packed form
8474H770293j91102p18412J320622J61392J149750j286729K098998j435395L98573
8465A0267990J041779J98518m91295j40532J152196k898463J389250K640418j643910
8456A1515951P74337P94467n68737k285853R34145J450106j833066J856340J374793
8447A4012483j179430M5144K146850Q15642j893824J86856j039278N53143J23240
8438A3770826R36155K000499J99063j842940K32970q62391P46972k90548J213241
8429A6103847o2987j501953L554180q22111n22851J645178J649464k385020K125357
8420A9783104j187653j368150K528845J875848j824033J66486L42860p71229K633125
8411B2179203m95698K390923l049333J801362P54655j433186J474304N51592m45051
$$ plain form
8402 23728771 25784074 24310256 24270413 22835817 24992643 23917636 24039496 24128541 24340581
8393 24340581 26729203 26465580 25854944 31808264 27852292 26689275 27358984 27228363 27095459
8384 27095459 27898367 26038118 25621681 27654843 27195264 28352503 28301780 27175526 25756705
8375 25756705 25841232 27999169 25246926 26347826 25133793 26449656 27153461 25062730 24508459
8366 24508459 23335338 23582580 25692738 26145890 25797337 23739946 24599726 25035848 21802572
8357 21802572 23664280 24474382 26140948 23424415 23315375 21786493 21992384 19716850 20727398
8348 20727398 23904638 22231007 19252071 19950407 21099177 20317591 20213288 17947435 21655770
8339 21655770 21415647 20269312 18206296 16214796 17239415 18448592 17270979 18818738
$$ packed form
8402B3728771K055303j473818l9843j434596K156826j075007J21860Q9045K12040
8393B4340581K388622k63623o10636N953320l955972j163017O69709j30621j32904
8384B7095459Q02908j860249m16437K033162m59579J157239n0723j126254j418821
8375B5756705Q4527K157937k752243J100900j214033J315863P03805k090731n54271
8366B4508459j173121K47242K110158M53152l48553k057391Q59780M36122l233276
8357B1802572J861708Q10102J666566k716533j09040j528882K05891k275534J010548
8348B0727398L177240j673631k978936O98336J148770p81586j04303k265853L708335
8339B1655770k40123j146335k063016j991500J024619J209177j177613J547759
$$ plain form
8331 18818738 18904875 18166951 16204609 15827291 14511188 14236476 15943238 14775310 15171219
8322 15171219 15387011 12476660 13023994 14565654 13326017 12970516 14766928 13347493 12757110
8313 12757110 11474092 13639416 12980391 11671442 11164525 12988700 11230915 11549465 14399927
8304 14399927 11345071 8762911 12071447 10817338 10179657 13326085 11206692 10975088
8296 10975088 11107723 10150576 8897980 10656392 11967335 10367609 7918902 10909838
8288 10909838 9745021 7803153 10073521 9348640 12711848 9648821 9873142 7040804
8280 7040804 8621310 10572678 8744205 6877450 9439345 7732347 9702346 8952409
8272 8952409 7622494 8783793 9747406 6916801 9863806 10517890 8949714 7670089 10612469
$$ packed form
8331A8818738Q6137p37924j962342l77318j316103k74712J706762j167928L95909
8322A5171219K15792k910351N47334J541660j239637l55501J796412j419435n90383
8313A2757110j283018K165324o59025j308949n06917J824175j757785L18550K850462
8304A4399927l054856k582160L308536j254109o37681L146428k119393k31604
8296A0975088J32635r57147j252596J758412J310943j599726k448707K990936
8288A0909838j164817j941868K270368p24881L363208l063027K24321k832338
8280G040804J580506J951368j828473j866755K561895j706998J969999p49937
8272H952409j329915J161299R63613k830605K947005O54084j568176j279625K942380
$$ plain form
8263 10612469 8685847 7867166 9350250 10744121 8874757 8503927 9729791 9475761 9028924
8254 9028924 6508716 8385070 8348182 8829684 8982213 10512793 7472315 7010849 5694286
8245 5694286 9451628 10280599 10074579 8077491 8988918 7273261 10557606 7100765 7744410
8236 7744410 11770182 10914785 6031604 9449149 8952719 6561163 7618328 7241177 9162002
8227 9162002 8130389 10001151 7865363 6405730 10502739 6625355 7382177 8853955
8219 8853955 6027715 5420275 12486888 9370306 8357371 7876914 9798243 5088984 9997913
8210 9997913 10068631 14219184 7364415 3616193 7094218 9934367 6643245 9244685 4011747
8201 4011747 10263645 14040501 9992231 4172636 6468180 4727363 9771127 13158325
$$ packed form
8263A0612469j926622q18681J483084J393871j869364l70830J225864k54030m46837
8254I028924k520208J876354l6888M81502J52529J530580l040478m61466j316563
8245E694286L757342Q28971k06020j997088R11427j715657L284345l456841O43645
8236G744410M025772q55397m883181L417545m96430k391556J057165l77151J920825
8227I162002j031613J870762k135788j459633M097009l877384P56822J471778
8219H853955k826240o07440P066613l116582j012935m80457J921329m709259M908929
8210I997913P0718M150553o854769l748222L478025K840149l291122K601440n232938
8201D011747O251898L776856m048270n819595K295544j740817N043764L387198
$$ plain form
8193 13158325 9885781 7147801 16490311 9590912 9755415 12107014 9801908 13960367
8185 13960367 11681005 6163129 9300409 9396619 9859974 13111142 9974250 5224167 9483640
8176 9483640 9266160 10320914 7318921 8749078 14370730 9542876 9342231 10802535 8870807
8167 8870807 10835005 11111181 8318047 8529965 12527176 11809036 12523558 11875830 8826513
8158 8826513 12131772 11304875 12249161 14061978 8685791 11291417 9272995 10171594 10187132
8149 10187132 14202991 13009107 12627929 10810677 16664652 11256348 11782397 11538495 14620250
8140 14620250 13835795 14167907 13731383 12456026 12193457 9964893 12035844 12638073 14270814
8131 14270814 13691753 12365479 16135827 12940690 14242320 13049015 15097903 18529765
$$ packed form
8193A3158325l272544k737980R342510o899399J64503K351599k305106M158459
8185A3960367k279362n517876L137280R6210M63355L251168l136892m750083M259473
8176I483640k17480J054754l001993J430157N621652m827854k00645J460304j931728
8167H870807J964198K76176k793134K11918L997211p18140P14522o47728l049317
8158H826513L305259q26897R44286J812817n376187K605626k018422Q98599J5538
8149A0187132M015859j193884l81178j817252N853975n408304N26049k43902L081755
8140A4620250p84455L32112m36524j275357k62569k228564K070951O02229J632741
8131A4270814n79061j326274L770348l195137J301630j193305K048888L431862
$$ plain form
8123 18529765 14561901 16405837 14936409 14572722 15553394 16076325 17761451 16568784 17166687
8114 17166687 16412708 14523670 15119074 15908462 16328646 15063387 15486619 17445866 14922773
8105 14922773 16191850 14917142 16329658 17893162 17012565 16330583 16419697 19246490 17273122
8096 17273122 15948249 16864352 15506852 15400122 17614649 16364609 14578346 16870846
8088 16870846 15977622 18355031 16982966 17817353 14763186 12683890 13641417 13837702 14519546
8079 14519546 17076565 15181706 13668717 14003346 15224875 16087737 16306953 16009723 14914157
8070 14914157 12778053 14881018 15051060 15281789 15861853 15234543 15705156 15180110 15171640
8061 15171640 13100112 15212996 13717651 15160298 13242208 13325277 12885575 13106878 13641480
$$ packed form
8123A8529765l967864J843936j469428l63687R80672N22931J685126j192667N97903
8114A7166687p53979j889038N95404P89388M20184j265259M23232J959247k523093
8105A4922773J269077j274708J412516J563504q80597o81982Q9114K826793j973368
8096A7273122j324873R16103j357500j06730K214527j250040j786263K292500
8088A6870846q93224K377409j372065Q34387l054167k079296R57527J96285O81844
8079A4519546K557019j894859j512989L34629J221529Q62862K19216k97230j095566
8070A4914157k136104K102965J70042K30729N80064o27310M70613n25046q470
8061A5171640k071528K112884j495345J442647j918090Q3069m39702K21303N34602
$$ plain form
8052 13641480 12254404 14420121 13594356 12328695 12368300 12463283 12972840 13502903 12023136
8043 12023136 13538626 11784793 10893855 10888899 10679503 9985010 11559712 10562059 9764005
8034 9764005 9888476 9213293 9804004 11069045 10586488 8923441 10873656 12236812 11470194
8025 11470194 9295023 9307956 9110495 10056450 9543321 10167386 9763871 8850682 8761687 10429504
8015 10429504 11681296 9642962 9535971 8991519 7314514 8264232 9244651 7352714 8187181
8006 8187181 8428136 9136916 8804122 10703665 10922379 10221221 8702234 8921900 8165023
7997 8165023 8783484 7872785 9234680 10686671 7378912 8029468 8534652 7307216 6997186
7988 6997186 9086560 8172969 9286381 9206843 8415375 7952984 6005737 9401314 7138321
$$ packed form
8052A3641480j387076K165717q25765j265661L9605R4983N09557N30063j479767
8043A2023136J515490j753833q90938m956k09396o94493J574702r97653p98054
8034I764005J24471o75183N90711J265041m82557j663047J950215J363156p66618
8025A1470194k175171J2933j97461R45955n13129O24065m03515r13189q8995J667817
8015A0429504J251792k038334j06991n44452j677005R49718R80419j891937Q34467
8006H187181K40955P08780l32794J899543K18714p01158j518987K19666p56877
7997H165023O18461r10699J361895J451991l307759O50556N05184j227436l10030
7988F997186K089374r13591J113412p9538p91468m62391j947247L395577k262993
$$ plain form
7979 7138321 6908023 11332994 7613733 7313743 5670011 7814267 6762987 9057117 6573245
7970 6573245 6542656 7735172 7458251 9331963 7389900 5420069 6108417 7001622 5714319
7961 5714319 5962832 7531727 7237386 8197846 9156717 8226732 7364635 8463657 6061837
7952 6061837 9109283 6329096 6235379 5797008 7323386 7410553 6399802 8997083 7251098
7943 7251098 5967628 5808750 6298376 6655365 7115887 6957348 6209216 8529752 7077036
7934 7077036 6747728 7186782 8282898 6661080 5150993 6884836 5741319 6644092 6359203
7925 6359203 6473499 4643304 7384364 5370999 5877279 7836360 7518396 3997470 5857661
7916 5857661 4584666 7366812 5517267 6782445 8082813 6438456 7656059 7018585
$$ packed form
7979G138321k30298M424971l719261k99990j643732K144256j051280K294130k483872
7970F573245l0589J192516k76921J873712j942063j969831O88348Q93205j287303
7961E714319K48513J568895k94341R60460R58871r29985q62097J099022k401820
7952F061837L047446k780187r3717m38371J526378Q7167j010751K597281j745985
7943G251098j283470j58878M89626L56989M60522j58539p48132K320536j452716
7934G077036l29308M39054J096116j621818j510087J733843j143517R02773k84889
7925F359203J14296j830195K741060k013365N06280J959081l17964l520926J860191
7916E857661j272995K782146j849545J265178J300368j644357J217603o37474
$$ plain form
7908 7018585 6873089 7158431 7178805 5610502 6467423 7659996 7345535 6762571 4372710
7899 4372710 7002818 7255938 6508922 6016122 7169106 5637500 7353912 6000297 5694365
7890 5694365 5212061 5857138 6239512 5987758 8082298 6992087 5911284 5879858 5076346
7881 5076346 6086287 6225803 6310687 4462095 4908662 5024384 6944646 5710365 4145998
7872 4145998 4993626 5359877 6110893 5144182 3372092 6051329 4179921 5593311 7232742
7863 7232742 4464380 2755670 4836680 4076450 3793894 4816908 4096526 4429591 1812359
7854 1812359 2653818 1253108 -2658752 -2619471 -6277957 36951936 16581955 16460760 11976791
7845 11976791 10264925 9407962 11424872 8328638 5892691 7602372 7627797 7628021 5742743
$$ packed form
7908G018585j45496K85342K0374j568303Q56921J192573l14461n82964k389861
7899D372710K630108K53120p47016m92800J152984j531606J716412j353615l05932
7890E694365m82304O45077L82374k51754K094540j090211j080803l1426q03512
7881E076346J009941J39516Q4884j848592M46567J15722J920262j234281j564367
7872D145998Q47628L66251P51016r66711j772090K679237j871408J413390J639431
7863G232742k768362j708710K081010p60230k82556J023014p20382L33065k617232
7854A812359Q41459j400710l911860L9281l658486M3229893k0369981j21195m483969
7845A1976791j711866q56963K016910l096234k435947J709681K5425K24j885278
$$ plain form
7836 5742743 6382285 6429276 5159453 7797543 8463753 7794628 6643958 7494750 5866086
7827 5866086 6116423 7665881 5832126 6626052 5768613 6228145 8974790 8139549 8657111
7818 8657111 6792325 6494339 7904392 5334743 7419066 6406289 6760542 7210736 7342482
7809 7342482 5109424 8939457 5299887 5648177 4728825 6723958 6886629 4789175 6872780
7800 6872780 7785143 5846058 5718906 6296795 2201254 5243983 4702077 6505700 6004916
7791 6004916 5906699 6599140 5713876 8060951 6650765 6566064 6819923 6367734 7247484 7004899
7781 7004899 7705388 7132720 5277445 7567072 7106627 7379157 6615369 4614121 8051970
7772 8051970 5105310 7105128 6910172 7003979 7873256 6168850 6401474 6152330 8836138
$$ packed form
7836E742743O39542M6991j269823K638090O66210o69125j150670Q50792j628664
7827E866086K50337J549458j833755P93926q57439M59532K746645q35241N17562
7818H657111j864786k97986J410053k569649K084323j012777L54253M50194J31746
7809G342482k233058L830033l639570L48290r19352J995133J62671k097454K083605
7800F872780R12363j939085j27152N77889m095541L042729n41906J803623n00784
7791F004916r8217O92441q85264K347075j410186q4701K53859m52189Q79750k42585
7781G004899P00489n72668j855275K289627m60445K72530p63788k001248L437849
7772H051970k946660J999818j94956R3807Q69277j704406K32624k49144K683808
$$ plain form
7763 8836138 5677157 8079151 7564178 7078567 6640615 6352980 6149566 6570868 7084566
7754 7084566 5542032 4899379 6448235 7069513 7325930 6934192 6267636 6279740 6438123
7745 6438123 6735966 6725266 7341777 5841578 7144767 5736435 7800576 8464934 5890568
7736 5890568 8346804 7453319 6652047 9086185 9399259 8318457 6584903 5643862 9917538
7727 9917538 6134466 7418499 6520839 6695141 5027776 5324717 7956908 6722928 8610338
7718 8610338 6887005 7581668 8087056 6784310 6433526 6658786 7918005 6383866 8055077
7709 8055077 7390579 7648606 9192579 6913178 8509607 7642996 6964260 8381291 8590988
7700 8590988 4983507 6213038 7139421 5460707 8408447 6637174 8517755 6555521
$$ packed form
7763H836138l158981K401994n14973m85611m37952k87635k03414M21302N13698
7754G084566j542534o42653J548856O21278K56417l91738o66556J2104J58383
7745F438123K97843j0700O16511j500199J303189j408332K064141O64358k574366
7736E890568K456236q93485q01272K434138L13074j080802j733554r41041M273676
7727I917538l783072J284033q97660J74302j667365K96941K632191j233980J887410
7718H610338j723333O94663N05388j302746l50784K25260J259219j534139J671211
7709H055077o64498K58027J543973k279401J596429q66611o78736J417031K09697
7700H590988l607481J229531R26383j678714K947740j771273J880581j962234
$$ plain form
7692 6555521 5052549 7743575 7558305 6560442 6218459 6046502 7547136 6720306 7870061
7683 7870061 7644330 8618607 9482105 6763762 8651032 6260802 6267166 7891170 8599410
7674 8599410 7544932 7250476 9361733 7435861 9645963 6560346 7686640 7846692 7088069
7665 7088069 9491103 7811583 7919936 7709084 7931496 6759625 9108556 9703096 7225704
7656 7225704 8627425 9006563 7910354 9390585 7610978 8323695 6956602 7227889 9902030
7647 9902030 7150228 7855138 5899714 9283096 7566902 6800376 8100840 8286350 7335593
7638 7335593 9140940 8154944 10264668 10097355 7714264 8474993 6911238 9109577 7425889
7629 7425889 8323122 6640132 9718302 10924784 10137414 9191410 7648258 7410110 8418912
$$ packed form
7692F555521j502972K691026j85270r97863l41983j71957J500634q26830J149755
7683G870061k25731R74277Q63498k718343J887270k390230O364J624004P08240
7674H599410j054478k94456K111257j925872K210102l085617J126294J60052p58623
7665G088069K403034j679520J08353k10852K22412j171871K348931N94540k477392
7656G225704J401721L79138j096209J480231j779607P12717j367093K71287K674141
7647I902030k751802P04910j955424L383382j716194p66526J300464J85510r50757
7638G335593J805347r85996K109724j67313k383091P60729j563755K198339j683688
7629G425889Q97233j682990L078170J206482p87370r46004j543152k38148J008802
$$ plain form
7620 8418912 9098127 10326996 10069844 7880627 7974566 8677918 9644900 9154008 8961526
7611 8961526 8433625 7671643 8623835 8240960 9600398 7821315 6768905 9657161 10567867
7602 10567867 9264230 9266312 7015505 9121534 10358914 9509800 9468235 9540395 8240499
7593 8240499 9640583 9370683 9865386 10757330 10352845 9463738 10696582 8100898 7435733
7584 7435733 11468326 10073751 9444616 9280035 9302498 9305537 8849040 8850301 11639479 9827079
7574 9827079 10046250 10259217 11653009 9746514 11209409 11751059 10975378 9820450 10030828
7565 10030828 9361393 9691496 11205058 10038166 8431845 10934915 12447378 9432662
7557 9432662 9100366 9278269 12562616 11837007 11770197 11066489 10794506 10470757 11570987
$$ packed form
7620H418912O79215J228869k57152k189217R3939P03352R66982m90892j92482
7611H961526n27901p61982R52192l82875J359438j779083j052410K888256R10706
7602A0567867j303637K082k250807K106029J237380q49114m1565P2160j299896
7593H240499J400084k69900M94703Q91944m04485q89107J232844k595684o65165
7584G435733M032593j394575o29135j64581K2463L039m56497J261K789178j812400
7574I827079K19171K12967J393792j906495J462895N41650p75681j154928K10378
7565A0030828o69435L30103J513562j166892j606321K503070J512463l014716
7557I432662l32296J77903L284347p25609o6810p03708k71983l23749J100230
$$ plain form
7548 11570987 11509658 11080378 13006628 8669477 9456714 12111196 10979402 10350887 9381836
7539 9381836 10840023 11227894 10142720 11009366 11229333 10957517 10336517 12288020 14478945
7530 14478945 10650153 10569102 12081105 11422774 11115496 12418057 9354336 12014765 14912270
7521 14912270 11996486 11027847 11910411 11661003 13413992 11317634 10915317 12337698 10179494
7512 10179494 12433754 12526265 13136849 13702534 13927386 12907655 13105723 11161603 12273041
7503 12273041 12937079 11868520 14158991 14300565 14836515 13005979 12790390 11120330 12372629
7494 12372629 12731367 13440257 13503241 14259357 13836444 14487103 13597980 14052418 13671892 12973794
7484 12973794 14781954 13986404 12328381 15660756 11866100 16802651 14161754 15123145
$$ packed form
7548A1570987o1329m29280J926250m337151P87237K654482j131794o28515r69051
7539I381836J458187L87871j085174Q66646K19967k71816o21000J951503K190925
7530A4478945l828792q1051J512003o58331l07278J302561l063721K660429K897505
7521A4912270k915784r68639Q82564k49408J752989k096358m02317J422381k158204
7512A0179494K254260R2511O10584N65685K24852j019731J98068j944120J111438
7503A2273041O64038j068559K290471J41574N35950j830536k15589j670060J252299
7494A2372629L58738P08890O2984P56116m22913O50659q89123M54438l80526o98098
7484A2973794J808160p95550j658023L332375l794656M936551k640897R61391
$$ plain form
7476 15123145 15300150 15822978 14572605 15277337 14382762 13989225 14687612 16499318 15915936
7467 15915936 17464408 15440446 16350587 17921379 15575936 15959167 15069755 16873154 14938930
7458 14938930 13095589 16226512 18075604 15644121 14886430 15256823 16344269 17285355 16896718
7449 16896718 15138096 16686308 15410546 15672599 16742810 15008640 16276700 14435274
7441 14435274 16898493 17612247 15409014 14408417 14384133 17098024 16133937 15532813 16119559
7432 16119559 16051208 14877846 15969378 15244846 14271956 14362508 12699913 14075096 17005970
7423 17005970 15126060 16141566 14604759 15280247 14916850 12335362 15717942 13349296
7415 13349296 14746199 12786287 15825752 15266762 14066093 14428105 14202900 15146419 15837397
$$ packed form
7476A5123145J77005N22828j250373P04732q94575l93537O98387J811706n83382
7467A5915936J548472k023962R10141J570792k345443L83231q89412J803399j934224
7458A4938930j843341L130923J849092k431483p57691L70393J087446R41086l88637
7449A6896718j758622J548212j275762K62053J070211j734170J268060j841426
7441A4435274K463219P13754k203233j000597k4284K713891r64087o01124N86746
7432A6119559o8351j173362J091532p24532r72890R0552j662595J375183K930874
7423A7005970j879910J015506j536807O75488l63397k581488L382580k368646
7415A3349296J396903j959912L039465n58990j200669L62012k25205R43519O90978
$$ plain form
7406 15837397 14080049 15256789 14916994 12853077 14062111 14889604 15570979 15130221 17180415
7397 17180415 14447339 12780966 14089984 14349793 11220847 15231074 15319492 13341810 12910850
7388 12910850 13320114 14535166 13671767 12586772 13325850 13664233 14105910 12207797 15550272
7379 15550272 14879517 13256136 13453905 13062089 13908957 14548605 15038753 15552449 11636331
7370 11636331 14938271 14835756 12102294 14697568 13431049 14771143 14814454 13860957 12089503
7361 12089503 15023613 13026275 12910476 14257984 14853610 13547119 15288003 13716370
7353 13716370 13831367 13338534 15079560 13975846 12401924 13682141 15742172 11170018
7345 11170018 15735037 12088655 13530399 13595366 12841666 11985560 11407106 15695773 12673242
$$ packed form
7406A5837397j757348J176740l39795k063917J209034Q27493O81375m40758K050194
7397A7180415k733076j666373J309018K59809l128946M010227Q8418j977682m30960
7388A2910850M09264J215052q63399j084995P39078L38383M41677j898113L342475
7379A5550272o70755j623381J97769l91816Q46868O39648M90148N13696l916118
7370A1636331L301940j02515k733462K595274j266519J340094M3311r53497j771454
7361A2089503K934110j997338j15799J347508N95626j306491J740884j571633
7353A3716370J14997m92833J741026j103714j573922J280217K060031m572154
7345A1170018M565019l646382J441744O4967p53700q56106n78454M288667l022531
$$ plain form
7336 12673242 13472769 14038542 15206182 14550141 14625656 14505524 15385945 11816251 13367244
7327 13367244 12350387 13706577 14492449 11727401 11560340 14769716 12665378 12241190 15283560
7318 15283560 14447172 11416266 15029712 14514984 13230173 13379693 11893174 12336557 15752231
7309 15752231 11754218 13223440 15074543 15127810 14714954 15441238 14688407 13591954 13209912
7300 13209912 12972689 14876814 14233467 14073037 13870845 14971304 15030296 14735579 13342418
7291 13342418 14755766 13298822 14997421 13365032 14689680 14733091 13193930 14531893
7283 14531893 14511007 15591899 13380114 15566547 14909853 15187744 14545798 15351177 14346785
7274 14346785 14180016 14625318 15995503 15621460 15056064 14214683 11645566 14923981 14902958
$$ packed form
7336A2673242P99527N65773J167640o56041P5515j20132Q80421l569694J550993
7327A3367244j016857J356190P85872k765048j67061L209376k104338m24188L042370
7318A5283560q36388l030906L613446n14728j284811J49520j486519M43383L415674
7309A5752231l998013J469222J851103N3267m12856P26284p52831j096453l82042
7300A3209912k37223J904125o43347j60430k02192J100459N8992k94717j393161
7291A3342418J413348j456944J698599j632389J324648M3411j539161J337963
7283A4531893k0886J080892k211785K186433o56694K77891o41946Q05379j004392
7274A4346785j66769M45302J370185l74043n65396q41381k569117L278415k1023
$$ plain form
7265 14902958 14596115 12646329 16012393 15371203 15329399 16237779 14294262 15448051 14721253
7256 14721253 15035913 16701948 13922197 14588389 14365592 14711619 14728568 14181952 14822066
7247 14822066 16121059 16242476 15891959 15437145 16451074 16063910 15518381 13535048 16350493
7238 16350493 16039090 15959170 17487176 17633174 16501411 15816685 16700513 14260975 14810068
7229 14810068 15848395 15819495 16713762 14641667 16847370 17256480 17219944 17837986 16203121
7220 16203121 15718205 18359699 16620363 16738343 17043433 15391533 15384825 17956010 17788014
7211 17788014 15568978 17322024 14459210 16008938 15734911 17489900 14627385 15532080
7203 15532080 16027789 17469741 18164271 18070823 18144534 17503038 16677626 19008490 19337338
$$ packed form
7265A4902958l06843j949786L366064o41190m1804R08380j943517J153789p26798
7256A4721253L14660J666035k779751O66192k22797L46027J6949n46616O40114
7247A4822066J298993J21417l50517m54814J013929l87164n45529j983333K815445
7238A6350493l11403p9920J528006J45998j131763o84726Q83828k439538N49093
7229A4810068J038327k8900Q94267k072095K205703M09110l6536O18042j634865
7220A6203121m84916K641494j739336J17980L05090j651900o708K571185j67996
7211A7788014k219036J753046k862814J549728k74027J754989k862515R04695
7203A5532080M95709J441952O94530r3448P3711o41496q25412K330864L28848
$$ plain form
7194 19337338 18486157 17757909 17486407 19443204 17605141 18116307 18355725 20708612 17243816
7185 17243816 16069845 17138254 17293803 20168728 18164547 21478802 19130107 20226420
7177 20226420 19321798 18421473 17313223 20820926 18768767 19488350 18484004 20776125 20819651
7168 20819651 19292429 20461455 17940957 18925468 18262946 22153271 19694963 18205271
7160 18205271 21821555 21495543 21546692 21052523 19240998 19763381 22098128 20138719 22360684
7151 22360684 21250105 21104560 20020327 21230034 20832772 21892507 19644005 20442859 21513865
7142 21513865 20991328 21389487 20564500 21058534 21646648 20488226 21657198 21941161 23788605
7133 23788605 21227413 21287543 22890142 22310958 23513094 22209359 23140966 23202693 22599936
$$ packed form
7194A9337338q51181p28248k71502J956797j838063N11166K39418K352887l464796
7185A7243816j173971J068409J55549K874925k004181L314255k348695J096313
7177B0226420r04622r00325j108250L507703k052159P19583j004346K292121M3526
7168B0819651j527222J169026k520498R84511o62522L890325k458308j489692
7160A8205271L616284l26012N1149m94169j811525N22383K334747j959409K221965
7151B2360684j110579j45545j084233J209707l97262J059735k248502P98854J071006
7142B1513865n22537L98159q24987M94034N88114j158422J168972K83963J847444
7133B3788605k561192O0130J602599n79184J202136j303735R31607O1727o02757
$$ plain form
7124 22599936 22260281 22578614 22315949 22840108 24167368 24321006 23382946 21724280 21934309
7115 21934309 23454829 25556924 25544952 24653590 24771331 25840845 24261210 22857608 23605116
7106 23605116 23431005 23506849 26239960 25759767 23737465 24383195 25132307 24319749 25044856
7097 25044856 25806346 24950056 25155244 25330315 25524709 24468978 28058293 24535609 25118997
7088 25118997 27587277 26708051 26156795 25701213 26501764 26463624 26009763 26415442 25831935
7079 25831935 26733796 26059988 26410463 26158652 27685645 27982147 28451649 29331864 26173353
7070 26173353 26628697 30471301 28062762 27307994 28762095 28864744 28422128 27427720 29413974
7061 29413974 28075792 31080576 30591814 28328058 27447957 28955082 28420309 30414880 29556404
$$ packed form
7124B2599936l39655L18333k62665N24159J327260J53638r38060j658666K10029
7115B1934309J520520K102095j1972q91362J17741J069514j579635j403602P47508
7106B3605116j74111P5844K733111m80193k022302O45730P49112q12558P25107
7097B5044856P61490q56290K05188J75071J94394j055731L589315l522684N83388
7088B5118997K468280q79226n51256m55582Q00551l8140m53861M05679n83507
7079B5831935R01861o73808L50475k51811J526993K96502M69502Q80215l158511
7070B6173353M55344L842604k408539p54768J454101J02649m42616r94408J986254
7061B9413974j338182L004784m88762k263756q80101J507125n34773J994571q58476
$$ plain form
7052 29556404 31185375 29991941 29876688 30930696 30776855 30071756 31583707 30922215 30388298
7043 30388298 32711821 31473507 32166802 30625473 32039734 31753816 31572011 30920645 33643575
7034 33643575 33930901 31360725 33426210 34427545 32617626 33188159 35128693 32848564
7026 32848564 35625115 35071907 34437138 32437531 33837613 34408475 34378032 34860881 37340210
7017 37340210 33312132 35868071 35983215 35300539 35894482 36276146 37029652 35369632 35290691
7008 35290691 35722052 36492245 36776480 36136184 37806380 38323402 37899729 37985416 37474642
6999 37474642 34894071 38059134 39064108 39534195 37923330 39362024 36881881 38537869
6991 38537869 39267567 38682083 37654885 42270105 39348006 41315459 40500369 41610810 40700827
$$ packed form
7052B9556404J628971j193434j15253J054008j53841p05099J511951o61492n33917
7043C0388298K323523j238314O93295j541329J414261k85918j81805o51366K722930
7034C3643575K87326k570176K065485J001335j809919N70533J940534k280129
7026C2848564K776551n53208o34769j999607J400082N70862l0443M82849K479329
7017C7340210m028078K555939J15144o82676N93943L81664P53506j660020p8941
7008C5290691M31361P70193K84235o40296J670196N17022m23673Q5687n10774
6999C7474642k580571L165063J004974M70087j610865J438694k480143J655988
6991C8537869P29698n85484j027198M615220k922099J967453q15090J110441r09983
$$ plain form
6982 40700827 39238942 40896047 41988783 43299661 41358728 41569939 41146980 42770989
6974 42770989 42873574 43214254 42237139 43208962 44633744 45184118 44029659 44698589 45313904
6965 45313904 44724888 43720405 44812343 45272848 46639674 44344922 46241937 46359410 46893414
6956 46893414 46957192 46102139 48126498 45537048 47694735 48131064 49622326 49305539 47362294
6947 47362294 49309949 48774251 49362127 49260205 50422278 50848442 50543404 50486622 49825065
6938 49825065 51972079 52017500 52311581 53107397 50915232 53774149 53865931 52805841 55132634
6929 55132634 52915900 54697046 53730270 53928948 55145966 55221888 55866997 55654519 56099571
6920 56099571 56558254 57865035 56675402 56626193 57388645 59444225 61178467 61106465 58968392
$$ packed form
6982D0700827j461885J657105J092736J310878j940933K11211m22959J624009
6974D2770989J02585L40680r77115R71823J424782N50374j154459O68930O15315
6965D5313904n89016j004483J091938M60505J366826k294752J897015J17473N34004
6956D6893414O3778q55053K024359k589450K157687M36329J491262l16787j943245
6947D7362294J947655n35698N87876j01922J162073M26164l05038n6782o61557
6938D9825065K147014M5421K94081P95816k192165K858917R1782j060090K326793
6929E5132634k216734J781146r66776J98678J217018P5922O45109k12478M45052
6920E6099571M58683J306781j189633m9209P62452K055580J734242p2002k138073
$$ plain form
6911 58968392 59141795 58978104 60361170 59912275 62482990 62111384 62367670 64123831 62511657
6902 62511657 64683013 63836529 62401538 64541006 64801525 64551346 66934192 66481636 66194544
6893 66194544 67650536 66854951 67234237 69123071 70005932 69399834 70148277 68148793 68262260
6884 68262260 72035409 72684234 71962192 72815941 72687133 74306430 73263388 73900777 75364797
6875 75364797 76045287 77226260 76519608 76821528 76107366 77564963 77122016 79471097 79775614
6866 79775614 80514234 78683699 81776076 79996024 81737739 83012176 84503998 85828975
6858 85828975 85211979 84413855 86575249 87340867 86411693 88732126 87916777 91426661 90755995
6849 90755995 91362386 92668820 92360060 92874845 93572912 95835736 95505804 97290503 95317056
$$ packed form
6911E8968392J73403j63691J383066m48895K570715l71606K56286J756161j612174
6902F2511657K171356q46484j434991K139468K60519k50179K382846m52556k87092
6893F6194544J455992p95585L79286J888834Q82861o06098P48443j999484J13467
6884F8262260L773149O48825p22042Q53749j28808J619297j043042O37389J464020
6875G5364797O80490J180973p06652L01920p14162J457597m42947K349081L04517
6866G9775614P38620j830535L092377j780052J741715J274437J491822J324977
6858H5828975o16996p98124K161394P65618r29174K320433q15349L509884o70666
6849I0755995O06391J306434l08760N14785O98067K262824l29932J784699j973447
$$ plain form
6840 95317056 97776074 98457818 98260693 98749078 100424843 101714074 101872707 103398689 104235539
6831 104235539 103221451 106899607 107578649 108818756 109067659 109042922 112003314 111559775 112368298
6822 112368298 112921294 115195298 117251612 117745345 116534017 118480747 118993639 120352202
6814 120352202 122168795 123507883 122989707 125511273 125550861 125707464 127254702 128065055 129639253
6805 129639253 131903853 133702279 133814318 134120728 137305106 137010963 138293810 139900541
6797 139900541 141114962 144283570 144763864 146272778 146434085 149349954 151261139 152325965
6789 152325965 153967925 152876224 156451309 157540217 159334060 160275108 162630742 163748423
6781 163748423 164787210 165361442 168734080 170187629 171421615 175061309 174136845 177245200
$$ packed form
6840I5317056K459018O81744j97125M88385J675765J289231J58633J525982Q36850
6831A04235539j014088L678156O79042J240107K48903k4737K960392m43539Q08523
6822A12368298N52996K274004K056314M93733j211328J946730N12892J358563
6814A20352202J816593J339088n18176K521566L9588J56603J547238Q10353J574198
6805A29639253K264600J798426J12039L06410L184378k94143J282847J606731
6797A39900541J214421L168608M80294J508914J61307K915869J911185J064826
6789A52325965J641960j091701L575085J088908J793843R41048K355634J117681
6781A63748423J038787N74232L372638J453549J233986L639694r24464L108355
$$ plain form
6773 177245200 177773849 179649857 182418576 185323747 186795618 189547487 191966472 191598359
6765 191598359 193859285 195162446 199368021 198739315 200424702 205094668 206084260 207634403
6757 207634403 212312738 212049350 216132547 216942988 220536365 222493410 224121435 226523213
6749 226523213 230238718 231568046 237528803 237060930 241418633 243795394 246310726 249073930
6741 249073930 251417110 253753949 255879822 258067348 262960512 264913095 266505847 270783709
6733 270783709 273752444 277541511 280655546 282481342 285656642 287938292 290870532 295719790
6725 295719790 299215609 304299078 307111851 309328961 314065351 316861811 319570844 323208940
6717 323208940 324054689 330328400 336374115 337176263 342003334 345804308 347986757 350762946
$$ packed form
6773A77245200N28649J876008K768719K905171J471871K751869K418985l68113
6765A91598359K260926J303161M205575o28706J685387M669966R89592J550143
6757B07634403M678335k63388M083197Q10441L593377J957045J628025K401778
6749B26523213L715505J329328N960757m67873M357703K376761K515332K763204
6741B49073930K343180K336839K125873K187526M893164J952583J592752M277862
6733B70783709K968735L789067L114035J825796L175300K281650K932240M849258
6725B95719790L495819N083469K812773K217110M736390K796460K709033L638096
6717C23208940Q45749O273711O045715Q02148M827071L800974K182449K776189
$$ plain form
6709 350762946 354488372 358739205 363496653 365916661 369599586 373575585 378167162 383820406
6701 383820406 386606364 388543666 393919390 399374191 401375837 406953173 408048066 410967071
6693 410967071 417677577 421095344 425283045 429864512 432337037 435088774 438792586 443719416
6685 443719416 447479579 450283456 453992094 456594217 461321533 462252229 464821521 470767517
6677 470767517 471954203 477976525 478458346 482463541 485574871 487127035 491381439 493787281
6669 493787281 497050792 499051695 501187393 502106993 505683131 506540605 508345895 511145800
6661 511145800 512058282 512449446 513140688 515610568 518358206 516635588 516854104 520569010 516898403
6652 516898403 519950046 517622867 521024171 519224521 517291583 517676151 516738691 518110117
$$ packed form
6709C50762946L725426M250833M757448K420008L682925L975999M591577N653244
6701C83820406K785958J937302N375724N454801K001646N577336J094893K919005
6693D10967071O710506L417767M187701M581467K472525K751737L703812M926830
6685D43719416L760163K803877L708638K602123M727316R30696K569292N945996
6677D70767517J186686O022322M81821M005195L111330J552164M254404K405842
6669D93787281L263511K000903K135698R19600L576138Q57474J805290K799905
6661E11145800R12482L91164O91242K469880K747638j722618K18516L714906l670607
6652E16898403L051643k327179L401304j799650j932938L84568r37460J371426
$$ plain form
6644 518110117 518257317 514673613 515684058 512160750 510589690 510821394 510158864 507884210
6636 507884210 505392832 502055707 500329870 497620304 496111303 494989279 491513370 486574373
6628 486574373 483715732 481549426 478029531 475446372 471048343 469803293 466701527 461088847
6620 461088847 457137255 454147059 451330496 446206827 443044633 440692748 437189512 432358531
6612 432358531 428988564 424793099 421216235 415493972 413835192 410550380 405594462 397929601
6604 397929601 396760809 389514063 387404672 384144193 378781352 376545409 373326332 367665720
6596 367665720 362292652 357956026 356008358 353383098 348259134 345610657 340156287 338989547
6588 338989547 331853841 329305510 324638151 321988853 317834751 315724441 311465437 304808041
$$ packed form
6644E18110117J47200l583704J010445l523308j571060K31704o62530k274654
6636E07884210k491378l337125j725837k709566j509001j122024l475909m938997
6628D86574373k858641k166306l519895k583159m398029j245050l101766n612680
6620D61088847l951592k990196k816563n123669l162194k351885l503236m830981
6612D32358531l369967m195465l576864n722263j658780l284812m955918p664861
6604C97929601j168792p246746k109391l260479n362841k235943l219077n660612
6596C67665720n373068m336626j947668k625260n123964k648477n454370j166740
6588C38989547p135706k548331m667359k649298m154102k110310m259004o657396
$$ plain form
6580 304808041 304648836 301814129 299863284 292983684 290994282 288474107 281687309 280621583
6572 280621583 274584770 273448732 271872679 266863118 263879994 262855180 257312541 254971958
6564 254971958 253140616 250485041 248013087 245064016 240438280 240588666 236394613 230815659
6556 230815659 228765386 228132623 226551024 223387210 219492020 217132974 214300157 214260579
6548 214260579 210204348 207921372 207748299 203836412 199934361 199486697 196247444 194329280
6540 194329280 192243609 192173940 189146584 186145151 184159063 183464837 178590765 177090091
6532 177090091 174284763 175097923 173833582 172607918 168021711 167182250 164526851 163405856
6524 163405856 161067144 162002321 160097183 155238081 156612904 154632205 152450456 151862374
$$ packed form
6580C04808041j59205k834707j950845o879600j989402k520175o786798j065726
6572B80621583o036813j136038j576053n009561k983124j024814n542639k340583
6564B54971958j831342k655575k471954k949071m625736J50386m194053n578954
6556B30815659k050273o32763j581599l163814l895190k359046k832817l9578
6548B14260579m056231k282976j73073l911887l902051m47664l239253j918164
6540A94329280k085671o9669l027356l001433j986088o94226m874072j500674
6532A77090091k805328Q13160j264341j225664m586207q39461k655399j120995
6524A63405856k338712R35177j905138m859102J374823j980699k181749n88082
$$ plain form
6516 151862374 148436331 149189483 147279026 145411491 142767508 140526878 141531391 139877290
6508 139877290 137999655 137658845 136769303 131805364 132685835 130886895 129347988 126265822
6500 126265822 126637339 125723350 126691532 123830830 122476419 123894640 118885439 119918691
6492 119918691 117067615 117505697 115497413 114152340 113459990 110916728 112955425 107654627
6484 107654627 107661275 107596585 108279367 106482308 105948260 103720934 102492397 101439364 101175837
6475 101175837 100818161 100920361 97172231 99274833 97822509 95794195 95812539 92631243 93179475
6466 93179475 93461831 91191097 92976205 91136210 89015009 89100916 88224448 88534239 87205109
6457 87205109 85181723 85588973 83436605 83987143 83415442 84611936 83400858 82123829 80846052
$$ packed form
6516A51862374l426043P53152j910457j867535k643983k240630J004513j654101
6508A39877290j877635l40810q89542m963939Q80471j798940j538907l082166
6500A26265822L71517r13989R68182k860702j354411J418221n009201J033252
6492A19918691k851076M38082k008284j345073o92350k543262K038697n300798
6484A07654627O648o4690O82782j797059n34048k227326j228537j053033k63527
6475A01175837l57676J02200l748130K102602j452324k028314J8344l181296N48232
6466I3179475K82356k270734J785108j839995k121201Q5907q76468L09791j329130
6457H7205109k023386M07250k152368N50538n71701J196494j211078j277029j277777
$$ plain form
6448 80846052 80740699 79563018 77467477 79046807 77762864 76107720 76844541 76163118 76778267
6439 76778267 73244525 73798930 73704009 73976708 73484185 71025012 72259188 71938544 71610214
6430 71610214 71357099 70567423 69286779 67614560 68906757 69615679 67740192 66744210 65156666
6421 65156666 66710450 68090243 65999544 64933822 64836520 62727042 64139043 61400296
6413 61400296 62591446 61402498 61403200 62249112 61231519 63100399 63760294 60781934 59404280
6404 59404280 59488840 61417178 59673040 60033865 58280455 58556533 57873025 58338855 55176428
6395 55176428 60052498 56933224 56408241 57242404 55593041 54991087 54989334 55482628 55601481
6386 55601481 54078823 54902183 55755892 52867879 55360394 53584146 53562413 54239969 53433574
$$ packed form
6448H0846052j05353j177681k095541J579330j283943j655144P36821o81423O15149
6439G6778267l533742N54405r4921K72699m92523k459173J234176l20644l28330
6430G1610214k53115p89676j280644j672219J292197P08922j875487r95982j587544
6421F5156666J553784J379793k090699j065722r7302k109478J412001k738747
6413F1400296J191150j188948P02Q45912j017593J868880O59895k978360j377654
6404E9404280Q4560J928338j744138L60825j753410K76078o83508M65830l162427
6395E5176428M876070l119274n24983Q34163j649363o01954j753M93294J18853
6386E5601481j522658Q23360Q53709k888013K492515j776248k1733O77556q06395
$$ plain form
6377 53433574 53404736 53410455 53209858 51214528 51534539 50539378 51575262 51820465 49186061
6368 49186061 51601217 52380799 50849030 49371621 49725478 50345844 48266696 49610363 49518605
6359 49518605 48948106 49114724 48163989 47851110 48149533 49187697 48312394 46652626 47991808
6350 47991808 47624129 47144859 48164966 48336847 49697809 46268799 47190815 44336795 46469389
6341 46469389 45454484 44808917 47806932 47953475 46478223 46073854 44910609 47402375 46117396
6332 46117396 45614323 45975287 46899442 45861377 46432837 45828751 45522971 46263154 45245793
6323 45245793 44749335 46092180 42837564 43781221 44433790 44761880 46383394 42290454 44468664
6314 44468664 44690340 46535273 45707057 42893939 45128523 44130354 44622250 45664419 44536552
$$ packed form
6377E3433574k8838N719k00597j995330L20011r95161J035884K45203k634404
6368D9186061K415156P79582j531769j477409L53857O20366k079148J343667r1758
6359D9518605n70499J66618r50735l12879K98423J038164q75303j659768J339182
6350D7991808l67679m79270J020107J71881J360962l429010R22016k854020K132594
6341D6469389j014905o45567K998015J46543j475252m04369j163245K491766j284979
6332D6117396n03073L60964R24155j038065N71460o04086l05780P40183j017361
6323D5245793m96458J342845l254616R43657O52569L28090J621514m092940K178210
6314D4468664K21676J844933q28216k813118K234584r98169M91896J042169j127867
$$ plain form
6305 44536552 44596805 43151365 45144750 42968347 44467216 43000228 44301344 43962282 44036981
6296 44036981 45326559 44634816 45089383 43700925 43232926 42782348 43783231 44347126 46304221
6287 46304221 42815397 46191426 43145215 43616388 44191084 45682744 44887426 44204675 44236352
6278 44236352 43194936 44597484 44377108 45662848 44450617 45270090 43557384 45050515
6270 45050515 45486961 46498369 47037427 46574281 46161159 46206068 45436641 45052844 44304708
6261 44304708 46105970 48736281 45384380 48650432 46401776 45875773 45985812 47004243
6253 47004243 47000437 47963102 48215394 47156614 48093846 48089747 48394147 49180459 48890202 50084076
6243 50084076 50067196 50675109 49066241 45993306 48595298 50367668 51187754 48967245 51612396
$$ packed form
6305D4536552O0253j445440J993385k176403J498869j466988J301116l39062P4699
6296D4036981J289578o91743M54567j388458m67999m50578J000883N63895J957095
6287D6304221l488824L376029l046211M71173N74696J491660p95318o82751L1677
6278D4236352j041416J402548k20376J285740j212231Q19473j712706J493131
6270D5050515M36446J011408N39058m63146m13122M4909p69427l83797p48136
6261D4304708J801262K630311l351901L266052k248656n26003J10039J018431
6253D7004243l806R62665K52292j058780R37232m099L04400P86312k90257J193874
6243E0084076j6880O07913j608868l072935K601992J772370Q20086k220509K645151
$$ plain form
6234 51612396 50892154 50671888 51732707 50007452 52302138 53352682 50922267 51399371 52856418
6225 52856418 53568104 52571406 53339031 53291828 54159167 55490670 58521960 55018347 53569950
6216 53569950 55489991 56945877 56968777 55093228 59631606 57313451 59828915 58529181
6208 58529181 57355932 59799905 58340251 60078715 61667655 62445955 63435751 63819898 63898660
6199 63898660 64917152 63799697 66215822 67727966 66789056 67741499 69918063 66854738
6191 66854738 68217234 71430034 71736448 73293025 70869836 72983100 73740891 73518246 75339560
6182 75339560 77442255 78556543 77974332 78742009 80979250 81619527 82496673 83792945 84342193
6173 84342193 86634232 87381482 87102653 89232852 92537556 91602415 92753527 95215803 96982834
$$ packed form
6234E1612396p20242k20266J060819j725255K294686J050544k430415M77104J457047
6225E2856418P11686r96698P67625m7203Q67339J331503L031290l503613j448397
6216E3569950J920041J455886K2900j875549M538378k318155K515464j299734
6208E8529181j173249K443973j459654J738464J588940P78300R89796L84147P8762
6199F3898660J018492j117455K416125J512144r38910R52443K176564l063325
6191F6854738J362496L212800L06414J556577k423189K113264P57791k22645J821314
6182G5339560K102695J114288n82211P67677K237241O40277Q77146J296272N49248
6173H4342193K292039P47250k78829K130199L304704r35141J151112K462276J767031
$$ plain form
6164 96982834 98629568 96286568 99602371 101521242 103746703 104586007 103361150 106124968
6156 106124968 110752276 111197886 110753529 114615225 113909757 116493459 119577856 121181153
6148 121181153 122716226 125852477 126145204 130220162 132593379 134049244 135765610 136920670
6140 136920670 139603315 140904386 144502941 147825830 148776313 150303703 152706250 155607548
6132 155607548 158441289 160579628 160563985 163491664 166596267 169375000 172564362 174238253
6124 174238253 175607336 177295275 179520159 184862626 184175987 186716687 188551859 190387261
6116 190387261 193219476 193002887 198613779 200713804 201777007 204825849 206479981 205121622
6108 205121622 209204386 208867587 209847467 214612088 214783171 216614237 217981057 218480465 217533806
$$ packed form
6164I6982834J646734k343000L315803J918871K225461Q39304j224857K763818
6156A06124968M627308M45610m44357L861696p05468K583702L084397J603297
6148A21181153J535073L136251K92727M074958K373217J455865J716366J155060
6140A36920670K682645J301071L598555L322889R50483J527390K402547K901298
6132A55607548K833741K138339j5643K927679L104603K778733L189362J673891
6124A74238253J369083J687939K224884N342467o86639K540700J835172J835402
6116A90387261K832215k16589N610892K100025J063203L048842J654132j358359
6108B05121622M082764l36799R79880M764621J71083J831066J366820M99408r46659
$$ plain form
6099 217533806 220191184 219697829 222409016 221891688 224084637 222265570 223784578 223450386
6091 223450386 224006633 225366286 223721719 225249482 224619075 223792933 224261218 223966005 224307188
6082 224307188 224696012 222792881 222876388 220778991 221487711 218789655 217146645 218002581 215898271
6073 215898271 215612568 213371913 213102856 210692712 208150143 207828522 204172599 203122349
6065 203122349 201448160 200315809 198988043 196064197 195969030 193378248 192033898 188981973
6057 188981973 189603494 185261039 181884950 182796450 180814013 178212275 176062151 173975165
6049 173975165 173395368 167681985 168632019 165587374 163301742 161069045 159278152 158482241
6041 158482241 154340806 152617712 151623970 149143547 148367184 146735672 145192394 142811423
$$ packed form
6099B17533806K657378m93355K711187n17328K192949j819067J519008l34192
6091B23450386N56247J359653j644567J527763o30407q26142M68285k95213L41183
6082B24307188L88824j903131Q3507k097397P08720k698056j643010Q55936k104310
6073B15898271k85703k240655k69057k410144k542569l21621l655923j050250
6065B03122349j674189j132351j327766k923846r5167k590782j344350l051925
6057A88981973O21521m342455l376089R11500j982437k601738k150124k086986
6049A73975165n79797n713383R50034l044645k285632k232697j790893p95911
6041A58482241m141435j723094r93742k480423p76363j631512j543278k380971
$$ plain form
6033 142811423 141198469 138179523 137677335 136559523 132732689 132052704 131018029 129073954
6025 129073954 128614725 123779724 121892582 120071917 120062305 119986452 117292129 117379233 113344627
6016 113344627 110973949 108465075 111757975 107134772 105372960 105248637 102304148 100861456
6008 100861456 100922565 99476550 97823995 96732857 95792683 94251878 96153517 91623848
6000 91623848 89881071 88917658 88632064 86899778 87218119 85570559 84432473 82073388 82678706
5991 82678706 79922061 79394869 78163116 77539883 77627715 76303507 75981329 74892392 74054773
5982 74054773 72154434 72603307 71569059 70054342 71496668 70772974 69114603 67813065
5974 67813065 66812329 65043533 65182071 65393199 67102276 63803336 65397097 61847374
$$ packed form
6033A42811423j612954l018946n02188j117812l826834o79985j034675j944075
6025A29073954m59229m835001j887142j820665r612p5853k694323Q7104m034606
6016A13344627k370678k508874L292900m623203j761812j24323k944489j442692
6008A00861456O1109j446015j652555j091138r40174j540805J901639m529669
6000I1623848j742777r63413k85594j732286L18341j647560j138086k359085O05318
5991H2678706k756645n27192j231753o23233Q7832j324208l22178j088937q37619
5982G4054773j900339M48873j034248j514717J442326p23694j658371j301538
5974F7813065j000736j768796J38538K11128J709077l298940J593761l549723
$$ plain form
5966 61847374 62354064 63093157 60071845 60331888 62061337 58866006 59168347 58669361 58815007
5957 58815007 59848974 59077026 59003467 56787578 55913117 57495128 56666124 55131644 56459129
5948 56459129 57365891 55922802 56413101 55109509 54826704 54031394 55109543 53993477 52564239
5939 52564239 54901214 54188004 54045548 54422784 53464198 52370138 51454725 50575358 52887873
5930 52887873 51981180 51741790 51841116 52054591 51850142 52303453 52706506 51683807 51292106
5921 51292106 51005265 52316400 52560812 52785116 52829288 50363865 51670157 52236858 53027964
5912 53027964 53271624 52796488 49961118 53575760 53726097 51991441 53360916 53614253 53495321
5903 53495321 51670184 55728358 54829214 55259915 55254269 56220100 56238707 55586878 55689218 55648486
$$ packed form
5966F1847374N06690P39093l021312K60043J729449l195331L02341m98986J45646
5957E8815007J033967p71948p3559k215889q74461J582011q29004j534480J327485
5948E6459129R06762j443089M90299j303592k82805p95310J078149j116066j429238
5939E2564239K336975p13210j42456L77236r58586j094060r15413q79367K312515
5930E2887873r06693k39390R9326K13475k04449M53311M03053j022699l91701
5921E1292106k86841J311135K44412K24304M4172k465423J306292N66701P91106
5912E3027964K43660m75136k835370L614642J50337j734656J369475K53337j18932
5903E3495321j825137M058174q99144M30701n646R65831J8607o51829J02340m0732
$$ plain form
5893 55648486 56811157 56840282 56379665 59406584 60007563 57538759 56637336 58078322 58039203
5884 58039203 60632048 61457644 60028500 60904495 60294615 61370554 60536997 63999499 61915936
5875 61915936 62642148 64013774 65147961 64224787 64583376 66365659 67403362 67580204 68220704
5866 68220704 68316280 68722512 68883170 69256438 71168141 72222060 71692040 72774733 74134128
5857 74134128 72365342 73939806 73480824 75987733 76560277 76596071 76926540 77715011 77585363
5848 77585363 77094914 77525542 77810000 78172895 80964240 78685176 82835265 82803410 81904652
5839 81904652 83087462 81918616 83248541 86246115 86506440 84824086 87170861 85769055
5831 85769055 85166874 85839772 87330921 88544808 86182611 87438095 89140665 88239571 86983355
$$ packed form
5893E5648486J162671K9125m60617L026919O00979k468804r01423J440986l9119
5884E8039203K592845Q25596j429144Q75995o09880J075939q33557L462502k083563
5875F1915936P26212J371626J134187r23174L58589J782283J037703J76842O40500
5866F8220704R5576M06232J60658L73268J911703J053919n30020J082693J359395
5857G4134128j768786J574464m58982K506909N72544L5794L30469P88471j29648
5848G7585363m90449M30628K84458L62895K791345k279064M150089l1855q98758
5839H1904652J182810j168846J329925K997574K60325j682354K346775j401806
5831H5769055o02181O72898J491149J213887k362197J255484J702570r01094j256216
$$ plain form
5822 86983355 88309813 87976065 89339394 88877640 90237805 89556843 90632725 88100840 89469770
5813 89469770 88482717 87952456 88140081 89148723 86966543 88917360 89904741 89677287 88361353
5804 88361353 88262551 86062430 89945230 89469332 87840834 84993249 85198307 89011877 87561448
5795 87561448 86284891 87653711 87669463 86454873 84703332 85293277 84699005 85598302 84406581
5786 84406581 85102169 83180776 84126972 84274599 83937775 82497369 83228735 81999943 82148867
5777 82148867 81602414 81885649 79004177 79799559 80617434 82011330 81007781 81215998 80424479
5768 80424479 79020523 79159702 80519117 77826715 78987600 79977779 79419877 80556625 80172240
5759 80172240 79697150 79591890 79600834 77510005 79122154 78988762 81339759 78655621 77292584
$$ packed form
5822H6983355J326458l33748J363329m61754J360165o80962J075882k531885J368930
5813H9469770r87053n30261J87625J008642k182180J950817R87381k27454j315934
5804H8361353r8802k200121L882800m75898j628498k847585K05058L813570j450429
5795H7561448j276557J368820J5752j214590j751541N89945n94272Q99297j191721
5786H4406581O95588j921393R46196J47627l36824j440406P31366j228792J48924
5777H2148867n46453K83235k881472P95382Q17875J393896j003549K08217p91519
5768H0424479j403956J39179J359415k692402J160885R90179n57902J136748l84385
5759H0172240m75090j05260Q944k090829J612149j33392K350997k684138j363037
$$ plain form
5750 77292584 78344512 78044218 78529300 78439421 79353695 79550479 77736104 81415520 79270836
5741 79270836 80282951 79086115 78329908 77836910 80796092 81545224 81867558 79782693 80769085
5732 80769085 80515018 79956872 81174278 80799136 81059855 83180293 80561027 78533801 81238226
5723 81238226 81145628 80540443 82005899 80489670 81204027 82328015 82598840 84184788 80721063
5714 80721063 83805421 82737381 82121315 80479067 83071684 80815015 82129576 82606027
5706 82606027 83998248 82375713 83349529 81314707 81958665 84213435 83662431 83944624 86312263
5697 86312263 84606715 83944827 84074899 84193562 85939644 84536342 84118127 84999549 88316501
5688 88316501 86480845 84875400 84924211 84911104 85460961 86783577 88805857 85140215 86399823
$$ packed form
5750G7292584J051928l00294M85082q9879R14274J96784j814375L679416k144684
5741G9270836J012115j196836p56207m92998K959182P49132L22334k084865R86392
5732H0769085k54067n58146J217406l75142K60719K120438k619266k027226K704425
5723H1238226r2598o05185J465456j516229P14357J123988K70825J585948l463725
5714H0721063L084358j068040o16066j642248K592617k256669J314561M76451
5706H2606027J392221j622535R73816k034822O43958K254770n51004K82193K367639
5697H6312263j705548o61888J30072J18663J746082j403302m18215Q81422L316952
5688H8316501j835656j605445M8811j3107N49857J322616K022280l665642J259608
$$ plain form
5679 86399823 84925240 85663835 87411584 88257752 88834716 87359724 86389585 87626971 89836057
5670 89836057 90429160 90999613 90491153 90336632 91677471 92871475 91493170 92568201 90718690
5661 90718690 92035895 92116480 93987886 95483494 96022776 95068168 95059185 96397458 97639706
5652 97639706 98423639 99915191 98751428 99165564 101537170 101801644 100478313 101238072 104044019
5643 104044019 104475695 106654693 106472122 107507100 107820742 109655538 111190254 111705734 113630674
5634 113630674 114167942 115141060 116520701 116785915 117694749 120005546 120405050 121782119 125344699
5625 125344699 124623411 126032515 126867706 128202465 131142705 132186301 134840303 138638675
5617 138638675 137962537 140943375 139560014 142497773 144909706 146484037 149257159 151424679
$$ packed form
5679H6399823j474583P38595J747749Q46168N76964j474992r70139J237386K209086
5670H9836057N93103N70453n08460j54521J340839J194004j378305J075031j849511
5661I0718690J317205Q0585J871406J495608N39282r54608q983J338273J242248
5652I7639706P83933J491552j163763M14136K371606K64474j323331P59759K805947
5643A04044019M31676K178998j82571J034978L13642J834796J534716N15480J924940
5634A13630674N37268R73118J379641K65214R08834K310797L99504J377069L562580
5625A25344699p21288J409104Q35191J334759K940240J043596K654002L798372
5617A38638675o76138K980838j383361K937759K411933J574331K773122K167520
$$ plain form
5609 151424679 152747944 156703207 157543531 161553918 160405377 163009343 165769685 169309318
5601 169309318 172016100 172851118 177038707 178618553 182365784 181874507 186667427 188865228
5593 188865228 191505412 192365763 195113861 197902046 200370689 207067366 208517977 210482287
5585 210482287 213325383 215041139 216249615 220274219 223356819 224908471 229981161 232895252
5577 232895252 234329480 237819893 240348302 242276962 245192947 247919408 252118513 255439361
5569 255439361 255714463 258676520 260499237 263287717 266319526 267310090 269943867 273318248
5561 273318248 274159385 276357958 279957751 281837287 283483447 282569206 286065550 288937304
5553 288937304 289330386 292976689 294404758 296481962 297003273 298874717 300330574 300411981 300604489
$$ packed form
5609A51424679J323265L955263Q40324M010387j148541K603966K760342L539633
5601A69309318K706782Q35018M187589J579846L747231m91277M792920K197801
5593A88865228K640184Q60351K748098K788185K468643O696677J450611J964310
5585B10482287K843096J715756J208476M024604L082600J551652N072690K914091
5577B32895252J434228L490413K528409J928660K915985K726461M199105L320848
5569B55439361K75102K962057J822717K788480L031809R90564K633777L374381
5561B73318248Q41137K198573L599793J879536J646160r14241L496344K871754
5553B88937304L93082L646303J428069K077204N21311J871444J455857Q1407J92508
$$ plain form
5544 300604489 301352337 305573590 304652113 307307644 305703575 308456741 308001398 307609909 309055858
5535 309055858 307951980 308680431 307477795 309447729 308771858 308969859 307837688 309094684
5527 309094684 306141057 309355720 308781710 309378054 308502869 305554963 304474450 305147042 301701483
5518 301701483 302070469 301269295 299967033 299824742 297942692 296283768 296977381 295319739 292802589
5509 292802589 291325620 291069320 289731198 288861689 287805296 286219184 283640480 280935619
5501 280935619 280452273 278386488 277041977 276802582 272946171 271869040 270049166 268026464
5493 268026464 265520161 265892061 262123494 262068578 256946570 255503164 252746203 253716082 248117753
5484 248117753 246483344 246251398 243576795 241093037 240451027 237475451 234334556 233870573
$$ packed form
5544C00604489P47848M221253r21477K655531j604069K753166m55343l91489J445949
5535C09055858j103878P28451j202636J969934o75871J98001j132171J256996
5527C09094684k953627L214663n74010N96344q75185k947906j080513O72592l445559
5518C01701483L68986q01174j302262j42291j882050j658924O93613j657642k517150
5509B92802589j476969k56300j338122q69509j056393j586112k578704k704861
5501B80935619m83346k065785j344511k39395l856411j077131j819874k022702
5493B68026464k506303L71900l768567n4916n122008j443406k756961R69879n598329
5484B48117753j634409k31946k674603k483758o42010k975576l140895m63983
$$ plain form
5476 233870573 228241268 227567667 227341773 225628162 222224666 220716386 219716691 217585355
5468 217585355 213969908 213789644 209478793 207619082 206506724 204873535 203473908 198744473
5460 198744473 199288441 196213438 191497848 191386178 190123932 188337615 186188132 183756313
5452 183756313 183109815 180837521 178026356 176103863 175689869 174711682 171834332 171338000 168754541
5443 168754541 168986077 165524307 166404755 162334671 161873395 159079907 157644422 157179320 156265261
5434 156265261 152476666 154061253 152289572 151173785 150660583 147318074 146998767 144186599
5426 144186599 145724662 143270591 142940709 142538853 140800824 140775688 140641995 139510781 137254647
5417 137254647 137839847 136111591 133981232 133004441 132687880 132434146 132685444 129842655 130256110
$$ packed form
5476B33870573n629305o73601k25894j713611l403496j508280r99695k131336
5468B17585355l615447j80264m310851j859711j112358j633189j399627m729435
5460A98744473N43968l075003m715590j11670j262246j786317k149483k431819
5452A83756313o46498k272294k811165j922493m13994r78187k877350m96332k583459
5443A68754541K31536l461770Q80448m070084m61276k793488j435485m65102r14059
5434A56265261l788595J584587j771681j115787n13202l342509l19307k812168
5426A44186599J538063k454071l29882m01856j738029k5136j33693j131214k256134
5417A37254647N85200j728256k130359r76791l16561k53734K51298k842789M13455
$$ plain form
5408 130256110 129541505 130260178 127742287 127026779 127030702 126642668 127052515 127618604 125553642
5399 125553642 124807224 123695905 123856005 125030772 125973942 123638168 122761704 123371732 121982429
5390 121982429 121792260 122941681 122524673 121569000 121942706 122721298 121403874 123104055 121657485
5381 121657485 120971177 121579339 122337349 121933551 121693052 122630390 122615862 122005327 122329889
5372 122329889 123849196 121911372 125605924 124267381 124133585 125330540 127137552 125458161
5364 125458161 125339275 125939792 127606724 125763842 128045966 129682481 127861622 126891970
5356 126891970 128380675 129029596 130574779 128814473 127123087 130706650 131742284 132310675
5348 132310675 133301062 131862078 133167827 134836814 133947433 134985138 137488458 137841142
$$ packed form
5408A30256110p14605P18673k517891p15508L923l88034M09847N66089k064962
5399A25553642p46418j111319J60100J174767R43170k335774q76464O10028j389303
5390A21982429j90169J149421m17008r55673L73706P78592j317424J700181j446570
5381A21657485o86308O08162P58010m03798k40499R37338j4528o10535L24562
5372A22329889J519307j937824L694552j338543j33796J196955J807012j679391
5364A25458161j18886O00517J666932j842882K282124J636515j820859r69652
5356A26891970J488705O48921J545183j760306j691386L583563J035634N68391
5348A32310675R90387j438984J305749J668987q89381J037705K503320L52684
$$ plain form
5340 137841142 137954886 135195156 137421451 137993949 139476040 140618673 140462406 139015918
5332 139015918 138309495 140899402 141707395 140984364 144017276 141379086 143070234 143634962 141517417
5323 141517417 141239573 143273251 144723665 142664515 142721022 141583425 144883653 143444482
5315 143444482 141714050 145089627 143801939 140292336 140594688 139160584 140889818 139693401
5307 139693401 138724506 141195308 138196030 140024052 137398766 134032201 136986671 135939468
5299 135939468 133419362 133913831 134896585 131945865 130481940 128021309 126486075 126010637
5291 126010637 124513773 122509498 121720686 118320604 119845125 117478155 116096445 112849412
5283 112849412 112866102 110376542 108023558 110213047 105381509 104630421 102874791 99314349
$$ packed form
5340A37841142J13744k759730K226295N72498J482091J142633j56267j446488
5332A39015918p06423K589907Q07993p23031L032912k638190J691148N64728k117545
5323A41517417k77844K033678J450414k059150N6507j137597L300228j439171
5315A43444482j730432L375577j287688l509603L02352j434104J729234j196417
5307A39693401r68895K470802k999278J828022k625286l366565K954470j047203
5299A35939468k520106M94469R82754k950720j463925k460631j535234m75438
5291A26010637j496864k004275p88812l400082J524521k366970j381710l247033
5283A12849412J6690k489560k352984K189489m831538p51088j755630l560442
$$ plain form
5275 99314349 99811786 98069454 95934433 96531966 95493380 93133062 91590018 88495611
5267 88495611 88863026 86155740 83940116 82962169 82714189 79463331 80755445 79355054 78627002
5258 78627002 75655151 73646511 72930799 71999181 71662089 71341914 69062914 68566911 66182338
5249 66182338 68443890 65339292 64359317 61739515 62694543 62201671 61024535 61434286 60879786
5240 60879786 59091547 60433084 58247971 57605773 56976117 55428897 52972531 52863894 54196073
5231 54196073 54258104 52904991 53748478 52148054 49766036 51897122 50805859 49046853 48646965
5222 48646965 49410713 49128143 46746015 49683041 46286901 47001584 46533970 46822448 46872351
5213 46872351 45721736 45827041 45136766 46138466 47437921 44955451 45369590 44671640 44176363
$$ packed form
5275I9314349M97437j742332k135021N97533j038586k360318j543044l094407
5267H8495611L67415k707286k215624r77947k47980l250858J292114j400391p28052
5258G8627002k971851k008640p15712r31618l37092l20175k279000m96003k384573
5249F6182338K261552l104598r79975k619802R55028m92872j177136M09751n54500
5240F0879786j788239J341537k185113o42198o29656j547220k456366j08637J332179
5231E4196073O2031j353113Q43487j600424k382018K131086j091263j759006l99888
5222D8646965P63748k82570k382128K937026l396140P14683m67614K88478M9903
5213D6872351j150615J05305o90275J001700J299455k482470M14139o97950m95277
$$ plain form
5204 44176363 43307688 44746779 43204111 41739461 41883557 40822013 43638961 39957558
5196 39957558 40629270 42155029 40025664 39837004 40885954 41465877 39771778 39392641 38616284
5187 38616284 40459322 39071051 39071075 39365952 39286716 39036008 40107207 37675356 39005803
5178 39005803 38286938 37551291 37274568 37902448 37185840 37795431 38344005 37127558 36392404
5169 36392404 35264204 33236552 36131213 35575944 35755673 34918482 33172165 35116384 35403794
5160 35403794 34016636 34279244 34461601 33410119 34950439 34487003 33655158 35447887 33951741
5151 33951741 31331385 34792478 32650817 32086034 30742888 33873151 33210294 30648997
5143 30648997 31906399 33500804 31911649 31331097 32140904 30935979 32275131 30999527
$$ packed form
5204D4176363q68675J439091j542668j464650J44096j061544K816948l681403
5196C9957558O71712J525759k129365j88660J048950N79923j694099l79137p76357
5187C8616284J843038j388271K4K94877p9236k50708J071199k431851J330447
5178C9005803p18865p35647k76723O27880p16608O09591N48574j216447p35154
5169C6392404j128200k027652K894661n55269J79729q37191j746317J944219K87410
5160C5403794j387158K62608J82357j051482J540320m63436q31845J792729j496146
5151C3951741k620356L461093k141661n64783j343146L130263o62857k561297
5143C0648997J257402J594405j589155n80552Q09807j204925J339152j275604
$$ plain form
5135 30999527 33089874 32874731 30693847 31670038 29775173 32235978 30716926 31647745 31662791
5126 31662791 29975692 29867365 31004220 29879786 30489820 30782842 30546541 30160844 30001753
5117 30001753 28419048 30031995 28919614 30342369 31560367 30312911 31104892 28783529
5109 28783529 28549320 30728767 28339314 28849214 30304864 29109153 30366101 32244715
5101 32244715 29943849 28464087 29386348 27862587 30821928 30588612 32417006 29300343
5093 29300343 30083213 29298308 29842650 29404437 31085181 29510004 28299408 29411461 28673884
5084 28673884 31979784 30807816 28941473 28657174 30654858 30754982 29700443 28392127
5076 28392127 30310613 31311745 30229651 33345094 32001394 32628958 30023197 29586961
$$ packed form
5135C0999527K090347k15143k180884R76191j894865K460805j519052R30819J5046
5126C1662791j687099j08327J136855j124434O10034K93022k36301l85697j59091
5117C0001753j582705J612947j112381J422755J217998j247456P91981k321363
5109B8783529k34209K179447k389453N09900J455650j195711J256948J878614
5101C2244715k300866j479762R22261j523761K959341k33316J828394l116663
5093B9300343P82870p84905N44342m38213J680744j575177j210596J112053p37577
5084B8673884L305900j171968j866343k84299J997684J00124j054539j308316
5076B8392127J918486J001132j082094L115443j343700O27564k605761m36236
$$ plain form
5068 29586961 31463052 33513838 31758121 30476110 32320794 30446940 30230305 30368904
5060 30368904 31919748 31607977 33078750 33668816 32564641 31583481 30887079 32756349 33667165
5051 33667165 31288355 32934137 32817500 34481896 33036038 34664122 36547980 33217899
5043 33217899 34891337 35281128 36122451 36391391 34003374 35655990 36810954 34206271 35978335
5034 35978335 36502157 37052983 37498366 36486260 37362381 37637158 37975928 38026978 37711553
5025 37711553 36452446 39019900 39082709 39400615 41009013 41845715 41332741 43016807 41968087
5016 41968087 43012135 43391999 44387048 42633409 44725819 44099680 44435713 43805195 45279777
5007 45279777 46625977 47964267 45327453 45972560 47248151 48947893 48622848 47877969 49226583
$$ packed form
5068B9586961J876091K050786j755717j282011J844684j873854k16635J38599
5060C0368904J550844l11771J470773N90066j104175r81160o96402J869270R10816
5051C3667165k378810J645782j16637J664396j445858J628084J883858l330081
5043C3217899J673438L89791Q41323K68940k388017J652616J154964k604683J772064
5034C5978335N23822N50826M45383j012106Q76121K74777L38770N1050l15425
5025C7711553j259107K567454O2809L17906J608398Q36702n12974J684066j048720
5016D1968087J044048L79864R95049j753639K092410o26139L36033o30518J474582
5007D5279777J346200J338290k636814O45107J275591J699742l25045p44879J348614
$$ plain form
4998 49226583 50662316 51062269 50115475 48221970 52205252 53214740 52616428 53311317 53513096
4989 53513096 54896959 55163935 56295838 57735060 54669431 56233460 57925576 58040541
4981 58040541 59849612 59672489 56865216 60225140 59451970 60114101 60108206 60998907 63312317
4972 63312317 61819166 64136265 64824101 64694616 67266083 64997178 64305305 66535680 67849400
4963 67849400 67343854 67492436 67867370 69702546 70192334 71921257 73134508 70604381 71818432
4954 71818432 73012519 72505347 72808305 72640986 74772077 76125786 73351200 75910505 79538523
4945 79538523 78445801 78093874 78529078 79959153 81358267 81184985 82841319 80766379 83442464
4936 83442464 83946411 84732729 83388950 85936380 86329176 86872247 89487169 88693455 89063564
$$ packed form
4998D9226583J435733L99953r46794j893505L983282J009488n98312O94889K01779
4989E3513096J383863K66976J131903J439222l065629J564029J692116J14965
4981E8040541J809071j77123k807273L359924p73170O62131n895Q90701K313410
4972F3312317j493151K317099O87836j29485K571467k268905o91873K230375J313720
4963F7849400n05546J48582L74934J835176M89788J728923J213251k530127J214051
4954G1818432J194087n07172L02958j67319K131091J353709k774586K559305L628018
4945G9538523j092722l51927M35204J430075J399114j73282J656334k074940K676085
4936H3442464N03947P86318j343779K547430L92796N43071K614922p93714L70109
$$ plain form
4927 89063564 90673833 89245293 89384742 89942315 93141961 92076911 94674047 94067055 94314856
4918 94314856 94998066 95534082 95178131 99095593 97330137 99145093 98104441 97411903 99612180
4909 99612180 98920719 99687403 101831605 103291818 101689698 102449681 101938803 103659668 103170986
4900 103170986 104073522 104772222 105035352 102104467 104833785 102991031 104199381 104696675 106843585
4891 106843585 104719445 104692289 105719433 106632122 105246907 104230747 105589643 107049238
4883 107049238 107818898 106502202 105685594 106750683 105276120 105516790 103172491 104797640
4875 104797640 103944188 104834265 106945696 105516810 106351584 105337092 105432151 102466713 101822075
4866 101822075 102973580 102246903 104648379 104490019 103186644 100274716 101330331 102692986
$$ packed form
4927H9063564J610269j428540J39449N57573L199646j065050K597136o06992K47801
4918I4314856O83210N36016l55951L917462j765456J814956j040652o92538K200277
4909I9612180o91461P66684K144202J460213j602120P59983n10878J720865m88682
4900A03170986R02536O98700K63130k930885K729318j842754J208350M97294K146910
4891A06843585k124140k7156J027144R12689j385215j016160J358896J459595
4883A07049238P69660j316696q16608J065089j474563K40670k344299J625149
4875A04797640q53452Q90077K111431j428886Q34774j014492R5059k965438o44638
4866A01822075J151505p26677K401476j58360j303375k911928J055615J362655
$$ plain form
4858 102692986 102987821 99766543 99313804 100284827 101083781 98248501 101651607 101483655 99128515
4849 99128515 99950910 99859228 99316104 100262238 99175831 97301799 99309517 98796355 99619782
4840 99619782 98766844 100753176 97108389 98421990 99286503 100642815 98451249 95736888
4832 95736888 97562885 98117764 99473004 99465409 100603018 97204076 98615484 100280005 101381445
4823 101381445 100057298 99913948 100025260 102856400 100108626 101396026 104099599 102145052
4815 102145052 104714641 103978385 104467295 105204902 105850494 105994118 107635314 108176137 109994298
4806 109994298 109018843 110676810 111154463 111169741 111690076 113419529 115297432 116434745 115157103
4797 115157103 118355041 119403687 118383247 119407953 120837338 123086840 124141672 125396467
$$ packed form
4858A02692986K94835l221278m52739R71023P98954k835280L403106j67952k355140
4849I9128515Q22395r1682n43124R46134j086407j874032K007718n13162Q23427
4840I9619782q52938J986332l644787J313601Q64513J356312k191566k714361
4832I5736888J825997N54879J355240p595J137609l398942J411408J664521J101440
4823A01381445j324147j43350J11312K831140k747774J287400K703573j954547
4815A02145052K569589p36256M88910P37607O45592J43624J641196N40823J818161
4806A09994298r75455J657967M77653J5278N20335J729453J877903J137313j277642
4797A15157103L197938J048646j020440J024706J429385K249502J054832J254795
$$ plain form
4789 125396467 123523924 126960551 128418319 131508340 131109221 132730740 136497492 135472572
4781 135472572 137222101 139103581 140712812 138519165 142374108 146776113 145313175 147964603
4773 147964603 150238180 149724848 152037304 152949552 157569655 158339201 158349542 159788427 162580812
4764 162580812 166470539 167035600 168411220 168953704 170458002 173271740 174645770 175630443
4756 175630443 176805715 177658325 180375593 183974464 184767171 183593888 187926708 188306500
4748 188306500 189740549 192107107 191599952 194667291 194016818 198208979 197666766 198859976
4740 198859976 197951441 202310730 204739188 205677365 203978263 206941217 205822579 208060774
4732 208060774 208648257 209537094 211790091 209317131 209027265 212589037 213155837 214492390 213474219
$$ packed form
4789A25396467j872543L436627J457768L090021l99119J621519L766752j024920
4781A35472572J749529J881480J609231k193647L854943M402005j462938K651428
4773A47964603K273577n13332K312456R12248M620103P69546J0341J438885K792385
4764A62580812L889727N65061J375620N42484J504298K813738J374030R84673
4756A75630443J175272Q52610K717268L598871P92707j173283M332820L79792
4748A88306500J434049K366558n07155L067339o50473M192161n42213J193210
4740A98859976r08535M359289K428458R38177j699102K962954j118638K238195
4732B08060774N87483Q88837K252997k472960k89866L561772N66800J336553j018171
$$ plain form
4723 213474219 213833737 212991374 214464063 214594443 215945640 217539102 217435011 217843869 219067304
4714 219067304 217304742 217542814 219194477 218087379 216693409 215704119 216972115 217436337
4706 217436337 216924579 221112354 219297535 218878456 215854114 219218737 217233351 218130501
4698 218130501 217296921 215447883 217138961 215765309 216425568 217148630 217218758 214230662 216067188
4689 216067188 217820083 215976225 217355819 215379095 213785463 213286816 215089460 214563136
4681 214563136 216912218 216600592 214997356 215159178 215510021 214197206 213649147 214370306 213707792
4672 213707792 215093012 215657719 214944037 215626779 215404533 215279346 215524507 213606713 215303440
4663 215303440 215473467 213737482 215975502 212638333 213718047 214627835 213164913 213737607
$$ packed form
4723B13474219L59518q42363J472689J30380J351197J593462j04091M08858J223435
4714B19067304j762562K38072J651663j107098j393970r89290J267996M64222
4706B17436337n11758M187775j814819m19079l024342L364623j985386Q97150
4698B18130501q33580j849038J691078j373652O60259P23062P0128k988096J836526
4689B16067188J752895j843858J379594j976724j593632m98647J802644n26324
4681B14563136K349082l11626j603236J61822L50843j312815n48059P21159o62514
4672B13707792J385220N64707p13682O82742k22246j25187K45161j917794J696727
4663B15303440J70027j735985K238020l337169J079714R09788j462922N72694
$$ plain form
4655 213737607 212786144 212381629 212924754 212582076 212638083 214067394 213224609 211155711 211593668
4646 211593668 212199941 210232255 210428661 209953529 208866997 208320897 206663632 207344996 206176881
4637 206176881 205553111 205571150 204359781 203542591 202975200 202527956 201408180 201867874 200177965
4628 200177965 199858636 198114007 197977316 196735941 195205448 197760312 193863852 193502737
4620 193502737 192799253 189557711 189905808 187211174 186913122 185586600 185442636 184791296 183965538
4611 183965538 182773467 182219611 179677019 179272363 177437725 177308545 176380985 172859268 172781360
4602 172781360 172433616 171014302 169199384 169662663 167946087 167110765 166996311 162729902 164624752
4593 164624752 163495778 161410983 160004938 157426381 158524496 154936739 156669307 154882137
$$ packed form
4655B13737607r51463m04515N43125l42678N6007J429311q42785k068898M37957
4646B11593668O06273j967686J96406m75132j086532n46100j657265O81364j168115
4637B06176881o23770J8039j211369q17190n67391m47244j119776M59694j689909
4628B00177965l19329j744629j36691j241375j530493K554864l896460l61115
4620A93502737p03484l241542L48097k694634k98052j326522j43964o51340q25758
4611A83965538j192071n53856k542592m04656j834638j29180r27560l521717p7908
4602A72781360l47744j419314j814918M63279j716576q35322j14454m266409J894850
4593A64624752j128974k084795j406045k578557J098115l587757J732568j787170
$$ plain form
4585 154882137 152774672 152196417 151427876 151994965 149016746 149101364 146070811 144242440 146465450
4576 146465450 144822987 144549913 141738249 141809178 140199730 137668090 137759394 136909755 138328669
4567 138328669 134888039 134216168 132619103 129953074 129840048 128793213 130066085 128127139
4559 128127139 129031334 125667852 124628561 124972058 124172167 120863088 121524727 120978675 120150523
4550 120150523 117048368 118172795 115849756 113765380 114520303 114085521 114152643 112477822 111486728
4541 111486728 109211049 108582352 107314832 105780013 105700916 105829128 104911733 101593449 101385216
4532 101385216 99128694 99670600 97867519 97407511 95160166 95825080 93849641 94640163 92165689
4523 92165689 90400085 91750293 88118183 88072169 87775704 85859016 84415841 84697071 83917016
$$ packed form
4585A54882137k107465n78255p68541N67089k978219Q4618l030553j828371K223010
4576A46465450j642463k73074k811664P0929j609448k531640R1304q49639J418914
4567A38328669l440630o71871j597065k666029j13026j046835J272872j938946
4559A28127139R04195l363482j039291L43497p99891l309079O61639n46052q28152
4550A20150523l102155J124427k323039k084376P54923m34782O7122j674821r91094
4541A11486728k275679o28697j267520j534819p9097J28212r17395l318284k08233
4532A01385216k256522N41906j803081m60008k247345O64914j975439P90522k474474
4523I2165689j765604J350208l632110m6014k96465j916688j443175K81230p80055
$$ plain form
4514 83917016 84255582 82770770 82169995 80603186 77768985 76527217 75295777 74933532 73955492
4505 73955492 74505843 73047906 71630481 70881396 69283753 70734407 66877386 67642347 67363993
4496 67363993 66133123 66543566 63325150 64914068 62782437 63367576 62087684 61342436 62076147
4487 62076147 58826529 56949258 58016139 57670078 57323303 57046356 55963001 55658208 53806671
4478 53806671 51451763 53866606 51956118 50324066 50585897 50034545 48789279 47692243
4470 47692243 48174304 46884697 46789556 47503958 46539360 44958830 44142014 43352616 43204792
4461 43204792 42013573 42256080 42960393 42953748 40608315 41767445 41073158 42082292 39356258
4452 39356258 38105446 40281521 38232799 37523494 39677337 37150959 36503554 35891819 36184382
$$ packed form
4514H3917016L38566j484812o00775j566809k834201j241768j231440l62245r78040
4505G3955492N50351j457937j417425p49085j597643J450654l857021P64961k78354
4496F7363993j230870M10443l218416J588918k131631N85139j279892p45248P33711
4487F2076147l249618j877271J066881l46061l46775k76947j083355l04793j851537
4478E3806671k354908K414843j910488j632052K61831n51352j245266j097036
4470D7692243M82061j289607r5141P14402r64598j580530q16816p89398j47824
4461D3204792j191219K42507P04313o645k345433J159130o94287J009134k726034
4452C9356258j250812K176075k048722p09305K153843k526378o47405o11735K92563
$$ plain form
4443 36184382 36345959 35429330 33805517 35396583 33532575 34263556 33303907 34334228 33631372
4434 33631372 31843610 32064125 32752726 31644194 33061407 30237895 31630658 32939317
4426 32939317 31227054 31837325 32100855 31113125 30303736 27419281 31006677 29856557 28853663
4417 28853663 29803376 29714518 27062888 29086580 30259630 28091328 28267873 27488959 26571547
4408 26571547 28337562 26753936 27707991 28754419 27957340 28648108 26837040 27329308 25960246
4399 25960246 25544923 27246295 27074626 27375965 26207234 27700916 27164896 26748644 26740748
4390 26740748 28455571 27350633 25485616 26558671 25871188 26867727 24165225 27488736
4382 27488736 27690773 25892767 25688744 25771421 25426660 26070187 25378985 26146699 26465892
$$ packed form
4443C6184382J61577r16629j623813J591066j864008P30981r59649J030321p02856
4434C3631372j787762K20515O88601j108532J417213k823512J392763J308659
4426C2939317j712263O10271K63530r87730q09389k884455L587396j150120j002894
4417B8853663R49713q8858k651630K023692J173050k168302J76545p78914r17412
4408B6571547J766015j583626R54055J046428p97079O90768j811068M92268j369062
4399B5960246m15323J701372j71669L01339j168731J493682n36020m16252p896
4390B6740748J714823j104938j865017J073055o87483R96539k702502L323511
4382B7488736K02037j798006k04023Q2677l44761O43527o91202P67714L19193
$$ plain form
4373 26465892 26793818 25098346 26435007 25476149 24864352 27593908 26420560 27165647 25919214
4364 25919214 28330468 26582872 26946234 25839814 25985204 27250053 27589002 26418709 27124248
4355 27124248 27203485 26949956 27840512 27492374 26383542 27121750 27144659 30313954 27906620
4346 27906620 27758494 28398213 29848966 28033493 28855352 28191443 29835318 30958446 27226859
4337 27226859 28953447 28571692 29100845 28743176 29161312 27677947 29914501 30439994 31360265
4328 31360265 30328903 28836671 30417599 30874693 32663266 31330478 31045008 30834582 31139360
4319 31139360 31426061 30531762 32268807 32302773 30636106 33421782 32688181 32985470 32314632
4310 32314632 32473275 32898854 31541344 32764108 31635719 32932326 33165903 34003588 33417951
$$ packed form
4373B6465892L27926j695472J336661r58858o11797K729556j173348P45087j246433
4364B5919214K411254j747596L63362j106420J45390J264849L38949j170293P05539
4355B7124248P9237k53529Q90556l48138j108832P38208K2909L169295k407334
4346B7906620j48126O39719J450753j815473Q21859o63909J643875J123128l731587
4337B7226859J726588l81755N29153l57669M18136j483365K236554N25493R20271
4328C1360265j031362j492232J580928M57094J788573j332788k85470k10426L04778
4319C1139360K86701q94299J737045L3966j666667K785676p33601K97289o70838
4310C2314632J58643M25579j357510J222764j128389J296607K33577Q37685n85637
$$ plain form
4301 33417951 33257082 33394958 34438772 33365092 33297735 32616249 33671334 32115991 34242917
4292 34242917 32152937 32312593 33375251 32211033 32842705 32603832 31782472 30571401 30583544
4283 30583544 32148794 30364379 33510530 31745293 29248673 30268108 29115506 29483410
4275 29483410 30184860 27608373 29666908 29828443 26996992 27566076 27751656 28626446 26010230
4266 26010230 25517023 26445791 24933070 23654701 25444209 24975433 25007359 28384444 25413370
4257 25413370 24651599 24604391 25387642 23951569 22513001 23200024 23063065 24346218 23808388
4248 23808388 20615129 20737248 20807224 21781742 22068318 20793970 20965778 22062594 20811769
4239 20811769 18962131 18727505 20268391 18740942 18377750 18131948 18893121 20176025 17775433
$$ packed form
4301C3417951j60869J37876J043814j073680o7357o81486J055085j555343K126926
4292C4242917k089980J59656J062658j164218O31672k38873q21360j211071J2143
4283C0583544J565250j784415L146151j765237k496620J019435j152602L67904
4275B9483410P01450k576487K058535J61535k831451N69084J85580Q74790k616216
4266B6010230m93207R28768j512721j278369J789508m68776L1926L377085k971074
4257B5413370p61771m7208P83251j436073j438568O87023j36959J283153n37830
4248B3808388l193259J22119O9976R74518K86576j274348J71808J096816j250825
4239B0811769j849638k34626J540886j527449l63192k45802P61173J282904k400592
$$ plain form
4230 17775433 18812380 17171308 17083555 18275088 16445089 16405586 16115399 14849279 17286993
4221 17286993 16796163 17694338 15744654 16161197 14537715 13991262 15789877 15949354 15478349
4212 15478349 16107616 14878746 13233624 13821735 13696106 14254553 16143061 15143872 14382627
4203 14382627 13432087 13272161 13730753 13771409 14288902 13741822 12264824 15051270 13559112
4194 13559112 12809869 12915629 12138991 12068626 10933881 12281796 12251117 13154827 12621529
4185 12621529 11425741 10853627 12860684 12032199 10602696 11774414 11248153 10954876 12031460
4176 12031460 10526530 9283814 9604835 9446426 11003877 9676231 10816226 10794953 9092053
4167 9092053 10119446 9262146 9201107 9689992 10823128 10569739 8976899 10240013 9365617
$$ packed form
4230A7775433J036947j641072q7753J191533j829999l9503k90187j266120K437714
4221A7286993m90830Q98175j949684M16543j623482n46453J798615J59477m71005
4212A5478349O29267j228870j645122N88111j25629N58447J888508r99189p61245
4203A4382627r50540j59926M58592M0656N17493n47080j476998K786446j492158
4194A3559112p49243J05760p76638p0365j134745J347915l0679R03710n33298
4185A2621529j195788n72114K007057q28485j429503J171718n26261k93277J076584
4176A2031460j504930j242716L21021j58409J557451j327646J139995k1273j702900
4167I092053J027393q57300o1039M88885J133136k53389j592840J263114q74396
$$ plain form
4158 9365617 11476566 9047919 10218140 10196963 9464373 7747834 7998634 8730054 7332996
4149 7332996 9285082 9706439 8662975 9360497 10030104 9042960 9955672 8477529 7417678
$$ packed form
4158I365617K110949k428647J170221k1177p32590j716539K50800P31420j397058
4149G332996J952086M21357j043464O97522O69607r87144R12712j478143j059851
$$ [...]
##END NTUPLES=NMR SPECTRUM
##END=
